##TITLE=1H_EC-3327(II-12)
 CDCl3
 8 sc, 
 31.5.2024
##JCAMPDX= 6.0         $$ Bruker NMR JCAMP-DX V2.0
##DATA TYPE= NMR SPECTRUM
##DATA CLASS= NTUPLES
##ORIGIN= UXNMR, Bruker Analytische Messtechnik GmbH
##OWNER= root
$$ XWIN-NMR		Version 3.5
$$ Fri May 31 13:48:25 2024 Russian Standard Time (UT+4h)  she@DPX200
##.OBSERVE FREQUENCY= 200.1309
##.OBSERVE NUCLEUS= ^1H
##.ACQUISITION MODE= SIMULTANEOUS
##.ACQUISITION SCHEME= undefined
##.AVERAGES= 8
##.DIGITISER RES= 18
##SPECTROMETER/DATA SYSTEM= spect
##.PULSE SEQUENCE= zg30
##.SOLVENT NAME= CDCl3
##.SHIFT REFERENCE= (INTERNAL, CDCl3, 0, 15.8472)
##AUDIT TRAIL= $$ (NUMBER, WHEN, WHO, WHERE, WHAT)
$$ ##TITLE= Audit trail, XWIN-NMR		Version 3.5
$$ ##JCAMPDX= 5.01
$$ ##ORIGIN= Bruker BioSpin GmbH
$$ ##OWNER= she
$$ F:/spectra/data/she/nmr/H-F/1/pdata/1/auditp.txt
$$ ##AUDIT TRAIL=  $$ (NUMBER, WHEN, WHO, WHERE, WHAT)
(   1,<2024-05-31 13:47:17.00 +0400>,<she>,<DPX200>,
      <created by zg, POWCHK disabled, PULCHK disabled
       configuration hash MD5:
       00 E9 B6 7A A2 85 ED C7 34 08 36 98 17 FE 4E 26
       data hash MD5: 16K
       54 35 89 D0 49 58 DC EB 4D 9C 94 63 0D E5 E8 0C>)
(   2,<2024-05-31 13:47:20.10 +0400>,<she>,<DPX200>,
      <Start of raw data processing
       efp BC_mod = 2 LB = 0.24 FT_mod = 6 PKNL = 1 PHC0 = -25312.32 PHC1 = 12.58748 SI = 16K 
       data hash MD5: 16K
       B8 97 CC DA 1E EF E6 7A 71 7F A8 96 2E 0C BD CD>)
(   3,<2024-05-31 13:47:37.10 +0400>,<she>,<DPX200>,
      <pk PHC0 = -0.1535079 PHC1 = -2 
       data hash MD5: 16K
       C8 9A B5 D8 37 B1 F6 CE 96 39 23 6E FE 3C C6 99>)
(   4,<2024-05-31 13:47:40.43 +0400>,<she>,<DPX200>,
      <abs ABSG = 5 
       data hash MD5: 16K
       36 B1 27 4F FB 62 F6 A2 A6 A3 DE 10 B7 9B 4C 78>)
$$ ##END=
$$ 
$$ hash MD5
$$ 81 26 23 FE F6 40 A2 1F 7D 6A EB 81 74 D5 D7 24
##$RELAX= 
##$RELAX= 
##$RELAX= 
##$RELAX= 
##$RELAX= 
##$RELAX= 
$$ Bruker specific parameters
$$ --------------------------
##$DU= <F:/spectra>
##$EXPNO= 1
##$NAME= <H-F>
##$PROCNO= 1
##$TYPE= <nmr>
##$USER= <she>
##$AMP= (0..31)
100 100 100 100 100 100 100 100 100 100 100 100 100 100 100 100 100 100 
100 100 100 100 100 100 100 100 100 100 100 100 100 100 
##$AQSEQ= 0
##$AQ_mod= 1
##$AUNM= <au_zg>
##$AUTOPOS= <>
##$BF1= 200.13
##$BF2= 200.13
##$BF3= 200.13
##$BF4= 200.13
##$BF5= 200.13
##$BF6= 200.13
##$BF7= 200.13
##$BF8= 200.13
##$BYTORDA= 1
##$CFDGTYP= 0
##$CFRGTYP= 5
##$CHEMSTR= <none>
##$CNST= (0..31)
1 1 145 1 1 1 1 1 1 1 1 1 1 1 1 1 1 1 1 1 1 1 1 1 1 1 1 1 1 1 1 1 
##$CPDPRG= <>
##$CPDPRG1= <>
##$CPDPRG2= <>
##$CPDPRG3= <>
##$CPDPRG4= <mlev>
##$CPDPRG5= <mlev>
##$CPDPRG6= <mlev>
##$CPDPRG7= <mlev>
##$CPDPRG8= <mlev>
##$CPDPRGB= <>
##$CPDPRGT= <>
##$D= (0..31)
0 1.2 0 0 0 0 0 0 0 0.06 0 0.03 0 0 0 0 0.0002 0 0 0 0 0 0 0 0 0 0 0 0 
0 0 0 
##$DATE= 1717148836
##$DBL= (0..7)
120 120 120 120 120 120 120 120 
##$DBP= (0..7)
150 150 150 150 150 150 150 150 
##$DBP07= 0
##$DBPNAM0= <>
##$DBPNAM1= <>
##$DBPNAM2= <>
##$DBPNAM3= <>
##$DBPNAM4= <>
$$ [...]
##$SUBNAM3= <"">
##$SUBNAM4= <"">
##$SUBNAM5= <"">
##$SUBNAM6= <"">
##$SUBNAM7= <"">
##$SUBNAM8= <"">
##$SUBNAM9= <"">
##$SW= 18.0517689322627
##$SWIBOX= (0..15)
0 0 2 0 0 0 0 0 0 0 0 0 0 0 0 0 
##$SW_h= 3612.71676300578
##$TD= 16384
##$TD0= 1
##$TE= 0
##$TE2= 300
##$TE3= 300
##$TEG= 300
##$TL= (0..7)
0 120 120 120 120 120 120 120 
##$TP= (0..7)
150 150 150 150 150 150 150 150 
##$TP07= 0
##$TPNAME0= <>
##$TPNAME1= <>
##$TPNAME2= <>
##$TPNAME3= <>
##$TPNAME4= <>
##$TPNAME5= <>
##$TPNAME6= <>
##$TPNAME7= <>
##$TPOAL= (0..7)
0.5 0.5 0.5 0.5 0.5 0.5 0.5 0.5 
##$TPOFFS= (0..7)
0 0 0 0 0 0 0 0 
##$TUNHIN= 0
##$TUNHOUT= 0
##$TUNXOUT= 0
##$USERA1= <user>
##$USERA2= <user>
##$USERA3= <user>
##$USERA4= <user>
##$USERA5= <user>
##$V9= 5
##$VALIST= <valist>
##$VCLIST= <CCCCCCCCCCCCCCC>
##$VD= 0
##$VDLIST= <DDDDDDDDDDDDDDD>
##$VPLIST= <PPPPPPPPPPPPPPP>
##$VTLIST= <TTTTTTTTTTTTTTT>
##$WBST= 1024
##$WBSW= 4
##$XGAIN= (0..3)
0 0 0 0 
##$XL= 0
##$YL= 0
##$YMAX_a= 350007
##$YMIN_a= -504853
##$ZGOPTNS= <>
##$ZL1= 120
##$ZL2= 120
##$ZL3= 120
##$ZL4= 120
##$ABSF1= 15.81413
##$ABSF2= -2.237761
##$ABSG= 5
##$ABSL= 3
##$ALPHA= 0
##$AQORDER= 0
##$ASSFAC= 0
##$ASSFACI= 0
##$ASSFACX= 0
##$ASSWID= 0
##$AUNMP= <proc_1d>
##$AZFE= 0.1
##$AZFW= 0.1
##$BCFW= 0
##$BC_mod= 2
##$BYTORDP= 0
##$COROFFS= 0
##$CY= -3
##$DATMOD= 1
##$DC= 0
##$DFILT= <>
##$DTYPP= 0
##$F1P= 0
##$F2P= 0
##$FCOR= 1
##$FTSIZE= 16384
##$FT_mod= 6
##$GAMMA= 0
##$GB= 0
##$INTBC= 1
##$INTSCL= 3.70164e-10
##$ISEN= 128
##$LB= 0.24
##$LEV0= 0
##$LPBIN= 0
##$MAXI= 10000
##$MC2= 0
##$MEAN= 0
##$ME_mod= 0
##$MI= 1.114404
##$NCOEF= 0
##$NC_proc= -6
##$NLEV= 6
##$NOISF1= 3.799351
##$NOISF2= 2.8
##$NSP= 0
##$NTH_PI= 0
##$NZP= 0
##$OFFSET= 15.84719
##$PC= 1
##$PHC0= -25312.47
##$PHC1= 10.58748
##$PH_mod= 1
##$PKNL= yes
##$PPARMOD= 0
##$PSCAL= 0
##$PSIGN= 0
##$REVERSE= no
##$SF= 200.12953486708
##$SI= 16384
##$SIGF1= 3
##$SIGF2= 2
##$SINO= 5.538805
##$SIOLD= 16384
##$SREGLST= <1H.CDCl3>
##$SSB= 0
##$STSI= 16384
##$STSR= 0
##$SW_p= 3612.71676300577
##$SYMM= 0
##$S_DEV= 0
##$TDeff= 16384
##$TDoff= 0
##$TI= <>
##$TILT= no
##$TM1= 0
##$TM2= 0
##$TOPLEV= 0
##$USERP1= <user>
##$USERP2= <user>
##$USERP3= <user>
##$USERP4= <user>
##$USERP5= <user>
##$WDW= 1
##$XDIM= 16384
##$YMAX_p= 291841261
##$YMIN_p= -292972
$$ End of Bruker specific parameters
$$ ---------------------------------
##NTUPLES= NMR SPECTRUM
##VAR_NAME=  FREQUENCY,     SPECTRUM/REAL,   SPECTRUM/IMAG
##SYMBOL=    X,             R,               I
##VAR_TYPE=  INDEPENDENT,   DEPENDENT,       DEPENDENT
##VAR_FORM=  AFFN,          ASDF,            ASDF
##VAR_DIM=   16384,         16384,           16384
##UNITS=     HZ,            ARBITRARY UNITS, ARBITRARY UNITS
##FACTOR=    0.220516191357247, 1,           1
##FIRST=     3171.49074428957, 0,            0
##LAST=      -441.226018716205, 0,           0
##MIN=       -441.226018716205, -292972,     0
##MAX=       3171.49074428957, 291841261,    0
$$ Real data points
##PAGE= N=1
##DATA TABLE= (X++(R..R)), XYDATA
$$ [...]
$$ plain form
6290 454253 490059 420266 304022 350750 462414 548430 455965 595020 504387 514971 566211
6279 566211 491051 519271 599804 645091 561960 397135 500224 517602 549499 671702 694009
6268 694009 667805 760192 807179 744761 838586 789970 670950 649218 784646 858999 887710
6257 887710 828306 791712 711386 695739 756065 893134 884046 873669 925107 860685 871439 898221
6245 898221 855792 786758 875999 1031086 1042372 944977 1011313 1049089 1094860 1132530 1131833 1129139
6233 1129139 1091866 1187026 1225622 1267671 1306435 1339062 1434633 1610486 1626076 1776955 1799951
6222 1799951 1710499 1734630 1675316 1689151 1700029 1587003 1699776 1717568 1683097 1620671 1699821
6211 1699821 1759227 1665557 1799620 1820687 1771068 1823247 1697074 1634539 1680257 1778051 1727736
$$ packed form
6290D54253L5806o9793j16244M6728J11664Q6016r2465J39055r0633J0584N1240
6279E66211p5160K8220Q0533M5287q3131j64825J03089J7378L1897J22203K2307
6268F94009k6204R2387M6987o2418R3825m8616j19020k1732J35428P4353K8711
6257H87710n9404l6594q0326j5647O0326J37069r088j0377N1438o4422J0754K6782
6245H98221m2429o9034Q9241J55087J1286r7395O6336L7776M5771L7670o97k694
6233A129139l7273R5160L8596M2049L8764L2627R5571J75853J5590J50879K2996
6222A799951q9452K4131n9314J3835J0878j13026J12773J7792l4471o2426P9150
6211A699821N9406r3670J34063K1067m9619N2179j26173o2535M5718R7794n0315
$$ plain form
6200 1727736 1709968 1611630 1623411 1685408 1773060 1823085 1679311 1704195 1679272 1704648 1725874
6189 1725874 1699897 1714459 1734856 1708913 1909413 1908403 1985195 2007361 1966309 1998449 2190198
6178 2190198 2188880 2239498 2315085 2344478 2409379 2544526 2506926 2472690 2613318 2707505 2773562
6167 2773562 2772269 2874908 2878520 2934630 3083629 3185566 3203175 3300241 3312868 3474190 3558946
6156 3558946 3600039 3717997 3872489 3885132 4047416 4099319 4222586 4276383 4371727 4436160 4580391
6145 4580391 4724967 4767294 5036910 5152181 5301414 5505002 5708043 5947564 6224642 6256474
6135 6256474 6373022 6612006 6812922 7123859 7419690 7503051 7601458 7788967 8100533 8492807
6125 8492807 8761476 8925459 9256930 9547495 9795103 10090856 10461202 10913728 11273831 11807420
$$ packed form
6200A727736j7768r8338J1781O1997Q7652N0025j43774K4884k4923K5376K1226
6189A725874k5977J4562K0397k5943K00500j010P6792K2166m1052L2140J91749
6178B190198j318N0618P5587K9393O4901J35147l7600l4236J40628R4187O6057
6167B773562j293J02639L612N6110J48999J01937J7609R7066J2627J61322Q4756
6156C558946M1093J17958J54492J2643J62284N1903J23267N3797R5344O4433J44231
6145D580391J44576M2327K69616J15271J49233K03588K03041K39521K77078L1832
6135F256474J16548K38984K00916L10937K95831Q3361R8407J87509L11566L92274
6125H492807K68669J63983L31471K90565K47608K95753L70346M52526L60103N33589
$$ plain form
6115 11807420 12306972 12795281 13348112 13916679 14679306 15475735 16352549 17211370 18231672
6106 18231672 19339304 20564897 22010695 23528338 25081249 26959884 29323253 31728724
6098 31728724 34311628 37073937 39325182 40328541 39958335 38507062 36602991 34696626
6090 34696626 33079232 31794408 30989611 30402353 30268470 30375696 30887843 31698159 32688090
6081 32688090 34120921 35529928 37224387 39007181 41117337 43440418 46058976 49213449
6073 49213449 52781502 56916457 61565967 66653043 72006405 76560339 78886768 77326329
6065 77326329 72256491 65636120 59227677 53846740 49421551 45939502 43253594 41189629
6057 41189629 39552583 38432162 37751675 37657584 37987972 38642835 39477408 40498414 41381292
$$ packed form
6115A1807420M99552M88309N52831N68567P62627P96429Q76814Q58821J020302
6106A8231672J107632J225593J445798J517643J552911J878635K363369K405471
6098C1728724K582904K762309K251245J003359l70206j451273j904071j906365
6090C4696626j617394j284824q04797n87258j33883J07226N12147Q10316R89931
6081C2688090J432831J409007J694459J782794K110156K323081K618558L154473
6073D9213449L568053M134955M649510N087076N353362M553934K326429j560439
6065G7326329n069838o620371o408443n380937m425189l482049k685908k063965
6057D1189629j637046j120421o80487r4091L30388O54863Q34573J021006Q82878
$$ plain form
6048 41381292 42163136 43253654 44449471 45510635 46536151 47620476 48809222 49947170
6040 49947170 50879994 50691826 48851428 45706832 41897091 38222659 34767501 31876532
6032 31876532 29350772 27391958 25711494 24200439 22978746 22049145 21472579 21160763 20759813
6023 20759813 20474049 20353809 20081762 19533318 18864688 18241179 17375998 16436060 15399388
6014 15399388 14537457 13763280 13022347 12294119 11640449 11225302 10833194 10462120 10131962
6005 10131962 9775841 9305836 8986350 8726581 8372817 8094911 7784668 7611549 7551665 7325462
5995 7325462 7127385 7055767 6998739 6844279 6627808 6607489 6585164 6498299 6497222 6443814 6427014
5984 6427014 6478602 6567437 6458504 6439079 6507566 6436652 6371409 6238505 6152750 6049814 5902557
$$ packed form
6048D1381292P81844J090518J195817J061164J025516J084325J188746J137948
6040D9947170R32824j88168j840398l144596l809741l674432l455158k890969
6032C1876532k525760j958814j680464j511055j221693r29601n76566l11816m00950
6023B0759813k85764j20240k72047n48444o68630o23509q65181r39938j036672
6014A5399388q61931p74177p40933p28228o53670m15147l92108l71074l30158
6005A0131962l56121m70005l19486k59769l53764k77906l10243j73119n9884k26203
5995G325462j98077p1618n7028j54460k16471k0319k2325q6865j077n3408j6800
5984F427014N1588Q8835j08933j9425O8487p0914o5243j32904q5755j02936j47257
$$ plain form
5973 5902557 5793179 5757764 5844420 5698270 5668844 5613174 5641915 5716103 5704864 5748896 5719910
5962 5719910 5804253 5844060 5934949 6114167 6268011 6422249 6575790 6769800 6943825 7229944
5952 7229944 7305435 7401022 7604508 7833304 8123034 8460166 8763506 9066109 9405152 9812953
5942 9812953 10330815 10894668 11441647 12187591 13071056 13904931 15059534 16310353 17535014
5933 17535014 18589401 19442933 19787167 19431407 18604921 17584791 16477659 15761702 15122547
5924 15122547 14695441 14355413 14297236 14366336 14551315 14834637 15163047 15670635 16405197 17254301
5914 17254301 18225988 19266063 20592680 22099178 23877696 26051791 28529261 31206085
5906 31206085 33764888 35342541 35302047 33297530 30279052 27113379 24209005 21754674
$$ packed form
5973E902557j09378l5415Q6656j46150k9426n5670K8741P4188j1239M4032k8986
5962E719910Q4343L9807R0889J79218J53844J54238J53541J94010J74025K86119
5952G229944P5491R5587K03486K28796K89730L37132L03340L02603L39043M07801
5942I812953N17862N63853N46979P45944Q83465Q33875J154603J250819J224661
5933A7535014J054387Q53532L44234l55760q26486j020130j107132p15957o39155
5924A5122547m27106l40028n8177O9100J84979K83322L28410N07588P34562Q49104
5914A7254301R71687J040075J326617J506498J778518K174095K477470K676824
5906C1206085K558803J577653m0494k004517l018478l165673k904374k454331
$$ plain form
5898 21754674 19774646 18238838 17020474 16153901 15296577 14736987 14426441 14179056 14062886
5889 14062886 14107613 14150034 14359437 14706991 15086726 15609431 16449567 17284290 18356518 19365836
5879 19365836 19974888 20081842 19453677 18079255 16376890 14577882 13085299 11711047 10611275
5870 10611275 9630494 8837090 8314922 7646894 7157675 6687049 6302012 5881600 5603961
5861 5603961 5421548 5098626 4839651 4643422 4258910 4027455 3917765 3693082 3537303 3519886
5851 3519886 3449957 3197742 3129720 3078925 2984516 2863600 2859025 2750109 2536431 2459152 2582061
5840 2582061 2580251 2508341 2484895 2444857 2300966 2321605 2239415 2177520 2161975 2098838 1980378
5829 1980378 1869818 1878633 1911701 1881855 1762189 1820295 1635356 1630773 1699930 1686819 1675297
$$ packed form
5898B1754674j980028j535808j218364q66573q57324n59590l10546k47385j16170
5889A4062886M4727M2421K09403L47554L79735N22705Q40136Q34723J072228J009318
5879A9365836O09052J06954o28165j374422j702365j799008j492583j374252j099772
5870A0611275r80781p93404n22168o68028m89219m70626l85037m20412k77639
5861E603961j82413l22922k58975j96229l84512k31455j09690k24683j55779j7417
5851C519886o9929k52215o8022n0795r4409j20916m575j08916k13678p7279J22909
5840B582061j810p1910k3446m0038j43891K0639q2190o1895j5545o3137j18460
5829A980378j10560Q815L3068k9846j19666N8106j84939m583O9157j3111j1522
$$ plain form
5818 1675297 1656659 1626659 1667827 1666588 1792714 1817091 1684664 1657472 1718602 1783996 1680729
5807 1680729 1663029 1593232 1559566 1545037 1491958 1425674 1445308 1323375 1253608 1327793 1389325
5796 1389325 1435152 1467850 1335642 1249773 1318141 1258644 1252901 1237251 1205143 1249419 1240218 1242474
5784 1242474 1375859 1376225 1317701 1198367 1194205 1218867 1220976 1267590 1162247 1126107 1132971 1126988
5772 1126988 1130590 1214552 1143303 1169544 1239365 1169515 1097290 1129035 1195285 1176914 1110992 1152591
5760 1152591 1232982 1287111 1214236 1320796 1350695 1282182 1343919 1335259 1306182 1197545 1171198
5749 1171198 1176546 1140286 1109025 1128341 1121589 1123348 1162724 1232607 1064517 1047939 1104377 1125458
5737 1125458 1197876 1104341 1078259 1111162 1146895 1146091 1177543 1194773 1152662 1182199 1170720 1224723
$$ packed form
5818A675297j8638l0000M1168j239J26126K4377j32427k7192O1130O5394j03267
5807A680729j7700o9797l3666j4529n3079o6284J9634j21933o9767P4185O1532
5796A389325M5827L2698j32208q5869O8368n9497n743j5650l2108M4276r201K256
5784A242474J33385L66n8524j19334m162K4662K109M6614j05343l6140O864n983
5772A126988L602Q3962p1249K6241O9821o9850p2225L1745O6250j8371o5922M1599
5760A152591Q0391N4129p2875J06560K9899o8513O1737q660k9077j08637k6347
5749A171198N348l6260l1261J9316o752J759L9376O9883j68090j6578N6438K1081
5737A125458P2418r3535k6082L2903L5733q04L1452J7230m2111K9537j1479N4003
$$ plain form
5725 1224723 1248594 1174051 1136164 1128514 1096196 1117052 1164940 1203305 1197579 1061187 1064848 955389
5713 955389 976762 1043065 1075341 1122117 1038356 1065360 1048863 985003 860780 949612 1056489
5702 1056489 1092433 1078628 1072955 1030164 1034789 1031006 1009827 985987 1079733 1090021 1086779 969111
5690 969111 1079650 1214636 1205887 1098501 1167926 1129107 1119269 1113887 1005593 1041773 1073752
5679 1073752 1102313 1069756 1087391 1125759 1270036 1258151 1245821 1188686 1325002 1280200 1385196
5668 1385196 1372838 1274298 1364493 1252720 1226349 1192571 1169850 1218839 1327097 1322618 1368902
5657 1368902 1350434 1230465 1329016 1431461 1546073 1504217 1364343 1409348 1349237 1442385 1382063
5646 1382063 1332121 1441535 1486566 1463109 1586414 1632943 1771374 1854984 1790798 1757569 1818176
$$ packed form
5725A224723K3871p4543l7887p650l2318K0856M7888L8365n726j36392L661j09459
5713I55389K1373O6303L2276M6776q3761K7004j6497o3860j24223Q8832J06877
5702A056489L5944j3805n673m2791M625l783k1179k3840R3746J0288l242j17668
5690I69111J10539J34986q749j07386O9425l8819r838n382j08294L6180L1979
5679A073752K8561l2557J7635L8368J44277j1885j2330n7135J36316m4802J04996
5668A385196j2358r8540R0195j11773k6371l3778k2721M8989J08258m479M6284
5657A368902j8468j19969R8551J02445J14612m1856j39874M5005o0111R3148o0322
5646A382063m9942J09414M5031k3457J23305M6529J38431Q3610o4186l3229O0607
$$ plain form
5635 1818176 1797016 1714264 1788561 1703487 1670065 1689705 1882621 1835875 1837304 1836814 1999531 2209403
5623 2209403 2218116 2093293 2080012 2145737 2244009 2182015 2186667 2161429 2171449 2269182 2227947 2227919
5611 2227919 2181917 2095730 2187856 2404773 2363777 2411388 2437526 2463555 2577014 2746194 2713635
5600 2713635 2685552 2774939 2930091 3020952 3054898 3078496 3047848 3178224 3215224 3313599 3379642
5589 3379642 3473807 3494396 3533120 3602576 3569916 3555539 3610478 3714804 3811840 3898203 4051956
5578 4051956 4148513 4375217 4398598 4477053 4598165 4690510 4779986 4964724 5032229 5242837 5346771
5567 5346771 5484086 5737102 5945947 6252034 6409144 6673950 6962002 7054628 7202018 7315916
5557 7315916 7461689 7675677 7738057 7886600 8012179 7989344 8080247 8296029 8414111 8682572
$$ packed form
5635A818176k1160q2752P4297q5074l3422J9640J92916m6746J429m90J62717K09872
5623B209403Q713j24823j3281O5725R8272o1994M652k5238J0020R7733m1235k8
5611B227919m6002q6187R2126K16917m0996M7611K6138K6029J13459J69180l2559
5600B713635k8083Q9387J55152R0861L3946K3598l0648J30376L7000R8375O6043
5589C379642R4165K0589L8724O9456l2660j4377N4939J04326R7036Q6363J53753
5578D051956R6557K26704K3381P8455J21112R2345Q9476J84738O7505K10608J03934
5567E346771J37315K53016K08845L06087J57110K64806K88052R2626J47390J13898
5557G315916J45773K13988O2380J48543J25579k2835R0903K15782J18082K68461
$$ plain form
5547 8682572 9000576 9183728 9517402 9857933 10000769 10236830 10580832 11025034 11424089 11785081
5537 11785081 12264018 12887958 13411722 14063280 14664857 15459433 16278773 17257319 18283193
5528 18283193 19338576 20492139 21865500 23330943 24999292 26885121 28991118 31482731
5520 31482731 34243796 37237601 40646645 43988215 46272722 46636269 45221851 42788192
5512 42788192 40023848 37489367 35364708 33694097 32575816 31700526 31167554 31068715 31145952
5503 31145952 31576233 32279039 33335945 34663155 36202833 38060158 40238140 42877264
5495 42877264 46024821 49730078 54086559 59060718 64792568 71232001 77639024 81581588
5487 81581588 80876992 76429835 70296605 63861028 57920819 52592540 48088396 44481944
$$ packed form
5547H682572L18004J83152L33674L40531J42836K36061L44002M44202L99055L60992
5537A1785081M78937O23940N23764O51558O01577P94576Q19340R78546J025874
5528A8283193J055383J153563J373361J465443J668349J885829K105997K491613
5520C1482731K761065K993805L409044L341570K284507L63547j414418k433659
5512D2788192k764344k534481k124659j670611j118281q75290n32972r8839P7237
5503C1145952M30281P02806J056906J327210J539678J857325K177982K639124
5495D2877264L147557L705257M356481M974159N731850O439433O407023L942564
5487H1581588p04596m447157o133230o435577n940209n328279m504144l606452
$$ plain form
5479 44481944 41389203 39077730 37285985 36024786 35119193 34577476 34238578 34129963 34102244
5470 34102244 34281531 34812413 35575744 36699628 38148448 39942220 42171630 44727989 47043333
5461 47043333 49004766 50011354 49791972 48013391 45292055 42097446 38767978 35572554
5453 35572554 32851479 30547420 28760004 27299225 25815621 24301915 23002800 21772420
5445 21772420 20563522 19575213 18731289 18020510 17527571 17158830 16884745 16724950 16616899
5436 16616899 16503386 16419937 16159839 15867134 15599343 15296940 15046163 14871013 14545797 14165426
5426 14165426 13767063 13280587 12752852 12150667 11641692 11171962 10709919 10161125 9838969
5417 9838969 9568063 9298060 8832564 8622022 8450126 8364092 8199985 8103592 8142773 7937087
$$ packed form
5479D4481944l092741k311473j791745j261199r05593n41717l38898j08615k7719
5470C4102244J79287N30882P63331J123884J448820J793772K229410K556359K315344
5461D7043333J961433J006588k19382j778581k721336l194609l329468l195424
5453C5572554k721075k304059j787416j460779j483604j513706j299115j230380
5445B1772420j208898r88309q43924p10779m92939l68741k74085j59795j08051
5436A6616899j13513q3449k60098k92705k67791l02403k50777j75150l25216l80371
5426A4165426l98363m86476n27735o02185n08975m69730m62043n48794l22156
5417I838969k70906k70003m65496k10542j71896q6034j64107r6393L9181k05686
$$ plain form
5407 7937087 7845578 7681280 7475440 7260732 7141639 7126912 7028334 6937147 6874236 6813442 6764769
5396 6764769 6687113 6569970 6480293 6457881 6446542 6371810 6397882 6337500 6260563 6211103 6232597
5385 6232597 6396400 6299744 6315548 6338105 6358872 6582405 6677506 6625165 6729512 6746957 6794681
5374 6794681 6849333 6953560 7012259 7028771 7039021 7126168 7224657 7221707 7310443 7470143 7507419
5363 7507419 7574429 7614017 7831327 7979409 8027999 8123652 8159580 8300668 8462245 8657392
5353 8657392 8856883 9079363 9282026 9563810 9937902 10323567 10708701 11344870 11831750 12275290
5343 12275290 12836428 13314777 13873051 14642443 15500860 16273724 17175247 18233807 19558726
5334 19558726 21051524 22598713 24243522 25635631 26124867 25537786 24387770 22957058
$$ packed form
5407G937087r1509j64298k05840k14708j19093j4727r8578r1187o2911o0794m8673
5396F764769p7656j17143q9677k2412j1339p4732K6072o0382p6937m9460K1494
5385F232597J63803r6656J5804K2557K0767K23533R5101n2341J04347J7445M7724
5374F794681N4652J04227N8699J6512J0250Q7147R8489k950Q8736J59700L7276
5363G507419O7010L9588K17310J48082M8590R5653L5928J41088J61577J95147
5353H657392J99491K22480K02663K81784L74092L85665L85134O36169M86880M43540
5343A2275290N61138M78349N58274P69392Q58417P72864R01523J058560J324919
5334A9558726J492798J547189J644809J392109M89236n87081j150016j430712
$$ plain form
5326 22957058 21646217 20695536 19986188 19421029 19065179 18841595 18742277 18816233 19147166 19562720
5316 19562720 20149179 20800492 21726113 22798780 23843291 25045490 26628812 28458343 30676855
5307 30676855 33363719 36417532 39425646 41046445 40289761 37584201 34082182 30689593
5299 30689593 27933761 25416109 23477683 21938585 20673360 19641220 18883479 18353512
5291 18353512 18022546 17722151 17559976 17624277 17764371 17974711 18280190 18840298 19360749 20046604
5281 20046604 20857062 21769638 22844391 23604689 23831301 23334237 22029284 20488460 19159139
5272 19159139 17910181 16803999 15972102 15387902 14956901 14415505 13966455 13597719 13218717
5263 13218717 12992711 12782558 12689270 12765593 12718574 12623294 12574063 12632143 12602151 12701664 12812684
$$ packed form
5326B2957058j310841r50681p09348n65159l55850k23584r9318P3956L30933M15554
5316A9562720N86459O51313R25621J072667J044511J202199J583322J829531K218512
5307C0676855K686864L053813L008114J620799p56684k705560l502019l392589
5299C0689593k755832k517652j938426j539098j265225j032140p57741n29967
5291A8353512l30966l00395j62175O4301J40094K10340L05479N60108N20451O85855
5281B0046604Q10458R12576J074753P60298K26612m97064j304953j540824j329321
5272A9159139j248958j106182q31897n84200m31001n41396m49050l68736l79002
5263A3218717k26006k10153r3288P6323m7019r5280m9231N8080k9992R9513J11020
$$ plain form
5252 12812684 12869063 13132380 13378002 13652546 13754437 14118493 14383660 14611081 14798223 15082571
5242 15082571 15461451 15731804 16098291 16499182 16904512 17035869 17287165 17464672 17679715
5233 17679715 17980040 18350834 18677528 18954135 19283267 19674810 20064329 20447910 20800040
5224 20800040 21320571 21878018 22523931 23186266 23844393 24452427 25247542 26030478 26799273
5215 26799273 27641469 28633726 29674893 30753918 31599746 32434274 33413525 34532052 35574505
5206 35574505 36570642 37652788 38686246 39833018 40859366 41929935 43113183 44438233
5198 44438233 45917762 47491593 49322599 51545296 53996262 56582305 59292841 62269593
5190 62269593 65486450 69099546 72235194 74076030 74796896 75752356 77293215 79360397
$$ packed form
5252A2812684N6379K63317K45622K74544J01891L64056K65167K27421J87142K84348
5242A5082571L78880K70353L66487M00891M05330J31357K51296J77507K15043
5233A7679715L00325L70794L26694K76607L29132L91543L89519L83581L52130
5224B0800040N20531N57447O45913O62335O58127O08034P95115P82936P68795
5215B6799273Q42196R92257J041167J079025Q45828Q34528R79251J118527J042453
5206C5574505R96137J082146J033458J146772J026348J070569J183248J325050
5198D4438233J479529J573831J831006K222697K450966K586043K710536K976752
5190F2269593L216857L613096L135648J840836P20866R55460J540859K067182
$$ plain form
5182 79360397 81694177 83997260 86115221 88317572 91103781 94704741 99120103 104540247
5174 104540247 110956598 118526272 127218789 136945929 147681022 159335769 171555720 183494455
5166 183494455 195069462 206975824 217888841 225927519 229842367 229061991 223312587 213535064
5158 213535064 202264812 191232124 179874965 168133580 156946432 146924233 138429345
5151 138429345 131772759 127091633 124282013 123556719 124100952 125612862 127759530 129320510
5143 129320510 129026860 127366913 125772307 125195038 126114473 128519632 131644486 134036918
5135 134036918 134531461 133327291 130667589 126119352 119244165 110751950 102103533 94011344
5127 94011344 87077194 81261046 76273691 72335522 69184590 66541686 64308285 62494954
$$ packed form
5182G9360397K333780K303083K117961K202351K786209L600960M415362N420144
5174A04540247O416351P569674Q692517R727140J0735093J1654747J2219951J1938735
5166A83494455J1575007J1906362J0913017Q038678L914848p80376n749404r777523
5158B13535064j1270252j1032688j1357159j1741385j1187148j0022199q494888
5151A38429345o656586m681126k809620p25294N44233J511910K146668J560980
5143A29320510k93650j659947j594606n77269R19435K405159L124854K392432
5135A34036918M94543j204170k659702m548237o875187q492215q648417q092189
5127I4011344o934150n816148m987355l938169l150932k642904k233401j813331
$$ plain form
5119 62494954 61086723 60300855 59822707 59479680 59594063 60103543 60869813 61948710 62733934
5110 62733934 62519328 60626801 57530879 53691521 49840712 46199155 42816360 39834855
5102 39834855 37122371 34844208 32805140 31031296 29525368 28196862 26930497 25588368
5094 25588368 24481594 23550218 22604945 21807533 21065152 20446138 19898922 19297877 18677464
5085 18677464 18202584 17783562 17410284 17117439 16831651 16502444 16215357 15989309 15870921
5076 15870921 15522859 15183781 15068057 14851070 14623107 14476317 14261929 14112350 13917790
5067 13917790 13918946 13874166 13736407 13662911 13772541 13840176 13839604 13999353 14164934 14214395 14379480
5056 14379480 14676102 14999893 15250418 15535667 15968678 16301611 16573743 16652671 16477312 16076661
$$ packed form
5119F2494954j408231p85868m78148l43027J14383N09480P66270J078897P85224
5110F2733934k14606j892527l095922l839358l850809l641557l382795k981505
5102C9834855k712484k278163k039068j773844j505928j328506j266365j342129
5094B5588368j106774r31376r45273p97412p42381o19014n47216o01045o20413
5085A8677464m74880m19022l73278k92845k85788l29207k87087k26048j18388
5076A5870921l48062l39078j15724k16987k27963j46790k14388j49579j94560
5067A3917790J156m4780j37759p3496J09630O7635n72J59749J65581M9461J65085
5056A4379480K96622L23791K50525K85249M33011L32933K72132P8928j75359m00651
$$ plain form
5046 16076661 15730421 15508596 15251926 15159567 14987927 15006793 14997694 15110743 15314330 15414914
5036 15414914 15472614 15517236 15868417 16099454 16372814 16733123 17163685 17629293 18155285 18711397
5026 18711397 19419808 20207102 21065271 22144319 23328966 24635243 25997268 27537124 29193816
5017 29193816 30851707 32694133 34571493 36816184 39484750 42771718 46679523 51466786
5009 51466786 56871439 63362114 70572681 75846435 75093621 68326672 59739428 51859635
5001 51859635 45343054 39944913 35575020 32077191 29376041 27120150 25396760 24073922
4993 24073922 22849060 21579217 20312881 19132885 18224827 17476288 16749646 16160558 15767173
4984 15767173 15321730 14757702 14330536 13870627 13479889 13107522 12713800 12294666 12064245
$$ packed form
5046A6076661l46240k21825k56670r2359j71640J8866r099J13049K03587J00584
5036A5414914N7700M4622L51181K31037K73360L60309M30562M65608N25992N56112
5026A8711397P08411P87294Q58169J079048J184647J306277J362025J539856J656692
5017B9193816J657891J842426J877360K244691K668566L286968L907805M787263
5009E1466786N404653O490675P210567N273754p52814o766949q587244p879793
5001E1859635o516581n398141m369893l497829k701150k255891j723390j322838
4993B4073922j224862j269843j266336j179996r08058p48539p26642n89088l93385
4984A5767173m45443n64028m27166m59909l90738l72367l93722m19134k30421
$$ plain form
4975 12064245 11924520 11899867 11851493 11622065 11451503 11345842 11364117 11555322 11737487 12062048
4965 12062048 12606697 13193512 13917846 14786011 15296668 15004158 14122696 13023405 11996372
4956 11996372 11129730 10261812 9535292 9073608 8544681 8193234 7896892 7696200 7487719
4947 7487719 7381678 7305030 7248084 7299544 7369476 7383306 7346885 7429001 7500672 7632479 7908830
4936 7908830 8253950 8607417 9007985 9505949 10275207 11246167 12219934 12952488 12941010 12386634
4926 12386634 11292486 10131984 9170020 8293956 7640061 7000546 6569047 6178506 5819748
4917 5819748 5592753 5338976 5250741 5053861 4814750 4797577 4757481 4715921 4623442 4584508 4579177
4906 4579177 4578372 4594850 4581450 4647461 4789719 4982309 5251699 5643560 5990310 6134200 6150773
$$ packed form
4975A2064245j39725k4653m8374k29428j70562j05661J8275J91205J82165L24561
4965A2062048N44649N86815P24334Q68165N10657k92510q81462j099291j027033
4956A1996372q66642q67918p26520m61684n28927l51447k96342k00692k08481
4947G487719j06041p6648n6946N1460O9932J3830l6421Q2116P1671J31807K76351
4936G908830L45120L53467M00568M97964P69258R70960R73767P32554j1478n54376
4926A2386634j094148j160502r61964q76064o53895o39515m31499l90541l58758
4917E819748k26995k53777q8235j96880k39111j7173m0096m1560r2479l8934n331
4906D579177q05J6478j3400O6011J42258J92590K69390L91861L46750J43890J6573
$$ plain form
4895 6150773 5947756 5747394 5525491 5107600 4793869 4545073 4454782 4330742 4248380 4183091
4885 4183091 4101201 3968272 3896174 3689909 3542802 3528295 3374900 3297537 3161603 3068272
4875 3068272 3038410 3059197 3088435 3113867 3025682 3000130 2997722 2930772 2874310 2938342 2929125 2921143
4863 2921143 2994941 3030007 3053055 3086449 3116040 3254735 3532410 3629579 3635461 3720028 3725921
4852 3725921 3696488 3730669 3647162 3559212 3402658 3344342 3280569 3204913 3237052 3100055 2972444
4841 2972444 2917399 2943539 2880170 2779771 2741126 2677120 2687995 2610635 2533029 2538812 2645995
4830 2645995 2676395 2621202 2704826 2799925 2798641 2782336 2781329 2911693 2960479 2871489 2825879 2853385
4818 2853385 3017510 2980897 3008022 2979256 2882818 2947506 2772329 2654480 2571686 2557044 2475271
$$ packed form
4895F150773k03017k00362k21903m17891l13731k48796r0291j24040q2362o5289
4885D183091q1890j32929p2098k06265j47107j4507j53395p7363j35934r3331
4875C068272k9862K0787K9238K5432q8185k5552k408o6950n6462O4032r217p982
4863B921143P3798L5066K3048L3394K9591J38695K77675R7169N882Q4567N893
4852C725921k9433L4181q3507q7950j56554n8316o3773p5656L2139j36997j27611
4841B972444n5045K6140o3369j00399l8645o4006J0875p7360p7606N783J07183
4830B645995L0400n5193Q3624R5099j284j6305j007J30364M8786q8990m5610K7506
4818B853385J64125l6613K7125k8766r6438O4688j75177j17849q2794j4642q1773
$$ plain form
4807 2475271 2317712 2283238 2142123 2087716 2091358 2049230 1985237 2049194 2064678 2020076 1980167
4796 1980167 2045687 2129111 2009996 2035289 2174887 2032486 2020531 2054886 2021456 1961708 1859830
4785 1859830 1895696 1949218 1851899 1801987 1841063 1720081 1604632 1520904 1403982 1427637 1469307
4774 1469307 1546049 1491754 1448365 1481340 1487215 1478970 1581669 1624127 1582225 1541195 1575523 1636153
4762 1636153 1678974 1621347 1784978 1840982 1790128 1757385 1668563 1749195 1754623 1546098 1507582
4751 1507582 1515448 1454041 1431102 1326604 1426930 1440521 1410767 1365725 1384901 1273840 1277642
4740 1277642 1376981 1238696 1269925 1333488 1257771 1248469 1224951 1313750 1283737 1264193 1270458 1319424
4728 1319424 1363793 1479784 1429555 1432667 1373319 1406773 1382847 1340414 1442467 1318827 1282647
$$ packed form
4807B475271j57559l4474j41115n4407L642m2128o3993O3957J5484m4602l9909
4796A980167O5520Q3424j19115K5293J39598j42401j1955L4355l3430n9748j01878
4785A859830L5866N3522r7319m9912L9076j20982j15449q3728j16922K3655M1670
4774A469307P6742n4295m3389L2975N875q245J02699M2458m1902m1030L4328O0630
4762A636153M2821n7627J63631N6004n0854l2743q8822Q0632N428k08525l8516
4751A507582P866o1407k2939j04498J00326J3591k9754m5042J9176j11061L802
4740A277642R9339j38285L1229O3563p5717r302k3518Q8799l0013j9544O265M8966
4728A319424M4369J15991n0229L112n9348L3454k3926m2433J02053j23640l6180
$$ plain form
4717 1282647 1241978 1108269 1168315 1226037 1233897 1249997 1128452 1062127 1028432 1028192 1042355 1048033
4705 1048033 1043155 1111029 1142975 1030534 1074103 1142275 1070835 1059202 1133381 1168019 1086502
4694 1086502 1148164 1103956 941122 1108006 1127690 1026060 1015956 982940 1040170 1058915 972255
4683 972255 854875 919850 938398 938206 1007881 1020218 1032472 981099 986889 973606 792127 806637
4671 806637 933292 1090331 978293 1015229 1110512 1086125 1027822 1101844 1177963 1158353 1174730
4660 1174730 1112172 1041316 886291 846931 935323 952247 910304 971243 959134 882445 894667
4649 894667 932620 941204 995466 958233 989071 1029038 993081 956558 975243 898621 939556 1056075
4637 1056075 1057569 1057754 1031976 1092250 1174722 1214293 1219103 1204507 1196297 1257735 1297798 1264004
$$ packed form
4717A282647m0669j33709O0046N7722P860J6100j21545o6325l3695k40J4163N678
4705A048033m878O7874L1946j12441M3569O8172p1440j1633P4179L4638q1517
4694A086502O1662m4208j62834J66884J9684j01630j0104l3016N7230J8745q6660
4683I72255j17380O4975J8548j92O9675J2337J2254n1373N790j3283j81479J4510
4671H06637J26655J57039j12038L6936R5283k4387n8303P4022P6119j9610J6377
4660A174730o2558p0856j55025l9360Q8392J6924m1943O0939j2109p6689J2222
4649H94667L7953Q584N4262l7233L0838L9967l5957l6523J8685p6622M0935J16519
4637A056075J494J85k5778O0274Q2472L9571M810j4596q210O1438M0063l3794
$$ plain form
4625 1264004 1184888 1253265 1293480 1189588 1264713 1276414 1241411 1162929 1175291 1264863 1370676
4614 1370676 1436637 1389544 1432980 1516837 1537228 1545006 1569289 1581690 1558244 1533236 1491395 1553714
4602 1553714 1517019 1588648 1630504 1627265 1757999 1796132 1834062 1962064 1940153 1959751 1900363
4591 1900363 1852501 2039944 2096647 1993199 2008883 2203291 2290238 2370700 2402213 2531037 2543729
4580 2543729 2577968 2656008 2668238 2757824 2813295 2780559 2880377 2975629 2991725 3078053 3197807
4569 3197807 3285091 3379327 3499228 3729379 3819911 3939094 4101552 4189449 4283594 4487166
4559 4487166 4676443 4898319 5028641 5110636 5100893 5148756 5232682 5414162 5868943 6161378
4549 6161378 6472682 6844717 7371446 7910609 8266236 8537270 8873018 9321842 9753992 10475392
$$ packed form
4625A264004p9116O8377M0215j03892P5125J1701l5003p8482J2362Q9572J05813
4614A370676O5961m7093M3436Q3857K0391P778K4283J2401k3446k5008m1841O2319
4602A553714l6695P1629M1856l239J30734L8133L7930J28002k1911J9598n9388
4591A900363m7862J87443N6703j03448J5684J94408Q6947Q0462L1513J28824J2692
4580B543729L4239P8040J2230Q9586N5471l2736R9818R5252J6096Q6328J19754
4569C197807Q7284R4236J19901K30151R0532J19183J62458Q7897R4145K03572
4559D487166J89277K21876J30322Q1995r743M7863Q3926J81480M54781K92435
4549F161378L11304L72035N26729N39163L55627K71034L35748M48824M32150P21400
$$ plain form
4539 10475392 11213213 12178111 13428307 15112213 17016213 19136914 22238235 25946563
4531 25946563 27516131 25274818 21510069 18084312 15435555 13409366 11890594 10696986
4523 10696986 9683186 8975147 8403331 8012119 7726330 7384550 7273803 7025275 6776396
4514 6776396 6658227 6604217 6561133 6564576 6620859 6652918 6727300 6720886 6695570 7002043 7130945
4503 7130945 7236869 7292202 7529572 7812866 7985338 8371067 8512135 8781214 8863547 8875210
4493 8875210 8904070 8875080 8997243 9025328 9010102 9050462 9055368 9100372 9077961 9169029 9195592
4482 9195592 9364794 9659156 9773107 9905066 10104154 10436487 10835423 11117657 11459563 11846438
4472 11846438 12283993 12600717 13123142 13679161 14089947 14761601 15336058 16053565 16731804
$$ packed form
4539A0475392P37821R64898J250196J683906J904000K120701L101321L708328
4531B5946563J569568k241313l764749l425757k648757k026189j518772j193608
4523A0696986j013800p08039n71816l91212k85789l41780j10747k48528k48879
4514F776396j18169n4010m3084L443N6283L2059P4382o414k5316L06473J28902
4503G130945J05924N5333K37370K83294J72472L85729J41068K69079Q2333J1663
4493H875210K8860k8990J22163K8085j5226M0360M906M5004k2411R1068K6563
4482I195592J69202K94362J13951J31959J99088L32333L98936K82234L41906L86875
4472A1846438M37555L16724N22425N56019M10786O71654N74457P17507O78239
$$ plain form
4463 16731804 17444160 17967086 18622277 19308923 19883455 20604475 21440923 22400379 23448301
4454 23448301 24736405 26224257 27841296 29736752 32155262 34762780 37437213 39813899
4446 39813899 41276248 41205653 39731965 37742776 35696553 33940019 32578679 31527995
4438 31527995 30890762 30619967 30675010 31245300 31897053 32750709 33632860 34550572 35872043
4429 35872043 37819527 39972592 42599019 45553372 48782806 52301300 55364268 57655857
4421 57655857 58593757 57712208 54842725 50510197 45994108 41727677 38141107 35244707
4413 35244707 32864800 30891758 29403990 28243126 27254842 26508620 25877676 25498777 25363125
4404 25363125 25558181 25969531 26613010 27543927 28775278 30163085 31527354 32412106 32438506
$$ packed form
4463A6731804P12356N22926O55191O86646N74532P21020Q36448R59456J047922
4454B3448301J288104J487852J617039J895456K418510K607518K674433K376686
4446C9813899J462349p0595j473688j989189k046223j756534j361340j050684
4438C1527995o37233k70795N5043N70290O51753Q53656Q82151R17712J321471
4429C5872043J947484K153065K626427K954353L229434L518494L062968K291589
4421E7655857R37900q81549k869483m332528m516089m266431l586570k896400
4413C5244707k379907j973042j487768j160864r88284p46222o30944l78899j35652
4404B5363125J95056M11350O43479R30917J231351J387807J364269Q84752K6400
$$ plain form
4395 32438506 31055258 28705181 25991348 23448438 21105862 18990812 17270745 15769055
4387 15769055 14529454 13465976 12444664 11644825 10848560 10227805 9829543 9260988 8777128
4378 8777128 8378582 7940512 7688707 7468365 7214311 6959795 6757322 6496776 6270855 6175053
4368 6175053 6069648 5818761 5728154 5614592 5396205 5215863 5117211 4987522 4887271 4788795
4358 4788795 4676354 4571447 4591765 4521857 4531534 4431502 4301911 4245562 4255350 4269761 4256244
4347 4256244 4202602 4205079 4241903 4182456 4236586 4213000 4328056 4353598 4355801 4515945 4611718
4336 4611718 4790656 4876312 4994208 5222705 5230846 5300000 5171890 5084412 5006214 4837257 4725870
4325 4725870 4588056 4514299 4552185 4581370 4567018 4623639 4698441 4693190 4696398 4757609 4983983
$$ packed form
4395C2438506j383248k350077k713833k542910k342576k115050j720067j501690
4387A5769055j239601j063478j021312p99839p96265o20755l98262n68555m83860
4378H777128l98546m38070k51805k20342k54054k54516k02473k60546k25921r5802
4368F175053j05405k50887r0607j13562k18387j80342r8652j29689j00251r8476
4358D788795j12441j04907K0318o9908R677j00032j29591n6349R788J4411j3517
4347D256244n3642K477L6824n9447N4130k3586J15056K5542K203J60144R5773
4336D611718J78938Q5656J17896K28497Q141O9154j28110q7478p8198j68957j11387
4325D725870j37814p3757L7886K9185j4352N6621P4802n251L208O1211K26374
$$ plain form
4314 4983983 5122379 5261399 5347876 5375396 5435631 5557070 5551241 5441004 5395841 5144073 4995196
4303 4995196 4804302 4532580 4294568 3902099 3858787 3758279 3526005 3337697 3489603 3388312
4293 3388312 3320766 3312891 3402368 3409278 3421157 3570816 3533608 3669714 3628452 3490411 3390302
4282 3390302 3185003 3044740 2961715 2643315 2486718 2310792 2200931 2169855 2122606 1982662
4272 1982662 2072669 1986474 1960448 1889293 1897125 1996274 1881930 1900042 1828768 1702721 1626029
4261 1626029 1518127 1485396 1506540 1427052 1433491 1430481 1320754 1252888 1313886 1220169 1230764
4250 1230764 1208086 1235785 1129160 1162299 1200356 1086146 1105329 978235 1093724 1075752 1114948
4239 1114948 1197718 1221234 1268387 1167463 1129236 1188420 1093091 940514 1016725 1129229 1139428
$$ packed form
4314D983983J38396J39020Q6477K7520O0235J21439n829j10237m5163k51768j48877
4303D995196j90894k71722k38012l92469m3312j00508k32274j88308J51906j01291
4293C388312o7546p875Q9477O910J1879J49659l7208J36106m1262j38041j00109
4282C390302k05299j40263q3025l18400j56597j75926j09861l1076m7249j39944
4272A982662R0007q6195k6026p1155P832R9149j14344J8112p1274j26047p6692
4261A626029j07902l2731K1144p9488O439l010j09727o7866O0998r3717J0595
4250A230764k2678K7699j06625L3139L8057j14210J9183j27094J15489j7972L9196
4239A114948Q2770K3516M7153j00924l8227N9184r5329j52577P6211J12504J0199
$$ plain form
4228 1139428 1135844 1033179 1069499 999759 1022689 1059988 1036459 1128300 1148944 1171985 1159804
4217 1159804 1185298 1140983 1101543 1098044 1007381 1001056 1118915 1135178 1179106 1194863 1140596 1090465
4205 1090465 1172816 1055952 927261 1027113 1012367 1015665 1039641 938321 992456 1038343 1073010
4194 1073010 1017899 1089186 1048941 1013901 1079934 1076316 1098884 1062408 1154479 1172281 1122713 1134480
4182 1134480 1188099 1114078 1116072 1153580 1095169 1096898 1131344 1189897 1142825 1030640 1145718
4171 1145718 1249727 1231602 1204865 1207761 1180085 1267801 1264714 1233084 1215023 1256806 1304941 1288207
4159 1288207 1323967 1341724 1349857 1271653 1263774 1258138 1275811 1302207 1343507 1311694 1336891 1371328
4147 1371328 1426658 1379850 1332907 1261503 1176572 1237693 1277925 1237787 1266080 1264133 1248408 1259017
$$ packed form
4228A139428l584j02665L6320o9740K2930L7299k3529R1841K0644K3041j2181
4217A159804K5494m4315l9440l499r0663o325J17859J6263M3928J5757n4267n0131
4205A090465Q2351j16864j28691R9852j4746L298K3976j01320N4135M5887L4667
4194A073010n5111P1287m0245l5040O6033l618K2568l6476R2071J7802m9568J1767
4182A134480N3619p4021J994L7508n8411J729L4446N8553m7072j12185J15078
4171A145718J04009j8125k6737K896k7676Q7716l087l1630j8061M1783M8135j6734
4159A288207L5760J7757Q133p8204p879n636J7673K6396M1300l1813K5197L4437
4147A371328N5330m6808m6943p1404q4931O1121M0232m0138K8293j947j5725J0609
$$ plain form
4135 1259017 1209461 1138425 1122580 1085294 1160938 1336381 1302413 1260057 1153443 1082774 1163025
4124 1163025 1195048 1150037 1328222 1270474 1249967 1301954 1225402 1292631 1363352 1272286 1271699 1259128
4112 1259128 1245532 1180967 1101563 1161285 1178474 1229663 1220199 1161395 1213266 1137794 1185625 1203403
4100 1203403 1206790 1220426 1172244 1288687 1295611 1205311 1258615 1336360 1305026 1270194 1193783 1168014
4088 1168014 1201754 1229471 1171158 1089538 1134179 1137344 1156067 1127314 1163294 1097352 1096175 1149795
4076 1149795 1127806 1196461 1195774 1231918 1150233 1084466 1030190 1186495 1231728 1248418 1245878 1252997
4064 1252997 1219616 1188477 1293579 1300712 1185227 1306675 1307444 1157738 1216692 1261224 1256674
4053 1256674 1286170 1310893 1323788 1307656 1304679 1486192 1539640 1514086 1508595 1588922 1555454 1434825
$$ packed form
4135A259017m9556p1036j5845l7286P5644J75443l3968m2356j06614p0669Q0251
4124A163025L2023m5011J78185n7748k0507N1987p6552O7229P0721r1066n87j2571
4112A259128j3596o4565p9404N9722J7189N1189r464n8804N1871p5472M7831J7778
4100A203403L387J3636m8182J16443O924r0300N3304P7745l1334l4832p6411k5769
4088A168014L3740K7717n8313q1620M4641L165J8723k8753L5980o5942j177N3620
4076A149795k1989O8655o87L6144q1685o5767n4276J56305M5233J6690k540P119
4064A252997l3381l1139J05102P133j15485J21448P69j49706N8954M4532m550
4053A256674K9496K4723J2895j6132k977J81513N3448k5554n491Q0327l3468j20629
$$ plain form
4041 1434825 1414708 1440777 1463340 1514771 1525849 1588432 1593225 1604041 1540383 1655048 1667857
4030 1667857 1614472 1659127 1785417 1748828 1696536 1631712 1763246 1700110 1620376 1748976 1684417
4019 1684417 1761548 1636350 1697330 1785857 1799242 1809759 1846214 1824045 1924902 1891840 2022577
4008 2022577 2010848 2101595 2108428 2058115 2074993 2012409 2037751 1969889 1994816 2093257 2169846 2206728
3996 2206728 2249003 2384876 2318022 2365086 2408980 2456789 2639015 2723267 2794312 2845233 2912449
3985 2912449 2966129 3012105 2930057 2912836 2903030 2936906 2875789 2742882 2777903 2820425 2846827
3974 2846827 2858078 2918092 3067325 3076638 3101662 3245476 3194308 3345794 3416181 3408752 3512297
3963 3512297 3515417 3575966 3639863 3745841 3870780 3897471 4087790 4209531 4266317 4471613 4543909
$$ packed form
4041A434825k0117K6069K2563N1431J1078O2583M793J0816o3658J14665J2809
4030A667857n3385M4655J26290l6589n2292o4824J31534o3136p9734J28600o4559
4019A684417P7131j25198O0980Q8527J3385J0517L6455k2169J00857l3062J30737
4008B022577j1729R0747O833n0313J6878o2584K5342o7862K4927R8441P6589L6882
3996B206728M2275J35873o6854M7064M3894M7809J82226Q4252P1045N0921O7216
3985B912449N3680M5976q2048j7221r806L3876o1117j32907L5021M2522K6402
3974B846827J1251O0014J49233R313K5024J43814n1168J51486P0387p429J03545
3963C512297L120O0549O3897J05978J24939K6691J90319J21741N6786K05296P2296
$$ plain form
3952 4543909 4748085 4840605 4967665 5115060 5145472 5232937 5380976 5525051 5655603 5789384
3942 5789384 5902515 5913523 6089503 6284980 6517618 6560053 6712483 6911658 7122246 7315132
3932 7315132 7491719 7682371 7918955 8143175 8341516 8628793 8865431 9002852 9225710 9451896
3922 9451896 9681459 10096386 10359621 10554640 10799594 11261189 11651755 11861889 12225231 12781998
3912 12781998 13193378 13619472 14118147 14643387 15153778 15665570 16306148 16969175 17709091
3903 17709091 18341677 19041254 19820199 20641576 21532649 22475180 23422750 24542370 25500463
3894 25500463 26665524 27918553 29194528 30592197 31914501 33326124 34877766 36421962
3886 36421962 37987858 39480686 40956989 42620361 44263455 45890057 47640718 49514761
$$ packed form
3952D543909K04176R2520J27060J47395L0412Q7465J48039J44075J30552J33781
3942E789384J13131J1008J75980J95477K32638M2435J52430J99175K10588J92886
3932G315132J76587J90652K36584K24220J98341K87277K36638J37421K22858K26186
3922I451896K29563M14927K63235J95019K44954M61595L90566K10134L63342N56767
3912A2781998M11380M26094M98675N25240N10391N11792O40578O63027P39916
3903A7709091O32586O99577P78945Q21377Q91073R42531R47570J119620R58093
3894B5500463J165061J253029J275975J397669J322304J411623J551642J544196
3886C6421962J565896J492828J476303J663372J643094J626602J750661J874043
$$ plain form
3878 49514761 51326683 53063883 54748654 56573673 58163449 59675716 61223304 62667659
3870 62667659 63868806 65068568 66101981 67073530 68154452 69085159 69895885 70711388 71483842
3861 71483842 72177878 72384040 72509986 72531338 72320326 71899517 71298852 70619436 69745137 68849552
3851 68849552 68023253 66883388 65783529 64690327 63441078 62152770 60622716 59101462
3843 59101462 57438214 55710656 53991830 52149795 50267408 48387630 46555460 44777551
3835 44777551 43019007 41419358 39843527 38255392 36642063 35050439 33491038 32008394
3827 32008394 30682978 29223905 27874157 26630656 25442233 24285803 23142924 22214478
3819 22214478 21377925 20507229 19728780 18937012 18197557 17627923 17072354 16475249 15997034
$$ packed form
3878D9514761J811922J737200J684771J825019J589776J512267J547588J444355
3870F2667659J201147J199762J033413R71549J080922R30707Q10726Q15503P72454
3861G1483842O94036K06162J25946K1352k11012m20809o00665o79416q74299q95585
3851F8849552q26299j139865j099859j093202j249249j288308j530054j521254
3843E9101462j663248j727558j718826j842035j882387j879778j832170j777909
3835D4777551j758544j599649j575831j588135j613329j591624j559401j482644
3827C2008394j325416j459073j349748j243501j188423j156430j142879r28446
3819B2214478q36553q70696p78449p91768p39455n69634n55569n97105m78215
$$ plain form
3810 15997034 15609033 15122842 14698150 14332894 14053002 13901618 13626487 13386083 13207844
3801 13207844 13007942 12872528 12625321 12557917 12461841 12267270 12187125 12029947 11859718 11798221
3791 11798221 11665702 11562415 11504151 11408851 11259886 11119019 11074560 11070923 10874882 10687454
3781 10687454 10479542 10378861 10241934 10034494 9930278 9816479 9656588 9519441 9387663
3772 9387663 9283927 9016114 9003053 8902303 8751592 8506369 8360082 8168289 7990580 7889509
3762 7889509 7645252 7628546 7428052 7394299 7342814 7259885 7162349 7020760 6894091 6788796
3752 6788796 6691923 6556046 6326076 6245998 6266892 6259821 6114563 5953613 5936790 5862223 5915555
3741 5915555 6007791 5983227 6029343 5979997 5860530 5854121 5842825 5778743 5704780 5683763 5616472
$$ packed form
3810A5997034l88001m86191m24692l65256k79892j51384k75131k40404j78239
3801A3207844j99902j35414k47207o7404r6076j94571q0145j57178j70229o1497
3791A1798221j32519j03287n8264r5300j48965j40867m4459l637j96041j87428
3781A0687454k07912j00681j36927k07440j04216j13799j59891j37147j31778
3772I387663j03736k67813j3061j00750j50711k45223j46287j91793j77709j01071
3762G889509k44257j6706k00494l3753n1485q2929r7536j41589j26669j05295
3752F788796r6873j35877k29970q0078K0894p071j45258j60950j6823p4567N3332
3741E915555R2236k4564M6116m9346j19467o409j1296o4082p3963k1017o7291
$$ plain form
3730 5616472 5537808 5492809 5510990 5466905 5393973 5352024 5297606 5315566 5063076 5120527 5129321
3719 5129321 5096733 5039021 5000053 4936804 4867702 4880432 4754395 4702589 4528018 4351577 4402365
3708 4402365 4492408 4559661 4439437 4344143 4264996 4297368 4285857 4210383 4261949 4218475 4226729
3697 4226729 4182705 4188850 4218537 4145278 4126544 4168598 4265142 4282841 4309751 4395074 4271675
3686 4271675 4313296 4373671 4251216 4279117 4432652 4420486 4373144 4359567 4426707 4376709 4474099
3675 4474099 4573567 4553061 4563574 4567619 4587750 4613534 4613333 4574127 4584921 4753210 4721686 4773604
3663 4773604 4802228 4815728 4904909 4881209 4889356 4851210 4724793 4841962 4916742 4950851 4998093
3652 4998093 4970225 5109371 5089757 5105507 5215645 5225247 5288370 5424934 5468420 5561020 5633653
$$ packed form
3730E616472p8664m4999J8181m4085p2932m1949n4418J7960k52490N7451Q794
3719E129321l2588n7712l8968o3249o9102J2730j26037n1806j74571j76441N0788
3708D402365R0043O7253j20224r5294p9147L2372j1511p5474N1566m3474Q254
3697D226729m4024O145K9687p3259j8734M2054R6544J7699K6910Q5323j23399
3686D271675M1621O0375j22455K7901J53535j2166m7342j3577O7140m9998R7390
3675D474099R9468k0506J0513M045K0131K5784k01l9206J0794J68289l1524N1918
3663D773604K8624J3500Q9181k3700Q147l8146j26417J17169P4780L4109M7242
3652D998093k7868J39146j9614J5750J10138R602O3123J36564M3486R2600P2633
$$ plain form
3641 5633653 5685524 5697148 5723758 5882955 5921345 5961532 5989620 6014891 6231187 6264747 6160641
3630 6160641 6218499 6279051 6376726 6421265 6369726 6562173 6563801 6548936 6658227 6761961 6779221
3619 6779221 6913424 7107524 7092050 7261230 7330213 7486635 7552729 7573708 7646530 7665839 7856254
3608 7856254 7915484 8067102 8183082 8378487 8543888 8658020 8881237 8866790 8888740 9031636
3598 9031636 9214087 9395673 9662646 9821109 9791935 9969813 10140578 10355583 10585807 10841528
3588 10841528 10881331 10995763 11220412 11397029 11722352 11905168 12133834 12259442 12532598 12841785
3578 12841785 13147696 13493028 13751315 13931659 14365562 14792114 15035364 15423431 15706535
3569 15706535 15990148 16516444 17070504 17519203 17957863 18505559 19201368 19718818 20399818
$$ packed form
3641E633653N1871J1624K6610J59197L8390M0187K8088K5271K16296L3560j04106
3630F160641N7858O0552R7675M4539n1539J92447J628j4865J09291J03734J7260
3619F779221J34203J94100j5474J69180O8983J56422O6094K0979P2822J9309J90415
3608G856254N9230J51618J15980J95405J65401J14132K23217j4447K1950J42896
3598I031636J82451J81586K66973J58463k9174J77878J70765K15005K30224K55721
3588A0841528L9803J14432K24649J76617L25323J82816K28666J25608K73156L09187
3578A2841785L05911L45332K58287J80344M33903M26552K43250L88067K83104
3569A5706535K83613N26296N54060M48699M38660N47696O95809N17450O81000
$$ plain form
3560 20399818 21275321 21985833 22663391 23485545 24248176 25132880 26052380 27001853 27776545
3551 27776545 28669037 29536117 30374689 31127172 31866280 32743860 33644431 34346744 34970813
3542 34970813 35769932 36667574 37306308 37976498 38563031 39169911 39720110 40070732 40444050
3533 40444050 40639516 40910277 41288680 41518789 41817339 42166481 42535536 42993746 43425196
3524 43425196 44032091 44451810 45026709 45590868 46260076 46916104 47634702 48284647 49092546
3515 49092546 50070317 51229746 52475020 53865426 55264760 56957590 58689927 60647883
3507 60647883 62615765 64857501 67271252 69806346 72547053 75444884 78515914 81719942
3499 81719942 84954253 88388624 91774312 95169570 98589417 102023485 105432767 108645911
$$ packed form
3560B0399818Q75503P10512O77558Q22154P62631Q84704R19500R49473P74692
3551B7776545Q92492Q67080Q38572P52483P39108Q77580R00571P02313O24069
3542C4970813P99119Q97642O38734O70190N86533O06880N50199L50622L73318
3533D0444050J95466K70761L78403K30109K98550L49142L69055M58210M31450
3524D3425196O06895M19719N74899N64159O69208O56028P18598O49945Q07899
3515D9092546R77771J159429J245274J390406J399334J692830J732337J957956
3507F0647883J967882K241736K413751K535094K740707K897831L071030L204028
3499H1719942L234311L434371L385688L395258L419847L434068L409282L213144
$$ plain form
3491 108645911 112077871 115358232 118804555 122353371 125945216 129446942 132915258 136294122
3483 136294122 139660856 142772982 145849524 148680268 151537357 154302872 157127157 159824320
3475 159824320 162567490 165296372 168161914 171258225 174387371 177343230 180288458 183231763
3467 183231763 186252160 189276625 192471584 196064956 200035938 204456087 209505697 215360586
3459 215360586 221757954 228917316 236684218 244960852 253606733 262279710 270696092 278321065
3451 278321065 284610244 289159870 291556321 291841261 290154539 287008494 282833419 278486824
3443 278486824 274152545 269936686 266075185 262550120 258946699 254957885 250333289 244280241
3435 244280241 236622640 227195836 215850987 203282370 189932243 176551960 163506784
$$ packed form
3491A08645911L431960L280361L446323L548816L591845L501726L468316L378864
3483A36294122L366734L112126L076542K830744K857089K765515K824285K697163
3475A59824320K743170K728882K865542L096311L129146K955859K945228K943305
3467A83231763L020397L024465L194959L593372L970982M420149N049610N854889
3459B15360586O397368P159362P766902Q276634Q645881Q672977Q416382P624973
3451B78321065O289179M549626K396451K84940j686722l146045m175075m346595
3443B78486824m334279m215859l861501l525065l603421l988814m624596o053048
3435B44280241p657601r426804j1344849j2568617j3350127j3380283j3045176
$$ plain form
3428 163506784 151124495 139868354 129986759 121232274 113573985 106824303 100926673 96001268
3420 96001268 91594408 87801110 84426373 81540105 78902142 76665695 74642428 72704637
3412 72704637 71018448 69409974 67964501 66667005 65429523 64265108 63199292 62318692
3404 62318692 61529004 60825403 60067506 59241291 58447399 57556747 56707801 55684973 54745609
3395 54745609 53777457 52547407 51264648 50052201 48841276 47668563 46522617 45453469
3387 45453469 44263990 43149932 42070613 40999579 39929693 38847178 37749435 36665576
3379 36665576 35619330 34678839 33731768 32786028 31845541 30996643 30212519 29367193 28777602
3370 28777602 28034726 27303417 26588307 26145005 25716100 25180056 24870450 24445379 23952776
$$ packed form
3428A63506784j2382289j1256141r881595q754485p658289o749682n897630m925405
3420I6001268m406860l793298l374737k886268k637963k236447k023267j937791
3412G2704637j686189j608474j445473j297496j237482j164415j065816q80600
3404F2318692p89688p03601p57897q26215p93892q90652q48946j022828r39364
3395E4745609r68152j230050j282759j212447j210925j172713j145946j069148
3387D5453469j189479j114058j079319j071034j069886j082515j097743j083859
3379C6665576j046246r40491r47071r45740r40487q48898p84124q45326n89591
3370B8777602p42876p31309p15110m43302m28905n36044l09606m25071m92603
$$ plain form
3361 23952776 23624852 23220780 22945879 22616655 22292147 22062243 21783071 21463150 21115419
3352 21115419 20849274 20563269 20294574 20139468 19853534 19622464 19340698 19121118 18932869
3343 18932869 18576800 18342117 18228640 17855448 17506058 17326189 17118780 16972943 16761293
3334 16761293 16548162 16278108 16087082 15918507 15792768 15513278 15253627 15122792 14966569
3325 14966569 14757273 14561388 14512383 14370981 14063720 13834544 13765415 13636236 13472572 13335877
3315 13335877 13168536 13060322 12937376 12854933 12754751 12674148 12630977 12482939 12288557 12186306
3305 12186306 12115442 11874315 11825400 11641233 11590637 11558438 11475698 11557904 11413693 11316510 11249405
3294 11249405 11268274 11196907 11058581 11062829 11039429 11015275 11006795 11019579 11053483 10847799 10774038
$$ packed form
3361B3952776l27924m04072k74901l29224l24508k29904k79172l19921l47731
3352B1115419k66145k86005k68695j55106k85934k31070k81766k19580j88249
3343A8932869l56069k34683j13477l73192l49390j79869k07409j45837k11650
3334A6761293k13131k70054j91026j68575j25739k79490k59651j30835j56223
3325A4966569k09296j95885m9005j41402l07261k29176o9129j29179j63664j36695
3315A3335877j67341j08214j22946q2443j00182q0603m3171j48038j94382j02251
3305A2186306p0864k41127m8915j84167n0596l2199q2740Q2206j44211r7183o7105
3294A1249405J8869p1367j38326M248k3400k4154q480J2784L3904k05684p3761
$$ plain form
3283 10774038 10802479 10718790 10729320 10776105 10711079 10684603 10676922 10738451 10774052 10794599 10814234
3272 10814234 10771288 10809200 10817958 10772412 10769396 10798084 10836039 10850291 10922476 11044141 10958724
3261 10958724 10927717 11029653 11061755 11021946 11008614 11115221 11208501 11324887 11316254 11364580 11446389
3250 11446389 11432989 11451823 11607023 11732118 11865643 11970107 12094928 12271874 12417105 12597503
3240 12597503 12764784 12985286 13295746 13583861 13996434 14311265 14704958 15190974 15736231
3231 15736231 16484035 17179499 17957630 18762941 19464963 20402014 21310047 21924934 22488891
3222 22488891 23002610 23321526 23451511 23515966 23510463 23331643 23272186 23282955 23135468 23048474
3212 23048474 23079124 23001705 22846621 22565071 22217110 21937241 21371353 20732119 19931614 19115006
$$ packed form
3283A0774038K8441q3689J0530M6785o5026k6476p681O1529L5601K0547J9635
3272A0814234m2946L7912Q758m5546l016K8688L7955J4252P2185J21665q5417
3261A0958724l1007J01936L2102l9809j3332J06607R3280J16386q633M8326Q1809
3250A1446389j3400J8834J55200J25095J33525J04464J24821J76946J45231J80398
3240A2597503J67281K20502L10460K88115M12573L14831L93693M86016N45257
3231A5736231P47804O95464P78131Q05311P02022R37051R08033O14887N63957
3222B2488891N13719L18916J29985O4455n503j78820n9457J0769j47487q6994
3212B3048474L0650p7419j55084k81550l47961k79869n65888o39234q00505q16608
$$ plain form
3202 19115006 18389566 17742780 17091946 16592965 16210099 15854093 15525336 15214756 15067844
3193 15067844 15083383 14941883 14739417 14692776 14656136 14595376 14652318 14591689 14564465 14600949 14606245
3182 14606245 14596820 14717871 14756197 14759470 14861888 14896067 14998135 15237062 15212807 15303252 15465135
3171 15465135 15688352 15900493 16135919 16350043 16569102 16887552 17122240 17415643 17662647
3162 17662647 18087859 18474714 18823384 19182551 19659967 20250000 20700227 21301172 21993230
3153 21993230 22491468 23082397 23731748 24357363 25156629 25868679 26610907 27392263 28272102
3144 28272102 29008486 29777774 30609230 31116139 31515936 31675637 31484164 30972942 30403009
3135 30403009 29610186 28665922 27636387 26685597 25970477 25214591 24552412 23955815 23409603
$$ packed form
3202A9115006p25440o46786o50834m98981l82866l56006l28757l10580j46912
3193A5067844J5539j41500k02466m6641l6640o0760N6942o0629k7224L6484N296
3182A4606245r425J21051L8326L273J02418L4179J02068K38927k4255R0445J61883
3171A5465135K23217K12141K35426K14124K19059L18450K34688K93403K47004
3162A7662647M25212L86855L48670L59167M77416N90033M50227O00945O92058
3153B1993230M98238N90929O49351O25615P99266P12050P42228P81356Q79839
3144B8272102P36384P69288Q31456N06909L99797J59701j91473n11222n69933
3135C0403009p92823r44264j029535r50790p15120p55886o62179n96597n46212
$$ plain form
3126 23409603 22979699 22607584 22377417 22159693 22012059 21685788 21426910 21347818 21294543 21353209
3116 21353209 21404503 21640731 21902037 22340941 22969159 23756935 24604932 25544274 26156442 25799088
3106 25799088 24784966 23608019 22527990 21647373 20963252 20160101 19470634 18785155 18288616
3097 18288616 18064984 17766000 17402803 17226456 17076480 17004503 16964238 17182256 17319269 17555465
3087 17555465 17609071 17803631 18086935 18705815 19403141 20191635 21275809 22603069 24085877
3078 24085877 25921593 28239425 29952127 29878606 28382892 26383287 24231595 22323481
3070 22323481 20638877 19237776 17999396 17053068 16270715 15785130 15273989 14929751 14555502
3061 14555502 14261256 14035578 13962818 13900474 13922387 14006006 14262965 14497457 14807112 15367994
$$ packed form
3126B3409603m29904l72115k30167k17724j47634l26271k58878p9092n3275N8666
3116B1353209N1294K36228K61306M38904O28218P87776Q47997R39342O12168l57354
3106B5799088j014122j176947j080029q80617o84121q03151o89467o85479m96539
3097A8288616k23632k98984l63197j76347j49976p1977m0265K18018J37013K36196
3087A7555465N3606J94560K83304O18880O97326P88494J084174J327260J482808
3078B4085877J835716K317832J712702p3521j495714j999605k151692j908114
3070B2323481j684604j401101j238380r46328p82353m85585n11141l44238l74249
3061A4555502k94246k25678p2760o2344K1913Q3619K56959K34492L09655N60882
$$ plain form
3051 15367994 15698979 16323121 17089319 17978542 18885518 20191565 21741226 23414255 24708652
3042 24708652 25390290 26008938 26741046 26234082 23680778 20731465 18448171 16802420 15445054
3033 15445054 14397294 13478116 12901390 12354284 12022287 11759990 11483765 11400870 11342179 11317728
3023 11317728 11357595 11351609 11538417 11721450 11988591 12302777 12882219 13705188 14557632 15715600
3013 15715600 17227041 18885548 18855275 16780733 14644059 12956328 11747034 10784777 10071719
3004 10071719 9476276 8927158 8512821 8067611 7809202 7501497 7199848 6848991 6688390
2995 6688390 6574351 6361449 6324474 6179183 6071081 5958636 5855471 5757529 5807093 5774669
2985 5774669 5771013 5678205 5539094 5463550 5242226 5179587 5051971 4993707 4926977 4875273 4789835
$$ packed form
3051A5367994L30985O24142P66198Q89223R06976J306047J549661J673029J294397
3042B4708652O81638O18648P32108n06964k553304k949313k283294j645751j357366
3033A5445054j047760r19178n76726n47106l31997k62297k76225q2895n8691k4451
3023A1317728L9867n986J86808J83033K67141L14186N79442Q22969Q52444J157968
3013A5715600J511441J658507l0273k074542k136674j687731j209294r62257p13058
3004A0071719n95443n49118m14337m45210k58409l07705l01649l50857j60601
2995F688390j14039k12902l6975j45291j08102j12445j03165r7942M9564l2424
2985E774669l656r2808j39111p5544k21324o2639j27616n8264o6730n1704q5438
$$ plain form
2974 4789835 4618334 4558886 4484116 4434431 4476817 4473234 4362245 4322741 4406864 4427446 4259374
2963 4259374 4272886 4210769 4257808 4122547 4003613 3922278 3935627 4026585 3867340 3831165 3792299
2952 3792299 3810016 3812812 3792153 3842045 3912061 3852463 3850901 3781469 3768205 3739024 3738507 3708853
2940 3708853 3632684 3554761 3531197 3487911 3556030 3610321 3626208 3610493 3679314 3609001 3464909
2929 3464909 3382143 3399206 3384098 3369660 3308925 3375692 3315512 3417530 3417775 3275812 3286307
2918 3286307 3174089 3201546 3197741 3236097 3178536 3151066 3198211 3299594 3333837 3404198 3356008
2907 3356008 3331810 3250490 3223659 3305819 3289781 3407476 3396777 3381906 3448123 3479145 3438412
2896 3438412 3544149 3553476 3546017 3605841 3784064 3787919 3791536 3789988 3862786 4185375 4284205 4237600
$$ packed form
2974D789835j71501n9448p4770m9685M2386l583j10989l9504Q4123K0582j68072
2963D259374J3512o2117M7039j35261j18934q1335J3349R0958j59245l6175l8866
2952C792299J7717K796k0659M9892P0016n9598j562o9432j3264k9181n17k9654
2940C708853p6169p7923k3564m3286O8119N4291J5887j5715O8821p0313j44092
2929C464909q2766J7063j5108j4438o0735O6767o0180J02018K45j41963J0495
2918C286307j12218K7457l805L8356n7561k7470M7145J01383L4243P0361m8190
2907C356008k4198q1320k6831Q2160j6038J17695j0699j4871O6217L1022m0733
2896C438412J05737R327p459N9824J78223L855L617j548P2798L22589R8830m6605
$$ plain form
2884 4237600 4379059 4443185 4480946 4482182 4578163 4636485 4735201 4998732 5077418 5006999 4814219
2873 4814219 4893914 4816719 4794719 4771336 4772907 4754793 4854216 4968203 5101177 5180456 5389091
2862 5389091 5316321 5188792 5161744 5153463 5294899 5344382 5275740 5340180 5561621 5571471 5713972
2851 5713972 5786672 5908563 6118468 6427168 6679481 6899885 7167558 7321908 7350808 7378659
2841 7378659 7373947 7304935 7214857 7128781 7200958 7348234 7502784 7700052 7789677 7832271 7906975
2830 7906975 8080596 8477832 8633694 8511416 8219388 8121807 8043831 8063460 8171854 8077598
2820 8077598 8232784 8363069 8430959 8566386 8685692 8827262 9030230 9261983 9443001 9611904
2810 9611904 9749024 9895784 10115328 10285476 10425543 10706838 10970304 11142084 11367474 11487784
$$ packed form
2884D237600J41459O4126L7761J236R5981N8322R8716K63531P8686p0419j92780
2873D814219P9695p7195k2000k3383J571j8114R9423J13987J32974P9279K08635
2862E389091p2770j27529k7048q281J41436M9483o8642O4440K21441R850J42501
2851E713972P2700J21891K09905L08700K52313K20404K67673J54350K8900K7851
2841G378659m712o9012r0078q6076P2177J47276J54550J97268Q9625M2594P4704
2830G906975J73621L97236J55862j22278k92028r7581p7976J9629J08394r4256
2820H077598J55186J30285O7890J35427J19306J41570K02968K31753J81018J68903
2810I611904J37120J46760K19544J70148J40067K81295K63466J71780K25390J20310
$$ plain form
2800 11487784 11513654 11457493 11446351 11438806 11131242 10836011 10612625 10386800 10142016 9925578
2790 9925578 9860462 9729990 9742090 9795105 9896110 9903446 9964248 10131451 10287004 10416306 10542355
2779 10542355 10719837 10923449 11033065 11056076 11079107 11164076 11118684 11110204 10996899 10751829
2769 10751829 10555852 10282964 9906244 9510308 9208512 8843484 8756387 8585384 8367218 8074639
2759 8074639 7972011 8057472 8042861 7873046 7802828 7809957 7833467 7765685 7713145 7546341 7358882
2748 7358882 7324362 7249214 7098430 7046513 6877012 6595963 6375167 6079347 5834823 5617391
2738 5617391 5352760 5116201 4950432 4723838 4560777 4398648 4272648 4139757 3990317 3899907
2728 3899907 3752613 3692624 3638314 3602524 3583447 3469606 3376270 3370121 3242812 3151278 3080166
$$ packed form
2800A1487784K5870n6161j1142p545l07564k95231k23386k25825k44784k16438
2790I925578o5116j30472J2100N3015J01005P336O0802J67203J55553J29302J26049
2779A0542355J77482K03612J09616K3011K3031Q4969m5392q480j13305k45070
2769A0751829j95977k72888l76720l95936l01796l65028q7097j71003k18166k92579
2759H074639j02628Q5461j4611j69815p0218P129K3510o7782n2540j66804j87459
2748G358882l4520p5148j50784n1917j69501k81049k20796k95820k44524k17432
2738E617391k64631k36559j65769k26594j63061j62129j26000j32891j49440r0410
2728C899907j47294n9989n4310l5790j9077j13841r3336o149j27309r1534p1112
$$ plain form
2717 3080166 2981394 2965473 2849850 2831986 2761952 2695287 2638822 2541553 2476516 2408449 2264672
2706 2264672 2296190 2303254 2277184 2337588 2262350 2152007 2060040 2122816 1987171 2009304 1980416
2695 1980416 1938044 1991211 1850757 1903051 1821241 1823928 1750140 1655768 1611791 1569431 1575694 1657436
2683 1657436 1486528 1508062 1547175 1555241 1499665 1470610 1486745 1443688 1477644 1478544 1430843 1414730
2671 1414730 1370983 1217122 1209916 1261330 1227334 1185186 1192057 1183870 1139458 1187630 1258271 1142509
2659 1142509 1127992 1137040 1163226 1065763 1111451 1072595 1013677 1091753 1047482 1026545 1077027 951464
2647 951464 858647 914028 889102 880211 822565 695646 688290 781104 805710 764213 743523 822264
2635 822264 918307 954359 828560 770129 716131 715589 719677 761445 764437 678395 720034 636145
$$ packed form
2717C080166r8772j5921j15623j7864p0034o6665n6465r7269o5037o8067j43777
2706B264672L1518P064k6070O0404p5238j10343r1967O2776j35645K2133k8888
2695A980416m2372N3167j40454N2294q1810K687p3788r4372m3977m2360O263Q1742
2683A657436j70908K1534L9113Q066n5576k9055J6135m3057L3956R00m7701j6113
2671A414730m3747j53861p206N1414l3996m2148O871q187m4412M8172P0641j15762
2659A142509j4517R048K6186r7463M5688l8856n8918P8076m4271k0937N0482j25563
2647I51464r2817N5381k4926q891n7646j26919p356R2814K4606m1497k0690P8741
2635H22264R6043L6052j25799n8431n3998n42M088M1768K992q6042M1639q3889
$$ plain form
2623 636145 693883 690094 576591 642223 677893 654469 678295 679795 565349 554401 584631 609622
2611 609622 619781 541800 555673 642672 657592 518117 448025 478443 515060 524405 533133 482123
2599 482123 449461 537981 562938 645558 645306 637518 620066 634193 573221 485454 471582 434933
2587 434933 529362 588823 524133 403802 437615 448573 503485 494979 518265 578501 534400 552861
2575 552861 521567 510442 512699 522471 479245 382340 396467 530140 538856 476469 420665 421718
2563 421718 534080 425703 417308 489081 521468 484275 470601 443767 362046 447070 420714
2552 420714 378855 398125 434846 418723 394252 383246 438185 375680 435347 389834 350575 421456
2540 421456 303655 314429 286958 281139 293943 405863 385606 260730 364957 501611 532861
$$ packed form
2623F36145N7738l789j13503O5632L5670k3424K3826J500j14446j0948L0230K4991
2611F09622J0159p7981J3873Q6999J4920j39475p0092L0418L6617R345Q728n1010
2599D82123l2662Q8520K4957Q2620k52p788j7452J4127o0972q7767j3872l6649
2587D34933R4429N9461o4690j20331L3813J0958N4912q506K3286O0236m4101J8461
2575E52861l1294j1125K257R772m3226r6905J4127J33673Q716o2387n5804J053
2563D21718J12362j08377q395P1773L2387l7193j3674k6834q1721Q5024k6356
2552D20714m1859J9270L6721j6123k4471j1006N4939o2505N9667m5513l9259P0881
2540D21456j17801J0774k7471n819J2804J11920k0257j24876J04227J36654L1250
$$ plain form
2529 532861 552185 466113 540798 534514 480302 370872 387872 377476 398129 359773 403418 349502
2517 349502 406439 413992 337230 370862 293091 352652 269050 275580 283425 267780 266748 315408
2505 315408 361522 412583 401369 350805 318952 321063 333967 344618 395549 226810 211261 262275
2493 262275 297669 323125 307702 287187 267729 279768 269303 286707 179355 318348 325810
2482 325810 386363 390268 314267 310361 257682 171783 258666 261190 226447 273492 293764 318352
2470 318352 391618 291384 300220 304473 242240 312603 284088 358772 301869 269044 246695 254134
2458 254134 223848 186031 243690 194510 262186 127843 251293 284822 187549 270663 228538
2447 228538 258336 280486 171829 152234 211403 267006 223457 229389 264289 260895 338020 238428
$$ packed form
2529E32861J9324q6072P4685o284n4212j09430J7000j0396K0653l8356M3645n3916
2517C49502N6937P553p6762L3632p7771N9561q3602O530P845j5645j032M8660
2505C15408M6114N1061j1214n0564l1853K111J2904J0651N0931j68739j5549N1014
2493B62275L5394K5456j5423k0515j9458J2039j0465J7404j07352J38993P462
2482C25810O0553L905p6001l906n2679q5899Q6883K524l4743M7045K0272K4588
2470C18352P3266j00234Q836M253o2233P0363k8515P4684n6903l2825k2349P439
2458B54134l0286l7817N7659m9180O7676j34343J23450L3529r7273Q3114m2125
2447B28538K9798K2150j08657j9595N9169N5603m3549N932L4900l394P7125r9592
$$ plain form
2435 238428 165146 202203 175898 215280 231167 220320 165015 229883 181611 122032 157754 133947
2423 133947 250158 224649 200510 164242 137291 181234 118951 123682 80032 110505 209745 251625
2411 251625 348531 168983 158161 163722 183061 226549 257567 140887 63506 122659 23474
2400 23474 -8175 94063 121012 66357 131154 180984 258045 257699 231927 188524 115378 54501
2388 54501 45560 145650 190682 206476 104611 113275 105242 138945 166049 149932 112190 192296
2376 192296 193383 195428 209224 149467 23622 26934 156540 120576 149927 173249 11850 36234
2364 36234 120131 136065 191838 222735 202484 143751 151386 112143 221523 240623 228968 180570
2352 180570 318036 134159 147664 106696 -8827 123255 131758 159090 132874 202594 50634
$$ packed form
2435B38428p3282L7057k6305L9382J5887j0847n5305O4868m8272n9579L5722k3807
2423A33947J16211k5509k4139l6268k6951M3943o2283M731m3650L0473R9240M1880
2411B51625R6906j79548j0822N561J9339M3488L1018j16680p7381N9153r9185
2400B3474l1649J02238K6949n4655O4797M9830P7061l46k5772m3403p3146o0877
2388E4501q941J00090M5032J5794j01865Q664q033L3703K7104j6117l7742Q0106
2376A92296J087K045J3796n9757j25845L312J29606l5964K9351K3322j61399K4384
2364C6234Q3897J5934N5773L0897k0251n8733P635l9243J09380J9100j1655m8398
2352A80570J37466j83877J3505m0968j15523J32082Q503K7332k6216O9720j51960
$$ plain form
2341 50634 75408 117551 108188 79282 138490 97949 132070 154895 168517 161441 116106 61607
2329 61607 89893 162573 138981 177882 156638 81460 74680 -9489 -57870 -45914 65335 103632
2317 103632 -777 -20958 43972 43811 -7582 120651 59401 112903 171897 185247 140226 172866
2305 172866 193421 147755 177198 206844 141454 105166 97560 102543 131186 221235 259792 114862
2293 114862 152840 150088 132565 28962 20556 38641 120050 227088 74771 213275 193997
2282 193997 126505 72497 78680 -29726 -28758 1696 84120 113892 51866 318503 282906 287263
2270 287263 240025 232534 282299 171872 122472 145419 165118 78508 118397 88039 37829 89479
2258 89479 -18036 -99264 33374 103486 93847 81956 131181 18956 -54621 -18725 19416
$$ packed form
2341E0634K4774M2143r363k8906N9208m0541L4121K2825J3622p076m5335n4499
2329F1607K8286P2680k3592L8901k1244p5178o780q4169m8381J1956J11249L8297
2317A03632j04409k0181O4930j61n1393J28233o1250N3502N8994J3350m5021L2640
2305A72866K0555m5666K9443K9646o5390l6288p606M983K8643R0049L8557j44930
2293A14862L7978k752j7523j03603q406J8085Q1409J07038j52317J38504j9278
2282A93997o7492n4008O183j08406R68L0454Q2424K9772o2026K66637l5597M357
2270B87263m7238p491M9765j10427m9400K2947J9699q6610L9889l0358n0210N1650
2258H9479j07515q1228J32638P0112r639j1891M9225j12225p3577L5896L8141
$$ plain form
2247 19416 79601 113165 121429 144042 111405 93887 74846 55899 74315 61403 82387 163250
2235 163250 164005 98133 237163 180307 138223 65865 135091 151108 128954 84345 57502 155506
2223 155506 69370 -8319 82507 70680 40899 46971 50201 118293 55978 10174 49261 7568
2211 7568 -28669 82566 114825 53285 140707 170162 153273 173276 97552 32737 90316 101071
2199 101071 13038 -60861 41560 -659 -24825 78991 59083 13446 103881 61934 70892
2188 70892 79997 87452 123128 98902 71003 63610 89200 76747 77516 -17515 54138 127503 163431
2175 163431 100761 131983 133310 127280 57887 22370 -5720 58277 27038 -21468 36847 69415
2163 69415 52371 33677 59649 156709 201793 129625 -7178 32184 179388 160044 -15794
$$ packed form
2247A9416O0185L3564Q264K2613l2637j7518j9041j8947J8416j2912K0984Q0863
2235A63250P55o5872J39030n6856m2084p2358O9226J6017k2154m4609k6843R8004
2223A55506q6136p7689R0826j1827k9781O072L230O8092o2315m5804L9087m1693
2211G568l6237J11235L2259o1540Q7422K9455j6889K0003p5724o4815N7579J0755
2199A01071q8033p3899J02421m2219k4166J03816j9908m5637R0435m1947Q958
2188G0892R105P455L5676k4226k7899p393K5590j2453P69r5031P1653P3365L5928
2175A63431o2670L1222J327o030o9393l5517k8090O3997l1239m8506N8315L2568
2163F9415j7044j8694K5972R7060M5084p2168j36803L9362J47204j9344j75838
$$ plain form
2152 -15794 80323 138945 51723 64428 27185 -11735 22010 95427 122190 254495 149118
2141 149118 162053 228350 256170 294123 183378 220677 244456 272405 124335 67490 155053
2130 155053 149771 253575 180971 171946 158215 247005 158477 86772 147294 199527 251696 198223
2118 198223 171057 201209 257092 187689 169502 223574 343004 311568 220704 200613 315653
2107 315653 312528 202273 119475 130940 275420 255326 293108 289871 265571 368080 460945
2096 460945 433341 400425 464222 380367 346289 378337 375150 354828 337015 377583 405380 440366
2084 440366 520870 604963 545579 657731 770388 663174 569962 640769 679358 810597 729253
2073 729253 682023 801901 856830 933866 861706 982171 984827 1036818 1022770 881495 893785
$$ packed form
2152a5794R6117N8622q7222J2705l7243l8920L3745P3417K6763J32305j05377
2141A49118J2935O6297K7820L7953j10745L7299K3779K7949j48070n6845Q7563
2130A55053n282J03804p2604r025j3731Q8790q8528p1705O0522N2233N2169n3473
2118A98223k7166L0152N5883o9403j8187N4072J19430l1436r0864k0091J15040
2107C15653l125j10255q2798J1465J44480k0094L7782l237k4300J02509R2865
2096D60945k7604l2916O3797q3855l4078L2048l187k0322j7813M0568K7797L4986
2084D40366Q0504Q4093n9384J12152J12657j07214r3212P0807L8589J31239q1344
2073G29253m7230J19878N4929P7036p2160J20465K656N1991j4048j41275J2290
$$ plain form
2062 893785 1003105 1056288 971962 1015025 1084411 1103278 1247289 1302959 1284030 1287247 1366751
2051 1366751 1425800 1426557 1487949 1594642 1598965 1603746 1621765 1631058 1703721 1764769 1790981 1876245
2039 1876245 2022270 2120544 2161812 2158419 2276595 2277643 2348921 2492929 2664922 2620880 2742408
2028 2742408 2977416 3166205 3250731 3348576 3568450 3912137 3949781 4174141 4612514 5087366
2018 5087366 5666772 6253948 6503766 6897479 7285441 7852684 8344767 9060632 9975618 11130705
2008 11130705 12696360 14817096 16983457 19420863 22759596 28320522 33280768 29589964
2000 29589964 23177424 18687982 15513974 13163936 11149911 9598064 8309628 7370789
1992 7370789 6647051 5862977 5380777 5032498 4700943 4488898 4088064 3741534 3365894 3023055
$$ packed form
2062H93785J09320N3183q4326M3063O9386J8867J44011N5670j8929L217P9504
2051A366751N9049P57O1392J06693M323M781J8019R293P2663O1048K6212Q5264
2039A876245J46025R8274M1268l393J18176J048P1278J44008J71993m4042J21528
2028B742408K35008J88789Q4526R7845K19874L43687L7644K24360M38373M74852
2018E087366N79406N87176K49818L93713L87962N67243M92083P15865R14986J155087
2008A1130705J565655K120736K166361K437406L338733N560926M960246l690804
2000B9589964o412540m489442l174008k350038k014025j551847j288436r38839
1992G370789p23738p84074m82200l48279l31555k12045m00834l46530l75640l42839
$$ plain form
1982 3023055 2845384 2696298 2389175 2163170 2024353 1999484 1871523 1816437 1696936 1665401
1972 1665401 1544034 1430619 1393253 1379660 1285665 1174154 1160021 1163014 1132204 987010 908919
1961 908919 804831 825105 787688 843395 828622 840179 868374 745036 758299 740903 666230
1950 666230 591312 561789 549878 495280 605173 696860 514111 528179 498306 546466 623959
1939 623959 493872 470914 506821 482272 354720 401805 365152 456394 449237 461375 474135
1928 474135 368665 291133 365298 420254 316856 387486 394954 386313 279367 214717 251868
1917 251868 233528 275230 256901 244343 225231 340296 334096 306133 313148 218487 163253 251821
1905 251821 181841 134736 127991 167196 189932 194531 188365 128433 115386 23646 110990 75766
$$ packed form
1982C023055j77671j49086l07123k26005j38817k4869j27961n5086j19501l1535
1972A665401j21367j13415l7366j3593r3995j11511j4133K993l0810j45194p8091
1961I08919j04088K0274l7417N5707j4773J1557K8195j23338J3263j7396p4673
1950F66230p4918k9523j1911n4598J09893R1687j82749J4068k9873M8160P7493
1939F23959j30087k2958L5907k4549j27552M7085l6653R1242p157J2138J2760
1928D74135j05470p7532P4165N4956j03398P0630P468q641j06946o4650L7151
1917B51868j8340M1702j8329j2558j9112J15065o200k7963P015r4661n5234Q8568
1905B51821o9980m7105o745L9205K2736M599o166n9932j3047r1740Q7344l5224
$$ plain form
1893 75766 44097 55575 111843 19014 100867 125307 107716 64806 118984 115129 107323 81422
1881 81422 18196 127597 191128 132052 27395 79676 154657 26386 7655 44486 157531
1870 157531 159573 24081 -9913 -98490 -69416 34662 12733 -56903 40781 53616 -8667
1859 -8667 118632 173157 143346 133564 168229 156262 170516 133700 30592 83102 38919 -12834
1847 -12834 111496 103687 137111 -37644 -74927 14236 -90247 13721 122105 74737 145566
1836 145566 41415 38724 -11314 -37875 9569 14302 54004 -3850 13024 22324 53878 208107
1824 208107 310685 196384 40965 35443 71843 11247 35375 42790 -12911 -19612 -55661 -6798
1812 -6798 -14887 12581 -10414 -35676 -85998 -31071 60222 71397 24808 25435 -15638 -21692 -12914
$$ packed form
1893G5766l1669J1478N6268r2829Q1853K4440j7591m2910N4178l855p806k5901
1881H1422o3226J09401O3531n9076j04657N2281P4981j28271j8731L6831J13045
1870A57531K042j35492l3994q8577K9074J04078k1929o9636R7684J2835o2283
1859h667J27299N4525k9811r782L4665j1967J4254l6816j03108N2510m4183n1753
1847a2834J24330p809L3424j74755l7283Q9163j04483J03968J08384m7368P0829
1836A45566j04151k691n0038k6561M7444M733L9702n7854J6874R300L1554J54229
1824B08107J02578j14301j55419n522L6400o0596K4128P415n5701o701l6049M8863
1812f798q089K7468k2995k5262n0322N4927R1293J1175m6589O27m1073o054Q778
$$ plain form
1799 -12914 -36934 -49126 -65984 -12481 -21136 8102 154745 156440 5445 62015 38996 141820
1787 141820 95144 46693 102358 142350 63709 57199 70566 78386 -25685 -40457 41760 75880
1775 75880 84085 86229 -67546 53735 29017 12941 42280 11328 13436 -11658 -34161 12480
1763 12480 64349 58334 10440 10123 -127399 -42405 86609 120390 82145 74210 -22507 67348
1751 67348 46807 -58549 -71051 -122542 -66024 57634 79326 -24404 20875 102736 23975
1740 23975 -44019 -28209 -27393 85346 192151 128560 98031 221246 131894 45763 134140 140057
1728 140057 134916 54599 -21805 -7491 -67585 79525 87104 69127 73178 11038 -462 -17114
1716 -17114 -4419 100952 2920 66757 7777 -189057 -113723 20 -34535 -20319 36974
$$ packed form
1799a2914k4020j2192j6858N3503q655K9238J46643J695j50995N6570k3019J02824
1787A41820m6676m8451N5665L9992p8641o510J3367P820j04071j4772Q2217L4120
1775G5880Q205K144j53775J21281k4718j6076K9339l0952K108k5094k2503M6641
1763A2480N1869o015m7894l17j37522Q4994J29014L3781l8245p935r6717Q9855
1751F7348k0541j05356j2502n1491N6518J23658K1692j03730M5279Q1861p8761
1740B3975o7994J5810Q16J12739J06805o3591l0529J23215q9352q6131Q8377N917
1728A40057n141q0317p6404J4314o0094J47110P579j7977M051o2140j1500j6652
1716a7114J2695J05371r8032O3837n8980j96834P5334J13743l4555J4216N7293
$$ plain form
1705 36974 -199509 -165253 -1895 -55865 -103904 -139843 -53828 32680 92010 59303 -10913
1694 -10913 -29484 94135 -9428 63590 112221 119658 65843 36431 -126029 -112215 -10307
1683 -10307 25951 -78451 -114648 -149810 -122709 -2505 4088 2803 -11027 -132804 -16022
1672 -16022 1903 -103701 -136250 -27812 23814 -75571 -14636 -22392 -28795 -57190 -117596 -26271
1660 -26271 39093 -199 102884 61792 15754 -37921 -83134 -57026 -50891 -88768 -102229 49108
1648 49108 144957 178022 112965 63502 85203 429 -24447 -51294 -101501 -169186 -9709 -48952
1636 -48952 -72257 -52562 31088 7206 24778 102316 38694 -106504 -120797 -52397 -469 -26738
1624 -26738 -4261 -97952 -56522 -10817 -100649 42150 71737 -6901 -27019 -8283 -50878 -22999
$$ packed form
1705C6974k36483L4256J63358n3970m8039l5939Q6015Q6508N9330l2707p0216
1694a0913j8571J23619j03563P3018M8631P437n3815k9412j62460J3814J01908
1683a0307L6258j04402l6197l5162K7101J20204O593j285j3830j21777J16782
1672a6022J7925j05604l2549J08438N1626r9385O0935p756o403k8395o0406R1325
1660b6271O5364l9292J03083m1092m6038n3675m5213K6108O135l7877j3461J51337
1648D9108R5849L3065o5057m9463K1701q4774k4876k6847n0207o7685J59477l9243
1636d8952k3305J9695Q3650k3882J7572P7538o3622j45198j4293O8400N1928k6269
1624b6738K2477r3691M1430M5705q9832J42799K9587p8638k0118J8736m2595K7879
$$ plain form
1612 -22999 -18064 -93972 -126530 -128756 -114550 -3698 -19323 -61049 -78676 -31491 -111484 -141696
1600 -141696 -8838 -6196 -26941 -134383 -128216 -42978 -116758 -23832 -42622 -66671 23057 80740
1588 80740 60040 -48553 -23832 26253 -24522 -28492 21200 -13599 -141538 -112598 -146684 -153693
1576 -153693 -113609 -86409 -5938 44271 51928 -73340 -70952 -85257 -21649 28753 27213 -44610
1564 -44610 -76193 -61642 -9862 -102163 -144796 -45388 -14832 -52132 14832 16989 24898 -9944
1552 -9944 -13064 -32469 -28837 -18959 -74154 -8011 -107517 -121061 -38859 -21127 17379 52071 -948
1539 -948 -63035 -24548 -10330 -11895 -21513 -125174 -106065 -77369 -74011 -65796 -10747 -60217 -130713
1526 -130713 -24505 -9826 -26038 2033 -26992 -109717 -83433 -114748 -27213 15826 55071
$$ packed form
1612b2999M935p5908l2558k226J4206J10852j5625m1726j7627M7185p9993l0212
1600a41696J32858K642k0745j07442O167Q5238p3780R2926j8790k4049Q9728N7683
1588H0740k0700j08593K4721N0085n0775l970M9692l4799j27939K8940l4086p009
1576a53693M0084K7200Q0471N0209P657j25268K388j4305O3608N0402j540p1823
1564d4610l1583J4551N1780r2301m2633R9408L0556l7300O6964K157P909l4842
1552i944l120j9405L632R878n5195O6143r9506j3544Q2202J7732L8506L4692n3019
1539i48o2087L8487J4218j565r618j03661J9109K8696L358Q215N5049m9470p0496
1526a30713J06208J4679j6212K8071k9025q2725K6284l1315Q7535M3039L9245
$$ plain form
1515 55071 -18446 -141955 -157410 -91837 -6114 -15343 -74633 -105595 -95147 -19907 2426 1508
1503 1508 12050 26446 38520 49046 15261 -894 26494 -3330 -81059 -80965 -158695 -64064 28026
1490 28026 -131621 -107342 -131585 -80279 -12112 76719 -529 -123902 -72567 59991 20741
1479 20741 40275 84959 62282 43854 96536 93678 -55831 -99826 -55716 -116154 -169747 -214017
1467 -214017 -108735 -73234 -93965 -66998 -26775 -29545 38929 20560 17298 60236 -81780 -91753
1455 -91753 -106745 -47776 60276 59145 -38136 -140903 -121169 -34293 -79154 -171182 -141025 -196866
1443 -196866 -101243 8886 -95853 -44781 70081 104462 91250 80173 65003 3777 -39916
1432 -39916 -133979 -175084 -140080 -69080 -71737 90197 55128 -55947 -18441 -8316 -37231 -129464
$$ packed form
1515E5071p3517j23509j5455O5573Q5723r229n9290l0962J0448P5240K2333r18
1503A508J0542J4396J2074J0526l3785j6155K7388k9824p7729R4p7730R4631R2090
1490B8026j59647K4279k4243N1306O8167Q8831p7248j23373N1335J32558l9250
1479B0741J9534M4684k2677j8428N2682k858j49509m3995M4110o0438n3593m4270
1467b14017J05282L5501k0731K6967M0223k770O8474j8369l262M2938j42016r973
1455i1753j4992N8969J08052j131r7281j02767J9734Q6876m4861r2028L0157n5841
1443a96866R5623J10129j04739N1072J14862L4381j3212j1077j5170o1226m3693
1432c9916r4063m1105L5004P1000k657J61934l5069j11075L7506J0125k8915r2233
$$ plain form
1420 -129464 -190239 -200785 -165739 -218951 -65597 64839 30721 54212 58430 -23656 -77862
1409 -77862 -33946 -103811 -30602 21205 99017 142159 97355 -926 -130277 18185 -36493
1398 -36493 -63513 -32609 -80374 14924 -14948 -116705 -151889 -74415 -113461 -44452 -51087 -106948
1386 -106948 -24260 -8045 -6126 119846 -20511 -60341 27188 -15996 -21160 -138394 -85877
1375 -85877 -70568 -50677 -39061 -41250 -189306 -128764 -43852 -11572 10796 12684 -35825 -91240
1363 -91240 -51305 -32179 -155963 -91092 -36243 -149995 -24473 -31563 -14637 108133 6723
1352 6723 179779 101062 120402 93634 -42987 -15135 -63586 -10093 -17423 -125503 -180903 -140361
1340 -140361 -15065 66203 -24908 48183 86210 -76007 -103877 12692 15038 23890 34447
$$ packed form
1420a29464o0775j0546L5046n3212J53354J30436l4118K3491M218q2086n4206
1409g7862M3916o9865P3209N1807P7812M3142m4804r8281j29351J48462n4678
1398c6493k7020L0904m7765R5298k9872j01757l5184P7474l9046O9009o635n5861
1386a06948Q2688J6215J919J25972j40357l9830Q7529m3184n164j17234N2517
1375h5877J5309J9891J1616k189j48056O0542Q4912L2280K2368J888m8509n5415
1363i1240L9935J9126j23784O4871N4849j13752J25522p090J6926J22770j01410
1352F723J73056p8717J9340k6768j36621K7852m8451N3493p330j08080n5400M0542
1340a40361J25296Q1268r1111P3091L8027j62217k7870J16569K346Q852J0557
$$ plain form
1329 34447 -6246 -43899 -60398 -6838 14421 -26201 -214632 -157163 -128693 -207325 -80789
1318 -80789 -12821 30089 13370 6866 -33419 -89003 -59407 -77943 -53779 -82080 -141176 6220
1306 6220 158545 56114 -2458 -62163 -96785 -79 -66550 -14610 -36643 21064 -57777 -112544
1294 -112544 -34131 -44756 -5324 67143 -41639 -80475 37792 -24888 -120764 -58579 -31162
1283 -31162 78995 9495 -96228 -41679 -20667 -78883 -148634 -84953 -109155 -90143 -23907
1272 -23907 15365 -6994 83369 15081 30894 42304 -16631 -53810 -66602 -147803 -91952 -122693
1260 -122693 -33653 17807 -75440 -43744 -71270 -179501 -139247 -69643 -66173 38859 10314
1249 10314 -94244 -58221 -49348 -113327 -85500 9219 51923 -48929 15801 -11481 -25532 26181
$$ packed form
1329C4447m0693l7653j6499N3560K1259m0622j88431N7469K8470p8632J26536
1318h0789O7968M2910j6719o504m0285n5584K9596j8536K4164k8301n9096J47396
1306F220J52325j02431n8572n9705l4622R6706o6471N1940k2033N7707p8841n4767
1294a12544P8413j0625L9432P2467j08782l8836J18267o2680r5876O2185K7417
1283c1162J10157o9500j05723N4549K1012n8216o9751O3681k4202J9012O6236
1272b3907L9272k2359R0363o8288J5813J1410n8935l7179j2792q1201N5851l0741
1260a22693Q9040N1460r3247L1696k7526j08231M0254O9604L470J05032k8545
1249A0314j04558L6023Q873o3979K7827R4719M2704j00852O4730k7282j4051N1713
$$ plain form
1237 26181 36378 -15083 28712 27427 -53152 -22198 39344 3553 3117 -10312 14818 -63887
1225 -63887 -9518 2519 -82596 -32971 74853 92180 -39481 -29817 91153 74533 -8666
1214 -8666 -94050 -144340 -11433 86397 22916 33995 -63311 40877 51412 -3711 -15131 57524
1202 57524 30301 -59105 -64856 15263 -90292 -177779 -127570 -132184 -25888 47015 67364 60835
1190 60835 19898 -100565 -6398 7708 -17630 11208 26108 24816 10644 -1110 -45821 39837
1178 39837 -14756 -82154 -139928 -133443 -71250 -19466 -26937 -96299 -91607 -80317 -160573 -175729
1166 -175729 -160332 -74499 10084 -80927 -128725 -198540 -151645 -131332 -145081 -144359 53956 110344
1154 110344 156654 89360 88106 -96760 -136854 -117635 -128195 8543 -23257 -24475 -15946 -133126
$$ packed form
1237B6181J0197n1461M3795j285q0579L0954O1542l5791m36j3429K5130p8705
1225f3887N4369J2037q5115M9625J07824J7327j31661R664J20970j6620q3199
1214h666q5384n0290J32907R7830o3481J1079r7306J04188J0535n5123j1420P2655
1202E7524k7223q9406n751Q0119j05555q7487N0209m614J06296P2903K0349o529
1190F0835m0937j20463R4167J4106k5338K8838J4900j292j4172j1754m4711Q5658
1178C9837n4593o7398n7774O485O2193N1784p471o9362M692J1290q0256j5156
1166a75729J5397Q5833Q4583r1011m7798o9815M6895K0313j3749P22J98315N6388
1154A10344M6310o7294j254j84866m0094J9219j0560J36738l1800j218Q529j17180
$$ plain form
1142 -133126 -96301 -86708 17125 -29271 -105674 -130418 -30993 -3253 -55245 21070 -80082
1131 -80082 -59634 -56300 -57786 -108001 -51489 -78190 -105690 -54630 54328 24509 -16684 19881
1119 19881 -18168 25234 24067 -21245 -17484 -17608 49925 12066 -112966 -106017 -69519 -92080 -29388
1106 -29388 11599 -78315 -39117 18206 -54298 -11756 76980 13925 -44903 -46191 -52425 -113194
1094 -113194 -15999 25179 34692 -61588 -39264 30724 -19545 -12327 -16048 -25442 37177 2633
1082 2633 -29252 -13627 -8580 -4719 -59519 -20505 35758 -37268 -39807 -48440 676 34703 24183
1069 24183 13365 -104686 -64037 100719 162068 30656 -41639 66540 63865 -165012 -61441
1058 -61441 -77257 -24600 -81712 -196561 -225231 -47746 52528 14903 129014 101236 97171
$$ packed form
1142a33126L6825R593J03833m6396p6403k4744R9425K7740n1992P6315j01152
1131h0082K0448L334j486n0215N6512k6701k7500N1060J08958k9819m1193L6565
1119A9881l8049M3402j167m5312L761j24O7533l7859j25032O949L6498k2561O2692
1106b9388M0987q9914L9198N7323p2504M2542Q8736o3055n8828j288o234o0769
1094a13194R7195M1178R513r6280K2324O9988n0269P218l721r394O2619l4544
1082B633l1885J5625N047L861n4800L9014N6263p3026k539q633M9116L4027j0520
1069B4183j0818j18051M0649J64756O1349j31412p2295J08179k675k28877J03571
1058f1441j5816N2657n7112j14849k8670J77485J00274l7625J14111k7778m065
$$ plain form
1047 97171 210862 116024 -36686 -89305 -33082 26934 85124 -36112 -23587 112980 96295
1036 96295 -16941 -35814 1808 -127095 -93190 -63416 -72326 -21276 -55424 -89298 34023
1025 34023 97407 35955 3284 -37932 -18248 128953 256349 270900 56370 -17951 14016
1014 14016 88978 -101419 -22135 6380 3354 87268 -10329 -20163 -38088 -55634 23477 43408
1002 43408 13468 -48925 -33332 -15358 -9787 38460 -41306 9107 -54435 -77195 -33240 -83805
990 -83805 -126977 -212070 -82685 13310 -20507 -128193 -65434 5116 -105211 -9795 114386
979 114386 121323 -57449 -26996 -77023 -67749 47328 29740 -131663 -68875 -74309 -43585 -5303
967 -5303 -15708 110392 113534 120056 75137 43909 78070 -1649 -56723 -30189 -101147 -35596
$$ packed form
1047I7171J13691r4838j52710n2619N6223O0016N8190j21236J2525J36567j6685
1036I6295j13236j8873L7622j28903L3905K9774q910N1050l4148l3874J23321
1025C4023O3384o1452l2671m1216J9684J47201J27396J4551k14530p4321L1967
1014A4016P4962j90397P9284K8515l026Q3914r7597r834j7925j7546P9111J9931
1002D3408k9940o2393J5593J7974N571M8247p9766N0413o3542k2760M3955n0565
990h3805m3172q5093J29385R5995l3817j07686O2759P0550j10327R5416J24181
979A14386O937j78772L0453n0027R274J15077j7588j61403O2788n434L0724L8282
967e303j0405J26100L142O522m4919l1228L4161p9719n5074K6534p0958O5551
$$ plain form
955 -35596 18027 29099 83161 37829 27114 -2095 -75566 83017 115556 -8373 97560
944 97560 28889 -5527 49350 92814 106563 105263 111776 19933 26595 30249 18989 2965 -38381
931 -38381 -12085 47302 47466 30885 14571 -41118 -92072 -157033 -126324 -29623 25558 31658 47891
918 47891 61474 -5958 3596 45530 1364 -15467 32639 31008 -18937 -25245 -101714 -33916 86412
905 86412 85439 -20090 -15817 52902 -144568 -87800 -19940 -13043 -47806 -96083 -84977 -34900
893 -34900 36411 93680 94408 43086 22516 86893 -31915 783 40407 25642 -32995 -49379
881 -49379 -46101 -66217 36493 -54502 -85482 -8808 -52742 -27800 69773 94374 -5172 -37927
869 -37927 36071 -51786 -133573 -65807 -52230 14450 140492 177125 47409 8121 48343 98569
$$ packed form
955c5596N3623J1072N4062m5332j0715k9209p3471J58583L2539j23929J05933
944I7560o8671l4416N4877M3464J3749j300O513r1843O662L654j1260j6024m1346
931c8381K6296N9387J64j6581j6314n5689n0954o4961L0709R6701N5181O100J6233
918D7891J3583o7432R554M1934m4166j6831M8106j631m9945o308p6469O7798J20328
905H6412r73j05529M273O8719j97470N6768O7860O897l4763m8277J1106N0077
893c4900P1311N7269P28n1322k0570O4377j18808L2698L9624j4765n8637j6384
881d9379L278k0116J02710r0995l0980P6674m3934K4942R7573K4601r9546l2755
869c7927P3998q7857q1787O7766J3577O6680J26042L6633j29716l9288M0222N0226
$$ plain form
857 98569 78692 43939 47719 21699 -15522 34387 107523 -2524 -45527 66664 122017 42964
845 42964 53837 49679 21013 72289 40978 58372 74503 63236 124459 68661 183814 99704
833 99704 75157 43444 1169 -5926 -16650 107377 4987 16746 77183 63965 20347 21486
821 21486 -59484 26700 90928 57317 74332 -29186 19785 67101 -50693 -73211 -12870 121943
809 121943 46686 -93077 -38878 -14343 -28917 -67936 -102933 -133090 -160810 -93572 87409
798 87409 32630 41403 -63627 -157148 -19378 -47778 -99639 -21070 4018 -22587 -55445 26693
786 26693 1920 15713 -19624 66402 145483 147213 108889 95389 138916 41616 -19700 6249
774 6249 -71609 6586 125458 -34576 -81880 -34151 -55059 -96541 -27501 -16186 -36128 -14472
$$ packed form
857I8569j9877l4753L780k6020l7221M9909P3136j10047m3003J12191N5353p9053
845D2964J0873m158k8666N1276l1311J7394J6131j1267O1223n5798J15153q4110
833I9704k4547l1713m2275p095j0724J24027j02390J1759O0437j3218m3618J139
821B1486q0970Q6184O4228l3611J7015j03518M8971M7316j17794k2518O0341J34813
809A21943p5257j39763N4199K4535j4574l9019l4997l0157k7720O7238J80981
798H7409n4779Q773j05030r3521J37770k8400n1861P8569K5088k6605l2858Q2138
786B6693k4773J3793l5337Q6026P9081J730l8324j3500M3527r7300o1316K5949
774F249p7858P8195J18872j60034m7304M7729k0908m1482O9040J1315j9942K1656
$$ plain form
762 -14472 45732 55040 -43018 -23740 -145095 -83684 -16267 17478 105428 85232 30804 -42846
750 -42846 -17286 11785 48288 -42940 -93064 -78377 -101065 46367 70662 -86369 -51984 -93592
738 -93592 -36046 91659 -15514 55020 164381 100975 165690 105951 -67815 -128432 -84434
727 -84434 -29176 -84966 -29359 99460 -5898 -130505 -96169 -20572 -32633 -5854 -53515
716 -53515 -61425 -37216 -54855 -6380 2047 86516 84346 82718 -78171 -64294 -18325 -128427
704 -128427 -8334 -53972 7828 55042 118925 7621 -74811 -24418 -134422 -145393 -73666
693 -73666 2077 287 22091 95361 -59116 -36124 -65335 -69032 -11228 52830 72308 132488
681 132488 84151 47223 47472 -4255 -9465 -14843 -69469 -128977 -151917 -100666 -8044 -70628 -64231
$$ packed form
762a4472O0204R308r8058J9278j21355O1411O7417L3745Q7950k0196n4428p3650
750d2846K5560K9071L6503r1228n0124J4687k2688J47432K4295j57031L4385m1608
738i3592N7546J27705j07173P0534J09361o3406O4715n9739j73766o0617M3998
727h4434N5258n5790N5607J28819j05358j24607L4336P5597j2061K6779m7661
716e3515p910K4209j7639M8475Q427Q4469k170j628j60889J3877M5969j10102
704a28427J20093m5638O1800M7214O3883j11304q2432N0393j10004j0971P1727
693g3666P5743j790K1804P3270j54477K2992k9211l697N7804O4058J9478O0180
681A32488m8337l6928K49n1727n210n378n4626n9508k2940N1251R2622o2584O397
$$ plain form
668 -64231 12305 73380 -3040 -10777 -43231 85298 -4412 -34043 -1796 -91587 -6083 -42424
656 -42424 -34624 7813 122836 37270 -43499 11098 -53892 -1056 56882 14585 50919 14799
644 14799 -87545 -54613 -102612 -131392 -75014 -35329 14404 40519 64800 19852 60574 52991
632 52991 20176 90013 16620 -21253 35638 34026 34013 46629 72466 81541 -19908 36108 -23222
619 -23222 -82057 -63884 -25677 6551 80205 61998 138199 168647 76240 -15199 -90453 -57580
607 -57580 -18154 4247 -68234 -93513 50506 87805 34342 51932 103890 37866 -37352 8897
595 8897 -19036 -68242 -78286 -29610 17506 20732 -24650 2286 -76741 -45739 -16782 -111517
583 -111517 -11357 -21984 -64931 3936 104425 145066 -15245 -33281 -28265 -79591 -33944
$$ packed form
668f4231P6536O1075p6420p737l2454J28529q9710k9631L2247q9791Q5504l6341
656d2424P800M2437J15023q5566q0769N4597o4990N2836N7938m2297L6334l6120
644A4799j02344L2932m7999k8780N6378L9685M9733K6115K4281m4948M0722p583
632E2991l2815O9837p3393l7873N6891j612j3J2616K5837R075j01449N6016n9330
619b3222n8835J8173L8207L2228P3654j8207P6201L0448r2407r1439p5254L2873
607e7580L9426K2401p2481k5279J44019L7299n3463J7590N1958o6024p5218M6249
595H897k7933m9206j0044M8676M7116L226m5382K6936p9027L1002K8957r4735
583a11517J00160j0627m2947O8867J00489M0641j60311j8036N016n1326M5647
$$ plain form
572 -33944 2095 -25669 16881 -21347 -69327 -26936 -66072 -33190 78277 80772 166267 183588
560 183588 128010 72747 -100471 -146647 -111485 -104445 -165070 -24843 77114 -64897 -13475
549 -13475 65095 -43515 27812 54576 81492 101020 55109 9353 -2943 3623 -55942 23739
537 23739 39180 18037 89341 16114 51296 -4565 -65955 -45624 -30771 16396 -89051 -132567
525 -132567 -33552 -59699 -64924 58245 83277 -28548 -11691 -29081 -94241 -72320 -97877 11706
513 11706 41772 58304 146308 18091 -29285 -15257 -1937 2982 70914 139991 78034 5047
501 5047 4942 116773 62309 10167 -80694 -12078 -32541 -58190 7937 54644 -31781 3913
489 3913 32348 26415 48570 -20102 27118 58725 -96851 -3398 2680 55951 -3340 82907
$$ packed form
572c3944L6039k7764M2550l8228m7980M2391l9136L2882J11467K495Q5495J7321
560A83588n5578n5263j73218m6176L5162P040o0625J40227J01957j42011N1422
549a3475P8570j08610P1327K6764K6916J9528m5911m5756j2296O566n9565P9681
537B3739J5441k1143P1304p3227L5182n5861o1390K0331J4853M7167j05447m3516
525a32567R9015k6147n225J23169K5032j11825J6857j7390o5160K1921k5557J09583
513A1706L0066J6532Q8004j28217m7376J4028J3320M919O7932O9077o1957p2987
501E047j05J11831n4464n2142r0861O8616k0463k5649O6127M6707q6425L5694
489C913K8435n933K2155o8672M7220L1607j55576R3453O078N3271n9291Q6247
$$ plain form
477 82907 118758 -43190 -59650 -54542 -51637 -12955 94646 100722 67510 75776 79920 20665 75147
464 75147 64151 -52551 -50374 32338 37771 106513 46842 122612 111744 62581 64440 75907
452 75907 -4332 -8021 -42709 -89976 -107673 13565 97829 20748 -24154 3647 -17707 39352
440 39352 67340 7232 -30510 62838 184581 144112 141378 123488 43138 -6850 -24793 -11110
428 -11110 6319 -2971 -44605 -47412 44172 -41140 30942 12869 34799 -9190 17455 48999
416 48999 -857 -36461 61069 178110 25881 131227 62660 73261 99359 118188 35145
405 35145 10453 76993 125967 129168 146678 149295 62501 18944 17634 -40803 -23768 76425
393 76425 51195 -24245 -363 40300 -84738 -197601 -107847 -72846 -32863 78763 110384
$$ packed form
477H2907L5851j61948j6460N108K905L8682J07601O076l3212Q266M144n9255N4482
464G5147j0996j16702K177Q2712N433O8742n9671P5770j0868m9163J859J1467
452G5907q0239l689l4688m7267j7697J21238Q4264p7081m4902K7801k1354N7059
440C9352K7988o0108l7742R3348J21743m0469k734j7890q0350m9988j7943J3683
428a1110J7429r290m1634k807R1584q5312P2082j8073K1930m3989K6645L1544
416D8999m9856l5604R7530J17041j52229J05346o8567J0601K6098J8829q3043
405C5145k4692O6540M8974L201J7510K617q6794m3557j310n8437J7035J00193
393G6425k5230p5440K3882M0663j25038j12863Q9754L5001L9983J11626L1621
$$ plain form
382 110384 103940 96928 153377 111236 106004 45958 21205 6451 66095 47604 51001 67857 42715
369 42715 15248 15307 20083 30415 -5016 -30991 27477 -56606 -12125 44300 92792 60121 45238
356 45238 23206 80481 125752 67011 89564 78835 55994 12131 58721 98944 137169 75158
344 75158 56554 20230 -73542 -45074 47344 48105 53566 30200 89574 103101 106466 153626 127817
331 127817 105422 170287 47168 38578 15345 -88763 56518 131755 36592 50591 88913
320 88913 60073 19172 18052 41426 60624 36815 48286 152357 176668 100940 176936 168819
308 168819 77985 69414 87159 100705 96427 74268 26366 131774 99145 198520 100150 25746
296 25746 35282 70011 115862 98061 164011 32559 -29904 -13580 99000 85712 -17026 32592
$$ packed form
382A10384o444p012N6449m2141n232o0046k4753j4754N9644j8491L397J6856k5142
369D2715k7467N9M776J0332l5431k5975N8468q4083M4481N6425M8492l2671j4883
356D5238k2032N7275M5271n8741K2553j0729k2841m3863M6590M0223L8225o2011
344G5158j8604l6324r3772K8468R2418P61N461k3366N9374J3527L365M7160k5809
331A27817k2395O4865j23119q590k3233j04108J45281P5237r5163J3999L8322
320H8913k8840m0901j120K3374J9198k3809J1471J04071K4311p5728P5996q117
308A68819r0834q571J7745J3546m278k2159m7902J05408l2629R9375r8370p4404
296B5746R536L4729M5851j7801O5950j31452o2463J6324J12580j3288j02738M9618
$$ plain form
284 32592 59014 -1896 15364 97573 -15735 -25003 54466 103319 86131 133185 154943 108549
272 108549 115109 22942 -25131 37723 -33290 15627 15666 -74938 -120177 62150 42826 29842
260 29842 38115 -74003 -66313 49482 -11018 -43039 95804 52735 51321 22454 96468 30878
248 30878 69591 62931 28747 33307 -39503 -524 11714 36047 137928 137178 11451 -2558
236 -2558 32576 103098 113028 56117 106473 150228 59872 -126741 -66622 44405 39537 9050
$$ packed form
284C2592K6422o0910J7260Q2209j13308r268P9469M8853j7188M7054K1758m6394
272A08549O560r2167m8073O2854p1013M8917L9r0604m5239J82327j9324j2984
260B9842Q273j12118P690J15795o0500l2021J38843m3069j414k8867P4014o5590
248C0878L8713o660l4184M560p2810L8979J2238K4333J01881p50j25727j4009
236b558L5134P0522R930n6911N0356M3755r0356j86613O0119J11027m868l0487
$$ [...]
##END NTUPLES=NMR SPECTRUM
##END=
