##TITLE=1H_EC-3327(II-1)
 CDCl3
 8 sc, 
 30.5.2024
##JCAMPDX= 6.0         $$ Bruker NMR JCAMP-DX V2.0
##DATA TYPE= NMR SPECTRUM
##DATA CLASS= NTUPLES
##ORIGIN= UXNMR, Bruker Analytische Messtechnik GmbH
##OWNER= root
$$ XWIN-NMR		Version 3.5
$$ Thu May 30 13:43:04 2024 Russian Standard Time (UT+4h)  she@DPX200
##.OBSERVE FREQUENCY= 200.1309
##.OBSERVE NUCLEUS= ^1H
##.ACQUISITION MODE= SIMULTANEOUS
##.ACQUISITION SCHEME= undefined
##.AVERAGES= 8
##.DIGITISER RES= 18
##SPECTROMETER/DATA SYSTEM= spect
##.PULSE SEQUENCE= zg30
##.SOLVENT NAME= CDCl3
##.SHIFT REFERENCE= (INTERNAL, CDCl3, 0, 15.8064)
##AUDIT TRAIL= $$ (NUMBER, WHEN, WHO, WHERE, WHAT)
$$ ##TITLE= Audit trail, XWIN-NMR		Version 3.5
$$ ##JCAMPDX= 5.01
$$ ##ORIGIN= Bruker BioSpin GmbH
$$ ##OWNER= she
$$ F:/spectra/data/she/nmr/H-F/1/pdata/1/auditp.txt
$$ ##AUDIT TRAIL=  $$ (NUMBER, WHEN, WHO, WHERE, WHAT)
(   1,<2024-05-30 13:41:37.04 +0400>,<she>,<DPX200>,
      <created by zg, POWCHK disabled, PULCHK disabled
       configuration hash MD5:
       00 E9 B6 7A A2 85 ED C7 34 08 36 98 17 FE 4E 26
       data hash MD5: 16K
       5B 42 5F F6 71 34 FB 05 37 B7 2A 82 FA 04 87 03>)
(   2,<2024-05-30 13:41:39.73 +0400>,<she>,<DPX200>,
      <Start of raw data processing
       efp BC_mod = 2 LB = 0.24 FT_mod = 6 PKNL = 1 PHC0 = -25306.52 PHC1 = 7.18748 SI = 16K 
       data hash MD5: 16K
       0A B4 0F 58 37 E8 3A 3E BF CA D6 83 DD 7E 98 CA>)
(   3,<2024-05-30 13:42:00.65 +0400>,<she>,<DPX200>,
      <pk PHC0 = -1.191049 PHC1 = 0 
       data hash MD5: 16K
       13 70 16 1C 79 37 23 86 59 51 F3 97 61 73 EE DA>)
(   4,<2024-05-30 13:42:04.68 +0400>,<she>,<DPX200>,
      <abs ABSG = 5 
       data hash MD5: 16K
       53 6D 1D E3 13 8C 41 2A 9E D8 B3 3A AC 38 FA 2C>)
$$ ##END=
$$ 
$$ hash MD5
$$ 12 4B 0C 22 5C 5F 77 C1 51 A6 5A FB 83 3A D5 0A
##$RELAX= 
##$RELAX= 
##$RELAX= 
##$RELAX= 
##$RELAX= 
##$RELAX= 
$$ Bruker specific parameters
$$ --------------------------
##$DU= <F:/spectra>
##$EXPNO= 1
##$NAME= <H-F>
##$PROCNO= 1
##$TYPE= <nmr>
##$USER= <she>
##$AMP= (0..31)
100 100 100 100 100 100 100 100 100 100 100 100 100 100 100 100 100 100 
100 100 100 100 100 100 100 100 100 100 100 100 100 100 
##$AQSEQ= 0
##$AQ_mod= 1
##$AUNM= <au_zg>
##$AUTOPOS= <>
##$BF1= 200.13
##$BF2= 200.13
##$BF3= 200.13
##$BF4= 200.13
##$BF5= 200.13
##$BF6= 200.13
##$BF7= 200.13
##$BF8= 200.13
##$BYTORDA= 1
##$CFDGTYP= 0
##$CFRGTYP= 5
##$CHEMSTR= <none>
##$CNST= (0..31)
1 1 145 1 1 1 1 1 1 1 1 1 1 1 1 1 1 1 1 1 1 1 1 1 1 1 1 1 1 1 1 1 
##$CPDPRG= <>
##$CPDPRG1= <>
##$CPDPRG2= <>
##$CPDPRG3= <>
##$CPDPRG4= <mlev>
##$CPDPRG5= <mlev>
##$CPDPRG6= <mlev>
##$CPDPRG7= <mlev>
##$CPDPRG8= <mlev>
##$CPDPRGB= <>
##$CPDPRGT= <>
##$D= (0..31)
0 1.2 0 0 0 0 0 0 0 0.06 0 0.03 0 0 0 0 0.0002 0 0 0 0 0 0 0 0 0 0 0 0 
0 0 0 
##$DATE= 1717062096
##$DBL= (0..7)
120 120 120 120 120 120 120 120 
##$DBP= (0..7)
150 150 150 150 150 150 150 150 
##$DBP07= 0
##$DBPNAM0= <>
##$DBPNAM1= <>
##$DBPNAM2= <>
##$DBPNAM3= <>
##$DBPNAM4= <>
$$ [...]
##$SUBNAM3= <"">
##$SUBNAM4= <"">
##$SUBNAM5= <"">
##$SUBNAM6= <"">
##$SUBNAM7= <"">
##$SUBNAM8= <"">
##$SUBNAM9= <"">
##$SW= 18.0517689322627
##$SWIBOX= (0..15)
0 0 2 0 0 0 0 0 0 0 0 0 0 0 0 0 
##$SW_h= 3612.71676300578
##$TD= 16384
##$TD0= 1
##$TE= 0
##$TE2= 300
##$TE3= 300
##$TEG= 300
##$TL= (0..7)
0 120 120 120 120 120 120 120 
##$TP= (0..7)
150 150 150 150 150 150 150 150 
##$TP07= 0
##$TPNAME0= <>
##$TPNAME1= <>
##$TPNAME2= <>
##$TPNAME3= <>
##$TPNAME4= <>
##$TPNAME5= <>
##$TPNAME6= <>
##$TPNAME7= <>
##$TPOAL= (0..7)
0.5 0.5 0.5 0.5 0.5 0.5 0.5 0.5 
##$TPOFFS= (0..7)
0 0 0 0 0 0 0 0 
##$TUNHIN= 0
##$TUNHOUT= 0
##$TUNXOUT= 0
##$USERA1= <user>
##$USERA2= <user>
##$USERA3= <user>
##$USERA4= <user>
##$USERA5= <user>
##$V9= 5
##$VALIST= <valist>
##$VCLIST= <CCCCCCCCCCCCCCC>
##$VD= 0
##$VDLIST= <DDDDDDDDDDDDDDD>
##$VPLIST= <PPPPPPPPPPPPPPP>
##$VTLIST= <TTTTTTTTTTTTTTT>
##$WBST= 1024
##$WBSW= 4
##$XGAIN= (0..3)
0 0 0 0 
##$XL= 0
##$YL= 0
##$YMAX_a= 247069
##$YMIN_a= -352703
##$ZGOPTNS= <>
##$ZL1= 120
##$ZL2= 120
##$ZL3= 120
##$ZL4= 120
##$ABSF1= 15.79982
##$ABSF2= -2.252071
##$ABSG= 5
##$ABSL= 3
##$ALPHA= 0
##$AQORDER= 0
##$ASSFAC= 0
##$ASSFACI= 0
##$ASSFACX= 0
##$ASSWID= 0
##$AUNMP= <proc_1d>
##$AZFE= 0.1
##$AZFW= 0.1
##$BCFW= 0
##$BC_mod= 2
##$BYTORDP= 0
##$COROFFS= 0
##$CY= -3
##$DATMOD= 1
##$DC= 0
##$DFILT= <>
##$DTYPP= 0
##$F1P= 0
##$F2P= 0
##$FCOR= 1
##$FTSIZE= 16384
##$FT_mod= 6
##$GAMMA= 0
##$GB= 0
##$INTBC= 1
##$INTSCL= 3.70164e-10
##$ISEN= 128
##$LB= 0.24
##$LEV0= 0
##$LPBIN= 0
##$MAXI= 10000
##$MC2= 0
##$MEAN= 0
##$ME_mod= 0
##$MI= 1.114404
##$NCOEF= 0
##$NC_proc= -7
##$NLEV= 6
##$NOISF1= 3.799351
##$NOISF2= 2.8
##$NSP= 0
##$NTH_PI= 0
##$NZP= 0
##$OFFSET= 15.80642
##$PC= 1
##$PHC0= -25307.71
##$PHC1= 7.18748
##$PH_mod= 1
##$PKNL= yes
##$PPARMOD= 0
##$PSCAL= 0
##$PSIGN= 0
##$REVERSE= no
##$SF= 200.129543026943
##$SI= 16384
##$SIGF1= 3
##$SIGF2= 2
##$SINO= 5.538805
##$SIOLD= 16384
##$SREGLST= <1H.CDCl3>
##$SSB= 0
##$STSI= 16384
##$STSR= 0
##$SW_p= 3612.71676300577
##$SYMM= 0
##$S_DEV= 0
##$TDeff= 16384
##$TDoff= 0
##$TI= <>
##$TILT= no
##$TM1= 0
##$TM2= 0
##$TOPLEV= 0
##$USERP1= <user>
##$USERP2= <user>
##$USERP3= <user>
##$USERP4= <user>
##$USERP5= <user>
##$WDW= 1
##$XDIM= 16384
##$YMAX_p= 446792522
##$YMIN_p= -879371
$$ End of Bruker specific parameters
$$ ---------------------------------
##NTUPLES= NMR SPECTRUM
##VAR_NAME=  FREQUENCY,     SPECTRUM/REAL,   SPECTRUM/IMAG
##SYMBOL=    X,             R,               I
##VAR_TYPE=  INDEPENDENT,   DEPENDENT,       DEPENDENT
##VAR_FORM=  AFFN,          ASDF,            ASDF
##VAR_DIM=   16384,         16384,           16384
##UNITS=     HZ,            ARBITRARY UNITS, ARBITRARY UNITS
##FACTOR=    0.220516191357247, 1,           1
##FIRST=     3163.33167678078, 0,            0
##LAST=      -449.385086224995, 0,           0
##MIN=       -449.385086224995, -879371,     0
##MAX=       3163.33167678078, 446792522,    0
$$ Real data points
##PAGE= N=1
##DATA TABLE= (X++(R..R)), XYDATA
$$ [...]
6234B855923N8181K42245O9065J1671J31548J11045R8557J47209J54263p0100
6224C809607J62734K4886Q8710l1262R6001n1001J47916o1139J10010J5247K79578
6213D591287J73602O3874K60841P8961M7836O5289P6599J31495K01846M47525
6203F139155J28695q7887L59878O3727K47931J78460K12252K44710K02077J30586
6193G819584L26883M1344J05770K20035K09076J47649Q9834M43496L11111J27068
6183I841850L64252K95629L16498M41199L00477L38911K02260L95083L78976L48280
6173A3223415L72186L15057M05367P83234L49518M69903P76259N50880P82181
6164A8028000J072335O63225Q34462J126372J376539J579272J490798J538196
$$ plain form
6234 2855923 2914104 3156349 3225414 3237085 3368633 3479678 3578235 3725444 3879707 3809607
6224 3809607 3972341 3997227 4085937 4054675 4150676 4099675 4247591 4186452 4296462 4311709 4591287
6213 4591287 4764889 4828763 5089604 5168565 5216401 5281690 5358289 5489784 5691630 6139155
6203 6139155 6267850 6179963 6539841 6603568 6851499 7029959 7242211 7486921 7688998 7819584
6193 7819584 8146467 8187811 8293581 8513616 8722692 8870341 8960175 9403671 9714782 9841850
6183 9841850 10206102 10501731 10818229 11259428 11559905 11898816 12101076 12496159 12875135 13223415
6173 13223415 13595601 13910658 14316025 15099259 15448777 15918680 16694939 17245819 18028000
6164 18028000 19100335 19763560 20598022 21724394 23100933 24680205 26171003 27709199
6156B7709199J906060K010903K096027K597032K745910K943636L520539L867853
6148D9397159L576628L325295K144810R0561j483514k877359l444019l305598
6140D7423963k173172j512286j173863p34941k42270M47499O30932J192931J839818
6131D5698611K165845K261189L117312L262276L796787M182138M701436M700449
6123G3886043N982361O291534O739887P131699O440164M299372M49180m576197
6115A06644043q839007j0474178r815519q133231o325049m859106l620046k937509
6107E1640398j936719r86615q71605k32087N55950J243782J336034J784626J726975
6098E4260739J671099J320363J607817J771524J479880J774783K065212J970226
$$ plain form
6156 27709199 29615259 31626162 33722189 36319221 39065131 42008767 45529306 49397159
6148 49397159 52973787 56299082 58443892 58534453 57050939 54173580 50729561 47423963
6140 47423963 45250791 43738505 42564642 41829701 41587431 42034930 42665862 43858793 45698611
6131 45698611 47864456 50125645 53242957 56505233 60302020 64484158 69185594 73886043
6123 73886043 79868404 86159938 92899825 100031524 106471688 110771060 111220240 106644043
6115 106644043 97805036 87330858 77515339 69382108 63057059 58197953 54577907 51640398
6107 51640398 49703679 48717064 47845459 47613372 48169322 49413104 50749138 52533764 54260739
6098 54260739 55931838 57252201 58860018 60631542 62111422 63886205 65951417 67921643
6090F7921643N82273j084249l218367n330110o016426n491745m679450l841832
6082C8841737l477016k835067k282003j775843j267830j322170q87243p49650
6074B4244915m96340o74085o22600m56271l98155p80997r23722r50302r38036
6065A8004407r57575q43338q02815p00086q47300p20337m58479n15975l82991
6056A1775511l77603n00859k62792l82405m67153o6121k74743m13311O5017r7455
6046H998086m18263j92296k24431R9492j39549n7104J18526k72139k95341L4562
6036G651543Q2105J5331O8877J01866j44296q9455j9481j31010q5328n1713Q22
6025G399261j35883J7690N0895R1515n8831k43382k5010L808K98101J72966l8856
$$ plain form
6090 67921643 68503916 67419667 64201300 58871190 52854764 47363019 42683569 38841737
6082 38841737 35364721 32529654 30247651 28471808 27203978 25881808 24994565 24244915
6074 24244915 23748575 23074490 22451890 21995619 21597464 20816467 19892745 18942443 18004407
6065 18004407 17046832 16203494 15400679 14700593 13853293 13132956 12674477 12158502 11775511
6056 11775511 11397908 10897049 10634257 10251852 9784699 9718578 9443835 9030524 9095541 8998086
6046 8998086 8579823 8387527 8163096 8262588 8123039 8065935 8184461 7912322 7616981 7651543
6036 7651543 7733648 7748979 7817856 7919722 7775426 7685971 7666490 7535480 7450152 7398439 7399261
6025 7399261 7263378 7281068 7331963 7423478 7364647 7121265 7096255 7100063 7398164 7571130 7532274
6014G532274P1982j80691K15261K2408m1627J33981J22031J90171R1397M96793
6004H653980L59471N5529M62403L10205M20186L75371K85311M69911N00065P22532
5994A2614964Q15292P77586Q23304R55385J051640J150635J375117J631276J685453
5985B2880652J045798O87125L2081o31616j045059j375993j431860q34574o78866
5976A8647688n76296j32005L4211J23220J84104K20942P49906Q88376Q86652J112524
5966B2139322J252537J655108J910428K278775K536494K585646L011672K887038
5958D0257020K518633J132013p47415k698087m203889m049732l671582k849736
5950B5687225k209762j843908j417217r83451r63302o19720m56842k80189l30446
$$ plain form
6014 7532274 7604256 7423565 7638826 7661234 7619607 7753588 7875619 8065790 8157187 8653980
6004 8653980 9013451 9068980 9531383 9841588 10261774 10637145 10922456 11392367 11892432 12614964
5994 12614964 13430256 14207842 15031146 15986531 17038171 18188806 19563923 21195199 22880652
5985 22880652 23926450 24613575 24645656 24014040 22968981 21592988 20161128 19326554 18647688
5976 18647688 18071392 17939387 17973598 18096818 18280922 18501864 19251770 20140146 21026798 22139322
5966 22139322 23391859 25046967 26957395 29236170 31772664 34358310 37369982 40257020
5958 40257020 42775653 43907666 43160251 40462164 36258275 32208543 28536961 25687225
5950 25687225 23477463 21633555 20216338 19232887 18269585 17649865 17193023 16912834 16582388
5941A6582388J73249J13124L99831N90451R66480P67633R94268J158571J208871
5932B2954866J211176O20802l97710j020915j742082k297458k057391j954353
5924A5316935j459413j357685j187747r86934p78347p93414p05376o74390n77576
5915F796053m64826k95724j43112m17019l67406j32290j75848j23495J5814r4161
5905D597986k64586r4374p1406k97412l00487n7178r1060o7524P8537j61409j7387
5894C253700r2175j1418l45958J00100R3884K7779L0254k39460j2928m4831j94061
5883B564886j73629K00808J16135P6379l22921L7751K1053k30517J89277o6849
5873B412373j55449N349R0048k9196j35751m7949o2382j01261q2116M22417r0046
$$ plain form
5941 16582388 16755637 16868761 17268592 17859043 18825523 19593156 20587424 21745995 22954866
5932 22954866 24166042 24786844 24389134 23368219 21626137 19328679 17271288 15316935
5924 15316935 13857522 12499837 11312090 10325156 9546809 8753395 8048019 7373629 6796053
5915 6796053 6331227 6035503 5892391 5475372 5107966 4975676 4799828 4676333 4692147 4597986
5905 4597986 4333400 4239026 4167620 3870208 3569721 3512543 3421483 3353959 3432496 3271087 3253700
5894 3253700 3161525 3150107 2804149 2904249 2998133 3025912 3056166 2816706 2803778 2758947 2564886
5883 2564886 2391257 2592065 2708200 2784579 2461658 2499409 2520462 2289945 2479222 2412373
5873 2412373 2256924 2262273 2352321 2323125 2187374 2139425 2077043 1975782 1893666 2316083 2226037
5862B226037j9369k6985J10687k44938L1956J15274j02320j8559j05262K8515
5852A995036J33530k41789q4536Q4899k27057J64349K2108k15305N5647M0663
5842A727545K8449J30883l6265J21483O0574p3894j04378j46559J73971L44260
5832B226069n2862j17126j8952o0166r4144p9620J88560q7005j64650K1884p357
5821A754631Q1595o2846l6812J873P0710j21242j32964L00089j4048j68500J71033
5810A843519r7446N7721p3894K21690J52851M592J06542R8089k57782k00998J46797
5799B001681q3368J11670R3397k77257j48344J25134J43106J7333j91601L7883
5789A829634k15401J08945L33134m2758o1009K03745k20507J5032J36993p7170
$$ plain form
5862 2226037 2206668 2179683 2290370 2045432 2077388 2192662 2090342 2071783 1966521 1995036
5852 1995036 2128566 1886777 1802241 1887140 1660083 1824432 1846540 1631235 1686882 1727545
5842 1727545 1755994 1886877 1850612 1972095 2032669 1958775 1854397 1707838 1881809 2226069
5832 2226069 2173207 2056081 2037129 1976963 1882819 1803199 1991759 1904754 1740104 1761988 1754631
5821 1754631 1836226 1773380 1736568 1738441 1809151 1687909 1554945 1855034 1840986 1672486 1843519
5810 1843519 1746073 1803794 1729900 1951590 2104441 2109033 2215575 2313664 2055882 1854884 2001681
5799 2001681 1918313 2029983 2123380 1846123 1697779 1822913 1966019 1983352 1791751 1829634
5789 1829634 1614233 1723178 2056312 2013554 1952545 2156290 1935783 1950815 2087808 2010638
5779B010638j22387Q521J72121o722p8228p0791l5119J36876Q5526J15604p1080
5768B144959j87010j54K1245r8117l145j58039j00550K02761K02156L80009l2067
5757B372048j26499k48137J44741J02238J73169p2339j62442q7845L0147k3658
5747B101423M7289j36725J39782J00059o8200k5585j47363L63601K09504j42173
5737B441612l2822J87160K18745m5712J25318K59381N2386n0632j2523j81J2997
5726C155729P3170l82087O7506M769r2284L5390N2169O1109o218K5975K52142
5715C247370J91370n622R8255K44832j40460N5653K09848J41069J01372K97863
5705D441550M59561L61975L93031n8048j69037l36877k74596k85974l50562k39871
$$ plain form
5779 2010638 1888251 1896772 2068893 2062171 1983943 1913152 1878033 2014909 2100435 2216039 2144959
5768 2144959 1957949 1957795 1979040 1880923 1877778 1719739 1619189 1821950 2024106 2404115 2372048
5757 2372048 2245549 1997412 2142153 2244391 2417560 2345221 2182779 2094934 2125081 2101423
5747 2101423 2148712 2011987 2151769 2251828 2183628 2158043 2010680 2374281 2583785 2441612
5737 2441612 2408790 2595950 2814695 2768983 2894301 3153682 3206068 3155436 3142913 3142732 3155729
5726 3155729 3228899 2846812 2914318 2919087 2826803 2862193 2914362 2975471 2969253 2995228 3247370
5715 3247370 3438740 3433118 3531373 3776205 3635745 3691398 3901246 4042315 4143687 4441550
5705 4441550 4901111 5263086 5656117 5598069 5429032 5092155 4817559 4531585 4181023 3941152
5695C941152J67279L7987k58951M6945l7025P213J52930K96704J36015O6576K35228
5684D792053K9328J42316J92392M46225J69475J35348K61125K90317M46657L36665
5674G241901j61116j31410l22904m45439m98833l31257j52182j50306J56205j01977
5664E102682j44482L0843j9971j94305J41657J39093K5434K6801J31881J55056
5654E394689L10723N18312J39129J32359M20084L56094M18434J65067j02412l27678
5644G424801j09394k66423n8875k85057k32115K1111k03711J94969j1590Q540
5634F482256l8953k1237L1395K12785J76777J67578K44128K05150K01677J59351
5624G820907L31031L22224J32473J79170M29882L24024N9776p0852M1916P5473
$$ plain form
5695 3941152 4108431 4146418 3887467 3934412 3897387 3904600 4057530 4354234 4490249 4556825 4792053
5684 4792053 4821381 4963697 5156089 5602314 5771789 5907137 6168262 6458579 6905236 7241901
5674 7241901 7080785 6949375 6626471 6181032 5682199 5350942 5198760 5048454 5204659 5102682
5664 5102682 4958200 4989043 4969072 4774767 4916424 5055517 5080951 5107752 5239633 5394689
5654 5394689 5705412 6223724 6362853 6495212 6915296 7271390 7689824 7854891 7752479 7424801
5644 7424801 7315407 7048984 6990109 6705052 6472937 6494048 6290337 6485306 6473716 6482256
5634 6482256 6443303 6422066 6453461 6666246 6843023 7010601 7254729 7459879 7661556 7820907
5624 7820907 8151938 8474162 8606635 8785805 9215687 9539711 9599487 9528635 9570551 9646024
5614I646024J60518J70097J96203J97500K75849K23471L85315J35063J76052P8782
5604A1644874K37331L08047J12605L25407Q2728K28303K28160L97087L73421L55256
5594A4293219O06526J02244K05772M99942N50527L85638K85125O56814P43273
5585A8329080P13447Q89562J139223J088714J106785J085438J321791J724662
5577B7398702J808253J928269K140277K431004K722115K981582L638472L919146
5569D8967820M016730M171637M373500L668704K373156K24302k502266m071671
5561F1221912m291439m026379l393648k566990j709052j402088p34312n0728M39631
5552D3486907R25498J549336J700425K054242K453679L206715L809487M337171
$$ plain form
5614 9646024 9806542 9976639 10172842 10370342 10646191 10869662 11254977 11390040 11566092 11644874
5604 11644874 11882205 12190252 12302857 12628264 12710992 12939295 13167455 13564542 13937963 14293219
5594 14293219 14899745 15001989 15207761 15707703 16258230 16643868 16928993 17585807 18329080
5585 18329080 19042527 19932089 21071312 22160026 23266811 24352249 25674040 27398702
5577 27398702 29206955 31135224 33275501 35706505 38428620 41410202 45048674 48967820
5569 48967820 52984550 57156187 61529687 65198391 67571547 67795849 65293583 61221912
5561 61221912 56930473 52904094 49510446 46943456 45234404 43832316 43098004 43047276 43486907
5552 43486907 44412405 45961741 47662166 49716408 52170087 55376802 59186289 63523460
5544F3523460M852695N483286O611507P193627Q099466Q425367P578894M132498
5536A15900800j174688o983069r916888j0248837r253669p862823o703267n247039
5528E8510520m077121l459816k527013j786531j451607j126160m56123j02240
5520D3523909M03556Q41738P76665J166576J713869J778807K361721K901109L118941
5511E8586891L454493K959072J857405m01158k552628m149062m745383m854307
5503E0155323m438020m061258l317943k994022k677104k308460k208046j845691
5495B6304779j486361j225802j010918p16993p12142n90563m81258k16383j22000
5486A9742359l81235M555j14392k44263l98326k40916J71181j25515m56585l28348
$$ plain form
5544 63523460 68376155 73859441 80470948 87664575 95764041 104189408 111768302 115900800
5536 115900800 114726112 107743043 97826155 87577318 78323649 70460826 63757559 58510520
5528 58510520 54433399 50973583 48446570 46660039 45208432 44082272 43626149 43523909
5520 43523909 43927465 44769203 45545868 46712444 48426313 50205120 52566841 55467950 58586891
5511 58586891 62041384 65000456 66857861 66456703 63904075 59755013 55009630 50155323
5503 50155323 45717303 41656045 38338102 35344080 32666976 30358516 28150470 26304779
5495 26304779 24818418 23592616 22581698 21864705 21152563 20562000 20080742 19864359 19742359
5486 19742359 19361124 19365679 19251287 19007024 18608698 18367782 18538963 18413448 17956863 17628515
5476A7628515j60180o18066o07233o77219r82181p52085n41989n46887l47108
5467A2395567m09191k24722m99300j96062L3643Q6032k11399j52885j87834j65245
5457A0468604k62949p0211R843J59903j64464k67204j62437q8062m98j80040J80150
5446I622635r9784j4884k4281k6650N1870m5319J89378N6349j24203L90140M77040
5435A0452291M3295l27630K68197N56347J93867J06423j21653j17192l25178l20610
5425A0408157J60025k1322k3392K88043j4362l7524K46170J83766J33020L47646
5415A1670227m2321l1827M96694M5888K94107K52045M86736K42218M30692Q36164
5405A4680623N93679M29644O87954R85007J096541Q42012R38638M91328k50127
$$ plain form
5476 17628515 17468335 16850269 16243036 15565817 14583636 13831551 13289562 12742675 12395567
5467 12395567 11986376 11761654 11262354 11066292 11099935 11185967 10974568 10821683 10633849 10468604
5457 10468604 10205655 10135444 10145287 10305190 10140726 9873522 9711085 9623023 9622525 9442485 9622635
5446 9622635 9522851 9507967 9483686 9457036 9508906 9463587 9652965 9709314 9585111 9975251 10452291
5435 10452291 10495586 10167956 10436153 10992500 11186367 11292790 11171137 11053945 10728767 10408157
5425 10408157 10568182 10546860 10523468 10811511 10797149 10759625 11005795 11189561 11322581 11670227
5415 11670227 11627906 11596079 12092773 12138661 12432768 12684813 13171549 13413767 13844459 14680623
5405 14680623 15274302 15703946 16391900 17376907 18473448 19315460 20254098 20745426 20495299
5396B0495299l72849R5916Q8270L01035P18907Q91080J030677J238969J549133
5387B6036437J884221J818199J900569J604340Q12347K54057p77376j604446j881426
5378C0046922j243107j106057p30293k10417o8330L95306L74897L80968J004915
5369B8844804J147887J413765J514240J030535M70145N13996J197721J600074
5361C7733167K304205K934701L155674L192335K409734N89992j913070l780617
5353D6626121m761577m291742l420278k743419k152898j638258j351115j065511
5345B5201323p63903n36882m97048k6584l4740K64442M21163M21709O19361P37062
5335B5805903J121104R85537P45538P98578Q27402N24993j72730j199645j925683
$$ plain form
5396 20495299 20122450 20218366 20306636 20607671 21326578 22217658 23248335 24487304 26036437
5387 26036437 27920658 29738857 31639426 33243766 34056113 34310170 33532794 31928348 30046922
5378 30046922 28803815 27697758 26967465 26757048 26688718 27084024 27458921 27839889 28844804
5369 28844804 29992691 31406456 32920696 33951231 34421376 34935372 36133093 37733167
5361 37733167 40037372 42972073 46127747 49320082 51729816 52319808 50406738 46626121
5353 46626121 41864544 37572802 34152524 31409105 29256207 27617949 26266834 25201323
5345 25201323 24437420 23900538 23403490 23376906 23342166 23606608 24027771 24449480 25068841 25805903
5335 25805903 26927007 27912544 28658082 29456660 30284062 30809055 30636325 29436680 27510997
5326B7510997k043376j866466j450063j263633j153409q91908o40360m06423m32411
5317A7362948m77973k60297o305o5505j78893j47422M4614P9597l5478R7608N626
5306A6418520Q6306M46360J00718L7919k5251J78273M27791Q0944M68295K18745
5296A8438620M32041L68893M84773L61496J95845L77298M23062N38805L70510
5287B1991343M88395L42167Q06444N83041N47195N48281M21229M21317K34340
5278B6383752L05908M26137O79927N73036M31117N06684Q90902P81955P70191
5269C1749609P47225O06323Q62529Q23050Q08812Q69863P48246J116128J304455
5260C9636240J230312J331981J585340J416906J413063J834495J420525J300669
$$ plain form
5326 27510997 25467621 23601155 22151092 20887459 19734050 18842142 18201782 17795359 17362948
5317 17362948 16884975 16624678 16618373 16552868 16373975 16226553 16271167 16350764 16315286 16412894 16418520
5306 16418520 16504826 16951186 17051904 17089823 17064572 17242845 17670636 17751580 18219875 18438620
5296 18438620 18870661 19239554 19724327 20085823 20281668 20658966 21082028 21620833 21991343
5287 21991343 22479738 22821905 23628349 24211390 24758585 25306866 25728095 26149412 26383752
5278 26383752 26689660 27115797 27795724 28368760 28799877 29306561 30197463 30979418 31749609
5269 31749609 32496834 33103157 33965686 34788736 35597548 36467411 37215657 38331785 39636240
5260 39636240 40866552 42198533 43783873 45200779 46613842 48448337 49868862 51169531
5252E1169531J231053J390641J665020J737854J772168J935662J913991J762659
5244F4578579K261990K101561K546660K946532L243597L481122L497040L751732
5236H8408813M161131M160737L730612K945118J804951K093833L085289L627934
5228A14018418L671530L414555L418658M195952N288194P097151Q330294J0078539
5220A59513291J1529651J2795686J3979347J5217263J5968533J6186271J5643416
5213B60833458J5288275J4778043J4061409J1331514O543255J092558m309962
5206C19618550r799763j3956802j6159189j6748665j7153145j6915181j6392225
5199B12493580j4482608j2036882r848297p395748m883259k577600o74802P07430
$$ plain form
5252 51169531 52400584 53791225 55456245 57194099 58966267 60901929 62815920 64578579
5244 64578579 66840569 68942130 71488790 74435322 77678919 81160041 84657081 88408813
5236 88408813 92569944 96730681 100461293 103406411 105211362 107305195 110390484 114018418
5228 114018418 117689948 121104503 124523161 128719113 134007307 141104458 149434752 159513291
5220 159513291 171042942 183838628 197817975 213035238 229003771 245190042 260833458
5213 260833458 276121733 290899776 304961185 316292699 322835954 323928512 319618550
5206 319618550 309818787 295861985 279702796 262954131 245800986 228885805 212493580
5199 212493580 198010972 185974090 176125793 168730045 163846786 161269186 160594384 161301814
5191A61301814J111825M91980k81928j161788j409558n48039O48483K089951L611125
5182A65853865M200545L502576J628769j375523l748572n541670p126386r380406
5174A48013198r955882j0083155q820733p283626n801651m349295k931401k125526
5166I6661929j465410m47366L65808O49233J655636K773905L687116M159040N592248
5157A13632139O786162P346505M114888l122r192320j5522464j3710681j1714937
5149H1736170q982513p419482o256433n484170m184250l341920l124055k546379
5141D0396968k201477j946740j635144j582063j174411j375814j140119o28518
5133B8712682j092442q92412p81351p47652m55064p02626n65131o02331m74387
$$ plain form
5191 161301814 162413639 162905619 162623691 161461903 160052345 159504306 160152789 162242740 165853865
5182 165853865 170054410 173556986 175185755 173810232 170061660 164519990 157393604 148013198
5174 148013198 138057316 127974161 119153428 111869802 106068151 101718856 98787455 96661929
5166 96661929 95196519 94749153 95114961 95764194 97419830 100193735 103880851 108039891 113632139
5157 113632139 120418301 127764806 131879694 131876572 122684252 107161788 93451107 81736170
5149 81736170 72753657 65334175 59077742 53593572 49409322 46067402 42943347 40396968
5141 40396968 38195491 36248751 34613607 33031544 31857133 30481319 29341200 28712682
5133 28712682 27620240 26727828 25946477 25198825 24743761 24041135 23476004 22873673 22399286
5124B2399286l94506o07245m75389m96331n87065j97720l30489p4155k41960l73535
5114A8620891k19842r3695n1026n0976R1007j51709j90564P0644J17912k2199
5104A8120443M0891M08057P4389J21381K90469J75242K29751M14137L61917L10336
5094B0547013L25074k6024l68477j18166j27638j81349J3576p8495j38438L52664
5084B0199740L17177L75341M51602L55690N84889O55745P58156R81342R53620
5075B5633302Q37961J518639J681849J892792K160415K154746K486721L136482
5067D1502907L741744M224000M583070N486879O258424O905469P880550P465484
5059H8048527M841119L70239o866594j1337678j0794734q959086p126512n859515
$$ plain form
5124 22399286 22004780 21397535 20922146 20425815 19838750 19641030 19310541 19236386 18994426 18620891
5114 18620891 18401049 18307354 18256328 18205352 18296359 18144650 17954086 18024730 18142642 18120443
5104 18120443 18161334 18569391 18643780 18765161 19055630 19230872 19460623 19874760 20236677 20547013
5094 20547013 20872087 20846063 20477586 20359420 20231782 20050433 20064009 19985514 19847076 20199740
5084 20199740 20516917 20892258 21343860 21699550 22284439 22940184 23698340 24679682 25633302
5075 25633302 26471263 27989902 29671751 31564543 33724958 35879704 38366425 41502907
5067 41502907 45244651 49468651 54051721 59538600 65797024 72702493 80583043 88048527
5059 88048527 92889646 93259885 86393291 75055613 64260879 55301793 48175281 42315766
5051D2315766m801408l842433l014474k723688j966786j566476j177094j300804
5043B1922603j265831j089033q52956q79862j111794o93958p03234l42135n01326
5034A4482474l32585p9470k18727k25443l39838j01117N4032j40289j44217j78904
5024A2775916R6262j31870l0632R8276j67214j25956j7715Q2771L43333L56100
5014A3279271K84469M85350M10723Q3736p69275o54668r74904q90844q65271p01931
5004I686656p00650l67506o86995k78483j70954k12740N706K7826j69608k48068
4994F885184K02764o5578k01361K77536J42127P8012L71704L40562L77026K37685
4984H645661N40439J69386O19877P83629P65650L12441m29266n11637q67123r54278
$$ plain form
5051 42315766 37514358 33671925 30657451 27933763 25966977 24400501 23223407 21922603
5043 21922603 20656772 19567739 18714783 17834921 16723127 16029169 15325935 14983800 14482474
5034 14482474 14149889 14070419 13851692 13626249 13286411 13185294 13239326 13099037 12954820 12775916
5024 12775916 12872178 12740308 12709676 12807952 12640738 12514782 12497067 12579838 12923171 13279271
5014 13279271 13563740 14049090 14459813 14543549 13774274 13119606 12144702 11253858 10388587 9686656
5004 9686656 8986006 8618500 7931505 7653022 7482068 7269328 7275034 7302860 7133252 6885184
4994 6885184 7087948 7022370 6821009 7098545 7240672 7318684 7690388 8030950 8407976 8645661
4984 8645661 9186100 9355486 9975363 10758992 11524642 11837083 11407817 10896180 10029057 9074779
4974I074779p42583p02150n69072p22628n72986j99936j15866r1652j92773k93486
4964D871647k51618j17758j4675J08811k5726j45074K6802k4283J29355O1525
4954D619006L13813M0841l5259P0695L71647L08923K43388j00730j76471q5230
4944E570623j72752k11657k64735l26988j81948j57150J15097j56273k50528J79219
4934D142908l05154M7672o9662l58594j83867J6190J02054p9428j39008L8542
4924C211653l5015k75406K1517n4339J37413L30056m4583j40570j54528q1311
4914B914887O6243j31769L24962M4890n7350L40641K38596M0604O8436J69672
4904D019812n460J99734M8641L4627j9775r9507k35577K3408j78371r4111o1099
$$ plain form
4974 9074779 8332196 7630046 7060974 6338346 5765360 5565424 5449558 5357906 5165133 4871647
4964 4871647 4620029 4502271 4487596 4596407 4570681 4425607 4452409 4428126 4557481 4619006
4954 4619006 4932819 4973660 4938401 5009096 5380743 5689666 5933054 5832324 5655853 5570623
4944 5570623 5397871 5186214 4921479 4594491 4412543 4255393 4370490 4214217 3963689 4142908
4934 4142908 3837754 3885426 3815764 3457170 3273303 3289493 3391547 3312119 3173111 3211653
4924 3211653 3176638 2901232 2922749 2868410 3005823 3335879 3291296 3150726 2996198 2914887
4914 2914887 2981130 2849361 3174323 3219213 3161863 3502504 3741100 3781704 3850140 4019812
4904 4019812 4014352 4214086 4262727 4297354 4277579 4178072 3942495 3965903 3787532 3693421 3632322
4893C632322K3052M6990k77167l17057j27830p7222j34334O8971K29521j08275
4883B958971O6644J21263j810j15781k11230J70255O0035p2887r444Q473J10075
4872C084564K04793R9405j86738o5266m7755j9970J97977Q3110L1457l59020j78397
4861B844160M24930j78805k15057J07448k04457j35796J10565j07073o1330k69929
4851B314656j54222O4620M4448m0399j338q5379J06132J45341l1892k93091J00811
4840B169687J61886J15584p41j30268J29959j24470J28545K6705N0168j12442
4830B414613k86907k85446J55626j9389j0962O7992k80389j75677J52109k8166
4820A703404m5866n2492P3752J47480J37215L1832m004r733o2480q936k09428
$$ plain form
4893 3632322 3655374 3702364 3425197 3108140 2980310 2903088 2768754 2837725 3067246 2958971
4883 2958971 3025615 3146878 3145068 3029287 2818057 2988312 3048347 2975460 2966016 2974489 3084564
4872 3084564 3289357 3388762 3202024 3136758 3089003 3069033 3267010 3350120 3381577 3022557 2844160
4861 2844160 3269090 3090285 2875228 2982676 2778219 2642423 2752988 2645915 2584585 2314656
4851 2314656 2160434 2225054 2269502 2229103 2227765 2142386 2248518 2393859 2361967 2068876 2169687
4840 2169687 2331573 2447157 2446416 2316148 2446107 2321637 2450182 2476887 2527055 2414613
4830 2414613 2127706 1842260 1997886 1978497 1967535 2035527 1755138 1579461 1731570 1703404
4820 1703404 1657538 1605046 1678798 1826278 1963493 1995325 1991321 1981588 1919108 1910172 1700744
4809A700744O3666J99272P1964Q1810n4408k72289o2931P817j42813r2044J096
4798A501884Q3860q4071J5532R903j65047R0647l0486j19681K49071J57428P7151
4787A786191r9880R0655j06726j8907L699N1158Q5173l64169p5594o8454J35931
4776A419077J93216j9874k5274p5344J61823j05785r1499j0440L19115n1969q9520
4765A623526K26253p4141Q4798Q0569k99840o8531J85259l32599j40252p9722
4755A205320J25264l7911o9618N8695k4386O6199K02117J43396k42164o295j14621
4744A305996k305J7364L5891J85292j43374K62039o6040J08522j80305j28195
4734A394885O0411R740n6557R9258p0164k21532m09N0119L36716j28238j84503
$$ plain form
4809 1700744 1764410 1963682 2035646 2117456 2063048 1790759 1727828 1735645 1592832 1500788 1501884
4798 1501884 1585744 1501673 1517205 1527108 1362061 1452708 1422222 1302541 1551612 1709040 1786191
4787 1786191 1686311 1776966 1670240 1651333 1655032 1706190 1791363 1427194 1351600 1283146 1419077
4776 1419077 1612293 1592419 1567145 1491801 1653624 1547839 1456340 1445900 1765015 1713046 1623526
4765 1623526 1849779 1775638 1860436 1941005 1641165 1572634 1757893 1425294 1285042 1205320
4755 1205320 1330584 1292673 1223055 1281750 1257364 1323563 1525680 1669076 1426912 1420617 1305996
4744 1305996 1303691 1321055 1356946 1542238 1398864 1660903 1594863 1703385 1523080 1394885
4734 1394885 1455296 1465036 1408479 1507737 1437573 1216041 1215632 1265751 1602467 1474229 1289726
4723A289726M7552M2904J03015k3831Q2591k35189j27908K14299M7658J44258
4713A585075k12330j76305K03577l1727N7163J34365J4891m6720j0942Q0507p655
4702A589899j8002j15794j22005L6841p3867r3263N3457K9409p3153N2662L30422
4691A596606m7756j56831K2820m1074q043j9474J21093j70335L17370p249l6505
4680A570622m3862j79727K44714M6353k2443k8064N9103j27102J28724K8205j71290
4669A505233K283n5085J77491P0613k02061K43585J29406Q4048o2818j82574L87226
4658B097347K26858k33498N5290q1662K2110j05894R2985j64040P7908J47209
4648B134613M2094P8439k66031J00313L07101k4649k6073k1745J09109n0599O2884
$$ plain form
4723 1289726 1337278 1380182 1483197 1459366 1541957 1306768 1178860 1393159 1440817 1585075
4713 1585075 1372745 1196440 1400017 1368290 1425453 1559818 1574709 1527989 1517047 1597554 1589899
4702 1589899 1571897 1456103 1334098 1370939 1297072 1203809 1257266 1286675 1213522 1266184 1596606
4691 1596606 1548850 1392019 1414839 1373765 1365722 1346248 1467341 1297006 1614376 1607127 1570622
4680 1570622 1526760 1347033 1591747 1638100 1615657 1587593 1646696 1519594 1648318 1676523 1505233
4669 1505233 1507516 1452431 1629922 1700535 1498474 1742059 1871465 1955513 1892695 1710121 2097347
4658 2097347 2324205 2090707 2145997 2064335 2086445 1980551 2073536 1909496 1987404 2134613
4648 2134613 2176707 2255146 1989115 2089428 2396529 2371880 2345807 2324062 2433171 2382572 2445456
4637B445456P3118K07697j88652M9234L38461M0512j02150Q9524J31675J20979
4627C205854Q9574M3731J16028K3509q4142J12292J16848Q0687J49433K08238
4617D062052l850J00615j9503J44141M10351n9917K53882J69524K58872J3712
4607E329879k6907Q1737J73112M57625K55744J09566K85064K67813N36232M36833
4597G906698N54131N22717M81590L29482M68449N71915J059558J107485J161995
4588A4164020J497410J733079K272302K136514J504962m69512k523709k775221
4580A7539845k688317k076920j582428j203475q99360q12298m23081k79176n37063
4571G037727l82819q3843o6112n915J39489N3766o774k15307j27115N4372P2882
$$ plain form
4637 2445456 2518574 2726271 2537619 2586853 2925314 2965826 2863676 2953200 3084875 3205854
4627 3205854 3295428 3339159 3455187 3478696 3394554 3506846 3623694 3704381 3853814 4062052
4617 4062052 4058202 4158817 4139314 4283455 4693806 4633889 4887771 5057295 5316167 5329879
4607 5329879 5302972 5384709 5557821 6015446 6271190 6380756 6665820 6933633 7469865 7906698
4597 7906698 8460829 8983546 9465136 9794618 10263067 10834982 11894540 13002025 14164020
4588 14164020 15661430 17394509 19666811 21803325 23308287 22838775 20315066 17539845
4580 17539845 14851528 12774608 11192180 9988705 9089345 8277047 7853966 7574790 7037727
4571 7037727 6654908 6571065 6504953 6499038 6638527 6692293 6685519 6470212 6343097 6397469 6470351
4560F470351K2044J56997o6597K1403K01067J19701N6024K56242J00893J67837
4550G505962K08449R4286J14375J07889L53233J43494K39881M4910M69099K54060
4540I535638K31517N74545Q1037Q7192J19086L10248R437L40429K18653J07040
4530A1614822J11808K48581J31288J97616J13743J24387J97923Q5507M21398K41055
4520A3488128K06792L84010L71317K20057K76260N76262O34366M19939N32971
4511A7110102N81892P23135P71796P41500J013179J099523J098176J352629J162982
4502B5654914J348553J391625J870610J617945J752650K037734K000488K538097
4494D0212616L053721L187060L150350L704553L751738K852172J524902j59263
$$ plain form
4560 6470351 6492395 6649392 6582795 6604198 6805265 6924966 6980990 7237232 7338125 7505962
4550 7505962 7714411 7808697 7923072 8030961 8384194 8527688 8767569 8812479 9281578 9535638
4540 9535638 9767155 10341700 10422737 10509929 10629015 10939263 10948700 11289129 11507782 11614822
4530 11614822 11726630 11975211 12106499 12304115 12417858 12542245 12740168 12825675 13247073 13488128
4520 13488128 13694920 14078930 14450247 14670304 14946564 15522826 16157192 16577131 17110102
4511 17110102 17691994 18415129 19186925 19928425 20941604 22041127 23139303 24491932 25654914
4502 25654914 27003467 28395092 30265702 31883647 33636297 35674031 37674519 40212616
4494 40212616 43266337 46453397 49603747 53308300 57060038 59912210 61437112 61277849
4486F1277849k118863l375128l418769l072870k133625j393133r65303l96617
4478D4403541L30514P49699J196807J546330J797376K056137K835488L027849
4470E7943741L420021M134960M780705N233946N091740L858047K841180N99616
4462H7903956k210843m724596o839396p275118o467764n787559m539623l561861
4454D6497196k730188j968743j729471j109927q29966o77004l61841J07067N34859
4445C7731982J079325J255462J555977J805133J912973J553007J078875l28310
4437D7644424k223822m051247m361016m198028l730565l058084k593981k235998
4429B1191683k133671j695713j386007q31027q45683j014795r69802n14328o45844
$$ plain form
4486 61277849 59158986 55783858 52365089 49292219 47158594 45765461 44800158 44403541
4478 44403541 44734055 45483754 46680561 48226891 50024267 52080404 54915892 57943741
4470 57943741 61363762 65498722 70279427 75513373 80605113 84463160 87304340 87903956
4462 87903956 85693113 80968517 74129121 66854003 60386239 54598680 50059057 46497196
4454 46497196 43767008 41798265 40068794 38958867 38128901 37451897 37090056 37197123 37731982
4445 37731982 38811307 40066769 41622746 43427879 45340852 46893859 47972734 47644424
4437 47644424 45420602 41369355 37008339 32810311 29079746 26021662 23427681 21191683
4429 21191683 19058012 17362299 15976292 15145265 14299582 13284787 12314985 11800657 11154813
4420A1154813m89047m69262n49510k23417j31513m75256m25025k54299k19276
4411G918208k70787m2845j08961m04401m31124k56543J43270j19570n6367j33943
4401F236937k2129l38610m6078k23129k57616L8280O2522n3865j32484k44506
4391E019322L54454J24127l34241j6560n863J57949L9312k87704J96490J91395
4381E438681J37704K31451k0130P4130J97724j73763j72177n8040j95605j23577
4371E336398p2721j94772J15749k993k52834j79278q6498N1827J87682J92693
4361E095253K16752J96600J70330J11321R5271K44539J65346r8969o8285o0042
4351F068116j00672j48790j19007k91142m03589k82226j48367k99618j65422j43441
$$ plain form
4420 11154813 10665766 10196504 9646994 9423577 9292064 8816808 8391783 8137484 7918208
4411 7918208 7647421 7604576 7495615 7091214 6660090 6403547 6546817 6427247 6370880 6236937
4401 6236937 6214808 5876198 5830120 5606991 5349375 5387655 5450177 5396312 5263828 5019322
4391 5019322 5373776 5497903 5163662 5147102 5141239 5299188 5338500 5050796 5247286 5438681
4381 5438681 5576385 5807836 5787706 5861836 6059560 5885797 5713620 5655580 5459975 5336398
4371 5336398 5263677 5068905 5184654 5181661 4928827 4749549 4663051 4714878 4902560 5095253
4361 5095253 5312005 5508605 5678935 5790256 5885527 6130066 6295412 6196443 6128158 6068116
4351 6068116 5967444 5818654 5699647 5408505 5004916 4722690 4574323 4274705 4109283 3965842
4341C965842r3713Q8873p5064j46099R2096N1074q2222l2014R6545L04506k57208
4330C912616J05811p5824r1934r6801k98612j82726n5070l40792j10751K06469
4320B972386j89545m5740q5097l12809k91220J81093j40938J95631J06686k12503
4310B177944l1412j28550k6690j50859Q9573K8043L1141n9767j86944R8501Q3632
4299A924612j93053K05647r8262j3314l29745o7706o2510J68725J16036m4450
4289A605980J4629J10269p4406m1086j9164q017j25334K7571P4240q4238J27064
4278A607508J12196J46565j02456k72462J07737J62318j02974J369k0623N5694
4268A694872j29986r271K6575k4445r1117J32667k4690J41151k3692j48480k25912
$$ plain form
4341 3965842 3872129 3961002 3885938 3739839 3831935 3883009 3800787 3768773 3865318 4169824 3912616
4330 3912616 4018427 3942603 3850669 3753868 3455256 3272530 3217460 2876668 2765917 2972386
4320 2972386 2782841 2737101 2652004 2339195 2047975 2229068 2088130 2283761 2390447 2177944
4310 2177944 2146532 2017982 1991292 1840433 1930006 1958049 1989190 1929423 1742479 1840980 1924612
4299 1924612 1731559 1937206 1838944 1825630 1495885 1428179 1365669 1534394 1650430 1605980
4289 1605980 1620609 1730878 1656472 1615386 1596222 1588205 1462871 1490442 1564682 1480444 1607508
4278 1607508 1719704 1866269 1763813 1491351 1599088 1761406 1658432 1659801 1639178 1694872
4268 1694872 1564886 1555615 1582190 1557745 1466628 1599295 1574605 1715756 1692064 1543584 1317672
4257A317672n1902O058J06901J18915l4589N6131j30847K2112j571r754K65054
4246A664180j15448j34658J56812M9435j63327r5850J93977r317j76636J31391
4236A500559J45873k7267P0385J17080P7170k8295m4744n8362K4506J68108q1594
4225A863419L4704j02581k2669J86122l9095k1737O7565m4623j71485J8456J24321
4214A892397K4352J8598p6710J88673J0613j08618j06154k08277K86787K06025
4204B127686O6743n5862j28508j68791J07697J05682n290j36593J44468O271Q0062
4193B143565m2714j02704M8617j01485J52548R0863J08758n3121n1263P9688Q354
4182B281106m8215r9296n7562p0274P2205R542o7874j04574M102K170R245M8421
$$ plain form
4257 1317672 1265770 1271828 1378729 1497644 1463055 1519186 1388339 1410451 1408880 1399126 1664180
4246 1664180 1548732 1414074 1570886 1620321 1456994 1361144 1555121 1545804 1369168 1500559
4236 1500559 1646432 1619165 1689550 1806630 1883800 1855505 1810761 1752399 1776905 1945013 1863419
4225 1863419 1898123 1795542 1772873 1958995 1919900 1898163 1965728 1921105 1749620 1768076 1892397
4214 1892397 1916749 1935347 1858637 2047310 2057923 1949305 1843151 1634874 1921661 2127686
4204 2127686 2194429 2138567 2010059 1841268 1948965 2054647 2049357 1912764 2057232 2063503 2143565
4193 2143565 2100851 1998147 2046764 1945279 2097827 2188690 2297448 2244327 2193064 2272752 2281106
4182 2281106 2232891 2133595 2076033 2005759 2077964 2087506 2019632 1915058 1919160 1921330 1930575 1978996
4170A978996l4855J88757j04339J2925K13097m6562j00733K07386K59416p8320
4160B495768k69986n9184J78551J14118j12104k76106K9247k9509k087P5033k41788
4149A901953r3460l0108p320K15350K87648n8219j6961p6005j1113J119j66492
4138A946392K17645L79478l60018K9335J04664l2675l8061K2261j96653J58265
4128B230633j06486j08275N2561J50064j20113j15814J61341k15466j6610n919
4118A905916N754J43855M3954J47525m4905Q4249O2818j88501O2124r9506J18611
4107B241894J0709M2508j17753q4600N3469K86516J33973l32071o5583J59825
4097B328887p4595J50031k6618R6913R8641j27305O4167p9681L9243P9267J1740
$$ plain form
4170 1978996 1944141 2132898 2028559 2041484 2254581 2208019 2107286 2314672 2574088 2495768
4160 2495768 2225782 2166598 2345149 2459267 2347163 2071057 2100304 2070795 2068708 2143741 1901953
4149 1901953 1808493 1778385 1771065 1986415 2274063 2215844 2198883 2122878 2111765 2112884 1946392
4138 1946392 2164037 2543515 2183497 2212832 2317496 2284821 2246760 2269021 2072368 2230633
4128 2230633 2124147 2015872 2068433 2218497 2098384 1982570 2143911 1928445 1911835 1905916
4118 1905916 1911670 2055525 2099479 2247004 2202099 2286348 2349166 2160665 2222789 2123283 2241894
4107 2241894 2252603 2295111 2177358 2092758 2146227 2432743 2566716 2234645 2169062 2328887
4097 2328887 2254292 2404323 2377705 2474618 2573259 2445954 2510121 2430440 2469683 2548950 2560690
4086B560690J18603j02570l5873k051J82520J59197m922k4579J05210N3505R4052
4075C103782k88170M25979j90384k70759J67329J4469J8593J50905j41085k5353
4065B965306j10494r2639K87045p5661J85406l1325j20203o4762J8482L84680
4055C345835J58931n778n7723k87079J32323o1437L1523q087J07236L50423J1535
4044C717702J31493m925m3346K43314P267j43524J72930K77692j31904K3187J31748
4033D381634k01270P1375K03373R0158J03055k5384K34557J19616K3078l4460
4023D965732p6204J08414k4421k9436J16992j98307k7681Q6906N0959N873J51091
4012E129918P4400J58986K0939j02632K83453K40056k172K17691L45836K13792
$$ plain form
4086 2560690 2679293 2576723 2540850 2538799 2721319 2880516 2875594 2851015 2956225 3009730 3103782
4075 3103782 2815612 3241591 3051207 2780448 2947777 2962246 2980839 3131744 2990659 2965306
4065 2965306 2854812 2762173 3049218 2973557 3158963 3127638 3007435 2942673 2961155 3345835
4055 3345835 3504766 3498988 3441265 3154186 3286509 3225072 3256595 3248508 3355744 3706167 3717702
4044 3717702 3849195 3844270 3800924 4044238 4051505 3907981 4080911 4358603 4226699 4249886 4381634
4033 4381634 4180364 4251739 4455112 4545270 4648325 4622941 4857498 4977114 5000192 4965732
4023 4965732 4889528 4997942 4973521 4944085 5061077 4862770 4835089 4921995 4972954 4978827 5129918
4012 5129918 5204318 5363304 5384243 5281611 5565064 5805120 5802948 6020639 6366475 6580267
4002F580267J77410J00236K7297M2424K43718K87894K85431k86538J15889K44315
3992G818343J14194P3371J45678J99518J95301M14147J82924j8868L00655L92268
3982I817531R5655K12297J85773J15114J24449N32090L60553L28271M27825J75087
3972A2374645Q9462N27393N4882K55515K68050M16668M43978M79246L35280R8739
3962A5343858M63988N00268K41609L93762N08663O63472N55157L10442O39724
3953A9620943O48154O47141O40666Q50261P38636R18073P05036J076459J057716
3944B6903085R63619O32947J106693J383903J237532J617440J625031J532337
3936C7002587J359697J599857J965979K046588J752886K052912K265714K309427
$$ plain form
4002 6580267 6757677 6857913 6885210 6927634 7171352 7459246 7744677 7458139 7574028 7818343
3992 7818343 7932537 8005908 8151586 8351104 8546405 8960552 9143476 9124608 9425263 9817531
3982 9817531 9913186 10125483 10311256 10426370 10550819 11082909 11443462 11771733 12199558 12374645
3972 12374645 12464107 12991500 13046382 13301897 13569947 13986615 14430593 14909839 15245119 15343858
3962 15343858 15807846 16308114 16549723 16943485 17452148 18115620 18670777 18981219 19620943
3953 19620943 20269097 20916238 21556904 22407165 23145801 24063874 24768910 25845369 26903085
3944 26903085 27866704 28499651 29606344 30990247 32227779 33845219 35470250 37002587
3936 37002587 38362284 39962141 41928120 43974708 45727594 47780506 50046220 52355647
3928E2355647K197592K315164K451066K251706K435023K603795K613548K372012
3920G1595553K328839K532360L001614K622136K792023K504133K361388K209421
3912I1947467J915858J920372J932452J902068J431457J278967J469193J161851
3904A04959685J041304J167078N02542N25040K61388p3725k93699o37484q69609
3895A06582520j327916j387531j249746j321765j467675j966335j905882j892707
3887I4062963j903963k148213k346365k517314k589354k843573k693679k806206
3879G4214296l055472k966412k790352k606197k572730k379077k392253k553158
3871E2898645k441773k096896k360598k252180k184434k243289j927074j826435
$$ plain form
3928 52355647 54553239 56868403 59319469 61571175 64006198 66609993 69223541 71595553
3920 71595553 73924392 76456752 79458366 82080502 84872525 87376658 89738046 91947467
3912 91947467 93863325 95783697 97716149 99618217 101049674 102328641 103797834 104959685
3904 104959685 106000989 107168067 107670609 108195649 108457037 108383312 108089613 107452129 106582520
3895 106582520 105254604 103867073 102617327 101295562 99827887 97861552 95955670 94062963
3887 94062963 92159000 90010787 87664422 85147108 82557754 79714181 77020502 74214296
3879 74214296 71158824 68192412 65402060 62795863 60223133 57844056 55451803 52898645
3871 52898645 50456872 48359976 45999378 43747198 41562764 39319475 37392401 35565966
3863C5565966j722987j629575j485420j529279j145232j220038j024598j138364
3855B4670473r23487p11078q25502p40753n12372p61598p51190l32794o90969
3846A8420730n20106o05953j88244k80390j77057l4344m31461j30396l66817P868
3836A5693830l06910j93179l430j71431j44864j07100M7283j21467Q658j12310
3826A4589080n2990q5654L5455k29837k05014k89816R6399k23022k9473k57028
3816A3348100j74247j73043l38205l357p1200q7687j95226j69274k83781j89698
3806A1662382K36k61246j4137L8047k40819k93604j17431J42196q7309k71667
3796A0556648j85850j20346J6179k34971k2728Q4756O6821r8442m7777j14780
$$ plain form
3863 35565966 33842979 32213404 30727984 29198705 28053473 26833435 25808837 24670473
3855 24670473 23746986 23035908 22210406 21469653 20957281 20195683 19444493 19111699 18420730
3846 18420730 17900624 17294671 17106427 16826037 16648980 16614636 16183175 16052779 15685962 15693830
3836 15693830 15386920 15193741 15190311 15018880 14874016 14766916 14814199 14692732 14701390 14589080
3826 14589080 14536090 14450436 14485891 14256054 14051040 13761224 13857623 13634601 13605128 13348100
3816 13348100 13173853 13000810 12662605 12659248 12588048 12500361 12305135 12135861 11852080 11662382
3806 11662382 11662618 11401372 11387235 11425282 11184463 10890859 10773428 10915624 10828315 10556648
3796 10556648 10370798 10250452 10266631 10031660 10008932 10093688 10160509 10062067 10014290 9899510
3786I899510J27915J13555r8763r2136Q5701K44991l6766l946j19433j30922J6842
3775A0006548K91058j35534j44676R9239l1726r4411k45431q3714P4193N0089
3765I785635j5256k56261J30095r4428n3288L9578n1633j64409J7241o9960K2235
3754I289549j74962j84338R1125P0973j11247J94393J63236j62599K4750J05823
3744I306703n9229Q8846J5998l49852K5116L15332K70463j83885l46951K42273
3734I324814K11261j434R820Q0735J20527J37730m1372n1967J5251J27496J78619
3723A0111480l5301N5363J22872L74007J05632l20478j34340M7658J69241K08595
3713A0704729K22156k4863o6931L44093J01189q9900K10813K17209O4679j71424
$$ plain form
3786 9899510 10027425 10140980 10042217 9950081 10035782 10280773 10244007 10240061 10120628 9989706 10006548
3775 10006548 10297606 10162072 10017396 10116635 10084909 9990498 9745067 9661353 9735546 9785635
3765 9785635 9770379 9514118 9644213 9549785 9496497 9536075 9484442 9320033 9337274 9267314 9289549
3754 9289549 9114587 8930249 9021374 9092347 8981100 9175493 9338729 9176130 9200880 9306703
3744 9306703 9247474 9336320 9352318 9002466 9027582 9342914 9613377 9429492 9082541 9324814
3734 9324814 9536075 9534641 9544461 9625196 9745723 9883453 9842081 9790114 9805365 9932861 10111480
3723 10111480 10076179 10131542 10254414 10628421 10734053 10413575 10279235 10326893 10496134 10704729
3713 10704729 10926885 10902022 10835091 11179184 11280373 11190473 11401286 11618495 11683174 11511750
3703A1511750K71603O3594n7053J89355K48962K55151n9135K41439K4558m3716
3693A2646508J21633J11939N22291J63399l09956l9545K64732Q0905O9076N49558
3683A4180540P9188N0273L29031K27377P5901K89125J31794k28382J05012L11040
3673A5550899L14805O0015J91617m0634o8884N35319L35695N2045J77904L65256
3663A7474037J97291K23307M63392K55255J39878O6395L6087K28056M56377L40911
3653A9880986K38161K78664J68068K99570J67202L41937O83212J92631L52865
3644B2603296M46257K82531K17563M36937N68213L28632L86786K70832M81132
3635B6022179L36395J54772M24777L15054L50472O53024M99153J82547K99959
$$ plain form
3703 11511750 11783353 11846947 11789894 11979249 12228211 12483362 12424227 12665666 12690224 12646508
3693 12646508 12768141 12880080 13402371 13565770 13255814 13216269 13481001 13561906 13630982 14180540
3683 14180540 14259728 14310001 14639032 14866409 14942310 15231435 15363229 15134847 15239859 15550899
3673 15550899 15865704 15925719 16117336 16076702 16007818 16543137 16878832 16930877 17108781 17474037
3663 17474037 17671328 17894635 18358027 18613282 18753160 18819555 18855642 19083698 19540075 19880986
3653 19880986 20119147 20397811 20565879 20865449 21032651 21374588 22057800 22250431 22603296
3644 22603296 23049553 23332084 23549647 23986584 24554797 24883429 25270215 25541047 26022179
3635 26022179 26358574 26513346 26938123 27253177 27603649 28256673 28755826 28938373 29238332
3626B9238332O30287K96119P04388O46325L22899L98769N06897P58571O28825
3617C4131412M87221O40132L81177N94958P13051P48866P94910M97136R52817
3608C9941680R07710P58957R26785R46847Q70096J041054J185097J212780J312929
3599D9103935J407136J358420J326289J569633J429440J514786J308029J366089
3591F0383757J447242J471614J403539J293002J091655J298905J220052J273970
3583G0883736J281213J322083J255906Q64998J038436J114637P28028Q09579M92685
3574G9791301M56834N95968K27571M79412J57565N16859N32325K33770M86573
3565H3478178N89634O39227N30807N22608P08063Q95210R30282Q75336J040294
$$ plain form
3626 29238332 29868619 30164738 30869126 31515451 31838350 32237119 32744016 33502587 34131412
3617 34131412 34618633 35258765 35639942 36234900 36947951 37696817 38491727 38988863 39941680
3608 39941680 40849390 41608347 42535132 43481979 44352075 45393129 46578226 47791006 49103935
3599 49103935 50511071 51869491 53195780 54765413 56194853 57709639 59017668 60383757
3591 60383757 61830999 63302613 64706152 65999154 67090809 68389714 69609766 70883736
3583 70883736 72164949 73487032 74742938 75607936 76646372 77761009 78489037 79298616 79791301
3574 79791301 80248135 80844103 81071674 81551086 81708651 82225510 82757835 82991605 83478178
3565 83478178 84067812 84707039 85237846 85760454 86468517 87363727 88294009 89169345 90209639
3556I0209639J253130J358911J437819J582016K022787K043732K140987K449385
3548A04498406K867540K850312L089541L386707L568527M290046L936666M671869
3540A33159614M862148M893650M897197M966887M883977N033839N047783N056860
3532A72801955M787474M841877N171083M795688M844096N149177N236577M907375
3524B12535302M817021M805148M724034M422441M009998L952349L815369L851721
3516B46933383L891007M008409M328518M242811M747909M892064M823552N198813
3508B83066466M988881N437939N776107O292250P229353Q096438Q912600J0115850
3500C39915884J1143810J2244306J3062699J3569595J3908593J2988074J1482101
$$ plain form
3556 90209639 91462769 92821680 94259499 95841515 97864302 99908034 102049021 104498406
3548 104498406 107365946 110216258 113305799 116692506 120261033 124551079 128487745 133159614
3540 133159614 138021762 142915412 147812609 152779496 157663473 162697312 167745095 172801955
3532 172801955 177589429 182431306 187602389 192398077 197242173 202391350 207627927 212535302
3524 212535302 217352323 222157471 226881505 231303946 235313944 239266293 243081662 246933383
3516 246933383 250824390 254832799 259161317 263404128 268152037 273044101 277867653 283066466
3508 283066466 288055347 293493286 299269393 305561643 312790996 320887434 329800034 339915884
3500 339915884 351059694 363304000 376366699 389936294 403844887 416832961 428315062
3493D28315062R087573O043115L225666J21106l187144n708275o877429p811393
3485D23208281p865482p424722p011492o683390o673943p335893q347179j0214036
3477C61652144j2970002j5540713j8049527k0064830k1395953k1525593k0891691
3470B31213835j9404406j7827845j5880742j3730353j1930599j0175682q954517
3463A33309691p731941o564150n787100n026143m162176l960411l337940k860937
3455I3878893k546437k376592k253108j912223k019631j829096j709110j470278
3447G7762418j561206j273001j340075r47655r34700r89990j004546j004385j076492
3438F7630368j317832j469805j480210j651651j598948j597065j486819j851206
$$ plain form
3493 428315062 437402635 443445750 446671416 446792522 443605378 437897103 431019674 423208281
3485 423208281 415342799 407918077 400906585 394223195 387549252 380213359 371866180 361652144
3477 361652144 348682142 333141429 315091902 295027072 273631119 252105526 231213835
3470 231213835 211809429 193981584 178100842 164370489 152439890 142264208 133309691
3463 133309691 125577750 119013600 113226500 108200357 104038181 100077770 96739830 93878893
3455 93878893 91332456 88955864 86702756 84790533 82770902 80941806 79232696 77762418
3447 77762418 76201212 74928211 73588136 72640481 71705781 70715791 69711245 68706860 67630368
3438 67630368 66312536 64842731 63362521 61710870 60111922 58514857 57028038 55176832
3430E5176832j574454j864807j606658j214970j236337j491938j497159j652052
3422D3038457j347831j204323j374164j314505j457541j323830j214270j163715
3414C2638278j324141r38225q69899j129852r06498q89601p39975o49268q66743
3405B4324076n08305m59810m51637o57393o42312j94756l07680l01390l69610
3396B0431183n21879m18029k17543l54115l39170j80074m65313k69474l19625
3387A7345961l93560k62550r0032k71047k55614l89419k29124l32934j59700k07442
3377A4754539P567p8197k92774l46393l44642l5163k52777k36048k40443k6028
3367A2909641n9948k02423k42390l43976k48543J071N5338k55032j54290j7960
$$ plain form
3430 55176832 53602378 51737571 50130913 48915943 47679606 46187668 44690509 43038457
3422 43038457 41690626 40486303 39112139 37797634 36340093 35016263 33801993 32638278
3414 32638278 31314137 30375912 29506013 28376161 27469663 26580062 25840087 25190819 24324076
3405 24324076 23815771 23355961 22904324 22246931 21604619 21409863 21102183 20800793 20431183
3396 20431183 19909304 19491275 19273732 18919617 18580447 18400373 17935060 17665586 17345961
3387 17345961 16952401 16689851 16599819 16328772 16073158 15683739 15454615 15121681 14961981 14754539
3377 14754539 14762106 14683909 14391135 14044742 13700100 13664937 13412160 13176112 12935669 12909641
3367 12909641 12849693 12647270 12404880 12060904 11812361 11813432 11868770 11613738 11459448 11441488
3357A1441488o1753l63207l8242R5001l18297k22341K770j68935J1262j90678
3347A0187068L1181p0655l02281L2481R0712k14067j3792J27226j08954p1894
3337I687025k09550J77744q5273N7727L06448M0495j06744o1987M5458q7795p676
3326I755872L5078o5900K9239l3368l26672K62171L0323r0924o4575Q1369O3650
3315I676263O5953J31915n847p8095N9414K45908l2403J9480R3455j49296J83462
3304A0210209J69474J72135K6309k84185J82818K39640J26286K01288k1518N7583
3294A1080039N9475j3377j09897K95485J02230j38622J27772p1625J92008P3631
3284A1597119L14244J87623l863J00434M46109L32511K73465L62907N07700L34641
$$ plain form
3357 11441488 11379735 11016528 10978286 11073287 10754990 10532649 10535419 10366484 10377746 10187068
3347 10187068 10218249 10147594 9845313 9877794 9968506 9754439 9740647 9867873 9758919 9687025
3337 9687025 9477475 9655219 9569946 9627673 9934121 9974616 9867872 9805885 9851343 9763548 9755872
3326 9755872 9790950 9725050 9754289 9720921 9394249 9656420 9686743 9595819 9531244 9612613 9676263
3315 9676263 9742216 9874131 9868284 9790189 9849603 10095511 10063108 10082588 10176043 10026747 10210209
3304 10210209 10379683 10551818 10578127 10293942 10476760 10716400 10842686 11043974 11022456 11080039
3294 11080039 11139514 11126137 11016240 11311725 11413955 11275333 11403105 11331480 11523488 11597119
3284 11597119 11911363 12098986 12095123 12195557 12641666 12974177 13247642 13610549 14118249 14452890
3274A4452890L85885L12780O24818O76089N97509Q87250P00984Q60839Q01722
3265B0300766P99424R14480Q66574O03070K98148K78924K53147K71220R3746k46083
3255B4433416o0682N813j42538q12O5904J48514j64866L6882j62489m55984o74036
3244B3029122m88648m24383o07614n98077n94129o12265o15076n04905k26790
3235A8357235l01354j73740M0077j6316k65823q2868J3950J14494P9217p3568
3225A7691304K95372K43421J62083R1840j46819K22188M59914J0315N3963l2031
3215A9051550N51191M66774K42691R8010M02491L87333L95038M16574L68412N90088
3205B2970152L18474M80655L47423N87798Q07191L49122M49831N55332L33474
$$ plain form
3274 14452890 14838775 15151555 15776373 16452462 17049971 17937221 18638205 19499044 20300766
3265 20300766 21100190 22014670 22881244 23484314 23782462 24061386 24314533 24585753 24679499 24433416
3255 24433416 24372734 24378547 24236009 24235197 24301101 24449615 24284749 24321631 24159142 23703158 23029122
3244 23029122 22540474 22116091 21508477 20910400 20316271 19704006 19088930 18584025 18357235
3235 18357235 18055881 17882141 17922218 17905902 17640079 17557211 17571161 17685655 17764872 17691304
3225 17691304 17986676 18230097 18392180 18484020 18337201 18559389 19019303 19029618 19083581 19051550
3215 19051550 19602741 20069515 20312206 20410216 20812707 21200040 21595078 22011652 22380064 22970152
3205 22970152 23288626 23769281 24116704 24704502 25511693 25860815 26310646 26865978 27199452
3196B7199452P17208P72772P53240P64966J054613R88960R34410J085994J266970
3187C5538585J270618J358826J497471J569879J642275J356074J666023J616249
3179D7516000J439632J542080R52713K61707p26059j696802j854824j731891j502139
3170D4200417j221332j072691j140175q89438q03465r20799n72602m24863N5082
3161C7210134K97877M67653L12629O74161Q45929Q96162O29382J61452j18403
3152D1376976j19459L12682M61569Q92078R34745J818110J889725J397944O66627
3143D9630997k23403p3143N27791J258987K587912L514557M806686L590279K528788
3134F8149451k182581p258170o347834m625918k706937j539300q43881l57298
$$ plain form
3196 27199452 27916660 28689432 29442672 30207638 31262251 32251211 33185621 34271615 35538585
3187 35538585 36809203 38168029 39665500 41235379 42877654 44233728 45899751 47516000
3179 47516000 48955632 50497712 51450425 51712132 50986073 49289271 47434447 45702556 44200417
3170 44200417 42979085 41906394 40766219 39876781 39073316 38152517 37579915 37155052 37210134
3161 37210134 37508011 37975664 38288293 38962454 39808383 40704545 41333927 41495379 41376976
3152 41376976 41257517 41570199 42031768 42923846 43858591 45676701 47566426 48964370 49630997
3143 49630997 49407594 49334451 49862242 51121229 53709141 57223698 62030384 65620663 68149451
3134 68149451 65966870 58708700 52360866 47734948 45028011 43488711 42644830 42287532
3126D2287532O89621Q04504P99758M57478n08461j226645j133217o96722n49382
3117D0924466j36828N18740Q57245J138259J718298J430422J746719K784086L905238
3108E4886645K456030J463204m495900p862661o369250m943436l300213k493750
3100B9340669j575845j397017r93734m69980k12898k89318J17149M85963L40954
3091B5345943m7663L1293p06049p24066o98791m54936k93588L69462L26522Q62496
3081B4010623Q59287K90968k59388j532005k306560j958339j733870j019036r51872
3072A5399808p75850n74562m08368l34375k03588l5755o0434j08211p7182K06544
3062A3028027K57959J44490K58603M92493O37881O03691O67338J010411J299292
$$ plain form
3126 42287532 42977153 43781657 44581415 45038893 44530432 43303787 42170570 41473848 40924466
3117 40924466 40787638 41306378 42163623 43301882 45020180 46450602 48197321 50981407 54886645
3108 54886645 57342675 58805879 54309979 46447318 40078068 35134632 31834419 29340669
3100 29340669 27764824 26367807 25374073 24904093 24691195 24401877 24519026 25004989 25345943
3091 25345943 25298280 25329573 24623524 23899458 23200667 22745731 22452143 22821605 23148127 24010623
3081 24010623 24869910 25160878 24901490 23369485 21062925 19104586 17370716 16351680 15399808
3072 15399808 14623958 14049396 13641028 13306653 13103065 13067310 13006876 12898665 12821483 13028027
3062 13028027 13285986 13430476 13689079 14181572 14819453 15423144 16090482 17100893 18400185
3053A8400185Q51290M02374m49555j720324k131028j849157j136560p20845p71879
3044A0874501q12998o38125l29211m67207k96327k44654k06395k76385j54911
3035G448288q9273j09189j96147k80642O2069j29232j18354j91129K6779j55672
3025F267498p130q9810J2046k27802m0037j69955m0857q4629k21036M8757q5152
3014E361893J34059k41643j23890l3215P991K98041j12230j47154r9922N8750
3004E102680J32889j18941j4285k80595j77233k05739M3006J33950L7371l7649
2994D615454j44615j44887l2145P540R2861p2287j51987m3333p7644j2532J0255
2983D046680K38292N8514k30644q5740L63482j22858k42154O7755q266o5709q8237
$$ plain form
3053 18400185 19251475 19653849 19204294 17483970 15352942 13503785 12367225 11646380 10874501
3044 10874501 10061503 9423378 9094167 8626960 8330633 8085979 7879584 7603199 7448288
3035 7448288 7359015 7249826 7053679 6773037 6835106 6705874 6587520 6396391 6423170 6267498
3025 6267498 6260368 6170558 6182604 5954802 5914765 5744810 5703953 5619324 5398288 5447045 5361893
3014 5361893 5495952 5254309 5130419 5097204 5105195 5403236 5291006 5143852 5043930 5102680
3004 5102680 5235569 5116628 5102343 4821748 4644515 4438776 4481782 4615732 4653103 4615454
2994 4615454 4470839 4325952 4293807 4301347 4394208 4321921 4169934 4126601 4048957 4036425 4046680
2983 4046680 4284972 4343486 4112842 4027102 4390584 4267726 4025572 4093327 4085061 4019352 3931115
2972C931115k09869M8922N8382K9582j14530K7209L16333O8640n5938r5258k9816
2961C974772k76028M6580o6049N4388j48856N3669N019p5258P0172n5396J52124
2950C735137q9951j09674K21446O473J23605J9357k38638M9769k29481k5482K15230
2939C677791K54332P2513J17430k09213j3346K74993N3143L8215q5334n5508J46259
2928D271275J77481K22554m0056J35234L6578j9399N4514j10224K61201J45568
2918E134726j15940N7498O5639j7356j10476P5170K5359K27066Q4632J74375o1240
2907E539453N2349L5488o9312P9390L11017j40574o8276j87438P3200K39544j3574
2896E851267K3121J41835J85614P5619J81931J23353L06108K58241N2675j9812
$$ plain form
2972 3931115 3721246 3770168 3828550 3858132 3743602 3770811 4087144 4155784 4099846 4004588 3974772
2961 3974772 3698744 3745324 3679275 3733663 3584807 3638476 3643495 3568237 3638409 3583013 3735137
2950 3735137 3645186 3535512 3756958 3763431 3887036 3906393 3667755 3717524 3488043 3462561 3677791
2939 3677791 3932123 4004636 4122066 3912853 3899507 4174500 4227643 4265858 4180524 4125016 4271275
2928 4271275 4448756 4671310 4631254 4766488 4803066 4783667 4838181 4727957 4989158 5134726
2918 5134726 5018786 5076284 5141923 5124567 5014091 5089261 5114620 5341686 5426318 5600693 5539453
2907 5539453 5591802 5627290 5557978 5637368 5948385 5807811 5739535 5552097 5625297 5864841 5851267
2896 5851267 5874388 6016223 6201837 6277456 6459387 6582740 6888848 7147089 7199764 7179952
2886G179952K40990J97440J73227K55512j20695j57217N8094J55644L24545R6620
2876H404112K43004J60318J96109J01433j5381P6661Q4543k36233O9760Q2839
2866I167165J57100k13046L72168J69581j79690M224L08464j3168M1587K38542
2856A0052927O8684J19431K23090J17379J99961J70485K34202M99751J85931K91278
2846A2163119K95646J92988N05249L46326N00227K37473j7951L54059K59946k25142
2836A4611940j02981o5267m61519m22489k16841m15529m54536k90149K6614j28239
2826A2081004k2362L05509j14828J75111k5607j10264J54402M46790K38220N73075
2816A3701050J02188Q4001L22037J1371J04209P257j33106l3912l73517l56666
$$ plain form
2886 7179952 7420942 7618382 7791609 8047121 7926426 7769209 7827303 7982947 8307492 8404112
2876 8404112 8647116 8807434 9003543 9104976 9089595 9166256 9250799 9014566 9084326 9167165
2866 9167165 9324265 9111219 9483387 9652968 9473278 9477502 9785966 9772798 9814385 10052927
2856 10052927 10121611 10241042 10464132 10581511 10781472 10951957 11186159 11685910 11871841 12163119
2846 12163119 12458765 12651753 13157002 13503328 14003555 14241028 14223077 14577136 14837082 14611940
2836 14611940 14508959 14443692 13982173 13559684 13342843 12927314 12472778 12182629 12209243 12081004
2826 12081004 12058642 12364151 12249323 12424434 12398827 12288563 12442965 12889755 13127975 13701050
2816 13701050 13803238 13887239 14209276 14220647 14324856 14332113 14199007 14165095 13791578 13434912
2806A3434912j18089l20487m61434l93482o07145l89888l61111m64227k60002
2797A0059047j81109m145k72541j34519n1140R7997j38200K53601q0536j43422
2787I405033L7737m7156j86183l76278J76572l97782n32963j08043l94043k83498
2777G293396l20786k70018l69144l18515k68257l21811j66236j95246k2389n8466
2767D982528m6650j20710j71796k65482r7812j68871O049p4112n3140K5845o2619
2756C953230k49317l9207l78288j78550K1907o9887j04741j72778j82874R6121
2746B695616k35707k60430J47605J9142j36485J07480j8237J14212l1169j15932
2736B286095n7739j14415P7005m8655K08406k85212k21595O6333Q3761j46030
$$ plain form
2806 13434912 13316823 12996336 12534902 12141420 11534275 11144387 10783276 10319049 10059047
2797 10059047 9877938 9873793 9601252 9466733 9415593 9513590 9375390 9628991 9548455 9405033
2787 9405033 9442770 9395614 9209431 8833153 9009725 8611943 8078980 7970937 7576894 7293396
2777 7293396 6972610 6702592 6333448 6014933 5746676 5424865 5258629 5063383 5040994 4982528
2767 4982528 4935878 4815168 4643372 4377890 4280078 4111207 4117256 4043144 3990004 4015849 3953230
2756 3953230 3703913 3664706 3286418 3107868 3129775 3059888 2955147 2782369 2599495 2695616
2746 2695616 2459909 2199479 2347084 2366226 2229741 2337221 2318984 2433196 2402027 2286095
2736 2286095 2228356 2113941 2190946 2142291 2350697 2065485 1843890 1910223 1993984 1847954
2726A847954l293j58066j94466J51705k05583P1224R7281J68164J6299j01620
2716A689599k8000k23215m656j78640l0949j02605Q6067k2257j74263P0664J13816
2705A195561J33920k23074q9177L4513j81464P5313j64910J64954J44663j21118
2695I69181N1491J31954M1621K590K0807M704j09370k9992l7012m9050j52719
2684H44205M5217k00146r8867n9789J44896L42759j74371k93366J67525l3413
2674F84650k27634K70483n5167J02733m60615J17386J32125J47138L6694M2962
2664G90755o7060j22012m9789k6801M5953j69329o3095J52409N2097n2644r6473
2653C94011L2178l1107J35882j5408k7161M33857j89067k66280o1014J99294j46938
$$ plain form
2726 1847954 1844661 1686595 1492129 1643834 1438251 1509475 1606756 1774920 1791219 1689599
2716 1689599 1661599 1438384 1433728 1255088 1224139 1121534 1207601 1185344 1011081 1081745 1195561
2705 1195561 1329481 1106407 1017230 1051743 870279 945592 780682 945636 1090299 969181
2695 969181 1020672 1152626 1194247 1196837 1217644 1222348 1112978 1082986 1045974 996924 844205
2684 844205 889422 689276 590409 530620 675516 1018275 843904 550538 718063 684650
2674 684650 457016 727499 672332 775065 314450 431836 563961 711099 747793 790755
2664 790755 723695 601683 551894 525093 571046 401717 338622 491031 543128 490484 394011
2653 394011 426189 395082 530964 515556 488395 922252 733185 466905 405891 605185 458247
2642D58247L9480O5600j23848r6943K3889n9611Q5776j81732Q7389o745K39994
2631E31496k2184j49573r1099q7360Q5144j97j2986K07158p1532m9700j8340n5745
2619B65082J2362K5565N7663J38102P830k9374m0716o0694L218m6890j90984P8346
2607B19510K54677n9171m4779p1492q2072j28240j57053J42872K03756K7599O5287
2596C70894j54700K88831k84246K50076j6016j45023P8895r7692r8338K460J91803
2585C86944p4557k40883o3833J10893J53416j80829O8693J83858j61534J01326
2575B83494J29269j70664j59606R1221r5412J45873K19585m0162l6702n6642k013
2564C08241j3744k7691j79124M9763J57833R681J30102k18178k8822o364k5536
$$ plain form
2642 458247 497727 563327 439479 342536 366425 306814 392590 210858 298247 291502 531496
2631 531496 509312 359739 268640 181280 266424 266227 253241 460399 388867 339167 320827 265082
2619 265082 277444 303009 360672 498774 506604 477230 436514 375820 379038 332148 141164 219510
2607 219510 474187 415016 370237 298745 216673 88433 -68620 74252 278008 305607 370894
2596 370894 216194 505025 220779 470855 454839 309816 388711 291019 192681 195141 386944
2585 386944 312387 71504 7671 118564 271980 91151 159844 343702 182168 283494
2575 283494 412763 242099 82493 173714 78302 224175 443760 403598 366896 310254 308241
2564 308241 294497 266806 87682 137445 295278 304959 435061 216883 188061 181697 156161
2553A56161J44173n4624j03116k1742J09818M7549R3743q5047l2120k1848j56793
2542G6154N1089q9337n8509Q1326k9843P2886K25908m2335j73147M0895r3330
2531F1757j41190J49535R8441p4625J04099j35579K8665M8467K62273k21765k9049
2520A51029j75494q1430J2516j50349J90265K30335p9947J1772K61939j01239
2510B69397m6561M3781q8112J0633j48514N0287r9465j95507L31597M918Q0086
2499B12540J30931J49500l43654k43310J16238J19981K0133n1874j76281j0995
2489g6791j91748J96453R451L7939J05868j85757l5888J76258j60705K6008J43211
2478D4299j80264q4101j0394J87567J06801M8909k41724N0196J73686k64494J95458
$$ plain form
2553 156161 300334 245710 142594 120852 230670 278219 371962 286915 254795 232947 76154
2542 76154 127243 37906 -20603 60723 30880 103766 329674 287339 114192 155087 61757
2531 61757 -79433 70102 168543 93918 198017 62438 91103 139570 401843 180078 151029
2520 151029 -24465 -105895 -93379 -243728 -53463 176872 96925 108697 370636 269397
2510 269397 222836 266617 178505 189138 40624 90911 -8554 -204061 127536 132454 212540
2499 212540 343471 492971 149317 -93993 22245 142226 162359 110485 -65796 -76791
2489 -76791 -268539 -72086 -62635 -24696 81172 -104585 -140473 35785 -124920 -98912 44299
2478 44299 -135965 -220066 -230460 -42893 63908 112817 -128907 -78711 94975 -169519 25939
2467B5939J91464j51239o6092J95357o1509p5621r9834j81371J11272L181L3202
2456g5251K36584J11850p5872q0592p616j00368J25421o7935k05710K41513r4509
2445G515M496O6561k26180Q5275R1672k3197l6475N5213R9344k92765P1928J32666
2433C6053M5712j42140n3715J27520l9146j63719J90740J71039j62953l0632L9695
2422A8454R8197k18740J1265J4814R1709Q5218R1372K8243k3908k97428m6677
2411a47481L25666K212j57338p4398J3258J15933J34393j35345k634K15470j74455
2400A15281k71548K61880O9460j16689R0772p5566l1108r3063k9837j42845J7629
2389b05634J31346M138J866k38193K59295J93294j10372p1511j38922M5960K4103
$$ plain form
2467 25939 217403 66164 72 195429 133920 58299 -41535 -222906 -111634 -108453 -75251
2456 -75251 161333 273183 197311 116719 109103 8735 134156 66221 -139489 102024 7515
2445 7515 12011 78572 -147608 -62333 29339 6142 -30333 24880 124224 -168541 -96613 36053
2433 36053 81765 -60375 -114090 13430 -25716 -189435 1305 172344 9391 -21241 18454
2422 18454 116651 -102089 -90824 -76010 15699 100917 192289 220532 196624 -100804 -147481
2411 -147481 178185 180397 23059 -51339 -38081 77852 212245 76900 74266 289736 115281
2400 115281 -156267 105613 175073 58384 149156 73590 42482 -50581 -80418 -223263 -205634
2389 -205634 -74288 -70150 -68284 -306477 -47182 146112 35740 -35771 -174693 -128733 -104630
2378a04630q5317L83502M8312k59532r2991J68965R8889k79179j53381K42502
2368c2860J10954o3447j16912J26953q3661K654J31134Q2682n3991k69783K19798
2357E3521Q8850P7403m0947j63216L1747P2642N2279j14798K9269Q5629j21852
2346E0527k46801L9731K17547J89679l03648j02696R3922J531k01861o4752L94191
2335F7370L35209k62336q0482J85449r6780m4503j6672Q5701j27891J47436J77731
2324C70232K2243k8785l44543p1055K9548K68712Q0401n4969n1257M4514j23059
2313A41982n5033K9315j18961l3990J44827J94100l20060k874O8858J11866Q4549
2302B44579j27385n444K32517r2579l43142j1640K54350j7497n2132j05634j79179
$$ plain form
2378 -104630 -189947 193555 241867 -17665 -110656 58309 157198 -121981 -275362 -32860
2368 -32860 78094 14647 -102265 24688 -58973 -56319 74815 157497 103506 -166277 53521
2357 53521 142371 219774 178827 15611 47358 120000 172279 57481 86750 172379 50527
2346 50527 -196274 -156543 61004 250683 -52965 -155661 -61739 -60208 -262069 -326821 67370
2335 67370 402579 140243 59761 245210 148430 103927 87255 172956 45065 192501 370232
2324 370232 392475 363690 19147 -51908 -22360 246352 326753 271784 220527 265041 141982
2313 141982 86949 116264 -2697 -36687 108140 302240 -17820 -20694 48164 160030 244579
2302 244579 117194 111750 344267 251688 -91454 -103094 151256 133759 81627 -24007 -203186
2291b03186R8005J17450N8428j62297p2126J97994n4737k86970J90678J31572
2281A4811P8365j25557N6079M2655j91990K03499M3079p5004k10003J51863P7297
2270F5094J24387J03143j58761N54N9664l7860p2158j86285m49j43554O064j1584
2258b51745J88537j26849K27553J33673o3827L0906q8919j22286j829K41506j35500
2247C1220M0950J99599j5162q2713l5573J5849j06145j46066P3102O5709j362
2236C9408J23923J18967j51297j90900r9858k883J23939K06292j93553m2124J94517
2225A26431j53852J48957j0953L0494k18450j82372J48909L34725L4087k88182
2215c0206J94671K175l0172l9357J62859j1811j84716J58643J28007L2543L5957
$$ plain form
2291 -203186 -105181 12269 70697 -91600 -163726 34268 -20469 -307439 -116761 14811
2281 14811 93176 -32381 23698 66353 -125637 77862 120941 45937 -164066 -12203 65094
2270 65094 189481 292624 133863 134417 194081 156221 84063 -102222 -102671 -246225 -240161 -251745
2258 -251745 -63208 -190057 37496 171169 107342 138248 49329 -72957 -74786 166720 31220
2247 31220 72170 271769 256607 173894 138321 154170 48025 -98041 -24939 40770 39408
2236 39408 163331 282298 131001 -59899 -159757 -162640 -38701 167591 -25962 -68086 126431
2225 126431 -27421 121536 110583 141077 -77373 -259745 -110836 223889 257976 -30206
2215 -30206 164465 166640 136468 97111 259970 248159 63443 222086 350093 382636 418593
2204D18593j70742o7015M0929k4651Q217O4212p7591N7342N0574R7901j0879j72375
2192B14515p3956K32735k15348P4642J13182j46287j02205o4894O4490N8706p5712
2181G9868R9755O3924j7138J21015Q9345j84125j65884K60971m0296j42198Q3976
2170B49213J10824l40150J73711J18315n594q9531k01188J66804J76979J09924
2160D69307m6548J33486J8141l3851J6445L8656j13985J11101k48400L4103R3890
2149D72345k01063N6116J86960K48281N6232j02760J24944K2641j62061k5493
2139F76142j50399M7894j17824K16783J87600j14977l7331Q8866R6518r4556r6645
2128G02071J84102J17712L2705o770J35378j3944j04418J26232p7102Q3044J38247
$$ plain form
2204 418593 247851 180836 221765 197114 205331 269543 191952 249294 299868 397769 386890 214515
2192 214515 140559 373294 157946 232588 345770 199483 97278 32384 96874 155580 79868
2181 79868 179623 243547 226409 347424 436769 252644 86760 347731 307435 165237 249213
2170 249213 360037 19887 193598 311913 306319 216788 15600 182404 359383 469307
2160 469307 422759 556245 574386 540535 556980 595636 481651 592752 344352 378455 472345
2149 472345 271282 327398 514358 762639 818871 716111 841055 863696 701635 676142
2139 676142 525743 573637 455813 672596 860196 745219 707888 796754 893272 798716 702071
2128 702071 886173 1003885 1036590 1029820 1165198 1151254 1046836 1173068 1095966 1179010 1317257
2117A317257J11266p6147J23969m7422j4797M8616J60223J27658r313J30691l0790
2106A841211m5238K20048L4849k11193M2834J43476K49451q9657J52047J15879
2096B453707l278J70166j73957M0834N2744l650K23321R0457M349J24870Q6216
2085C065779J00083L56401J80246j01038K6016J68197J30303m4762K07855J30258
2075D219338j80818J39079J18140K71839M10342K89635K5782P4917J56123K61159
2065E785536L48532M5448M10272L81052M90424K77396L87226N98251O50010O29126
2055A0003273J013868R95467J110994Q12249R05693J447934J461864J694228K302996
2046B1748566K779982L258443L503167M003353M698247N945496Q156995N156368
$$ plain form
2117 1317257 1428523 1352376 1476345 1428923 1414126 1462742 1622965 1750623 1741310 1872001 1841211
2106 1841211 1795973 2016021 2050870 1839677 1882511 2025987 2275438 2185781 2337828 2453707
2096 2453707 2450429 2620595 2446638 2487472 2540216 2536566 2759887 2850344 2854693 2979563 3065779
2085 3065779 3165862 3522263 3702509 3601471 3627487 3795684 3925987 3881225 4089080 4219338
2075 4219338 4038520 4177599 4295739 4567578 4977920 5267555 5293337 5368254 5524377 5785536
2065 5785536 6134068 6179516 6589788 6970840 7461264 7738660 8125886 8724137 9374147 10003273
2055 10003273 11017141 12012608 13123602 13935851 14841544 16289478 17751342 19445570 21748566
2046 21748566 24528548 27786991 31290158 35293511 39991758 45937254 54094249 59250617
2038E9250617L626330o021251j2213192r449510o951089m558338m115800k886192
2030A6681575k252608j863397j540966r51358p71445n86202q90280l12308k87110
2021G225901o33812p75711o62817k50542k78651k73910l76482k65728l76461k29649
2011C102138P6869j79375l25205m22012k3582Q0425k13248k79847j47012R789
2001A678940K9872M4159J00336J87875k46113m47322K9233j45898K46187n1235
1991A426034q2952l1772l03133j3483J82663p0318k55086J8425l9560L39542j12360
1980A058000j66636L1248R659k21587j77705r165n5219P3121n9142J74892o1018
1969E96448J33756o0162j44039R475J3113j83871J91933k3731j27999N1892J04526
$$ plain form
2038 59250617 62876947 56855696 44642504 35192994 28241905 23683567 19567767 16681575
2030 16681575 14428967 12565570 11024604 10073246 9301801 8715599 7825319 7513011 7225901
2021 7225901 6592089 5816378 5153561 4903019 4624368 4350458 3973976 3708248 3331787 3102138
2011 3102138 3179007 2999632 2674427 2252415 2228833 2309258 2096010 1816163 1669151 1678940
2001 1678940 1708812 1752971 1853307 2041182 1795069 1347747 1376980 1231082 1477269 1426034
1991 1426034 1343082 1311310 1008177 994694 1177357 1107039 851953 870378 830818 1170360 1058000
1980 1058000 891364 922612 932271 710684 532979 523814 468595 541716 482574 657466 596448
1969 596448 730204 670042 526003 535478 548591 364720 556653 532922 404923 456815 561341
1958E61341o9381j7054j72674j2342r6439k5648j1198K01059J2369k9769o7805
1947B72459p271K710r5896J61567P0421j39011P5948j6287m4498p6608j14829
1936H8705J80520q6097J1756l06913P280J78122J93953J29183j57259m7279r3421
1925I8550J21316L4963j23915J8345j79525Q1197L63937j12750j32771j02967
1915F6380J66656j19246j42082o0912J44879K926j16892J17004r1560M9674J29018
1904A45845P8516q3858J58283j25853k2400J36360N3940k10104p8712j88123m8869
1893a84975K4808K06995J1798J6477p3381J24519M7075k0166k80496K54241k61192
1882a34297j1975L3100L33483Q981k36206M6622j68364J40644j48584J10562j75405
$$ plain form
1958 561341 491960 474906 302232 289890 193451 167803 156605 357664 370033 340264 272459
1947 272459 265188 267898 172002 333569 403990 264979 340927 324640 280142 203534 88705
1936 88705 269225 183128 194884 -112029 -104749 73373 267326 396509 239250 191971 98550
1925 98550 219866 254829 130914 149259 -30266 50931 414868 302118 169347 66380
1915 66380 233036 113790 -28292 -89204 55675 58601 -58291 58713 -32847 16827 145845
1904 145845 224361 140503 298786 172933 150533 286893 340833 130729 52017 -136106 -184975
1893 -184975 -160167 46828 58626 75103 1722 126241 173316 153150 -127346 126895 -134297
1882 -134297 -146272 -113172 220311 229292 -6914 39708 -128656 11988 -136596 -26034 -201439
1871b01439J35505J33971j33656j31410q6547L6640J31418Q3598L0243l5655R9059
1860F1727K326k11226J10058J91239j94983J12040J52939j09317l6189m1959k700
1849C3955Q589Q0358j6172j75932Q2129j13660R7293m873M2232J23596p6353J24031
1837B05193J0670j22849n768J07538K4550n3721k33559p3396J99765o468l17628
1826b65673J56291K22569p11j54534N9935J78147j81242j58183m4656J41239J2455
1815c4363J05685m1064r0476j4693J22219j15857J46627R3814k49338J21544j35173
1804i1075r219J24748J78554p269r1081l33742n9018K01626j39326R9339P7328
1793d9135m600j01452N0946J08941L52668n48961j77161P1293l6719J18579O7884
$$ plain form
1871 -201439 -65934 68037 -65619 -197029 -283576 -246936 -115518 -31920 -1677 -37332 61727
1860 61727 64053 -147173 -37115 154124 -40859 71181 224120 114803 78614 36655 33955
1849 33955 42544 122902 106730 -69202 12927 -100733 -3440 -8313 33919 157515 81162 205193
1837 205193 215863 93014 87246 194784 219334 165613 -67946 -141342 58423 51955 -265673
1826 -265673 -109382 113187 112476 -42058 17877 196024 14782 -143401 -188057 -46818 -34363
1815 -34363 71322 30258 -60218 -74911 47308 -68549 78078 171892 -77446 44098 -91075
1804 -91075 -100294 24454 203008 195739 104658 -229084 -288102 -86476 -225802 -126463 -49135
1793 -49135 -53735 -155187 -104241 4700 357368 -191593 -368754 -297461 -334180 -215601 -147717
1782a47717K26267J9174j73248K37668p6852k60314Q6827J72770J83802j31663
1772A36714R242l4616K56509Q7703j30461K8500j44614n1278j77162k8237j43478
1761a91178j7922R1452j50492N9534K50858O3769r2641Q9644j49216N6925n2250
1750d1517o1847N5915n3912o8218N3641q5209j26927k8429j60969Q0073J10270
1739c27129R5976l8742K02374J62087l28973j8669j19193Q7402N9159k7476R3801
1728a59383K58623J01540L8016j77747j37173P3668M6391o5644l34543n1295L65565
1717d1982p6746j01768r9065N3352J2601j00443J31112P3194J6447r2320J06593
1706a19025J16048m2462J73994J39122j58528j76128j15247J8956J04769J40669
$$ plain form
1782 -147717 78550 97724 -75524 162144 85292 -175022 -88195 84575 268377 136714
1772 136714 145956 111340 367849 455552 325091 353591 208977 157699 -19463 -47700 -191178
1761 -191178 -209100 -117648 -268140 -208606 42252 106021 13380 103024 -46192 10733 -41517
1750 -41517 -103364 -47449 -101361 -169579 -115938 -201147 -328074 -356503 -517472 -437399 -327129
1739 -327129 -231153 -269895 -67521 94566 -234407 -253076 -372269 -284867 -225708 -253184 -159383
1728 -159383 99240 200780 238796 61049 -76124 -2456 43935 -21709 -356252 -407547 -41982
1717 -41982 -118728 -220496 -319561 -266209 -253608 -354051 -222939 -149745 -133298 -225618 -119025
1706 -119025 -2977 -45439 128555 267677 109149 -66979 -182226 -163270 -58501 82168
1696H2168q9806J39235J7437m97653k4461J69386M3727M47474l0723k62361l20547
1685c26124L9929O0262k9099j00922K68338K00522j17525J80887j02443j5230
1675E8595J045m819j0113j88685j30174M0681J90483j19090j15336K7503p7227
1664c27137o377m0240J51374M6376J30584J20447J4698k07412K02709k15313O7339
1653f2952K63073j32372j63827n8034R653K3831j00476k86J84825L0060j78275
1642a84780r4092J13298K50042j57965q3708J05606j25984r626k34005L34369
1632h6845J11825m1007j64650l1090O8086J8218j56864J20402O5703Q5133j57402
1621a68491J70461q4916k30152J71019P6201j39780l4421R5449j19797J2016M4061
$$ plain form
1696 82168 -7638 131597 149034 -348619 -373080 -203694 -159967 287507 256784 -5577 -326124
1685 -326124 -286195 -225933 -255032 -355954 -87616 112906 -4619 176268 73825 58595
1675 58595 59640 54821 44708 -143977 -274151 -233470 -42987 -162077 -277413 -249910 -327137
1664 -327137 -333514 -373754 -222380 -176004 -45420 75027 89725 -117687 85022 -130291 -62952
1653 -62952 200121 67749 -96078 -154112 -144459 -120628 -221104 -221390 -36565 -6505 -184780
1642 -184780 -278872 -165574 84468 -73497 -157205 -51599 -177583 -187209 -421214 -86845
1632 -86845 24980 -16027 -180677 -211767 -143681 -125463 -282327 -161925 -96222 -11089 -168491
1621 -168491 1970 -82946 -313098 -142079 -65878 -205658 -240079 -144630 -264427 -252411 -208350
1610b08350K8224j23844J34287J22909l6262r6858L9068R8993n7665j40851N2887
1599a87462p978J18348K13490o6946j03847j05987R7072m668k67997J10950Q134
1588a96891N2677J16483M8075R3390j97822j2269j5598K1017j49675p3049L9480
1577b74182J33047J58897n36J01925j03950q6177q2990j4365N524k2076l0632
1566b15515n7103J57571M0072j93795m5735M0737N1391j09230M9637L664J29885
1555a48421j62744K3939L8673J03824p491j65444J29535q9346q4444j24769L09894
1544a76794J18760j30232m1980N3855J16806r2304K0802j8041l2312K111K2354
1533a56975J37736j32752o6613r0844n2J76244J30960J01165r6944J8154j20029
$$ plain form
1610 -208350 -180126 -303970 -169683 -46774 -83036 -179894 -140826 -41833 -99498 -240349 -187462
1599 -187462 -195440 -77092 136398 69452 -34395 -140382 -43310 -47978 -315975 -205025 -196891
1588 -196891 -144214 -27731 20344 113734 -84088 -96357 -111955 -90938 -240613 -313662 -274182
1577 -274182 -141135 17762 17226 119151 15201 -70976 -153966 -168331 -162807 -184883 -215515
1566 -215515 -272618 -115047 -74975 -268770 -314505 -273768 -222377 -331607 -281970 -278306 -148421
1555 -148421 -311165 -287226 -248553 -144729 -152220 -317664 -188129 -277475 -361919 -486688 -176794
1544 -176794 -58034 -188266 -230246 -176391 -59585 -151889 -131087 -149128 -181440 -179329 -156975
1533 -156975 -19239 -151991 -218604 -309448 -309500 -133256 -2296 98869 1925 20079 -99950
1522i9950j47045M2603K02986j33087L993k87220J40285J6156L1491J45251R0515
1511E978m2293k28445r0502J88385M210q4688J5432K60627J06514j32522p9907
1500g7211q9667J22144M3576r493j02904J60895k3379J46906j29607p7440j23043
1489a59223P5544Q136J00227r1757N3495m7350O4457K9174p4670J17771J43819
1478B19623j65578j86182J01251k45951j81018L93258J30739K6823j41774P648
1468d1161l8306K5542Q1262j36988k11902K53564J6680j84614R5380J11437J3841
1457a5265j21906J82316j85724k53431K61855L38324J52113k66883m06933K19271
1447i6263K08497k01607k05304J75102J11704J06690o4141N4738p3132j50041
$$ plain form
1522 -99950 -246995 -204392 -1406 -134493 -130500 -417720 -277435 -261279 -229788 -84537 5978
1511 5978 -36315 -264760 -355262 -166877 -162667 -247355 -231923 28704 135218 2696 -77211
1500 -77211 -166878 -44734 -1158 -10651 -113555 47340 23961 170867 41260 -36180 -159223
1489 -159223 -83679 -75543 24684 -67073 -13578 -60928 3529 32703 -41967 75804 219623
1478 219623 54045 -132137 -30886 -276837 -457855 -64597 66142 92965 -48809 -41161
1468 -41161 -79467 -53925 27337 -109651 -321553 -67989 -51309 -235923 -140543 -29106 -15265
1457 -15265 -137171 45145 -140579 -394010 -132155 206169 358282 91399 -315534 -96263
1447 -96263 112234 -89373 -294677 -119575 -7871 98819 34678 89416 16284 -133757
1437a33757M2209j1396K626J34992r3314k458O3036r7829j01308j0833L1930J23389
1425e2713L945J06258j94526k24913J93744L76304m3868k55670m1461q0037J68581
1414d4356J98647m7547M1358N8243j77303L987O8047m8840q0196j22972M0317
1403a10615N5280o8393l4936r1047O5185K80749K00158r9078j25314k13343r0967
1392b32321q2340J28460K59663K7150o9813L5787l0865o7969j48975o6296l2612
1381b80131J20108K02669O216K3925k06840j57522N8920N0989J32483J44103j40354
1370d5434l931K3289k1895O1831K7294k64570P5422k8420q9909r5541J2265J27637
1358b21962N0657j05354R0788k9931J49773j27555O6329j09049p2088K35588j17270
$$ plain form
1437 -133757 -91548 -102944 -100318 34674 -58640 -61098 1938 -95891 -197199 -208032 -176102 -52713
1425 -52713 -48768 57490 -137036 -361949 -168205 208099 164231 -91439 -132900 -212937 -44356
1414 -44356 154291 106744 148102 206345 29042 33029 101076 52236 -27960 -150932 -110615
1403 -110615 -55335 -123728 -158664 -249711 -184526 96223 296381 197303 71989 -141354 -232321
1392 -232321 -314661 -186201 73462 100612 30799 66586 35721 -32248 -181223 -247519 -280131
1381 -280131 -160023 42646 48862 72787 -134053 -291575 -232655 -181666 -49183 94920 -45434
1370 -45434 -49365 -26076 -47971 13860 41154 -223416 -147994 -176414 -266323 -361864 -349599 -221962
1358 -221962 -171305 -276659 -185871 -215802 -66029 -193584 -127255 -236304 -308392 -72804 -190074
1347a90074k8286J64579R5729j24279Q8393o1673j59537j3196j980J07028K1124
1336a02172m9229K05700j79354J21425n7505m7622O4950k30392N7435L30320J05866
1325B19422O6101k05001j84386j8867l3652j13888J20204K8905n382J49912q4742
1314f1374k1210j48903J4491J06135J63887p4363j68544L1130j00797l0473K75704
1303a4317O3133q5325k3646j81051L2057J72620P2851r7843L6513o5048J2570
1292g7486R8042J49023Q8734j13197j87689J49721j75931N0681j48837j03153
1282b70092K4557P3619N9197L978P3051m6689Q4570K5233j09789n2831q8038N9253
1270a63981J42496k05063M3322l0103R8635p7413J47603N5528j19632j14788J23022
$$ plain form
1347 -190074 -218360 -53781 41948 -82331 6062 -55611 -215148 -228344 -230324 -123296 -102172
1336 -102172 -151401 54299 -125055 -3630 -61135 -108757 -43807 -274199 -216764 113556 219422
1325 219422 285523 80522 -103864 -122731 -156383 -270271 -150067 -121162 -126544 23368 -61374
1314 -61374 -82584 -231487 -216996 -110861 53026 -21337 -189881 -158751 -259548 -290021 -14317
1303 -14317 48816 -36509 -60155 -241206 -209149 -36529 36322 -61521 -25008 -90056 -77486
1292 -77486 20556 169579 258313 145116 -42573 107148 -68783 -18102 -166939 -270092
1282 -270092 -245535 -171916 -112719 -108741 -35690 -82379 2191 27424 -82365 -135196 -223234 -163981
1270 -163981 -21485 -226548 -183226 -213329 -114694 -192107 -44504 11024 -108608 -223396 -100374
1259a00374o084J87237K1070k05477J80236o7571L5745J98503m834j39001r4580
1248D870j77502N9835J77694J3433p4422o4720k27663J13293N6760J21083J68127
1237A70788l4434k62070j57421L1638K34266j05311j80569K22135j78037M477
1227b54538k4597p6770m0777k8117Q2808j5039J44087Q4218l9501n6644J04711
1216a20159J15392k26340J8556R0408k7741J25633m2716O9363J6457l7358J7751
1205g54k04795J31226J00830J75966Q1812j62529j42390J38774k46822N9291M5848
1194b3543N943r692p123k8630k91310r814K86931J07787j64150K98129k5677M2600
1182A81451j4889k6813j64019j25296J26368j72876M1129M797J43991P0345l45
$$ plain form
1259 -100374 -106458 80779 101849 -103628 76608 9037 44782 243285 238451 99450 4870
1248 4870 -172632 -112797 64897 78330 3908 -60812 -288475 -175182 -118422 2661 170788
1237 170788 136354 -125716 -283137 -251499 -17233 -122544 -303113 -80978 -259015 -254538
1227 -254538 -279135 -355905 -396682 -424799 -341991 -357030 -212943 -128725 -168226 -224870 -120159
1216 -120159 -4767 -231107 -212551 -122143 -149884 -24251 -66967 2396 18853 -18505 -754
1205 -754 -205549 -74323 26507 202473 284285 121756 -20634 118140 -128682 -69391 -23543
1194 -23543 -17600 -27292 -34415 -63045 -354355 -364169 -77238 30549 -133601 164528 138851 181451
1182 181451 166562 139749 -24270 -149566 -23198 -196074 -154945 -150148 -6157 64188 63843
1171F3843J05642j39234o8451j75432K22823O541K5396L37873j62273k82311j11301
1160a76884R121j10342j17265R8769K62473m0243J8295l9833L3924q7465j05295
1149b54745J24681l7883n5602N0522J68487K8085k49867K49294j40269k0345K48349
1138A10707p9210k19719K64203O3898m72712J44752J01408Q3996j78146K22937
1128D2114j07769r9491l32252q5227K68251N6712K44817j36971J18186J4560j66863
1117a83933P2985l5123R6475J40504q2319j38574J40216k0520k3443J24525q4779
1106F014m4621j59918K78117J01645j94572j66795J4022r673K84118r1213K8378
1095D5502J08002J0926j48204k0052J13202j76695N6349J06865l63389O0145J21230
$$ plain form
1171 63843 169485 30251 -38200 -213632 9191 15732 41128 379001 216728 -65583 -176884
1160 -176884 -167763 -278105 -395370 -296601 -34128 -74371 -56076 -95909 -61985 -149450 -254745
1149 -254745 -130064 -167947 -223549 -173027 -4540 23545 -226322 22972 -117297 -137642 110707
1138 110707 31497 -188222 75981 139879 -332833 -188081 -86673 -2677 -180823 42114
1128 42114 -65655 -165146 -497398 -582625 -314374 -257662 -12845 -149816 -31630 -17070 -183933
1117 -183933 -110948 -146071 -49596 90908 8589 -129985 10231 -10289 -33732 90793 6014
1106 6014 -38607 -198525 79592 181237 -13335 -180130 -166108 -175781 108337 17124 45502
1095 45502 153504 164430 16226 -3826 109376 -67319 -10970 95895 -267494 -207349 -86119
1084h6119j96021K04705L9306l5076j40438J86528O1791j41250j82252K41673
1074d7153O8565j64741r0740J11315j56690O3089K1500M2941l2591l6004J37736
1063h2773J90040j37898j60132R7254K42998l0k464k23723k59988J42089O54Q6833
1051a07140J1839Q2942r174l3692J85988j03161l3619J13453j266N4597j75461
1040a4694r9766l6355O9340L6864k43391L2309K56335N4952j94353m0155J07999
1029g0915j88048j4828R2873Q3076m124r1197M6937j09243J3176M4163N0764L511
1017a43855J33316j27748O1729J78688j79725p2426l339n0212N2216K74430q2497
1006D0577K2688Q1268L0768j79957j18653J38116L03510n9826k6202j10613j12445
$$ plain form
1084 -86119 -282140 -77435 -38129 -73205 -213643 -27115 34676 -106574 -288826 -47153
1074 -47153 21412 -143329 -234069 -122754 -279444 -216355 -194855 -151914 -184505 -220509 -82773
1063 -82773 107267 -30631 -190763 -93509 149489 149459 146995 -76728 -336716 -194627 -193973 -107140
1051 -107140 -95301 -12359 -21533 -55225 130763 27602 -6017 107436 106170 160767 -14694
1040 -14694 -114460 -150815 -81475 -44611 -288002 -255693 642 55594 -138759 -178914 -70915
1029 -70915 -258963 -273791 -180918 -97842 -101966 -193163 -146226 -255469 -242293 -198130 -147366 -143855
1017 -143855 -10539 -138287 -76558 102130 -77595 -150021 -153360 -203572 -151356 123074 40577
1006 40577 63265 144533 175301 -4656 -123309 14807 318317 258491 232289 121676 9231
995I231J9580j2898Q2509k9904j15962K763p202J56898M7543j03485K02997r8000
983A54070k35258L1042K0092L1544L05179k11917r9601J78652j19854J13928k35248
972f7371k4069J96633J76354J01377l06151P198J4936j02131O9961J54028j57542
961F3223j69945J61674j00176p4883Q9352J15389K5081j49950j96410K64879R3377
950A21611p5875L5252J0819r3567p2831p2871p7284J3004j0807l5283L31945o6902
938G211K20253N4868k00230j79288m2013M2136Q4183J61260j71434R8169j41933
927f6818l3213J36117q234p3240l7946P9493k2438j00814J64899R1078K4016k72462
915a19562l4790j9426J03748J40920K779o8493j0880N7282k55812j36922L79747
$$ plain form
995 9231 28811 15913 98422 68518 -47444 -44681 -51883 105015 152558 49073 252070 154070
983 154070 -81188 -50146 -30054 1490 306669 94752 -4849 173803 53949 167877 -67371
972 -67371 -91440 105193 281547 382924 76773 83971 98907 -3224 66737 220765 63223
961 63223 -106722 54952 -45224 -120107 -30755 84634 109715 -40235 -236645 28234 121611
950 121611 45736 80988 91807 -1760 -74591 -147462 -224746 -211742 -222549 -257832 74113 7211
938 7211 227464 282332 82102 -97186 -139199 -97063 -12880 148380 -23054 75115 -66818
927 -66818 -100031 36086 27852 -45388 -83334 -3841 -26279 -127093 37806 128884 152900 -119562
915 -119562 -154352 -173778 -70030 70890 73669 5176 -5704 51578 -204234 -341156 38591
904C8591O1096j73728K8793N9388K28705o4280J07509R0557N8208j3741m05776
893A5322j5251k127j98496j00791J90906J19667J65185k13595J09060r643l3442
882B6795J52335k74681M3021J36187P0066j02014o2654j01903Q3169j7293J13909
871F6937m6625j87682J43973o3934j42136j306J46927l4041P4198J00296j48872
860i2265K35998K6842k11572O7769M4707r0416o6388j6553j08479m7282J37652
849a19987J32125m9784J10781q864r413j4998K38987j45959k6930O3753q5834
838H3877J43499p1087M2531O8201k09433l6498J46614j2777r6350o8974L3669
827B3272J3380J5322N5887P1829K3175k13597j42930J55754J63281p3385J05371
$$ plain form
904 38591 99687 -74041 -45248 14140 242845 178565 286074 376631 434839 421098 15322
893 15322 71 -2056 -200552 -301343 -110437 9230 174415 -39180 69880 60237 26795
882 26795 179130 -95551 -52530 83657 153723 51709 -10945 -112848 -29679 -46972 66937
871 66937 20312 -167370 -23397 -87331 -229467 -230773 -83846 -117887 -43689 56607 -92265
860 -92265 143733 170575 -40997 26772 71479 -18937 -85325 -101878 -210357 -257639 -119987
849 -119987 12138 -37646 73135 64271 54858 39860 278847 132888 105958 169711 83877
838 83877 227376 156289 198820 267021 57588 21090 167704 154927 58577 -10397 23272
827 23272 36652 51974 107861 179690 202865 -10732 -153662 2092 165373 91988 197359
816A97359K1429k16167K868L87P8095J56782j79910j15948J33122j21226p4877
805a18086j90583J8803K77512M909l1112J13643j69787J37026J87054o2409j00695
794F6275j13274m791k1364K24762j59360N5767K29571j45893j04121j00402J92279
783A19449R395j43187L9554j18659j49395Q1278J22091K63778k6498j45542l229
772D9035Q3499J9776P788k10971k01488j4738P534R5084K04578R7773j68191J1761
760a8560k0529n7415R4713M426J14909j48504K520K5937l5656j61959J39256K8315
748c2547k5720J28343p542N6867J4752j40940j32972n9655l2721J95464J5641
737b1030j02599l6603P6854K6246j18521J35623J83122l0597O900j87881J66428
$$ plain form
816 197359 218788 2621 5489 5876 83971 240753 60843 -55105 78017 -43209 -118086
805 -118086 -308669 -289866 -12354 -7445 -38557 75086 -94701 42325 229379 166970 66275
794 66275 -46999 -51790 -73154 151608 -7752 48015 277586 131693 27572 -72830 119449
783 119449 128844 -14343 25211 -93448 -242843 -161565 -39474 224304 197806 52264 49035
772 49035 132534 152310 160098 -50873 -252361 -267099 -259565 -164481 40097 137870 -30321 -18560
760 -18560 -39089 -96504 -1791 2635 117544 -30960 -28440 -2503 -38159 -200118 -60862 -32547
748 -32547 -58267 70076 62534 119401 134153 -6787 -139759 -199414 -232135 -36671 -21030
737 -21030 -123629 -160232 -83378 -57132 -175653 -40030 143092 112495 119395 -68486 97942
726I7942M1970K4453n6557M5526n6996J0825J21026k2075k28111J0285Q8876k0604
714E6560K32554k06728k52804L0644N5230n1636J9449K03332j7579j14058k2557
703f7593N7291j3913o2153K68537J66258m3094j61488r9967J77013J78780l66788
692C2883J3198J01918j88416q3274m1977L7103L4522M9232P0524J22092M801O7139
680B19745J23664k35507j37925Q5785M0103o4783J43786k16744j6310J77418Q0484
669A99716m274J31285q5559l54405J22802R4975P4672p0494m718p8681J63590
658A88909j02929j97104m8882J72125N2720k5854j7936Q9701o2336J9617N7681
647A25712P671p7411j65281K37119J513j04157J26584J8873O6925M884o2638N3113
$$ plain form
726 97942 139912 164365 107808 153334 96338 107163 228189 206114 -21997 -11712 77164 56560
714 56560 289114 82386 -170418 -139774 -84544 -136180 -116731 86601 69022 -45036 -67593
703 -67593 -10302 -24215 -86368 182169 348427 305333 143845 43878 220891 399671 32883
692 32883 46081 147999 -40417 -123691 -165668 -128565 -94043 -44811 25713 147805 152606 219745
680 219745 343409 107902 -30023 55762 95865 31082 174868 -41876 -58186 119232 199716
669 199716 195442 326727 241168 -113237 9565 104540 179212 108718 104000 25319 188909
658 188909 85980 -111124 -160006 12119 64839 38985 21049 110750 48414 68031 125712
647 125712 133383 55972 -109309 127810 129323 25166 151750 170623 237548 242432 179794 232907
635B32907L08427k13041j37669j41683m0188R6130N098N3325l01535J70987M5287
624G8045m6184p5782M4436m6755K94140q0319k5089P0352j02240j14023K74691
613B71272J31027l93594L2443p8429j34395M7509K04144j14604Q9104K50730J99543
602E04750k27635j29347p2212j09610J03470j74540o9171K95171J0263J4051P2419
591B17609r3334k24681N3731j59630P1772Q2478L2010j37491K6476J94400J18703
580A82043J04342j14996J06901K7452l3379j33699j57923J38698R1308j16798
570I3949K6718J477q1726K576J35589j77780n7229P3705K9611j05183L9756N8042
558C9505L4565j42655J22000m0724j73510j2159n704N0406J56010j11765L8798
$$ plain form
635 232907 541334 328293 190624 48941 8753 104883 109981 163306 -138229 32758 78045
624 78045 31861 -43921 515 -46240 247900 167581 142492 212844 110604 -3419 271272
613 271272 402299 8705 41148 -37281 -171676 -124167 79977 -34627 54477 305207 504750
602 504750 277115 147768 75556 -34054 69416 -105124 -174295 120876 131139 145190 217609
591 217609 124275 -100406 -46675 -206305 -134533 -52055 -20045 -157536 -131060 63340 182043
580 182043 286385 171389 278290 305742 272363 138664 -19259 119439 210747 93949
570 93949 120667 122144 40418 42994 178583 803 -56426 17279 46890 -58293 -18537 39505
558 39505 74070 -68585 53415 12691 -160819 -172978 -178682 -128276 27734 -84031 -45233
547d5233J09028j15131n0891J56942m8508j4554L1354j8745M8404j3737J03053
536A41982n2898q580M0242K19191P7266j32535j24080j39237O1246o3883r4556
525g5842K95834K6682j64696O066p1664o0268Q6939L4874j97553p9613L9760K31430
513G1949M8483J07445L6304k72423o8593J50587J91962q7961k49667p9581J30285
502b1210K36518R2522J23287q6225J3548j92105J82071N2956l85267J83990j46655
491E3430j31292j00577J02666J71841r6592K00628R7710l2925j83920k11977R1365
480c9643Q1821P5244P8485k8493K0637K35615k41896j33177J48819j99026r8660
469a00274J74157J21122j66303J6297Q499M8855Q888j19164R2714J89628j21050
$$ plain form
547 -45233 63795 -51336 -102227 54715 6207 -8347 23007 4262 52666 38929 141982
536 141982 89084 80504 120746 339937 417203 284668 160588 21351 82597 18714 -75842
525 -75842 219992 246674 81978 88044 16380 -43888 43051 77925 -119628 -199241 -159481 71949
513 71949 120432 227877 264181 -8242 -76835 73752 265714 177753 -71914 -151495 -21210
502 -21210 215308 307830 431117 344892 358440 166335 348406 401362 16095 200085 53430
491 53430 -77862 -178439 -75773 96068 -524 200104 297814 264889 80969 -131008 -39643
480 -39643 42178 117422 195907 167414 188051 423666 181770 48593 197412 -1614 -100274
469 -100274 73883 195005 28702 44999 53498 102353 111241 -7923 84791 274419 153369
458A53369j15931J46785j33977Q0797j05808o5638Q2381J00881r4916K19888J45344
447D13175k47229k57756M9790r2451m8077M9692K6624K30816K4885J81914j80140
$$ plain form
458 153369 37438 184223 50246 131043 25235 -40403 41978 142859 47943 267831 413175
447 413175 165946 -91810 -42020 -134471 -182548 -132856 -106232 124584 149469 331383 151243
$$ [...]
##END NTUPLES=NMR SPECTRUM
##END=
