##TITLE=1H_EC-3327(2)
 CDCl3
 8 sc, 
 3.5.2024
##JCAMPDX= 6.0         $$ Bruker NMR JCAMP-DX V2.0
##DATA TYPE= NMR SPECTRUM
##DATA CLASS= NTUPLES
##ORIGIN= UXNMR, Bruker Analytische Messtechnik GmbH
##OWNER= root
$$ XWIN-NMR		Version 3.5
$$ Fri May  3 14:24:04 2024 Russian Standard Time (UT+4h)  she@DPX200
##.OBSERVE FREQUENCY= 200.1309
##.OBSERVE NUCLEUS= ^1H
##.ACQUISITION MODE= SIMULTANEOUS
##.ACQUISITION SCHEME= undefined
##.AVERAGES= 8
##.DIGITISER RES= 18
##SPECTROMETER/DATA SYSTEM= spect
##.PULSE SEQUENCE= zg30
##.SOLVENT NAME= CDCl3
##.SHIFT REFERENCE= (INTERNAL, CDCl3, 0, 16.4069)
##AUDIT TRAIL= $$ (NUMBER, WHEN, WHO, WHERE, WHAT)
$$ ##TITLE= Audit trail, XWIN-NMR		Version 3.5
$$ ##JCAMPDX= 5.01
$$ ##ORIGIN= Bruker BioSpin GmbH
$$ ##OWNER= she
$$ F:/spectra/data/she/nmr/H-F/1/pdata/1/auditp.txt
$$ ##AUDIT TRAIL=  $$ (NUMBER, WHEN, WHO, WHERE, WHAT)
(   1,<2024-05-03 14:22:44.62 +0400>,<she>,<DPX200>,
      <created by zg, POWCHK disabled, PULCHK disabled
       configuration hash MD5:
       00 E9 B6 7A A2 85 ED C7 34 08 36 98 17 FE 4E 26
       data hash MD5: 16K
       8C A4 88 2B 91 35 85 FF 6F 2D 0D 85 2B FF 14 BD>)
(   2,<2024-05-03 14:22:47.59 +0400>,<she>,<DPX200>,
      <Start of raw data processing
       efp BC_mod = 2 LB = 0.24 FT_mod = 6 PKNL = 1 PHC0 = -25296.13 PHC1 = 7.18731 SI = 16K 
       data hash MD5: 16K
       23 AA 16 F0 3E DC 37 44 43 68 E9 D9 13 26 6B 94>)
(   3,<2024-05-03 14:23:11.26 +0400>,<she>,<DPX200>,
      <pk PHC0 = -1.331443 PHC1 = 2.2 
       data hash MD5: 16K
       80 73 A0 F2 88 56 CB 4E 48 B4 0A AB 0E 63 83 AF>)
(   4,<2024-05-03 14:23:14.14 +0400>,<she>,<DPX200>,
      <abs ABSG = 5 
       data hash MD5: 16K
       63 C0 68 1D C2 60 44 87 6A 48 88 04 5D E0 5A 50>)
$$ ##END=
$$ 
$$ hash MD5
$$ 0D 97 47 CB EE 9A E0 9D DD 68 20 83 8F 8E 58 B3
##$RELAX= 
##$RELAX= 
##$RELAX= 
##$RELAX= 
##$RELAX= 
##$RELAX= 
$$ Bruker specific parameters
$$ --------------------------
##$DU= <F:/spectra>
##$EXPNO= 1
##$NAME= <H-F>
##$PROCNO= 1
##$TYPE= <nmr>
##$USER= <she>
##$AMP= (0..31)
100 100 100 100 100 100 100 100 100 100 100 100 100 100 100 100 100 100 
100 100 100 100 100 100 100 100 100 100 100 100 100 100 
##$AQSEQ= 0
##$AQ_mod= 1
##$AUNM= <au_zg>
##$AUTOPOS= <>
##$BF1= 200.13
##$BF2= 200.13
##$BF3= 200.13
##$BF4= 200.13
##$BF5= 200.13
##$BF6= 200.13
##$BF7= 200.13
##$BF8= 200.13
##$BYTORDA= 1
##$CFDGTYP= 0
##$CFRGTYP= 5
##$CHEMSTR= <none>
##$CNST= (0..31)
1 1 145 1 1 1 1 1 1 1 1 1 1 1 1 1 1 1 1 1 1 1 1 1 1 1 1 1 1 1 1 1 
##$CPDPRG= <>
##$CPDPRG1= <>
##$CPDPRG2= <>
##$CPDPRG3= <>
##$CPDPRG4= <mlev>
##$CPDPRG5= <mlev>
##$CPDPRG6= <mlev>
##$CPDPRG7= <mlev>
##$CPDPRG8= <mlev>
##$CPDPRGB= <>
##$CPDPRGT= <>
##$D= (0..31)
0 1.2 0 0 0 0 0 0 0 0.06 0 0.03 0 0 0 0 0.0002 0 0 0 0 0 0 0 0 0 0 0 0 
0 0 0 
##$DATE= 1714731764
##$DBL= (0..7)
120 120 120 120 120 120 120 120 
##$DBP= (0..7)
150 150 150 150 150 150 150 150 
##$DBP07= 0
##$DBPNAM0= <>
##$DBPNAM1= <>
##$DBPNAM2= <>
##$DBPNAM3= <>
##$DBPNAM4= <>
$$ [...]
##$SUBNAM3= <"">
##$SUBNAM4= <"">
##$SUBNAM5= <"">
##$SUBNAM6= <"">
##$SUBNAM7= <"">
##$SUBNAM8= <"">
##$SUBNAM9= <"">
##$SW= 18.0517689322627
##$SWIBOX= (0..15)
0 0 2 0 0 0 0 0 0 0 0 0 0 0 0 0 
##$SW_h= 3612.71676300578
##$TD= 16384
##$TD0= 1
##$TE= 0
##$TE2= 300
##$TE3= 300
##$TEG= 300
##$TL= (0..7)
0 120 120 120 120 120 120 120 
##$TP= (0..7)
150 150 150 150 150 150 150 150 
##$TP07= 0
##$TPNAME0= <>
##$TPNAME1= <>
##$TPNAME2= <>
##$TPNAME3= <>
##$TPNAME4= <>
##$TPNAME5= <>
##$TPNAME6= <>
##$TPNAME7= <>
##$TPOAL= (0..7)
0.5 0.5 0.5 0.5 0.5 0.5 0.5 0.5 
##$TPOFFS= (0..7)
0 0 0 0 0 0 0 0 
##$TUNHIN= 0
##$TUNHOUT= 0
##$TUNXOUT= 0
##$USERA1= <user>
##$USERA2= <user>
##$USERA3= <user>
##$USERA4= <user>
##$USERA5= <user>
##$V9= 5
##$VALIST= <valist>
##$VCLIST= <CCCCCCCCCCCCCCC>
##$VD= 0
##$VDLIST= <DDDDDDDDDDDDDDD>
##$VPLIST= <PPPPPPPPPPPPPPP>
##$VTLIST= <TTTTTTTTTTTTTTT>
##$WBST= 1024
##$WBSW= 4
##$XGAIN= (0..3)
0 0 0 0 
##$XL= 0
##$YL= 0
##$YMAX_a= 90841
##$YMIN_a= -179664
##$ZGOPTNS= <>
##$ZL1= 120
##$ZL2= 120
##$ZL3= 120
##$ZL4= 120
##$ABSF1= 16.42675
##$ABSF2= -1.625153
##$ABSG= 5
##$ABSL= 3
##$ALPHA= 0
##$AQORDER= 0
##$ASSFAC= 0
##$ASSFACI= 0
##$ASSFACX= 0
##$ASSWID= 0
##$AUNMP= <proc_1d>
##$AZFE= 0.1
##$AZFW= 0.1
##$BCFW= 0
##$BC_mod= 2
##$BYTORDP= 0
##$COROFFS= 0
##$CY= -3
##$DATMOD= 1
##$DC= 0
##$DFILT= <>
##$DTYPP= 0
##$F1P= 0
##$F2P= 0
##$FCOR= 1
##$FTSIZE= 16384
##$FT_mod= 6
##$GAMMA= 0
##$GB= 0
##$INTBC= 1
##$INTSCL= 3.70164e-10
##$ISEN= 128
##$LB= 0.24
##$LEV0= 0
##$LPBIN= 0
##$MAXI= 10000
##$MC2= 0
##$MEAN= 0
##$ME_mod= 0
##$MI= 1.114404
##$NCOEF= 0
##$NC_proc= -8
##$NLEV= 6
##$NOISF1= 3.799351
##$NOISF2= 2.8
##$NSP= 0
##$NTH_PI= 0
##$NZP= 0
##$OFFSET= 16.40691
##$PC= 1
##$PHC0= -25297.46
##$PHC1= 9.38731
##$PH_mod= 1
##$PKNL= yes
##$PPARMOD= 0
##$PSCAL= 0
##$PSIGN= 0
##$REVERSE= no
##$SF= 200.129422853065
##$SI= 16384
##$SIGF1= 3
##$SIGF2= 2
##$SINO= 5.538805
##$SIOLD= 16384
##$SREGLST= <1H.CDCl3>
##$SSB= 0
##$STSI= 16384
##$STSR= 0
##$SW_p= 3612.71676300577
##$SYMM= 0
##$S_DEV= 0
##$TDeff= 16384
##$TDoff= 0
##$TI= <>
##$TILT= no
##$TM1= 0
##$TM2= 0
##$TOPLEV= 0
##$USERP1= <user>
##$USERP2= <user>
##$USERP3= <user>
##$USERP4= <user>
##$USERP5= <user>
##$WDW= 1
##$XDIM= 16384
##$YMAX_p= 318619383
##$YMIN_p= -1269966
$$ End of Bruker specific parameters
$$ ---------------------------------
##NTUPLES= NMR SPECTRUM
##VAR_NAME=  FREQUENCY,     SPECTRUM/REAL,   SPECTRUM/IMAG
##SYMBOL=    X,             R,               I
##VAR_TYPE=  INDEPENDENT,   DEPENDENT,       DEPENDENT
##VAR_FORM=  AFFN,          ASDF,            ASDF
##VAR_DIM=   16384,         16384,           16384
##UNITS=     HZ,            ARBITRARY UNITS, ARBITRARY UNITS
##FACTOR=    0.220516191357247, 1,           1
##FIRST=     3283.50541762015, 0,            0
##LAST=      -329.211345385625, 0,           0
##MIN=       -329.211345385625, -1269966,    0
##MAX=       3283.50541762015, 318619383,    0
$$ Real data points
##PAGE= N=1
##DATA TABLE= (X++(R..R)), XYDATA
$$ [...]
10988c87313J21598N8054N71387R4820p28490J78227O27224M8049m11845m18705
$$ -387313 -265715 -207661 363726 458546 -269944 -91717 535507 583556 171711 -246994
10978b46994J43214k90603k1794M54237j6070n46772M93298q8415j23227J29227
$$ -246994 -103780 -394383 -416177 38060 21990 -524782 -31484 -119899 -243126 -113899
10968a13899L10765L8691m57864j67917r522O81233J00147j28347P6341N5001
$$ -113899 196866 235557 -222307 -390224 -399746 281487 381634 253287 329628 384629
10958C84629K2999j27316K18364n90006k21832Q3712j44100J24205L18567M12007
$$ 384629 407628 280312 498676 -91330 -313162 -229450 -373550 -249345 69222 481229
10948D81229J94352o06546k70227j755j25796L32703J44260l37554l10473m5281
$$ 481229 675581 69035 -201192 -202947 -328743 3960 148220 -189334 -499807 -545088
10938e45088M48830R8355l30796m7605L43656N7393j25065J60219M9527j58298
$$ -545088 -96258 2097 -328699 -376304 -32648 24745 -100320 59899 109426 -48872
10928d8872m291k41375j89594K28437M35775J99222m95591J28686o2773l13080
$$ -48872 -53163 -294538 -484132 -255695 180080 379302 -116289 12397 -50376 -363456
10918c63456R85L61602J36285J20415n67266R5638R7130L12734J2504k94930M75195
$$ -363456 -362471 -869 135416 255831 -311435 -215797 -118667 194067 206571 -88359 386836
10907C86836j49776j09445k1443l07869N15094j96005m02169l03804m20284K91144
$$ 386836 237060 127615 106172 -201697 313397 117392 -284777 -588581 -1008865 -717721
10897g17721o6615j20654O52436N55442j78693k13240M4735k45485K68255J33763
$$ -717721 -784336 -904990 -252554 302888 124195 -89045 -44310 -289795 -21540 112223
10887A12223Q98K76256k90061j36207J66661r5097k831R1982q6713P8314M2194
$$ 112223 113121 389377 99316 -36891 129770 34673 31842 123824 37111 115425 157619
10876A57619j60671l63827K05768q6690J4202l06155J86254J06600L29045K78695
$$ 157619 -3052 -366879 -161111 -247801 -233599 -539754 -353500 -246900 82145 360840
10866C60840K63069K28014n07837k31483j71560N35048k19653l59166R2945K45741
$$ 360840 623909 851923 344086 112603 -58957 476091 256438 -102728 -9783 235958
10856B35958q4022p4773L87259n84744R0129J26719K21636k91337l86900J21835
$$ 235958 151936 77163 464422 -120322 -30193 96526 318162 26825 -360075 -238240
10846b38240J20054k6578j14738J14460m61579M39621K54347R2200m13948p5939
$$ -238240 -118186 -144764 -259502 -145042 -606621 -167000 87347 179547 -234401 -310340
10836c10340L53467J64923P3589l12166L84178M5202K82313n08699o2360K09273
$$ -310340 43127 208050 281639 -30527 353651 398853 681166 172467 110107 319380
10826C19380l11735p6037l04573M08855r5040K81471l00801m78808K08213J60206
$$ 319380 7645 -68392 -372965 35890 -59150 222321 -78480 -557288 -349075 -188869
10816a88869l20625L54463m19420k82026N32436L71328L15283k82049j28115M5644
$$ -188869 -509494 -155031 -574451 -856477 -324041 47287 362570 80521 -47594 -1950
10806a950r8189M77551j03323J35223N3061k93212Q6962J70796J04049j93627
$$ -1950 -100139 377412 274089 409312 462373 169161 256123 426919 530968 337341
10796C37341j1530l25481j62558M709J94882m0760j97810J95480K57736p7098
$$ 337341 325811 330 -162228 -157519 37363 -3397 -201207 -5727 252009 174911
10786A74911K43695j052L47585n64318k24709l07984l14748O83223L48230r6532
$$ 174911 418606 417554 765139 200821 -23888 -331872 -646620 36603 384833 288301
10776B88301m3215p5647k7964l00151l85720N45369J84269j54012J51811k58914
$$ 288301 245086 169439 141475 -158676 -544396 973 185242 31230 183041 -75873
10766g5873m41286K05348K92783K30062o995m03934r305J59287N19299N79N098
$$ -75873 -517159 -311811 -19028 211034 204039 -199895 -209200 -49913 469386 469965 475063
10755D75063r8394n20492K940L21507m60015L47703L44806K05675j27683k53895
$$ 475063 376669 -143823 -140883 180624 -279391 68312 413118 618793 491110 237215
10745B37215K3674J32037k9818Q8834n14506n5643N42705k08898n59851q3551
$$ 237215 260889 392926 363108 451942 -62564 -118207 424498 215600 -344251 -427802
10735d27802J76091K39599l78696L9166j09449J05651Q0055j23170L76504J4980
$$ -427802 -251711 -12112 -390808 -351642 -461091 -355440 -275385 -398555 -22051 -7071
10725g071J96911l40184K2685l48584Q16713m8302k85856M6885N34858l16737
$$ -7071 189840 -150344 -127659 -476243 340470 292168 6312 53197 588055 271318
10715B71318l25828k60880o8023l43727j0336M86741L2816k9408K95444k92472
$$ 271318 -54510 -315390 -383413 -727140 -737476 -250735 -217919 -247327 48117 -244355
10705b44355j56083K10300l06672j25310P48038j76139K94900n30621J86071Q18669
$$ -244355 -400438 -190138 -496810 -622120 125918 -50221 244679 -285942 -99871 718798
10695G18798j53221n85069p6806l51456l31007L95171L89264K01060r2429j40103
$$ 718798 565577 -19492 -96298 -447754 -778761 -383590 5674 206734 114305 -25798
10685b5798m25832K38269M30096Q5343l11720J55421J03012M7469n94991k53605
$$ -25798 -451630 -213361 216735 302078 -9642 145779 248791 296260 -298731 -552336
10675e52336M75371K06832l26261J22364o83711P77205L64162m04618p52285j53545
$$ -552336 -76965 129867 -196394 -74030 -757741 19464 383626 -20992 -773277 -926822
10665i26822L68452L62453j6724k02173N24372K61234o62499Q1578N944N98334
$$ -926822 -558370 -195917 -212641 -414814 109558 370792 -291707 -210129 -204185 394149
10655C94149p300n23501l01233O23340J36450o84137L25355N59390n11326l52514
$$ 394149 386849 -136652 -437885 185455 321905 -362232 -36877 522513 11187 -341327
10645c41327O90806k01044l22325K62918p2911L66707k74507K040J89913k65702
$$ -341327 349479 148435 -173890 89028 16117 382824 108317 110357 300270 34568
10635C4568k17009L24296k91581l23294L15405J21944L73723k98389R3777k6743
$$ 34568 -182441 141855 -149726 -473020 -157615 -35671 338052 39663 133440 106697
10625A06697n11531m70469P35982q8657M64243m8435l4812n6565j22054K41201
$$ 106697 -404834 -875303 -139321 -227978 236265 187830 153018 96453 -25601 215600
10615B15600r5324k94916j51881J26795K03924n89512P3296L41266J85595M0857
$$ 215600 120276 -174640 -326521 -199726 4198 -585314 -512018 -170752 14843 55700
10605E5700J63682M14161j88292n71597K58748m26350M54407K98292l61035J11956
$$ 55700 219382 633543 445251 -126346 132402 -293948 160459 458751 97716 209672
10595B09672l31422L28709q0381l55281j0624J28785l5715L93453L07583k63026
$$ 209672 -121750 206959 126578 -228703 -239327 -110542 -146257 247196 554779 291753
10585B91753M6850k38303J64471J8522L3067J28857j39848l05341n74902J20377
$$ 291753 338603 100300 264771 283293 316360 445217 305369 28 -574874 -454497
10575d54497K58863L10064j39750m17750J016445k04052m19303r4606r3057J012017
$$ -454497 -195634 114430 -25320 -443070 573375 369323 -49980 -144586 -237643 774374
10565G74374l18671l42368J16219j9335k73878l07841k50064L53135L46721n69284
$$ 774374 455703 113335 229554 210219 -63659 -371500 -621564 -268429 78292 -490992
10555d90992k10412M57630k07529P05278q5422J56840n5999o22353N96132m35469
$$ -490992 -701404 -243774 -451303 253975 168553 325393 269394 -352959 243173 -192296
10545a92296R2875L94463k09630k73279l74261O61018K43221l03308j98109k37895
$$ -192296 -99421 295042 85412 -187867 -562128 98890 342111 38803 -159306 -397201
10535c97201R431M51436K918k99797K92810L54279j47241j13432l55754l4086
$$ -397201 -387770 63666 66584 -233213 59597 413876 266635 153203 -202551 -236637
10525b36637J82063K91524l45550n1734j95214M08723j35252j10280K50232J5996
$$ -236637 -54574 236950 -108600 -160334 -355548 53175 -82077 -192357 57875 73871
10515G3871m53400J91071K9416j31134j15454k24279J73567R8423K33908l48256
$$ 73871 -379529 -188458 -159042 -290176 -405630 -629909 -456342 -357919 -124011 -472267
10505d72267j61742K40069J64090j92976L31658k59249J4382l243k5330J72118
$$ -472267 -634009 -393940 -229850 -422826 -91168 -350417 -336035 -339278 -364608 -192490
10495a92490K55609Q240j59300j3693K98875R0598j06180j36073m42792L54693
$$ -192490 63119 71359 -87941 -101634 197241 287839 181659 45586 -397206 -42513
10485d2513P08794j73830l20585n00961J57850K33101O9021P9337L24168K07833
$$ -42513 666281 492451 171866 -329095 -171245 61856 130877 210214 534382 742215
10475G42215j91821R4398q99515o29708N87732j51386j79069M56136M89705n280
$$ 742215 550394 644792 -254723 -884431 -296699 -448085 -627154 -171018 318687 313407
10465C13407J91309n08784k68443k36065m65102O03419P75669n86694M828K74858
$$ 313407 504716 -4068 -272511 -508576 -973678 -370259 405410 -181284 -176456 98402
10455I8402j32911M53385J67866k82505o53612j07897O55367K23466j99271o25656
$$ 98402 -34509 418876 586742 304237 -349375 -457272 198095 421561 222290 -403366
10445d03366Q5289L89627m7447K7191l15744l64594L90342P9890M17174j7064
$$ -403366 -318077 71550 24103 51294 -264450 -629044 -238702 -158812 258362 241298
10435B41298O9602j97307l27150K79185k08632J34492k13077l43775q1086L99995
$$ 241298 310900 113593 -213557 65628 -143004 -8512 -221589 -565364 -646450 -246455
10425b46455K27422J92180j66440O9605q8270J35663L93272o19444j89345J26504
$$ -246455 -19033 173147 6707 76312 -11958 123705 516977 -102467 -291812 -165308
10415a65308k39001J17922j05250L21830k18655k06634P89509K75058n7163k59370
$$ -165308 -404309 -286387 -391637 -69807 -288462 -495096 294413 569471 512308 252938
10405B52938j37196J76655o756J50434j07571m923l09353k11284K44476j7704
$$ 252938 115742 292397 285641 436075 328504 323581 14228 -197056 47420 29716
10395B9716J37333J56706o8341j95610K00566r1767r7404j46223k78441O15924
$$ 29716 167049 323755 255414 59804 260370 168603 71199 -75024 -353465 262459
10385B62459o50080K57904K62628N0768O59588m91058p76323K97896J70730J87242
$$ 262459 -387621 -129717 132911 183679 843267 352209 -424114 -126218 44512 231754
10375B31754J59797r8547R6630l52189k0314M0818L84718r3492k38604K18767
$$ 231754 391551 293004 389634 37445 17131 57949 442667 349175 110571 329338
10365C29338o06084j61982J37038M0702J4468J26840m30630L06060K09275k62576
$$ 329338 -276746 -438728 -301690 -260988 -246520 -119680 -550310 -244250 -34975 -297551
10355b97551J35984M95287J14210l73926L45529k08688j18674R8537O00115l14321
$$ -297551 -161567 333720 447930 74004 419533 210845 92171 190708 790823 476502
10345D76502m67384k83329J40118n3207J50094o8454K25001P4331l49211k79692
$$ 476502 9118 -274211 -134093 -187300 -37206 -105660 119341 193672 -155539 -435231
10335d35231L03814M64914k88999j32051L70411J04044k59014L08037M1577J33127
$$ -435231 -131417 333497 44498 -87553 282858 386902 127888 435925 477502 610629
10325F10629J50361k40123o87482L92550K40389n446j60549K8368M43296R7742
$$ 610629 760990 520867 -166615 225935 466324 460878 300329 328697 771993 869735
10315H69735l12647l92037k65544J72300k31482l97553L46032Q7049Q6406j24570
$$ 869735 557088 165051 -100493 71807 -159675 -557228 -211196 -124147 -37741 -162311
10305a62311N6575M61312j63134k03454N5647l73845O77781n1935O8670o9461
$$ -162311 -105736 355576 192442 -11012 44635 -329210 348571 296636 365306 295845
10295B95845P8545l11732n694j81075R1420P1073k23174K59047K82440K10316
$$ 295845 374390 62658 56964 -124111 -32691 38382 -184792 74255 356695 567011
10285E67011l78144j89304L9073n1732m04569j2518n5705M17539J26540q6933
$$ 567011 188867 -437 38636 -13096 -417665 -430183 -485888 -68349 58191 -28742
10275b8742k63655M00916j71123M63422n08709o69277N07804m00516K25596L52240
$$ -28742 -292397 108519 -62604 400818 -107891 -777168 -269364 -669880 -444284 -92044
10265i2044o45392K68448J28994l6327L49620o7813K16280M39334n3459l43139
$$ -92044 -737436 -468988 -339994 -376321 -26701 -94514 121766 561100 507641 164502
10255A64502L112J52746j80587j59369N22657P1064j44625o99103j8700l7572
$$ 164502 167614 320360 139773 -19596 503061 574125 429500 -269603 -288303 -325875
10245c25875k62689J43969j11795J33089R9379Q06208n73055q17522K52832L36999
$$ -325875 -588564 -444595 -556390 -423301 -323922 482286 -90769 -908291 -655459 -318460
10235c18460M07785J13572j45048j48692N7200M03602J11006o9228n85947j77060
$$ -318460 89325 202897 57849 -90843 -33643 369959 480965 411737 -174210 -351270
10225c51270M57636m20372L74174M6640O9961k43765j20549O36081p27755m9027
$$ -351270 106366 -314006 60168 106808 176769 -66996 -187545 448536 -279219 -328246
10215c28246N60280q40113L65669O51266m62683j8099M74581l25398J65916l40393
$$ -328246 232034 -608079 -242410 408856 -53827 -71926 402655 77257 243173 -97220
10205i7220j46896M42321n6588l6768l19582l30334O4658P9461Q46439J66847
$$ -97220 -244116 198205 141617 104849 -214733 -545067 -480409 -400948 445491 612338
10195F12338o13383l7375j49751N21941m61759l43159M75473j30048k15230M468
$$ 612338 -1045 -38420 -188171 333770 -127989 -471148 4325 -125723 -340953 -336485
10185c36485K93112M01256j71602m31156r3503L54431P8504K60867o66385q0864
$$ -336485 -43373 357883 186281 -244875 -338378 16053 94557 355424 -310961 -391825
10175c91825M02419j53915k07902O2989J59746L17565q5389J3099K31079n39514
$$ -391825 10594 -143321 -351223 -288234 -128488 189077 103688 116787 347866 -191648
10165a91648O2849R7500o7232m72816j09720L4439M33301N88698J50333r3344
$$ -191648 -128799 -31299 -98531 -571347 -681067 -646628 -213327 375371 525704 432360
10155D32360J8462J40304p85090l28789L06192L82893K46534k24273P4079L07236
$$ 432360 450822 591126 -193964 -522753 -216561 166332 412866 188593 262672 569908
10145E69908k73106l26499L03941q9217j25744K9448L43540J59779m0202j17688
$$ 569908 296802 -29697 274244 185027 59283 88731 432271 592050 551848 434160
10135D34160l23025j25529r0514j64737J51304J75996m04338J10899L20796k3952
$$ 434160 111135 -14394 -104908 -269645 -118341 57655 -346683 -235784 85012 61060
10125F1060M12308K01868j15674Q9599j28666J39452j93154K34676Q0934r38816
$$ 61060 473368 675236 559562 649161 520495 659947 466793 701469 782403 -156413
10115a56413L2958K78993J42963k37579k80071L95523l36527M84037l44670j50703
$$ -156413 -123455 155538 298501 60922 -219149 176374 -160153 323884 -20786 -171489
10105a71489L80410j96025J36012j44774K74748M20823k33156k90948j01473k90248
$$ -171489 208921 12896 148908 4134 278882 699705 466549 175601 74128 -216120
10095b16120J43759j13736N20710l67790M2430K18553j90875j23527l79662l52966
$$ -216120 -72361 -186097 334613 -33177 9253 227806 36931 -86596 -466258 -819224
10085h19224k15648M9618L98986K98857K30296m5672k3714l4935J0592m1631R0363
$$ -819224 -1034872 -985254 -586268 -287411 -57115 -102787 -126501 -161436 -150844 -192475 -102112
10074a02112K93188j41231l03405N40653L08638o51701K57979M65994r242l80475
$$ -102112 191076 49845 -253560 287093 595731 -55970 202009 668003 658761 278286
10064B78286l95581k21933L91640l39493k21043o5247P1070Q116N03402l85349
$$ 278286 -117295 -339228 52412 -287081 -508124 -573371 -502301 -494185 9217 -376132
10054c76132J64497L71717M64516m69499l32707O701q999k86862j0935K38645
$$ -376132 -211635 160082 624598 155099 -177608 -170907 -179906 -466768 -477703 -239058
10044b39058j55533M49233k43894q1040P02649j05914n54884N20913o0898J02903
$$ -239058 -394591 54642 -189252 -270292 432357 326443 -228441 292472 231574 334477
10034C34477o08297K30744J31543k38205q487J95670J15575l1588l1169q5071
$$ 334477 -273820 -43076 88467 -149738 -158225 37445 153020 121432 90263 5192
10024E192j47546L6012m9952K99979k46323l05707M61350L09912k02801o36114
$$ 5192 -142354 -106342 -156294 143685 -102638 -408345 53005 362917 160116 -475998
10014d75998L86775K1727o2103l19943j43373M35301l5698j41006K84946m39413
$$ -475998 -89223 -67496 -129599 -449542 -592915 -157614 -193312 -334318 -49372 -488785
10004d88785k95124L91377M58495j93530K78401q0097j62843q5059R3303Q6519
$$ -488785 -783909 -392532 65963 -127567 150834 70737 -92106 -177165 -83862 2657
9994B657k30115L25454o20795J16227L34117p2111R9870L95129j65187O02344
$$ 2657 -227458 97996 -522799 -406572 -72455 -144566 -44696 350433 185246 787590
9984G87590j8880m52601N9837L947m0331o9202k56314l68026J43631K52956j0338
$$ 787590 768710 316109 375946 379893 339562 270360 14046 -353980 -210349 42607 32269
9973C2269l60480k14839L29341K03021q992K35601j78743K75629K10694m02440
$$ 32269 -328211 -543050 -213709 -10688 -19680 215921 37178 312807 523501 121061
9963A21061J07419m3003J51356K24358m06160m56697L12929o9717j30803r8220
$$ 121061 228480 185477 336833 561191 155031 -301666 11263 -58454 -189257 -287477
9953b87477M9247J43215j8015R9969l55036m1141M06585M66996L42998l21277
$$ -287477 -238230 -95015 -113030 -13061 -368097 -409238 -2653 464343 807341 486064
9943D86064J71453m62450m31478K07467J50387j61836j0790m4333J44156j30997
$$ 486064 657517 195067 -236411 -28944 121443 -40393 -51183 -95516 48640 -82357
9933h2357R7846j92051K56559k44360l54113J48170L98270K67123J8597k297p81514
$$ -82357 15489 -176562 79997 -164363 -518476 -370306 27964 295087 313684 311387 -470127
9922d70127L2590j65178J2910P8792L9937j57313N23277l9464j83024o0472m9334
$$ -470127 -437537 -602715 -589805 -511013 -471076 -628389 -105112 -144576 -327600 -388072 -437406
9911d37406l11133M01273r2635L10976o727J07780n62607L45164M08782P3791
$$ -437406 -748539 -347266 -439901 -128925 -135652 -27872 -590479 -245315 163467 237258
9901B37258k11012m8012J82708j76748m22567N26550N8240K84500K7889n73669
$$ 237258 26246 -21766 160942 -15806 -438373 88177 146417 430917 458806 -114863
9891a14863N1572K71577K13505j21849j04928m27148k02184J44801j80767k05224
$$ -114863 -63291 208286 421791 299942 195014 -232134 -434318 -289517 -470284 -675508
9881f75508N57112m1697K64116m85322j22944J06879J63464K33696P3008k73361
$$ -675508 -118396 -160093 104023 -381299 -504243 -397364 -233900 -204 72804 -200557
9871b00557L17655J31015l13315j23000k08492j76514l4118M91816M43501l42094
$$ -200557 117098 248113 -65202 -188202 -396694 -573208 -607326 -115510 327991 -14103
9861a4103r612M0073P31232K04330r07952q8423K41299l23574Q6991J86845k12716
$$ -14103 -23715 16358 747590 951920 43968 -44455 196844 -126730 -39739 147106 -65610
9850f5610m65532M07801K25160l1826J48856J01724k0528n3958k96922k72683
$$ -65610 -531142 -123341 101819 69993 218849 320573 300045 246087 -50835 -323518
9840c23518K60923K04008J12779j33131L03712k52066l19924j91611K12106M92429
$$ -323518 -62595 141413 254192 121061 424773 172707 -147217 -338828 -126722 365707
9830C65707k0734k13750k38275O1323l75792K66360K97028K08493L75254r6779
$$ 365707 344973 131223 -107052 -45729 -421521 -155161 141867 350360 725614 628835
9820F28835o29837J53479k3904l37550L50523Q5415L29339m22993m81018k50843
$$ 628835 -1002 152477 128573 -208977 141546 226961 556300 133307 -347711 -598554
9810e98554M51708L62496k65538P40263m89174J74619K36619K2713m85790m97865
$$ -598554 -146846 215650 -49888 690375 201201 375820 612439 635152 149362 -348503
9800c48503j0794L14940l46888N44786k38878l15440J74643L90313L45134q53719
$$ -348503 -359297 -44357 -391245 153541 -85337 -400777 -226134 164179 509313 -344406
9790c44406J56901l88242J16344K49580M53723L8888j40876l78813L60939k8099
$$ -344406 -187505 -575747 -459403 -209823 243900 282788 141912 -236901 124038 95939
9780I5939R1839l01680J26360R031r9692M67613j16106n94267L38079O8109n8529
$$ 95939 187778 -113902 12458 21489 -78203 389410 273304 -320963 17116 85225 26696
9769B6696k4799o9035K90873P1214j93827K0314P12375l06816k47445K99574l74592
$$ 26696 1897 -67138 223735 294949 101122 121436 833811 526995 279550 579124 204532
9758B04532L67570K96511l57055o18502O7625J84375l07552j03338q5820J24101
$$ 204532 572102 868613 511558 -106944 -39319 145056 -162496 -265834 -351654 -227553
9748b27553K95214j31411k43739M78678k33227L68324J36229J80553k42258m75607
$$ -227553 67661 -63750 -307489 171189 -62038 306286 442515 623068 380810 -94797
9738i4797P7282l31737K119N22074J75165J2705Q4346j85049k49622J16708L21971
$$ -94797 -17515 -349252 -347133 174941 350106 362811 447157 262108 12486 129194 451165
9727D51165P4384m79628l12484k3996J48850O23702m13556k1342k4551j8388r5226
$$ 451165 525549 45921 -266563 -290559 -141709 481993 68437 47095 22544 4156 -91070
9716i1070r8560L27136P6852m5901L2245O5985J32637l45810K47979k19533K48884
$$ -91070 -189630 137506 214358 168457 200702 266687 399324 53514 301493 81960 330844
9705C30844o6024k60693l7395J85204l54527m58258N67793j43632R6411J83709
$$ 330844 264820 4127 -33268 151936 -202591 -660849 -93056 -236688 -140277 43432
9695D3432K81664r6898P9148k35490K05625K69837j18642O201L82917l85049l14880
$$ 43432 325096 228198 307346 71856 277481 547318 428676 434877 817794 432745 117865
9684A17865o2974N0708m48485L59921K54080k3609o2493L04439K43019n5904O1133
$$ 117865 54891 105599 -342886 17035 271115 247506 185013 489452 732471 676567 737700
9673G37700m16114l35006N00790M47602m95053k45748l68191O4562Q2072P5127
$$ 737700 321586 -13420 487370 934972 439919 194171 -174020 -109458 -27386 47741
9663D7741k93520L87945k72459j14517N70125m5035J21616l64851N2678k09454
$$ 47741 -245779 142166 -130293 -244810 325315 280280 401896 37045 89723 -119731
9653a19731j96751J73483K92676J11305M1426k64473k20085J16614M14210l86732
$$ -119731 -316482 -142999 149677 260982 302408 37935 -182150 -65536 348674 -38058
9643c8058m8971O105Q2195J72064l35614L25146j25860m17666L61553m79767k0568
$$ -38058 -87029 -80924 1271 173335 -162279 162867 37007 -380659 -19106 -498873 -519441
9632e19441p7177j8883N78459n31463M85549J55035j13211J26876n585J58664
$$ -519441 -596618 -615501 -37042 -568505 -82956 72079 -41132 85744 80159 238823
9622B38823n52183j04559K84748J00366N34393J86625j62084j28708l29234q19332
$$ 238823 -313360 -417919 -133171 -32805 501588 688213 526129 397421 68187 -751145
9612g51145M36999P77127K57753m43079j16728K11914l00970l17782j08027k8007
$$ -751145 -314146 462981 720734 277655 160927 372841 71871 -245911 -353938 -381945
9602c81945L16932L49059J56495j47027J3365j90535l01406J55586K02996K03761
$$ -381945 -65013 284046 440541 293514 306879 116344 -185062 -29476 173520 377281
9592C77281J38446m17325l5776j55773J83195K99938J92110j53567q4168k42530
$$ 377281 515727 98402 62626 -93147 90048 389986 582096 428529 344361 101831
9582A01831K35300K80492k60298j80735k11858M10521J89979p358m0630M9642
$$ 101831 337131 617623 357325 176590 -35268 375253 565232 557874 517244 566886
9572E66886p28008Q9854N83902l4140j39511o18305l40041R3927K37129Q547K80725
$$ 566886 -161122 -71268 512634 478494 338983 -279322 -619363 -525436 -288307 -279760 965
9561I65L20613n47959m77251M06243N98513k98915j07911M92307k69444P1661
$$ 965 321578 -226381 -703632 -297389 301124 2209 -105702 386605 117161 188822
9551A88822j8249m55477M73281L31677j50978j30518M41945n44231l31921J83072
$$ 188822 170573 -284904 188377 520054 369076 238558 680503 136272 -195649 -12577
9541a2577J43363K18277L61147J3501o12503r7141K1794Q4471J18314K74652k83370
$$ -12577 130786 349063 710210 723711 111208 14067 35861 120332 238646 513298 229928
9530B29928k43568J48129m9826m1681n07822o03179O92566J6912O4706L34465
$$ 229928 -13640 134489 84663 42982 -464840 -1068019 -375453 -358541 -293835 40630
9520D0630j84345l4865k93397L34303M2830j66056j19322J819L91763m78542R7648
$$ 40630 -143715 -178580 -471977 -137674 -94844 -260900 -380222 -378403 13360 -465182 -367534
9509c67534J30451k44271P08602l39111o4499M9884J92132l45581o3375J68737
$$ -367534 -237083 -481354 227248 -111863 -176362 -126478 65654 -279927 -343302 -174565
9499a74565K02278K2563p1537J6732R3614L6677K00758j38977j64402L16665k59340
$$ -174565 27713 50276 -21261 -4529 89085 125762 326520 187543 23141 339806 80466
9488H0466j46851m01770j38679R41629K53899j87678l6858M83323j21031l08962
$$ 80466 -66385 -468155 -606834 334795 588694 401016 364158 847481 726450 417488
9478D17488j36306P9457j70315l43726K31587L92583m5124n99867j06368M40685
$$ 417488 281182 360639 190324 -153402 78185 470768 425644 -174223 -280591 160094
9468A60094L7093j87654L97116n1781l37483R0771K89277j49790J00419M06750
$$ 160094 197187 9533 406649 354868 17385 108156 397433 247643 348062 754812
9458G54812J18203n73513K00160k15326k65163J91965M96718P3633N9030j7743
$$ 754812 873015 299502 499662 284336 19173 211138 707856 781489 840519 822776
9448H22776m85159k18497O2521r4828L08750j11263L220k92025L69603J30922
$$ 822776 337617 119120 181641 86813 395563 284300 287520 -4505 365098 496020
9438D96020J28095m91587l98034K34679L19957m25825K03457J66858K5140j75932
$$ 496020 624115 132528 -265506 -30827 289130 -136695 66762 233620 258760 82828
9428H2828l28411P23335r8216M07898l06446J67069k95961J70789L44254n51293
$$ 82828 -245583 477752 379536 787434 480988 648057 352096 522885 867139 315846
9418C15846N0983K42644l21839l7170K43756J11481J38590n2192K50851k16217
$$ 315846 366829 609473 287634 250464 494220 605701 744291 692099 942950 726733
9408G26733J95719M7503K16800m35488j57724M40456J86727R4589O6417r8235
$$ 726733 922452 969955 1186755 751267 593543 1033999 1220726 1315315 1381732 1283497
9398A283497j1530O80493q26039j06066j11403m50874l00232J59521K26342J04451
$$ 1283497 1271967 1952460 1126421 1020355 908952 458078 157846 317367 543709 648160
9388F48160P1676k8481j57669k46730K0107J84410l37564K83064M34856J73552
$$ 648160 719836 691355 533686 286956 307063 491473 153909 436973 871829 1045381
9378A045381k62337n1818m82537k22014L47727k00406m7469J41808j52950J62457
$$ 1045381 783044 731226 248689 26675 374402 173996 126527 268335 115385 277842
9368B77842N29292J85886k56643p4507j1867q7128J4468n073L52283L22568k09485
$$ 277842 807134 993020 736377 661870 650003 562875 577343 572270 924553 1247121 1037636
9357A037636k36987j35334j27700k25943J9866M9459k71474j81776L87787K27626
$$ 1037636 800649 665315 537615 311672 331538 380997 109523 -72253 315534 543160
9347E43160l20766k91881P6858L84760j60867J04602M06258k44378l56149K22584
$$ 543160 222394 -69487 7371 392131 231264 335866 742124 497746 141597 364181
9337C64181l84495J02625j96951N00985j2666l49391J16088J38451M96780k32143
$$ 364181 -20314 82311 -114640 386345 373679 24288 140376 278827 775607 543464
9327E43464m66630L4232m23961O21195m2800l08151j417N6769L75208m49450O3044
$$ 543464 76834 111066 -312895 308300 265500 -42651 -44068 12701 387909 -61541 1503
9316A503J69862j51009m31011O14814k02349M71824J43132m01711L22116Q4526
$$ 1503 171365 20356 -410655 204159 1810 473634 616766 215055 537171 621697
9306F21697K06662k71088J29199J33323n82892J78863N4467r3525J96458l28695
$$ 621697 828359 557271 686470 819793 236901 415764 470231 376706 573164 244469
9296B44469r1224q2052L42595j17684O1549N12888o9945m29119M84395K455l2281
$$ 244469 153245 71193 413788 296104 357653 870541 800596 371477 855872 858327 826046
9285H26046j93711o19472M51354L23441n03712n2036O3798O0084j74651K46975
$$ 826046 632335 12863 464217 787658 283946 231910 295708 355792 181141 428116
9275D28116p7034o3464N58592J46666o28607O8523l22895j2682M36266J65645
$$ 428116 351082 287618 846210 992876 364269 432792 109897 97215 533481 699126
9265F99126j13347j4636M56994J62251o43946l33376N10588n64383J71843K67284
$$ 699126 585779 571143 1028137 1190388 546442 213066 723654 159271 331114 598398
9255E98398K66848k11734m04918K79019M02426Q0017j55568J97352J18004o80379
$$ 598398 865246 653512 248594 527613 930039 1010056 854488 1051840 1169844 489465
9245D89465j59292o05788N45996k04596O55993Q05908j01509o99964k41272N44088
$$ 489465 330173 -275615 270381 65785 721778 1527686 1426177 726213 484941 1029029
9235A029029p61623k6385K48852l66783K49813O54912m67555K54415k43723J44476
$$ 1029029 267406 241021 489873 123090 372903 1027815 560260 814675 570952 715428
9225G15428N56778m38023k05482J51797J86105j04223M54682k85247L16222m27487
$$ 715428 1272206 834183 628701 780498 966603 862380 1317062 1031815 1348037 920550
9215I20550M55346K21459l23029J27123M933q7593j21921K40111J40368m42340
$$ 920550 1375896 1597355 1274326 1401449 1406382 1318789 1196868 1436979 1577347 1135007
9205A135007J08588j47470k77884M44378m61466K31789L9674j55275L96754k18771
$$ 1135007 1243595 1096125 818241 1262619 801153 1032942 1072616 917341 1314095 1095324
9195A095324K17464J33169m61885J82247j24466L31611N0102j34391R4281k14815
$$ 1095324 1312788 1445957 984072 1166319 1041853 1373464 1423566 1289175 1383456 1168641
9185A168641k67296L71402J67146n1339J13456K21364k73600M91828K98830m19838
$$ 1168641 901345 1272747 1439893 1388554 1502010 1723374 1449774 1941602 2240432 1820594
9175A820594l42860j17438K86168M06727k29768R4687L20316K82289m16645m33129
$$ 1820594 1477734 1360296 1646464 2053191 1823423 1918110 2238426 2520715 2104070 1670941
9165A670941K73044j36236L04747K58359K6194N08377o51405m8469K19849l43283
$$ 1670941 1943985 1807749 2112496 2370855 2397049 2905426 2254021 2205552 2425401 2082118
9155B082118k0153L47911J39774q4221M04980L85009k09060L41064J56751j39127
$$ 2082118 2061965 2409876 2549650 2465429 2870409 3255418 3046358 3387422 3544173 3405046
9145C405046O182k62631l8608P72524N55305L52356K37210O07543K79789l7001
$$ 3405046 3411228 3148597 3109989 3882513 4437818 4790174 5027384 5634927 5914716 5877715
9135E877715l20350l00485m04931m30368m0941o99803J02705k28137l01659m78558
$$ 5877715 5557365 5256880 4851949 4421581 4380640 3680837 3783542 3555405 3253746 2775188
9125B775188n1111k04664K7332N7561n7651m24530j67078j07734k62248j1068
$$ 2775188 2724077 2519413 2546745 2604306 2546655 2122125 1955047 1847313 1585065 1573997
9115A573997J88666N73934n91905M3178m80666o59444N87407J60668L95969N16741
$$ 1573997 1762663 2336597 1744692 1787870 1307204 647760 1235167 1395835 1791804 2308545
9105B308545J38968p69299k67502K25901Q1695M3540M2554j39710l91199O76591
$$ 2308545 2447513 1678214 1410712 1636613 1718308 1761848 1804402 1664692 1273493 1950084
9095A950084N7611j14792q6454n9732j33288R0867P2882m07837M48317n9948l8322
$$ 1950084 2007695 1892903 1806449 1746717 1613429 1704296 1777178 1369341 1817658 1757710 1719388
9084A719388J60516m42106l37107q4344N18157M78409L47415J10270l88638k05989
$$ 1719388 1879904 1437798 1100691 1016347 1534504 2012913 2360328 2470598 2081960 1875971
9074A875971j66907l58546N47965R3083o10648J733L65627n2582k7321J73099
$$ 1875971 1709064 1350518 1898483 1991566 1380918 1382651 1748278 1695696 1668375 1841474
9064A841474J3163J25543j03921J01895l15333J12286M17389N9109k85181R6440
$$ 1841474 1854637 1980180 1876259 1978154 1662821 1775107 2192496 2251605 1966424 2062864
9054B062864k85702m6204j0037L616L1329M5173k78988J81141J27039J04115J9430
$$ 2062864 1777162 1730958 1720921 1724537 1755866 1801039 1522051 1703192 1830231 1934346 1953776
9043A953776Q49650k0977o12831L21089Q814k05673K25768K80045k25315j10087
$$ 1953776 2803426 2782449 2169618 2490707 2499521 2293848 2519616 2799661 2574346 2464259
9033B464259J30600N70101j4399n77915L17641L14382M58892l52085k9431m18703
$$ 2464259 2594859 3164960 3150561 2572646 2890287 3204669 3663561 3311476 3282045 2863342
9023B863342m69429N3103K18836R8290j18554n5812j22797L96186N742k62105
$$ 2863342 2393913 2447016 2665852 2764142 2645588 2589776 2466979 2863165 2868907 2606802
9013B606802m35522J10412Q8994K47360p8116j21273j55918N81476M43084L58791
$$ 2606802 2171280 2281692 2370686 2618046 2539930 2418657 2262739 2844215 3287299 3646090
9003C646090o33206k1128n69976K10991j87l10979J00918L02452j04813j30071
$$ 3646090 3012884 2991756 2421780 2632771 2632584 2321605 2422523 2724975 2620162 2490091
8993B490091P45028J1050n5730M57528k90242n37893Q7637K63388M03502K57479
$$ 2490091 3235119 3246169 3190439 3647967 3357725 2819832 2907469 3170857 3574359 3831838
8983C831838k6000m98985j49704j85083L42176l07000N25720N91227L05150J41589
$$ 3831838 3805838 3306853 3157149 2972066 3314242 3007242 3532962 4124189 4429339 4570928
8973D570928o22418M859L73618r7921l08902J76773J71667j72341k35556M68994
$$ 4570928 3948510 3953369 4326987 4229066 3920164 4096937 4268604 4096263 3860707 4329701
8963D329701j11818r9557n37605j83942M58216R5859l04870K24204m7005L62929
$$ 4329701 4217883 4118326 3580721 3396779 3854995 3950854 3645984 3870188 3823183 4186112
8953D186112K72003l4937J63883m15557p99730J38687P87832r4688J44255k68509
$$ 4186112 4458115 4423178 4587061 4171504 3371774 3510461 4298293 4203605 4347860 4079351
8943D079351m272L49231N44007j95342J82180R78287L88289o80236k00640J53831
$$ 4079351 4075079 4424310 4968317 4772975 4955155 5933442 6321731 5641495 5440855 5594686
8933E594686K90802K10235M4968j97039J50781K42634j37801J64848J36823L83513
$$ 5594686 5885488 6095723 6140691 5943652 6094433 6337067 6199266 6364114 6500937 6884450
8923F884450K1904L2576N0079J93900L76093J73674O75577M56016Q5499J72572
$$ 6884450 6906354 6938930 6989009 7182909 7559002 7732676 8408253 8864269 8949768 9122340
8913I122340k64113k6915R4265J06063r0031P57074L25362K70973O12134J05416
$$ 9122340 8858227 8831312 8925577 9031640 8941609 9698683 10024045 10295018 10907152 11012568
8903A1012568L57147K33445L53481l03066m5985N79563Q91087N08556j27336n80870
$$ 11012568 11369715 11603160 11956641 11653575 11607590 12187153 13078240 13586796 13459460 12878590
8893A2878590L88263N06522L11085L23566K71737K33897J000708O09942N14577
$$ 12878590 13266853 13773375 14084460 14408026 14679763 14913660 15914368 16524310 17038887
8884A7038887N57187M15639J97204J53176R78099R68167O32712M52272N61614
$$ 17038887 17596074 18011713 18208917 18362093 19340192 20308359 20941071 21393343 21954957
8875B1954957O29430R74098Q80607P31064M89956J261528P57969Q98700J117646
$$ 21954957 22584387 23558485 24439092 25170156 25660112 26921640 27679609 28578309 29695955
8866B9695955J894453J873103J456372K149754K486251J847118J894070K992948
$$ 29695955 31590408 33463511 34919883 37069637 39555888 41403006 43297076 46290024
8858D6290024L319448L403551L702784M521598N107110N602016O009969N737254
$$ 46290024 49609472 53013023 56715807 61237405 66344515 71946531 77956500 83693754
8850H3693754M778005M730942N290511L945671J026880j144836k57217N07454
$$ 83693754 88471759 93202701 98493212 102438883 103465763 102320927 102063710 102571164
8842A02571164j66928o86187n83629N05623K096352L174937L944090K228712O07458
$$ 102571164 102404236 101718049 101134420 101640043 103736395 106911332 110855422 113084134 113691592
8833A13691592M99859J05161j280644k714734m132482m019777l732497l822379
$$ 113691592 114191451 114296612 113015968 110301234 106168752 102148975 98416478 94594099
8825I4594099m805216l777222k375332r24528N82047N61130K895328L959765M705606
$$ 94594099 89788883 86011661 83636329 82711801 83293848 83854978 86750306 90710071 95415677
8816I5415677M385713L199026K624144L597294L150379N66816j097453j942951
$$ 95415677 99801390 103000416 105624560 109221854 112372233 112939049 111841596 109898645
8808A09898645j668066j283123j755325j120901n12639J388236K306377J927663
$$ 109898645 108230579 106947456 105192131 104071230 103558591 104946827 107253204 109180867
8800A09180867J419222l47601p82983j088081k356854m785314p251974p196211
$$ 109180867 110600089 110252488 109469505 108381424 106024570 101239256 93987282 86791071
8792H6791071o353626p083443p951594p199525n914623n424782m471152l183398
$$ 86791071 80437445 73354002 65402408 58202883 52288260 46863478 42392326 39208928
8784C9208928l291818k153157k593637j689541j652363j277470q58245p66149
$$ 39208928 35917110 33763953 31170316 29480775 27828412 26550942 25692697 24926548
8776B4926548j423149p53888j072679j131361n60793q61524j135591r42951j25952
$$ 24926548 23503399 22749511 21676832 20545471 19984678 19123154 17987563 17044612 16918660
8767A6918660p81568r54364m7576J86559o1877l36395k79167O1970q32604j009385
$$ 16918660 16137092 15182728 15135152 15321711 15259834 14923439 14644272 14706242 13873638 12864253
8757A2864253l22760n38102m68892J04041m68690j30858K70154j35757n16535
$$ 12864253 12541493 12003391 11534499 11638540 11169850 11038992 11309146 11173389 10656854
8748A0656854L27524O421q7090j55403l26092n80162k96798j55494l99356m27770
$$ 10656854 10984378 10990799 10903709 10748306 10422214 9842052 9545254 9389760 8990404 8562634
8738H562634N14388j89136l1945r6167k24233M59368L79385k54554m44038r13765
$$ 8562634 9077022 8887886 8855941 8759774 8535541 8994909 9374294 9119740 8675702 7761937
8728G761937p72413j3974j26805q8455n5964p96980o06075k23430k07298O38934
$$ 7761937 6989524 6975550 6848745 6760290 6704326 5907346 5301271 5077841 4870543 5509477
8718E509477j09839j77702m8274n13751J63668j42153j4354L26591m71097o03247
$$ 5509477 5399638 5221936 5173662 4659911 4823579 4681426 4667072 4993663 4522566 3919319
8708C919319P14872l61119k84041k66102l49534L21427j3295J09388J80190p1361
$$ 3919319 4634191 4273072 3989031 3722929 3373395 3694822 3681527 3790915 3971105 3899744
8698C899744O6932r4462K13189M45069l62031j73969J11016o73257m98143P997
$$ 3899744 3966676 3872214 4085403 4530472 4168441 3994472 4105488 3432231 2934088 2942085
8688B942085j5746L00168L54246l15196n01582K00423J54346j48333L79419j30382
$$ 2942085 2926339 3226507 3580753 3265557 2763975 2964398 3118744 2970411 3349830 3219448
8678C219448k16592K75524l75823J95048j7802O8631j51900j11603K82379K79446
$$ 3219448 3002856 3278380 2902557 3097605 3079803 3148434 2996534 2884931 3167310 3446756
8668C446756r0558P5968l02594j85404k89270j85499Q11159o84524N3296L67574
$$ 3446756 3356198 3432166 3129572 2944168 2654898 2469399 3280558 2596034 2649330 3016904
8658C016904j09273j87409j46034M95952J99526P729K02357M5139j56496J49337
$$ 3016904 2907631 2720222 2574188 3070140 3269666 3277395 3479752 3524891 3368395 3517732
8648C517732J68746q5038J03814r6717l04787L40293p3519K25841k07063J57856
$$ 3517732 3686478 3601440 3705254 3608537 3303750 3644043 3570524 3796365 3589302 3747158
8638C747158j28296P2027J89907q9035j53188N41192K15903m70205L6710k0342
$$ 3747158 3618862 3690889 3880796 3791761 3638573 4179765 4395668 3925463 3962173 3941831
8628C941831o69192r82k3776J3961M6442l21164L50959K40625K78792j44553R4236
$$ 3941831 3272639 3271657 3247881 3261842 3308284 2987120 3338079 3578704 3857496 3712943 3807179
8617C807179j64040J74133O43401M8458p19868l18133K07946k39885K15428J00705
$$ 3807179 3643139 3817272 4460673 4509131 3789263 3471130 3679076 3439191 3654619 3755324
8607C755324j5906p6203M38077k7707j49449N12809m41090j38372K32811L33531
$$ 3755324 3739418 3663215 4101292 4073585 3924136 4436945 3995855 3857483 4090294 4423825
8597D423825l63139J52969K37160L3836j00069k86531R4711K35882n23354P3400
$$ 4423825 4060686 4213655 4450815 4484651 4384582 4098051 4192762 4428644 3905290 3978690
8587C978690j02854m695M51257M1938j13317r02321j23178N8003j80981K22404
$$ 3978690 3875836 3871141 4322398 4364336 4251019 3348698 3225520 3283523 3102542 3324946
8577C324946J87867J72377M789l16401j9122j87164K50192J34468k68592J12889
$$ 3324946 3512813 3685190 3689979 3373578 3354456 3167292 3417484 3551952 3283360 3396249
8567C396249L51601k47641k71192J32823M4782J66655l483R7558o1738P4134L87974
$$ 3396249 3747850 3500209 3229017 3361840 3406622 3573277 3569794 3667352 3605614 3679748 4067722
8556D067722n22348r213P4216o3696J26309k51637K31051K41995k19045L36221
$$ 4067722 3545374 3536161 3610377 3546681 3672990 3421353 3652404 3894399 3675354 4011575
8546D011575q7191J46676K64781j20369k3478j90050L67293J19741o58157j15979
$$ 4011575 3924384 4071060 4335841 4215472 4191994 4001944 4369237 4488978 3830821 3714842
8536C714842l14209Q5982N19970M60048J08173o3934r633n76169l4277L77439
$$ 3714842 3400633 3486615 4006585 4466633 4574806 4510872 4501239 3925070 3890793 4268232
8526D268232k43510L8258Q8069R1084N3817N07159M9319N17108K95420J79739
$$ 4268232 4024722 4062980 4151049 4242133 4295950 4803109 4852428 5369536 5664956 5844695
8516E844695q41970l01923R2086P3668l8254j83499j21715n52437k12752L62429
$$ 5844695 5002725 4700802 4792888 4866556 4828302 4644803 4523088 3970651 3757899 4120328
8506D120328k5115m80736K68590l0073K04509j80265k36085K6959N33275K40225
$$ 4120328 4095213 3614477 3883067 3852994 4057503 3877238 3641153 3668112 4201387 4441612
8496D441612k92675l41139N30866l44658K42687J33441k06753j11665L50894k1834
$$ 4441612 4148937 3807798 4338664 3994006 4236693 4370134 4163381 4051716 4402610 4380776
8486D380776L41698m06886L54697p5796J93139N908m47676J3599j59750l66711
$$ 4380776 4722474 4315588 4670285 4594489 4787628 4793536 4345860 4359459 4199709 3832998
8476C832998m5389M07250L49199m70431m9413P27427O32976n39506K63026j54326
$$ 3832998 3787609 4194859 4544058 4073627 4024214 4751641 5384617 4845111 5108137 4953811
8466D953811m10530J35543j81889Q8196N26764J82861P6540q7385j92012p476
$$ 4953811 4543281 4678824 4496935 4585131 5111895 5294756 5371296 5283911 5091899 5084423
8456E084423l53148M73555P91822j87339l13216j2806K64783n1728K71142k18646
$$ 5084423 4731275 5204830 5996652 5809313 5496097 5483291 5748074 5696346 5967488 5748842
8446E748842k45805K41944k9763M29884J74072j72122k41970o5725j03035O87633
$$ 5748842 5503037 5744981 5715218 6145102 6319174 6147052 5905082 5839357 5736322 6423955
8436F423955L60811K64388o19501l33657N592M39428M90641L74066l57571j13324
$$ 6423955 6784766 7049154 6429653 6095996 6101588 6541016 7031657 7405723 7048152 6934828
8426F934828k17554N17561j04099M18135L16452o63455m70726K65977P15383L930
$$ 6934828 6717274 7234835 7130736 7548871 7865323 7201868 6731142 6997119 7712502 7716432
8416G716432n2123j74740k94369K40141j01233K09792n04625K98484K900j60214
$$ 7716432 7664309 7489569 7195200 7435341 7334108 7543900 7039275 7337759 7340659 7180445
8406G180445M29156n7195K44349N73026q6823n43018k36171N57998N7762m5187
$$ 7180445 7609601 7552406 7796755 8369781 8282958 7739940 7503769 8061767 8119529 8074342
8396H074342J2512j7465j99392M84061J17464j69845k24442n5426J75826L1646
$$ 8074342 8086854 8069389 7869997 8354058 8471522 8301677 8077235 8021809 8197635 8229281
8386H229281L17835M10957J9753O3579N15531J7127k57996l32978M10181M33456
$$ 8229281 8547116 8958073 8977826 9041405 9556936 9574063 9316067 8983089 9393270 9826726
8376I826726m55890j08154O55386k98215j97242n17796J57401O00924M89704l4071
$$ 9826726 9370836 9262682 9918068 9619853 9422611 8904815 9062216 9663140 10152844 10118773
8366A0118773J35259k41106O07900L48326l29101R1255J030831L40873J32165
$$ 10118773 10254032 10012926 10620826 10969152 10640051 10731306 11762137 12103010 12235175
8357A2235175j80735K11221N40907L61231O79413O3492K86363p0283N30866O92296
$$ 12235175 12054440 12265661 12806568 13167799 13847212 13910704 14197067 14126784 14657650 15349946
8347A5349946N09783l479J19350M9887K91064L4142Q6548Q06742M43037K56395
$$ 15349946 15859729 15856250 15975600 16025487 16316551 16350693 16437241 17243983 17687020 17943415
8337A7943415R19339N10314k10933K9037M87617P85839N03657N74901L12006O04255
$$ 17943415 18862754 19373068 19162135 19191172 19678789 20464628 20968285 21543186 21855192 22459447
8327B2459447M56314K0997L66661N37492O25894N31033J217983Q36438M42967
$$ 22459447 22915761 22936758 23303419 23840911 24466805 24997838 26215821 27052259 27495226
8318B7495226P15677M13710J040278P02624M11292M74337Q57978Q90402P95058
$$ 27495226 28210903 28624613 29664891 30367515 30778807 31253144 32111122 33001524 33796582
8309C3796582J285409N03637P95034J171064N41357J330112J655927N39446R58695
$$ 33796582 35081991 35585628 36380662 37551726 38093083 39423195 41079122 41618568 42577263
8300D2577263J800828J638436J579602J682168J845597J469701J962513J700192
$$ 42577263 44378091 46016527 47596129 49278297 51123894 52593595 54556108 56256300
8292E6256300J867803K711874J464672K031319K486919K648315L639322M048349
$$ 56256300 58124103 60835977 62300649 64331968 66818887 69467202 73106524 77154873
8284G7154873M643748M594105N047128N141117O692065P220537P933428J0299330
$$ 77154873 81798621 86392726 91439854 96580971 103273036 110493573 118427001 128726331
8276A28726331J2323351J3375797J4137038J1663329P475410N152246M951554
$$ 128726331 141049682 154425479 168562517 180225846 187701256 192853502 197805056
8269A97805056L909180j003744l981011m486390k719435m27911J215445N167926
$$ 197805056 201714236 200710492 196729481 192243091 189523656 189095745 190311190 195479116
8261A95479116Q684693J0449744J0400648J0226074Q083550M911655K273182J325895
$$ 195479116 204163809 214613553 225014201 235240275 243323825 248235480 250508662 251834557
8253B51834557j483570o710399j1801453j0871374q230287o386998n629974o677006
$$ 251834557 250350987 243640588 231839135 220967761 212737474 206350476 200720502 194043496
8245A94043496n968994m276468k898881k654087k178803j849004k025861m160499
$$ 194043496 188074502 183798034 180899153 178245066 176066263 174217259 172191398 168030899
8237A68030899n250064o133051o275637n834490o120446n375530m008525l393754
$$ 168030899 162780835 156647784 150372147 144537657 138417211 133041681 129033156 125639402
8229A25639402l157390k491865k529548l997717m868423l063351j804020k158476
$$ 125639402 122482012 119990147 117460599 113462882 108594459 105531108 103727088 101568612
8221A01568612l432625n465725n395080m517023l562289k618399j614041j533820
$$ 101568612 98135987 92670262 87275182 82758159 79195870 76577471 74963430 73429610
8213G3429610j335682j663919K29944M13514N46106M89827J118422J594780K538812
$$ 73429610 72093928 70430009 70659953 71073467 71619573 72109400 73227822 74822602 77361414
8204G7361414K873541L441538M376964N720405O542227P858062O332598L593887
$$ 77361414 80234955 83676493 88053457 93773862 100316089 108174151 114506749 118100636
8196A18100636K045382L580365N832999N913071N21015o274364m033915m972955
$$ 118100636 120146018 123726383 129559382 135472453 135993468 129719104 125685189 120712234
8188A20712234m310289l398994j441574j211313l798143m679912n248716o063785
$$ 120712234 116401945 113002951 111561377 110350064 106551921 101872009 96623293 90559508
8180I0559508q720908q538322p512266o515296m687942m002743l050331k940578
$$ 90559508 81838600 73300278 65788012 59272716 54584774 50582031 47531700 44591122
8172D4591122j689555j580047j399020j318493j701689o02009p00758o14432O5996
$$ 44591122 42901567 41321520 39922500 38604007 36902318 36300309 35599551 34985119 35051115
8163C5051115J14256k26406O97509J247371L02455J234652J501435J317241R76044
$$ 35051115 35165371 34938965 35636474 36883845 37186300 38420952 39922387 41239628 42215672
8154D2215672O0678N1253o60660j105302j155532m21243r83968q24399k48469
$$ 42215672 42276350 42327603 41666943 40561641 39406109 38984866 38000898 37176499 36928030
8145C6928030o45226q78743j006071j023807q64855j011402l82808J90754p84224
$$ 36928030 36282804 35404061 34397990 33374183 32509328 31497926 31115118 31305872 30521648
8136C0521648m93592n82071M87686R1755n19206m21076n22494j17496J64327M38449
$$ 30521648 30028056 29445985 29933671 30025426 29506220 29085144 28562650 28445154 28609481 29047930
8126B9047930N51382J0757K96748J117616O51548J01967O93759R40595J82570
$$ 29047930 29599312 29610069 29906817 31024433 31675981 31777948 32471707 33412302 33594872
8117C3594872P32259N45708R42103J083575R41849J003628P40754J213171J068646
$$ 33594872 34327131 34872839 35814942 36898517 37840366 38843994 39584748 40797919 41866565
8108D1866565M5813J663857O23866P52204J053555P77610M19135J383706J981444
$$ 41866565 41912378 43576235 44200101 44952305 46005860 46783470 47202605 48586311 50567755
8099E0567755J707292J952849K186509K036431J468971J918527K601035L318491
$$ 50567755 52275047 54227896 56414405 58450836 59919807 61838334 64439369 67757860
8091F7757860L549820M448600M692959N054937M188991K025264K250642K324681
$$ 67757860 71307680 75756280 80449239 85504176 89693167 91718431 93969073 96293754
8083I6293754L248889M330680N280590O355810P581669Q989399J1929160J4142361
$$ 96293754 99542643 103873323 109153913 115509723 123091392 132080791 144009951 158152312
8075A58152312J7789708K0953218K5751856L0837968L8118695K7015626j9792332
$$ 158152312 175942020 196895238 222647094 253485062 291603757 318619383 298827051
8068B98827051l9923571l4227135k6890844j9477368j3803880r583345p081007
$$ 298827051 258903480 224676345 197785501 178308133 164504253 154920908 147839901
8061A47839901m966835n659499n513407m485902l865560l018017k042572j463845
$$ 147839901 142873066 137213567 131700160 127214258 123348698 120330681 118288109 116824264
8053A16824264k33148k04308j500777l275673l413616l727636l356113j984500
$$ 116824264 116591116 116386808 114886031 111610358 108196742 104469106 101112993 99128493
8045I9128493j180516K37263J268270L520635M169002M277511K205461O57651
$$ 99128493 97947977 98185240 99453510 102974145 107143147 111420658 113626119 114283770
8037A14283770N06567O01850J40987l01980j193038j962934k921083o067901m500636
$$ 114283770 114790337 115392187 115533174 115231194 114038156 112075222 109154139 103086238 98585602
8028I8585602l264650k239175j929591l157606m214244m893748l651672l177293
$$ 98585602 95320952 93081777 91152186 87994580 83780336 78886588 75234916 72057623
8020G2057623k894324j954557j369426j744739j101244j498320k335574l234046
$$ 72057623 69163299 67208742 65839316 64094577 62993333 61495013 59159439 55925393
8012E5925393k834713j791921j560225r72884p4634L46525J079314Q11789m60277
$$ 55925393 53090680 51298759 49738534 48765650 48691016 49037541 50116855 50928644 50468367
8003E0468367k250256k840337k793975k277599r28092j70630n01222j505736k766247
$$ 50468367 48218111 45377774 42583799 40306200 39378108 39207478 38706256 37200520 34434273
7994C4434273l161619k729877k447433j385711j814728j632409j638926j296133
$$ 34434273 31272654 28542777 26095344 24709633 22894905 21262496 19623570 18327437
7986A8327437q20628r61811j342749m96494k20666o80198p42258l26427o42174
$$ 18327437 17506809 16544998 15202249 14705755 14485089 13804891 13062633 12736206 12094032
7977A2094032j43428r64603o35740k34687m65337k21632m26184K75798j81933
$$ 12094032 11950604 10986001 10350261 10115574 9650237 9428605 9002421 9278219 9096286
7968I096286k83315l97586k28542k20332o7069k25640q9926l34743K25754j62189
$$ 9096286 8812971 8415385 8186843 7966511 7899442 7673802 7583876 7249133 7474887 7312698
7958G312698q11088q6940L04164k15832m36018N6161j46009j64803j25812k20741
$$ 7312698 6501610 6414670 6718834 6503002 6066984 6123145 5977136 5812333 5686521 5465780
7948E465780l72244L823o27606N11080k75382K42906j90300J76392l39992m42891
$$ 5465780 5093536 5097359 4469753 4980833 4705451 4948357 4758057 4934449 4594457 4151566
7938D151566K22571l9518J27809m50506m22393k8003L19696p3962j26798p6080
$$ 4151566 4374137 4334619 4462428 4011922 3589529 3561526 3881222 3807260 3680462 3604382
7928C604382J03630p5473l63417j10757N3447k25809K72051R914p7878J55675
$$ 3604382 3708012 3632539 3269122 3158365 3211812 2986003 3258054 3267968 3190090 3345765
7918C345765J07666K04823n42501k8333o0665N48716M71374l72285m28272j67924
$$ 3345765 3453431 3658254 3115753 3087420 3026755 3575471 4046845 3674560 3246288 3078364
7908C078364J92474l3482m05132K70681M03545m37298j60092l67338j72715L76145
$$ 3078364 3270838 3237356 2832224 3102905 3506450 3069152 2909060 2541722 2369007 2745152
7898B745152j46345o1412N25604J2693M7958m45332K54566j03829m84135Q07353
$$ 2745152 2598807 2537395 3062999 3075692 3123650 2678318 2932884 2829055 2344920 3152273
7888C152273n51132J32565j06546J8428j98644l26347J31309j19261M486J40005
$$ 3152273 2601141 2733706 2627160 2645588 2446944 2120597 2251906 2132645 2137131 2277136
7878B277136L2814l55728N35055n23027L15102l44401k73052l13902R5614Q051
$$ 2277136 2309950 1954222 2489277 1966250 2281352 1936951 1663899 1349997 1445611 1453662
7868A453662O4430J02464J80970K773l40959J39049P60632k24799m65000q4505
$$ 1453662 1518092 1620556 1801526 1804299 1463340 1602389 2363021 2138222 1673222 1588717
7858A588717r159k36654j03385J09383j02963K88429j82577n80238m06984J1881
$$ 1588717 1579558 1342904 1239519 1348902 1245939 1534368 1351791 771553 364569 376450
7848C76450O00997J12484q3644J56466L4356J48195j76082j42583K24933r6587
$$ 376450 977447 1089931 1006287 1162753 1197109 1345304 1169222 1026639 1251572 1154985
7838A154985J73425l24425O3034L54536o12867J46237J26205j22236m5611M9635
$$ 1154985 1328410 1003985 1067019 1421555 808688 954925 1081130 958894 913283 962918
7828I62918J03770M1629Q3536L00918k93793K08442k75817m49822L32868k69775
$$ 962918 1066688 1108317 1191853 1492771 1198978 1407420 1131603 681781 1014649 744874
7818G44874n92636j54290M41605k88149J67257k35532l37929j72353P70626J7886
$$ 744874 152238 -2052 439553 151404 318661 83129 -254800 -427153 343473 361359
7808C61359K20383j70204n7881l98079l84481q39898J67085K853085o09364n27741
$$ 361359 581742 411538 353657 -44422 -428903 -1268801 -1101716 1751369 1142005 614264
7798F14264O9622Q6373L45176l56889n60840L64883L30052n10665J83617M46107
$$ 614264 683886 770259 1115435 758546 197706 562589 892641 381976 565593 1011700
7788A011700o84394m9471K27751N32455k60996o70195N50334L19424j60528k54968
$$ 1011700 327306 277835 505586 1038041 777045 106850 657184 976608 816080 561112
7778E61112m97889P0942J93836J34143L29271q3576k81505J87263q2192J2478
$$ 561112 63223 134165 328001 462144 791415 707839 426334 613597 531405 543883
7768E43883o6816M25702n76157k80215M70534L59060Q1118l30982j63439J62544
$$ 543883 477067 902769 326612 46397 516931 875991 957109 626127 462688 625232
7758F25232Q0639k8273j25506J37843O9648k22573J37024J94059l90235m44697
$$ 625232 705871 677598 552092 689935 759583 537010 674034 868093 477858 33161
7748C3161K78767k88182p8717j7045J97083k3704r6757K97656q4278m61310J81528
$$ 33161 311928 23746 -54971 -72016 125067 101363 4606 302262 217984 -243326 -61798
7737f1798K87975K50466j12019r6532r8386J48297j29817j14767N11750k7038
$$ -61798 226177 476643 364624 268092 169706 318003 188186 73419 585169 558131
7727E58131L17121L06447l23910m12878N9061Q8698k18019J6830K39315n4522
$$ 558131 875252 1181699 857789 444911 503972 592670 374651 391481 630796 576274
7717E76274k3839J34049l69132J58326j30143Q5271L67275J49388J49816p7197
$$ 576274 552435 686484 317352 475678 345535 430806 798081 947469 1097285 1020088
7707A020088k63497J88131k17068j97823p75376J43092N06485k1189J66083r0784
$$ 1020088 756591 944722 727654 529831 -245545 -102453 404032 382843 548926 458142
7697D58142L28081j55420n89872P3857J95510K55324R2243K74094k76111n3181
$$ 458142 786223 630803 40931 114788 310298 565622 657865 931959 655848 602667
7687F02667L05206l29737R5337k52240K72232n84626K79146N17328M71169n05059
$$ 602667 907873 578136 673473 421233 693465 108839 387985 905313 1376482 871423
7677H71423J78020j36730n21278L53358O7420l15655J07633n61568M73927L56289
$$ 871423 1049443 912713 391435 744793 812213 496558 604191 42623 516550 872839
7667H72839J21323l12733k91463K98930j53166p4384j00433o6723m093j53853
$$ 872839 994162 681429 389966 688896 535730 461346 360913 294190 290097 136244
7657A36244j96203J75213j70662j06189P4832N80883J78040j07347J17473m617
$$ 136244 -59959 115254 -55408 -161597 -86765 494118 672158 564811 682284 677667
7647F77667k16491r9103l97311M2730J58035K2190K36417k55997l49262N1023
$$ 677667 461176 362073 -35238 7492 165527 187717 424134 168137 -181125 -130102
7637a30102p920L52982n3106K26848j76642l34823j1297l28574j49883M94448
$$ -130102 -138022 214960 161854 388702 212060 -122763 -134060 -462634 -612517 -118069
7627a18069n2643N37303o9607o81841K10814J09504j75224J65931N768J57300
$$ -118069 -170712 366591 296984 -384857 -174043 -64539 -239763 -73832 -68064 89236
7617H9236n41605j38517O91717K08011N9651l91342k15333J03696J67624l58898
$$ 89236 -452369 -590886 100831 308842 368493 -22849 -238182 -134486 33138 -325760
7607c25760l21542M18317J45377j96485k65458J16201J18268M61449L14392j31831
$$ -325760 -647302 -228985 -83608 -280093 -545551 -429350 -311082 150367 464759 332928
7597C32928j6586L94375K16074K55003k75295K20850m52967n72403K12593j10326
$$ 332928 316342 710717 926791 1181794 906499 1127349 674382 101979 314572 204246
7587B04246k89454R9691m8154L67002r4378n57360J42519j15873J69981k37735
$$ 204246 -85208 14483 -33671 333331 238953 -318407 -175888 -291761 -121780 -359515
7577c59515J96139j1055m62337K49259K62209k37718M7879M46235k65361k08774
$$ -359515 -163376 -174431 -636768 -387509 -125300 -363018 -315139 131096 -134265 -343039
7567c43039k59029O32826K35092m18476m3893J47632k04803j71375J08858J36656
$$ -343039 -602068 30758 265850 -152626 -196519 -48887 -253690 -425065 -316207 -179551
7557a79551o7833j54285N43844j28376o0720K01243l34503l22752L13931k58141
$$ -179551 -247384 -401669 142175 13799 -46921 154322 -180181 -502933 -189002 -447143
7547d47143K58822J45916L6237m85278M15920R4562l49337K19308J43428j03757
$$ -447143 -188321 -42405 -6168 -491446 -75526 19036 -330301 -110993 32435 -71322
7537g1322M8041j21445L4643m51716j15653M46911K93048n25256J66430j32742
$$ -71322 -23281 -144726 -110083 -561799 -677452 -230541 62507 -462749 -296319 -429061
7527d29061o9971O41309q6600j38908K38382l35516n54099N78788k50216L61459
$$ -429061 -499032 142277 55677 -83231 155151 -180365 -734464 -155676 -405892 -44433
7517d4433k72004K04714j97260J35923m3029m3586O92070l96937M46382l98486
$$ -44433 -316437 -111723 -308983 -173060 -216089 -259675 432395 35458 481840 83354
7507H3354m88053j9247o6561j14610K44386K57630k37520M4426Q8590J90126K95249
$$ 83354 -404699 -423946 -490507 -605117 -360731 -103101 -340621 -296195 -207605 -17479 277770
7496B77770k9069q95094n4981L80527J48882j16756o1006M11402j98472K78996
$$ 277770 248701 -646393 -701374 -320847 -171965 -288721 -349727 61675 -136797 142199
7486A42199M91407q3589o11362l03113L35584Q7479m26515k04591l92612J29030
$$ 142199 633606 550017 -61345 -364458 -28874 58605 -367910 -572501 -965113 -836083
7476h36083L40866J95400K99703m89183l95089N11885J61808J00286M64208L46244
$$ -836083 -495217 -299817 -114 -489297 -884386 -372501 -210693 -110407 353801 700045
7466G00045n44573O3156L84938p40101m34077K23475J77749O8071m17040K01952
$$ 700045 155472 218628 603566 -136535 -570612 -347137 -169388 -101317 -518357 -316405
7456c16405M17310k15375J65996l73116l82288M89572k00860p1597M73825J71183
$$ -316405 100905 -114470 51526 -321590 -703878 -214306 -415166 -486763 -12938 158245
7446A58245j70897l58962n5205M13829k60585N6324Q9408m82257l66718m6742
$$ 158245 -12652 -371614 -426819 -12990 -273575 -217251 -127843 -610100 -976818 -1023560
7436a023560K05478J07001k03814M43257N52043m78901J31368L76519J89245o34561
$$ -1023560 -818082 -711081 -914895 -471638 80405 -398496 -267128 109391 298636 -335925
7426c35925j81935j05243J31486O5483l75506Q59874m01449k49640J69917j15355
$$ -335925 -517860 -623103 -491617 -426134 -801640 58234 -343215 -592855 -422938 -538293
7416e38293P7805N1854M75003J37093k11481m05137J68665l71908J16547M0226
$$ -538293 -460488 -408634 66369 203462 -8019 -413156 -244491 -616399 -499852 -459626
7406d59626J3308P0207k617O8913J67604j48125l74244k1296O94969L9441l59766
$$ -459626 -446318 -376111 -378728 -309815 -142211 -290336 -664580 -685876 9093 48534 -311232
7395c11232k06686k29668N6996J062044O8571J79054k24684m73877L36668q6910
$$ -311232 -517918 -747586 -690590 371454 440025 619079 394395 -79482 257186 170276
7385A70276l01806o1522m8455L45539m63846j44488J227392j54856l79723j44592
$$ 170276 -131530 -193052 -241507 104032 -359814 -504302 723090 568234 188511 43919
7375D3919l52619K07763p0382J26517k09336l91890Q2502k79391K66011n199J79348
$$ 43919 -308700 -100937 -171319 -44802 -254138 -646028 -563526 -842917 -576906 -582105 -402757
7364d02757j52906M44429j66036m14441M22394j97085M20018m219J59803L6945
$$ -402757 -555663 -111234 -277270 -691711 -269317 -466402 -46384 -50603 109200 146145
7354A46145J3041L3971m50827O42765J71394m32127k33770k30493m38110R4276
$$ 146145 159186 193157 -257670 385095 556489 124362 -109408 -339901 -778011 -683735
7344f83735j42511K36542M43058l5384K39974K4145l13175j96550K01730l31052
$$ -683735 -826246 -589704 -146646 -182030 57944 82089 -231086 -427636 -225906 -556958
7334e56958L59181K94712j24559k51707L51932l58416j20517M69349m38297M02849
$$ -556958 -197777 96935 -27624 -279331 72601 -285815 -406332 63017 -375280 27569
7324B7569M15651J03902n10733j05952j28365K89651K04185j22152j16997k71700
$$ 27569 443220 547122 36389 -69563 -197928 91723 295908 173756 56759 -214941
7314b14941J77530O8756J35816J75662M9089o62011L24910j68328m02080J72079
$$ -214941 -37411 31345 167161 342823 391912 -270099 54811 -113517 -515597 -343518
7304c43518L442M12677m14057l2576K09755k31579k04999N24481P4368k74566
$$ -343518 -340076 72601 -341456 -374032 -164277 -395856 -600855 -76374 -2006 -276572
7294b76572J78937M8649j76871k79779K26111K06710N3835N2988j7176J53769
$$ -276572 -97635 -48986 -225857 -505636 -279525 -72815 -18980 34008 16832 170601
7284A70601p3620L46859n02379K43874j29802j71823Q8905J1603j0280j07201
$$ 170601 96981 443840 -58539 185335 55533 -116290 -27385 -15782 -26062 -133263
7274a33263J7224l23878j87812L71036J41734k21610k48687J40558M21639K82492
$$ -133263 -116039 -439917 -627729 -256693 -114959 -336569 -585256 -444698 -23059 259433
7264B59433k83568l2694j2832j33883K73558l89402O6211K54233L10554o03070
$$ 259433 -24135 -56829 -69661 -203544 70014 -319388 -253177 1056 311610 -291460
7254b91460j73266l9313J42972M32935j93583Q794j63585L69560Q9067m0445k4007
$$ -291460 -464726 -504039 -361067 71868 -121715 -112921 -276506 93054 182121 141676 117669
7243A17669l16550O9293K9962n27950L21043L88783k76105o05095N9704L0146
$$ 117669 -198881 -129588 -99626 -627576 -306533 82250 -193855 -798950 -739246 -709100
7233g09100l63048J88457L16814M65378K65766l1458L05237l75978k96029l58261
$$ -709100 -1072148 -883691 -566877 -101499 164267 132809 438046 62068 -233961 -592222
7223e92222k77483O13366P348k32240J28641j51545j15140J85583k5520J98056
$$ -592222 -869705 -256339 -248991 -481231 -352590 -504135 -619275 -433692 -459212 -261156
7213b61156l4303K16499J20570P5880K08341J33850k57798k87553k06722K05339
$$ -261156 -295459 -78960 41610 117490 325831 459681 201883 -85670 -292392 -87053
7203h7053J14356m9388m92199j65384N12721q1348n6979L54231J2941m24169K2790
$$ -87053 27303 -22085 -514284 -679668 -166947 -248295 -305274 48957 61898 -362271 -339481
7192c39481N13681p1186P5003m17998M38912J31093n50150N77119j41878l46423
$$ -339481 174200 103014 178017 -239981 198931 330024 -220126 356993 215115 -131308
7182a31308J86996n2999m04401P4967j1967J17754K60259m65580o5217J72628
$$ -131308 55688 2689 -401712 -326745 -338712 -220958 39301 -426279 -491496 -318868
7172c18868K04361q8817K55198K20630l21559Q640L0360m11669K4094M02618n49723
$$ -318868 -114507 -203324 51874 272504 -49055 -40415 -10055 -421724 -397630 4988 -544735
7161e44735k34426M64021K34667M24224K64923n01182r6847l73655K99111R7361
$$ -544735 -779161 -315140 -80473 343751 608674 107492 10645 -363010 -63899 33462
7151C3462j26527M52869j40142l63260k78279L78215l2977q0537l20079j9500
$$ 33462 -93065 359804 219662 -143598 -421877 -43662 -76639 -157176 -477255 -496755
7141d96755J25551L55775k18367j80593k7163J01109K5596Q53848J58224l19391
$$ -496755 -371204 -15429 -233796 -414389 -441552 -340443 -314847 539001 697225 377834
7131C77834n05419l03027L62381P9907J88915j56572m59464J05829O00848L42814
$$ 377834 -127585 -430612 -68231 11676 200591 44019 -415445 -309616 291232 634046
7121F34046p65298j581p3027j86613p1696l8497j12342j50620k16875N96818M53725
$$ 634046 -131252 -132833 -205860 -392473 -464169 -502666 -615008 -765628 -982503 -385685 68040
7110F8040n80526o1206M77266J88338n97576J48680j04997L4486r3335R5773j26348
$$ 68040 -512486 -573692 -96426 91912 -505664 -356984 -461981 -427495 -520830 -425057 -551405
7099e51405j6348K49113q3617l7150M83966m31279J33781K21495r7806o92095
$$ -551405 -567753 -318640 -402257 -439407 44559 -386720 -252939 -31444 -129250 -821345
7089h21345L75481n6126J35510M8591n252J79349j19986K38307k01788l26299
$$ -821345 -445864 -501990 -366480 -317889 -323141 -143792 -263778 -25471 -227259 -553558
7079e53558r1768K73693N86524k21318k32062j77073l21801K55422L02828O5413
$$ -553558 -645326 -371633 214891 -6427 -238489 -415562 -737363 -481941 -179113 -113700
7069a13700j44170o1979K42219J63451l65754N38730l87178l44302J8012J70163
$$ -113700 -257870 -319849 -77630 85821 -279933 258797 -128381 -472683 -454671 -284508
7059b84508K93503k61874N06637R8055m09440l18436R16324l69387M7229j10827
$$ -284508 8995 -252879 253758 351813 -57627 -376063 540261 170874 218103 107276
7049A07276j4390J50875j82026n9486J56776n1662m2085m67190n54755M01345
$$ 107276 92886 243761 61735 2249 159025 107363 65278 -401912 -956667 -555322
7039e55322N41841K08871j22251O885M3312L63743o34003L30351M97j61784l90783
$$ -555322 -13481 195390 73139 80024 123336 487079 -146924 183427 183924 22140 -368643
7028c68643O0530j5075k41590L90550J18317O51831n55432j90929q721m5313L49438
$$ -368643 -308113 -323188 -564778 -174228 -55911 595920 40488 -150441 -159162 -204475 144963
7017A44963o89462p568K21315J7505M60532j49559K2355m56421J88609L31228
$$ 144963 -544499 -552067 -330752 -313247 147285 -2274 20081 -436340 -247731 83497
7007H3497l99171J66929K64059J85409j80853m5270j9525p3810J07050L62198
$$ 83497 -315674 -148745 115314 300723 119870 74600 55075 -18735 88315 450513
6997D50513o58463K50468j03669J45192K38860n44029J34849R5189j06861j66819
$$ 450513 -207950 42518 -61151 84041 322901 -221128 -86279 8910 -97951 -264770
6987b64770m89020L71066K25855M4874J89882m07063k53464P41465J04185p1069
$$ -264770 -753790 -382724 -156869 -111995 77887 -329176 -582640 158825 263010 191941
6977A91941m169L61234j17123L1643j66763J39309j07348j108768N5328O99806
$$ 191941 187772 549006 431883 463526 296763 436072 328724 -780044 -724716 -24910
6967b4910k34211k51449K24562n2446L5235o702Q9696J8470o07688K53486J59148
$$ -24910 -259121 -510570 -286008 -338454 -303219 -309921 -220225 -201755 -809443 -555957 -396809
6956c96809j22192l97374J3631M33315L19865J82676m4240J73367p82153j26055
$$ -396809 -519001 -916375 -902744 -469429 -149564 33112 -11128 162239 -619914 -745969
6946g45969P07684M5622r976L73462m74265n9339N11510k44161m53255J90697
$$ -745969 -38285 7337 -2639 370823 -103442 -162781 348729 104568 -348687 -157990
6936a57990K83704R2862r66878M57838M12038l07670l64798j26282J27477P1978
$$ -157990 125714 218576 -748302 -290464 121574 -186096 -550894 -677176 -549699 -477721
6926d77721J73440N97132o91816k25605K56034J22271j20363M3538K26786j7118
$$ -477721 -304281 292851 -398965 -624570 -368536 -246265 -366628 -323090 -96304 -113422
6916a13422o5770k04703J77854O3031L0354j60265K87340j94300J78269J94622
$$ -113422 -179192 -383895 -206041 -143010 -112656 -272921 14419 -179881 -1612 193010
6906A93010n46607n6809R2941P6343Q9601l69545N14493k34786n67646m3412M39256
$$ 193010 -353597 -410406 -317465 -241122 -151521 -521066 -6573 -241359 -809005 -852417 -413161
6895d13161M79183K80998j25106J86393o01463m0825K70541j85607J96600k39421
$$ -413161 66022 347020 221914 408307 -193156 -233981 36560 -149047 47553 -191868
6885a91868J29368K72186L20254j69161o91453j75635M66965j79217J17390J03982
$$ -191868 -62500 209686 529940 360779 -330674 -506309 -39344 -218561 -101171 2811
6875B811J30720J39192j86749m02701O9146J46005q5376L7687j06189L05439N15176
$$ 2811 133531 272723 85974 -316727 -247581 -101576 -186952 -149265 -255454 49985 565161
6864E65161m22601L90368j68749k79645R8977p64742K91507L05998k64776o9773
$$ 565161 142560 532928 364179 84534 183511 -581231 -289724 16274 -248502 -318275
6854c18275k7997n04677K20684J79684j08685L64709K67091K03184j53662J10212
$$ -318275 -346272 -850949 -630265 -450581 -559266 -194557 72534 275718 122056 232268
6844B32268K22581j072410k97836k0606L94184J41815J26235N16602p38306l02399
$$ 232268 454849 -617561 -915397 -936003 -541819 -400004 -273769 242833 -495473 -797872
6834g97872P08886O42409k51264k59245j79332l4824K75310L45908j80470k70630
$$ -797872 -88986 553423 302159 42914 -136418 -171242 104068 449976 269506 -1124
6824a124k65406J41397J53186J00455K06542j56370J78146j98383N1376p01192
$$ -1124 -266530 -125133 28053 128508 335050 178680 356826 158443 209819 -491373
6814d91373j49313M97547r9252O28969k62733p15467L28553Q33721o52945m50622
$$ -491373 -640686 -143139 -242391 386578 123845 -591622 -263069 570652 -82293 -532915
6804e32915P16691j99050j33051R6388m46130k25593M45062O95522k19426m1114
$$ -532915 183776 -15274 -148325 -51937 -498067 -723660 -278598 416924 197498 156384
6794A56384J81934k26328k47244K68906k51791p9730L41248k5858o2579j76851
$$ 156384 338318 111990 -135254 133652 -118139 -197869 143379 117521 54942 -121909
6784a21909l82681l85259L56107k9219L60066l14833O7368L24710K55859N58402
$$ -121909 -504590 -889849 -533742 -562961 -202895 -517728 -450360 -125650 130209 688611
6774F88611m89001k90985l30307j05483l40957M57996O12512l7125k42220J38790
$$ 688611 199610 -91375 -421682 -527165 -868122 -410126 202386 165261 -76959 61831
6764F1831j9743l1242j68272L01928n14640K11707K99697L14722K99215o23722
$$ 61831 42088 10846 -157426 144502 -370138 -158431 141266 455988 755203 131481
6754A31481j62797J35043k66748m70615M79127J22663L1262J79167j50700j4591
$$ 131481 -31316 103727 -163021 -633636 -154509 -31846 -584 178583 27883 13292
6744A3292K81151J89045k18090k61860j2682j27603K44323m61061J40487L1934
$$ 13292 294443 483488 265398 3538 -9144 -136747 107576 -353485 -212998 -181064
6734a81064K28400m7390L8969r4222j33581N6353J97454o2623P3653o3599j5208
$$ -181064 47336 -54 38915 -55307 -188888 -132535 64919 2296 75949 12350 -2858
6723b858O68879l30610j95134J75283j26143q6799l1933n72428K73929J92818
$$ -2858 666021 335411 140277 315560 189417 102618 70685 -501743 -227814 -34996
6713c4996L75771k91358k97041K95341r670k36861k68584N45946J54642k68719
$$ -34996 340775 49417 -247624 47717 38047 -198814 -467398 78548 233190 -35529
6703c5529L28527M5788k44575k20408n11891K99834O5818N66895k07625k50627
$$ -35529 292998 338786 94211 -126197 -638088 -338254 -272436 294459 86834 -163793
6693a63793m85738O85189J66171J02607l64767j44028M1742k36185j76755R2538
$$ -163793 -649531 35658 201829 304436 -60331 -204359 -162617 -398802 -575557 -483019
6683d83019O05231j78941l98769j46948P87139K57329k05731j31346J87551q9549
$$ -483019 122212 -56729 -455498 -602446 184693 442022 236291 104945 292496 202947
6673B02947O1525j38521j62243J8812r9986k09447n28100M31588L84480R3737
$$ 202947 264472 125951 -36292 -17480 -117466 -326913 -855013 -423425 -38945 54792
6663E4792J51147m95501k01777L93208K92369k37629j8223k68866J36412N34005
$$ 54792 205939 -289562 -491339 -98131 194238 -43391 -61614 -330480 -194068 339937
6653C39937M50769j35609n21421l35180K3026O86715L28565j97439l91119J21176
$$ 339937 790706 655097 133676 -201504 -178478 508237 836802 639363 248244 369420
6643C69420n74164m9190L84886R956j11854l86731M51347K68731l53015q525K044
$$ 369420 -204744 -253934 130952 140908 29054 -357677 93670 362401 9386 861 2905
6632B905Q995M48762k68813j38106k26968J37802J16565N26040o73502m02378
$$ 2905 11900 460662 191849 53743 -173225 -35423 81142 607182 -66320 -468698
6622d68698K10453J95102L09426p1046K00810m2763o98932k31791J84379L90058
$$ -468698 -258245 -63143 246283 175237 376047 333284 -365648 -597439 -413060 -23002
6612b3002L5676q1023J79023l35982o6497J16010M59678j60362m29294P51206
$$ -23002 12674 -68349 110674 -225308 -291805 -175795 283883 123521 -305773 445433
6602D45433l84964j00395P2759M43876j10471Q1963L10626j73715l47663N23232
$$ 445433 60469 -39926 32833 476709 366238 448201 758827 585112 237449 760681
6592G60681l8170n16873j30807J93181J4755j43959L2566q2141K07173J1054M93845
$$ 760681 722511 205638 74831 268012 282767 138808 171374 89233 296406 307460 801305
6581H01305o06657n03890N57526K16683m42456k48818J4769M47690p8824l85236
$$ 801305 194648 -309242 248284 464967 22511 -226307 -211538 236152 157328 -227908
6571b27908J95110J13123K2166N58435L96981k66467J97664j11608q00368L03532
$$ -227908 -32798 80325 102491 660926 1057907 791440 989104 877496 77128 380660
6561C80660k39266M91981k14544l19584j42415k22774J06896n8123O48103K95433
$$ 380660 141394 633375 418831 99247 -43168 -265942 -159046 -217169 430934 726367
6551G26367j07262J55060k83304j44025J91289p7389J70967l80599j21045J96671
$$ 726367 619105 774165 490861 346836 538125 460736 631703 251104 130059 326730
6541C26730M09030l49359q8218M43750J30401J27166p87182j91494K77035K05577
$$ 326730 735760 386401 298183 741933 872334 999500 212318 20824 297859 503436
6531E03436l44374K89439j9054L1675k73899K50612m46324R6743J80940k34978
$$ 503436 159062 448501 429447 461122 187223 437835 -8489 88254 269194 34216
6521C4216J75402k03648J08417M8629J90433k39370L28127m55051L54300L86361
$$ 34216 209618 5970 114387 163016 353449 114079 442206 -12845 341455 727816
6511G27816k68141n98369M504r5577l43156Q04038M25238n74384J24779j68731
$$ 727816 459675 -138694 -134190 -229767 -572923 231115 656353 81969 206748 38017
6501C8017j14183K90078j47630k64272K59969K82902j06357k97597Q7331P83878
$$ 38017 -76166 213912 66282 -197990 61979 344881 238524 -59073 28258 812136
6491H12136k56873m94470M08778L69259K03375m46647q3979R1959o77434K34055
$$ 812136 555263 60793 469571 838830 1042205 595558 511579 603538 -73896 160159
6481A60159L51083n00063m07499R68881N76098l47975n56068J19631l90954k45803
$$ 160159 511242 11179 -396320 572561 1148659 800684 244616 364247 -26707 -272510
6471b72510k50711P1289M45723K06671n65132K50344L00923p6305Q613R202J31978
$$ -272510 -523221 -451932 -6209 200462 -364670 -114326 186597 110292 118905 128107 260085
6460B60085k79708K01516K64564R5003j9112m43332J67106J04929l24528j85416
$$ 260085 -19623 181893 446457 541460 522348 79016 246122 351051 26523 -158893
6450a58893N69725J29745J30684r1263m36860j59993M47204j76873k66328R651
$$ -158893 410832 540577 671261 579998 143138 -16855 430349 253476 -12852 -3201
6440c201m6961L8889m66730L57k2743L89816K80310J89029J1189l14712j65355
$$ -3201 -50162 -11273 -478003 -477646 -500389 -110573 169737 358766 369955 55243 -110112
6429a10112L06097J48245k25294O2216j8825n3001K68489M31780K98941r83574
$$ -110112 195985 344230 118936 181152 162327 109326 377815 809595 1108536 124962
6419A24962k30704O30851K69406q91761J33341O34830P2426n25951n21771L4117
$$ 124962 -105742 525109 794515 -97246 36095 670925 743351 217400 -304371 -270254
6409b70254J73569k62507N69260L02560k88282m71787J22796J98696o0654l5124
$$ -270254 -96685 -359192 210068 512628 224346 -247441 -124645 74051 13397 -21727
6399b1727O59704R710K2926L7921k96416m08280n2350k43986M53740n35118k19615
$$ -21727 637977 647687 670613 708534 412118 3838 -48512 -292498 161242 -373876 -593491
6388e93491P54831J28700M47343j30773j13749j72892j41917L47391Q391q1597
$$ -593491 161340 290040 737383 606610 492861 319969 178052 525443 533834 452237
6378D52237p97600l45654O09012J36866K04132m62677n243k43332J89948M86070
$$ 452237 -345363 -691017 -82005 54861 258993 -203684 -208927 -452259 -262311 223759
6368B23759n49928k52506M00511M01626L23591l13715k57907J38652j97295L12868
$$ 223759 -326169 -578675 -178164 223462 547053 233338 -24569 114083 -83212 229656
6358B29656J63848P038l37907k10112L09925k33525K96501k48414K17676J53607
$$ 229656 393504 400542 62635 -147477 162448 -71077 225424 -22990 194686 348293
6348C48293j4791N4450r8187k15123M7517j82754J38487J74533L69556p37879
$$ 348293 333502 387952 289765 74642 122159 -60595 77892 252425 621981 -115898
6338a15898p7570K58473J29899J64160k5939R280Q3536l0351m62472J77381J20633
$$ -115898 -193468 65005 194904 359064 333125 342405 425941 395590 -66882 110499 231132
6327B31132m6267K02514j11328j04646j94751o7244m3360l89466K53P65496j4237
$$ 231132 184865 387379 276051 171405 -23346 -90590 -133950 -523416 -523163 242333 228096
6316B28096m27326k82891J49541M01112k20377K91732K26222k46798l93640j43724
$$ 228096 -199230 -482121 -332580 68532 -151845 139887 366109 119311 -274329 -418053
6306d18053J67311O65832o218j67373j72381j28814J63562l65342K19774L83664
$$ -418053 -250742 415090 408872 241499 69118 -59696 103866 -261476 -41702 341962
6296C41962j4270k73496j74025K03107M33232n5903l16715K50039n8818r0480
$$ 341962 327692 54196 -119829 83278 516510 460607 143892 393931 335113 244633
6286B44633n210o00327L84527P44544k51261m76798n7150J44693K97036K6501
$$ 244633 239423 -360904 23623 768167 516906 40108 -17042 127651 424687 451188
6276D51188l52511L41355k63377n93563M04201N00675P4099j91137k9014L90866
$$ 451188 98677 440032 176655 -416908 -12707 487968 562067 370930 341916 732782
6266G32782k79451k33811j57595K03996J92289R2886L30637n83934l44034J9460
$$ 732782 453331 219520 61925 265921 458210 551096 881733 297799 -46235 -26775
6256b6775J5065L55521k2427n92103K74172N77346k45182J18485j11845O79081
$$ -26775 -11710 343811 321384 -270719 3453 580799 335617 454102 342257 1021338
6246A021338k98171n71443K14263K20663k88075J56574L32491m62031l61834k08966
$$ 1021338 723167 151724 365987 586650 298575 455149 787640 325609 -36225 -245191
6236b45191M6105J73617J14783m15961M70240k14807M15755K73173K6160m0365
$$ -245191 -199086 -25469 89314 -326647 143593 -71214 344541 617714 643874 603509
6226F03509J6634j8282J02623M77893l52133l6117k47266J43599j72089k18984
$$ 603509 620143 601861 704484 1182377 830244 794127 546861 690460 518371 299387
6216B99387j75582k84115K49099J23259r7658O49165l09278o21751L35805M11528
$$ 299387 123805 -160310 88789 212048 114390 763555 454277 -167474 168331 579859
6206E79859M31850K05121n06844N4499j14712n3409l15563j8429J9421L87861
$$ 579859 1011709 1216830 709986 764485 649773 596364 280801 262372 281793 669654
6196F69654m29586m20769J42968j73604L34333M01035l00844l15001O7091O38357
$$ 669654 240068 -180701 -37733 -211337 122996 524031 223187 -91814 -24723 613634
6186F13634J24433J5647J24584q84451K06859K62000j74722L59623L20276j13418
$$ 613634 738067 753714 878298 -6153 200706 462706 287984 647607 967883 854465
6176H54465j07319k23841K05871k1905K69796j214R2926K22868N61165l50583
$$ 854465 747146 523305 729176 707271 977067 975853 1068779 1291647 1852812 1502229
6166A502229N5785O1718p2473L90103q5775m52787n7967m24211J84111l35796
$$ 1502229 1558014 1619732 1547259 1937362 1851587 1398800 1340833 916622 1100733 764937
6156G64937J38901K57496L5723R6685m29689J15391J41954J52529k53513j40511
$$ 764937 903838 1161334 1197057 1293742 864053 979444 1121398 1273927 1020414 879903
6146H79903J11942L5890m58507j26997P49111j59391M7912N1978j92021k70168
$$ 879903 991845 1027735 569228 442231 1191342 1031951 1079863 1131841 939820 669652
6136F69652j64300K70753m0346j3839k21098M15909j88269R635M13307l59492
$$ 669652 505352 776105 735759 721920 500822 916731 728462 738097 1151404 791912
6126G91912J29403K0509k36175M41300o77900n21852N16784L35393O59495J98956
$$ 791912 921315 941824 705649 1146949 469049 -52803 463981 799374 1458869 1657825
6116A657825p18629k76544Q397j25991N16687L31581n03862J72968J71531m66136
$$ 1657825 939196 662652 671049 545058 1061745 1393326 889464 1062432 1233963 767827
6106G67827l73539N4910J61678J843K60933K17847J66021n17752l33513L56446
$$ 767827 394288 449198 610876 612719 873652 1091499 1257520 739768 406255 762701
6096G62701n33496J56147O1258Q2073l97156K07608M09992M92015k01200P6229
$$ 762701 229205 385352 446610 528683 131527 339135 749127 1241142 1039942 1116171
6086A116171l44056O513p5825R4450q3211K08216L72948j70770j55938m10295
$$ 1116171 772115 778628 702803 797253 714042 922258 1295206 1124436 968498 558203
6076E58203l42677j27777L85051j17678L10155j54599J77339J56301l90416n13317
$$ 558203 215526 87749 472800 355122 665277 510678 688017 844318 453902 -59415
6066e9415N45714J58934K12212j83307J0030j58518L20460K44093m56113L59495
$$ -59415 486299 645233 857445 674138 684168 525650 846110 1090203 634090 993585
6056I93585p1022l59959j06734N43579j37703l99525K57336K97889j20419m73917
$$ 993585 922563 562604 455870 999449 861746 462221 719557 1017446 897027 423110
6046D23110K31352l30740K0185J56710j15635J09179p117L42873l18892M58448
$$ 423110 654462 323722 343907 500617 384982 494161 487044 829917 511025 969473
6036I69473j4709q11663O78867O01352n47927m24734r340J8682k5348l46688L46890
$$ 969473 954764 143101 821968 1423320 875393 450659 441319 460001 434653 87965 434855
6025D34855q710r3902k38205O67890l84446N1341k3986n89858M82039l20574r6780
$$ 434855 426145 332243 94038 761928 377482 428823 404837 -185021 297018 -23556 -120336
6014a20336J23300P05563K01712j96846j78968l8712K18660l83058j18172p4864
$$ -120336 2964 708527 910239 713393 534425 495713 714373 331315 213143 138279
6004A38279j63529M8456L11212j04260K2994p966l41610K07121J51675j27717
$$ 138279 -25250 23206 334418 230158 253152 245186 -96424 110697 262372 134655
5994A34655J42272M91830J36282k19701j75464J63239l52581k75110K74535K23968
$$ 134655 276927 768757 905039 685338 509874 673113 320532 45422 319957 543925
5984E43925j12614O34871l6326n68559j90683J78667L19873o5723R5928l45895
$$ 543925 431311 1066182 1029856 461297 270614 449281 769154 703431 799359 453464
5974D53464J06879J61864l21423l6687K14434l19869M9398M83962j72488M6651
$$ 453464 560343 722207 400784 364097 578531 258662 308060 792022 619534 666185
5964F66185j39320j79629p2860M82735p1071J48849J25384j53300j98533k46564
$$ 666185 526865 347236 274376 757111 686040 834889 960273 806973 608440 361876
5954C61876K24921R1961J6509J50316R9265j5577l27513j47192l00521k24938
$$ 361876 586797 678758 695267 845583 944848 929271 601758 454566 154045 -70893
5944g0893Q05299M56745R4418m45749k79442l3776L15397K5763M1300J08220L05863
$$ -70893 734406 1191151 1285569 839820 560378 526602 841999 867762 909062 1017282 1323145
5933A323145j1105n43200R4647l90092K17624L40376l88693J19956k04183L62296
$$ 1323145 1312040 768840 863487 473395 691019 1031395 642702 762658 558475 920771
5923I20771k330p3831P6932o2362j68277M85746n1417m11723J94730j09508P9746
$$ 920771 918441 844610 921542 859180 690903 1176649 1125232 713509 908239 798731 878477
5912H78477j37653M96432K37370l45065j70855K79584k44385j65344p6471K79177
$$ 878477 740824 1237256 1474626 1129561 958706 1238290 993905 828561 752090 1031267
5902A031267j65837j90555M63784L7860p35080l10984K36161M01465J05217k42040
$$ 1031267 865430 674875 1138659 1176519 441439 130455 366616 768081 873298 631258
5892F31258L25573K16509q8808N4561k90219n9013L34456O3994L69J54913l1555
$$ 631258 956831 1173340 1084532 1139093 848874 789861 1124317 1188311 1188680 1343593 1312038
5881A312038K72787j2047M2666J65818m18668q4704o925k13853N9686O57858J41734
$$ 1312038 1584825 1572778 1615444 1781262 1362594 1277890 1270965 1057112 1116798 1774656 1916390
5870A916390k28968m9609k49724P9745j48269m7948j91616k0237L60854K94768
$$ 1916390 1687422 1637813 1388089 1467834 1319565 1271617 1080001 1059764 1420618 1715386
5860A715386L12575r7755l61879k32588p9352j66979j99393k00855l48506p4482
$$ 1715386 2027961 1930206 1568327 1335739 1256387 1089408 890015 689160 340654 266172
5850B66172N15359J02162J95159J48597l33715K01276L454K31733J049o6702J98807
$$ 266172 781531 883693 1078852 1227449 893734 1095010 1098464 1330197 1331246 1264544 1463351
5839A463351m54271j59869P64620k78735p02836O25106M65510k96061j61500J85342
$$ 1463351 1009080 849211 1613831 1335096 632260 1257366 1722876 1426815 1265315 1450657
5829A450657k70592J54916k17016L03224K89957k07671p05424K44379K26410j09570
$$ 1450657 1180065 1334981 1117965 1421189 1711146 1503475 798051 1042430 1268840 1159270
5819A159270j14716k156L27847k42482n64793L9094J34522M65359L48765M3163
$$ 1159270 1044554 1042398 1370245 1127763 562970 602064 736586 1201945 1550710 1593873
5809A593873r6107n00068k31382M18078K66238o11715L55689L50869J58035m34853
$$ 1593873 1497766 997698 766316 1184394 1450632 838917 1194606 1545475 1703510 1268657
5799A268657j26881J97432m4344J36794j69310K28936k54485j54976L74408O819
$$ 1268657 1141776 1339208 1294864 1431658 1262348 1491284 1236799 1081823 1456231 1463050
5789A463050n33671L39156M3039j34352m0817K90663K09270J38885J44080k81164
$$ 1463050 929379 1268535 1311574 1177222 1136405 1427068 1636338 1775223 1919303 1638139
5779A638139K30995M9170p24879k94781Q00368l69742q9425K79715P51104j34828
$$ 1638139 1869134 1918304 1193425 898644 1699012 1329270 1239845 1519560 2270664 2135836
5769B135836M49183m31609Q7364k45296j36200Q08293j08569j73799l23508K66201
$$ 2135836 2585019 2153410 2240774 1995478 1859278 2667571 2559002 2385203 2061695 2327896
5759B327896l04591M74551k1073K2225R1549m90668k64670j8717Q22810J88004
$$ 2327896 2023305 2497856 2476783 2499008 2590557 2099889 1835219 1816502 2639312 2827316
5749B827316l78411O9156j15716O98141J64180q8910M7629j91727p92407L16410
$$ 2827316 2448905 2518061 2402345 3100486 3264666 3175756 3223385 3031658 2239251 2555661
5739B555661L94144l9005k182j07706L22753l92503m94414J22692M23903K12869
$$ 2555661 2949805 2910800 2908618 2800912 3123665 2731162 2236748 2359440 2783343 2996212
5729B996212p15389J51422k87249k40713M39775L92854L08823j93877k65691M326
$$ 2996212 2280823 2432245 2144996 1904283 2344058 2736912 3045735 2851858 2586167 2590493
5719B590493O25824n0461k4393m53961J56987P564m94298M56757k61556J08901
$$ 2590493 3216317 3165856 3141463 2687502 2844489 2852053 2357755 2814512 2552956 2661857
5709B661857P10482m48157J98455K56650j25129p86571K87602J50847j69326K57599
$$ 2661857 3372339 2924182 3122637 3379287 3254158 2467587 2755189 2906036 2736710 2994309
5699B994309L49620J75720K36125m02287J45124K88450K72834K52167k33358J6873
$$ 2994309 3343929 3519649 3755774 3353487 3498611 3787061 4059895 4312062 4078704 4095577
5689D095577k59574O14179j10205K0787M31920J02655M81418r7511o00795k17357
$$ 4095577 3836003 4450182 4339977 4360764 4792684 4895339 5376757 5279246 4678451 4461094
5679D461094K66020J04990n04157m07048M67708L46089K03444N46773J96249J6365
$$ 4461094 4727114 4832104 4327947 3920899 4388607 4734696 4938140 5484913 5681162 5697527
5669E697527l09658N69892K01805O09509L76086o75811J72095J59804q8003K47247
$$ 5697527 5387869 5957761 6159566 6769075 7145161 6469350 6641445 6801249 6713246 6960493
5659F960493K26864M54036L06281l34207M39849M8984q2955J80192K08836M4638
$$ 6960493 7187357 7641393 7947674 7613467 8053316 8102300 8019345 8199537 8408373 8453011
5649H453011M93101R1140L44546k06429k00442J202483K20887K92551l8412K14343
$$ 8453011 8946112 9037252 9381798 9175369 8974927 10177410 10398297 10690848 10652436 10866779
5639A0866779J81319N92730K24706M73652J8004m0701Q64531M82722O13866J50264
$$ 10866779 11048098 11640828 11865534 12339186 12357190 12316489 13181020 13663742 14277608 14427872
5629A4427872R3011Q00790O57260J89836O18642P12221R80218J325898J236805
$$ 14427872 14520883 15321673 15978933 16168769 16787411 17499632 18479850 19805748 21042553
5620B1042553L06408Q76038J414330J459348J489446J327297K270726K109160
$$ 21042553 21348961 22224999 23639329 25098677 26588123 27915420 30186146 32295306
5612C2295306K809594L528305K799491K584238K595551J525555j66307j310566
$$ 32295306 35104900 38633205 41432696 44016934 46612485 48138040 47971733 46661167
5604D6661167k245436k156896j733062j032105j47899n27023K95371Q08211J094951
$$ 46661167 44415731 42258835 40525773 39493668 39345769 38818746 39114117 39922328 41017279
5595D1017279J474794J397491K571368K229541L205001L569755L577459L906819
$$ 41017279 42492073 43889564 46460932 48690473 51895474 55465229 59042688 62949507
5587F2949507K969121M084054L288466K344864L498538M082032M760367M144074
$$ 62949507 65918628 70002682 73291148 75636012 79134550 83216582 87976949 92121023
5579I2121023J857098j692313n009122o522877p121731o043046n123790l121193
$$ 92121023 93978121 92285808 87276686 80753809 73632078 67589032 62465242 59344049
5571E9344049k078471r94793q5057k72076L82661J234634K004815K380233K373674
$$ 59344049 57265578 56270785 56185728 55913652 56296313 57530947 59535762 61915995 64289669
5562F4289669K671880L236332K820192J465329Q57626J78885j433197n95608j262220
$$ 64289669 66961549 70197881 73018073 74483402 75341028 75519913 74086716 73491108 72228888
5553G2228888r34997j200695j544308l147094m113837m227026m500622l525988
$$ 72228888 71293891 70093196 68548888 65401794 61287957 57060931 52560309 49034321
5545D9034321l104303k741281k414191j620101j310069p61976o20352p02146n91036
$$ 49034321 45930018 43188737 40774546 39154445 37844376 37082400 36462048 35759902 35168866
5536C5168866k02211k06661M07907O35290L51830O35033o65787j242942j332612
$$ 35168866 34966655 34759994 35167901 35803191 36155021 36790054 36124267 34881325 33548713
5527C3548713k871646k285315k034067j755184j450121p91240j257351j578310
$$ 33548713 30677067 28391752 26357685 24602501 23152380 22361140 21103789 19525479
5519A9525479j176917p22531j62943k0383j216134j143114m40284p8781j001859
$$ 19525479 18348562 17626031 17463088 17442705 16226571 15083457 14643173 14564392 13562533
5510A3562533m3565k09538n60006m79953J09434L25624R920k56149m10966L49247
$$ 13562533 13518968 13309430 12749424 12269471 12378905 12704529 12714449 12458300 12047334 12396581
5500A2396581k35963o9457P3790m62763j03801N3843n34977J28748q5915j1603
$$ 12396581 12160618 12091161 12164951 11702188 11598387 11652230 11117253 11246001 11160086 11148483
5490A1148483j55370q4049m44777Q6948l65300j60618L30926o5818R2161J62379
$$ 11148483 10993113 10909064 10464287 10551235 10185935 10025317 10356243 10290425 10382586 10544965
5480A0544965j56319m9090k31390N46848N8862j40368M90736K25739J04191Q77190
$$ 10544965 10388646 10339556 10108166 10655014 10713876 10573508 11064244 11289983 11394174 12271364
5470A2271364L60020J94629l61215L80151N98389L96352Q96191M56297Q65670
$$ 12271364 12631384 12826013 12464798 12844949 13443338 13839690 14735881 15192178 16057848
5461A6057848L43309Q94422N65411O00362K143693J594454J206872J516826J677683
$$ 16057848 16401157 17295579 17860990 18461352 20605045 22199499 23406371 24923197 26600880
5452B6600880J990218K760088K469402J985333J310564q97424j378182j537029
$$ 26600880 28591098 31351186 33820588 35805921 37116485 36219061 34840879 33303850
5444C3303850k266637j702868j274078p41824j92425j474934o53480J68637K91992
$$ 33303850 31037213 29334345 28060267 27318443 27126018 25651084 24997604 25166241 25458233
5435B5458233L55334P06573J510420J341182J692664K082254K310066L116049
$$ 25458233 25813567 26520140 28030560 29371742 31064406 33146660 35456726 38572775
5427C8572775L657025L933651M659058N345470N524096M469539Q18703k848164
$$ 38572775 42229800 46163451 50822509 56167979 61692075 66161614 66980317 64132153
5419F4132153n138346o698786o023563m953975m196540l132674k553822k054045
$$ 64132153 58993807 52295021 46271458 41317483 37120943 33988269 31434447 29380402
5411B9380402j585630j798885j065422n03050o36300r6408L2341K42235J019872
$$ 29380402 27794772 25995887 24930465 24427415 23791115 23694707 23727048 23969283 24989155
5402B4989155P61323J777374J316630J852809K139856J568094K458597J241284
$$ 24989155 25750478 27527852 28844482 30697291 32837147 34405241 36863838 38105122
5394C8105122r68788k517473l207337l132412k685409k967771k390020k157855
$$ 38105122 37136334 34618861 31411524 28279112 25593703 22625932 20235912 18078057
5386A8078057j859868j722504j567775q16553l70437j055299o14864l15499m81716
$$ 18078057 16218189 14495685 12927910 12111357 11740920 10685621 10070757 9755258 9273542
5377I273542m94959p40715m73904n3344k19876o10528m54102j61384K06316j10233
$$ 9273542 8778583 8037868 7563964 7510620 7290744 6680216 6226114 6064730 6271046 6160813
5367F160813k34820k9572J60181j77386p9271k82157m07591R7944j19429o6413
$$ 6160813 5925993 5896421 6056602 5879216 5799945 5517788 5110197 5208141 5088712 5022299
5357E022299l10848K42729j12858k02868j03385l28830J44371o8828j39710o2255
$$ 5022299 4711451 4954180 4841322 4638454 4535069 4206239 4350610 4281782 4142072 4079817
5347D079817o10039N15957M1938l55780O4537O142j9354k69753n06384m37129
$$ 4079817 3469778 3985735 4027673 3671893 3736430 3742572 3723218 3453465 2947081 2509952
5337B509952L22275R16869k67778k99783o13045M37418K37421n91319P4368n61008
$$ 2509952 2832227 3749096 3481318 3181535 2568490 3005908 3243329 2652010 2726378 2165370
5327B165370M01067J73830j42401j4699M50444L70738j23941n99426k90365Q0124
$$ 2165370 2566437 2740267 2597866 2583167 3033611 3404349 3280408 2680982 2390617 2470741
5317B470741M79315m49994J09905J49963l32113K18963j91229J61301L2895K93983
$$ 2470741 2950056 2500062 2609967 2759930 2427817 2646780 2455551 2616852 2649747 2943730
5307B943730k1560l89399q734M03722j68052k60028K03l55315k3449J93727J35989
$$ 2943730 2922170 2532771 2524037 2927759 2759707 2499679 2499882 2144567 2121118 2314845 2450834
5296B450834Q3907p3233J88562j48137j28904Q317L36620k42223k50608K09182
$$ 2450834 2534741 2461508 2650070 2501933 2373029 2381346 2717966 2475743 2225135 2434317
5286B434317M19599K65402n37939k73084J79102m79070l57021N39503J35034m3868
$$ 2434317 2853916 3119318 2581379 2308295 2487397 2008327 1651306 2190809 2325843 2281975
5276B281975L89603P6550o39818k30207K73415K68833O8312K13614l86160r8907
$$ 2281975 2671578 2748128 2108310 1878103 2151518 2420351 2488663 2702277 2316117 2217210
5266B217210J94595J13479P2067J14683j06898K54070k51444m20613r1184O6406
$$ 2217210 2411805 2525284 2597351 2712034 2605136 2859206 2607762 2187149 2095965 2162371
5256B162371k81435K45346N79520N7974n09030M35492l34230L31309L39228p9685
$$ 2162371 1880936 2126282 2705802 2763776 2254746 2690238 2356008 2687317 3026545 2946860
5246B946860N4481j8785k83370j9458O712L9299N42667l03145k43875L02213j83027
$$ 2946860 3001341 2982556 2699186 2679728 2686440 2725739 3268406 2965261 2721386 3023599 2840572
5235B840572l716k84379j17444p8880j43155Q73495m49308k34983l9016L04212
$$ 2840572 2836856 2552477 2435033 2356153 2212998 3086493 2637185 2402202 2363186 2667398
5225B667398l2156n93452Q9002N05595l38099M40326L21905l64507j69550L07817
$$ 2667398 2635242 2041790 2130792 2636387 2298288 2738614 3060519 2696012 2526462 2834279
5215B834279J39314l84894L7078L43351J59730m53133l99593L84723L68651j06252
$$ 2834279 2973593 2588699 2625777 2969128 3128858 2675725 2276132 2660855 3029506 2923254
5205B923254J96216q5767l90969K81356J93874l91725K20092p9591o10240M25658
$$ 2923254 3119470 3033703 2642734 2924090 3117964 2726239 2946331 2866740 2256500 2682158
5195B682158K83379j04397J47014L3607O6500n48528O04088J19431l22384L32405
$$ 2682158 2965537 2861140 3008154 3041761 3108261 2559733 3163821 3283252 2960868 3293273
5185C293273k11978L62213m56574l8153j92908P24636N68060k8695r22720l65955
$$ 3293273 3081295 3443508 2986934 2948781 2755873 3480509 4048569 4019874 3097154 2731199
5175B731199L60713M00860j38306K5628J30441n5875j0328K26538N6696m43778
$$ 2731199 3091912 3492772 3354466 3380094 3510535 3454660 3444332 3670870 3727566 3283788
5165C283788K14325P4898r5891K91814K63567K15703j62872p6083K13669K40515
$$ 3283788 3498113 3573011 3477120 3768934 4032501 4248204 4085332 4009249 4222918 4463433
5155D463433k21233n00976J9062L38225l23837M8628l43778j53763O29102L63400
$$ 4463433 4242200 3741224 3760286 4098511 3774674 3823302 3479524 3325761 3954863 4318263
5145D318263N43227o81908m10366j75070M20659o7113K96645j01255K8461K50577
$$ 4318263 4861490 4179582 3769216 3594146 4014805 3947692 4244337 4143082 4171543 4422120
5135D422120K43117j14616n52965j2462K10743l65249j34849P07986l20848o8094
$$ 4422120 4665237 4550621 3997656 3985194 4195937 3830688 3695839 4403825 4082977 4014883
5125D014883N22276L43782j94645r0582P67826n22939k68598J11094K88816N69561
$$ 4014883 4537159 4880941 4686296 4595714 5363540 4840601 4572003 4683097 4971913 5541474
$$ [...]
##END NTUPLES=NMR SPECTRUM
##END=
