##TITLE=1H_EC-3327(1)
 CDCl3
 8 sc, 
 3.5.2024
##JCAMPDX= 6.0         $$ Bruker NMR JCAMP-DX V2.0
##DATA TYPE= NMR SPECTRUM
##DATA CLASS= NTUPLES
##ORIGIN= UXNMR, Bruker Analytische Messtechnik GmbH
##OWNER= root
$$ XWIN-NMR		Version 3.5
$$ Fri May  3 14:29:39 2024 Russian Standard Time (UT+4h)  she@DPX200
##.OBSERVE FREQUENCY= 200.1309
##.OBSERVE NUCLEUS= ^1H
##.ACQUISITION MODE= SIMULTANEOUS
##.ACQUISITION SCHEME= undefined
##.AVERAGES= 8
##.DIGITISER RES= 18
##SPECTROMETER/DATA SYSTEM= spect
##.PULSE SEQUENCE= zg30
##.SOLVENT NAME= CDCl3
##.SHIFT REFERENCE= (INTERNAL, CDCl3, 0, 16.4554)
##AUDIT TRAIL= $$ (NUMBER, WHEN, WHO, WHERE, WHAT)
$$ ##TITLE= Audit trail, XWIN-NMR		Version 3.5
$$ ##JCAMPDX= 5.01
$$ ##ORIGIN= Bruker BioSpin GmbH
$$ ##OWNER= she
$$ F:/spectra/data/she/nmr/H-F/1/pdata/1/auditp.txt
$$ ##AUDIT TRAIL=  $$ (NUMBER, WHEN, WHO, WHERE, WHAT)
(   1,<2024-05-03 14:28:38.00 +0400>,<she>,<DPX200>,
      <created by zg, POWCHK disabled, PULCHK disabled
       configuration hash MD5:
       00 E9 B6 7A A2 85 ED C7 34 08 36 98 17 FE 4E 26
       data hash MD5: 16K
       1C E1 EA B0 19 D4 9A E6 46 40 02 CA 98 48 D5 C4>)
(   2,<2024-05-03 14:28:41.65 +0400>,<she>,<DPX200>,
      <Start of raw data processing
       efp BC_mod = 2 LB = 0.24 FT_mod = 6 PKNL = 1 PHC0 = -25297.46 PHC1 = 9.38731 SI = 16K 
       data hash MD5: 16K
       E8 AF 07 05 D1 B8 82 F3 94 1B 14 4D 70 D7 CD B7>)
(   3,<2024-05-03 14:28:56.92 +0400>,<she>,<DPX200>,
      <pk PHC0 = 1.911122 PHC1 = -2.2 
       data hash MD5: 16K
       CB 7D 70 48 3F 41 13 35 D3 00 70 BA 64 8A 50 B2>)
(   4,<2024-05-03 14:29:00.31 +0400>,<she>,<DPX200>,
      <abs ABSG = 5 
       data hash MD5: 16K
       D0 89 65 0F 3A 05 D5 B4 69 3C 53 6C A9 94 A1 F7>)
$$ ##END=
$$ 
$$ hash MD5
$$ 04 14 84 DF FC AB F6 0C 65 0B B6 F5 19 CE A8 10
##$RELAX= 
##$RELAX= 
##$RELAX= 
##$RELAX= 
##$RELAX= 
##$RELAX= 
$$ Bruker specific parameters
$$ --------------------------
##$DU= <F:/spectra>
##$EXPNO= 1
##$NAME= <H-F>
##$PROCNO= 1
##$TYPE= <nmr>
##$USER= <she>
##$AMP= (0..31)
100 100 100 100 100 100 100 100 100 100 100 100 100 100 100 100 100 100 
100 100 100 100 100 100 100 100 100 100 100 100 100 100 
##$AQSEQ= 0
##$AQ_mod= 1
##$AUNM= <au_zg>
##$AUTOPOS= <>
##$BF1= 200.13
##$BF2= 200.13
##$BF3= 200.13
##$BF4= 200.13
##$BF5= 200.13
##$BF6= 200.13
##$BF7= 200.13
##$BF8= 200.13
##$BYTORDA= 1
##$CFDGTYP= 0
##$CFRGTYP= 5
##$CHEMSTR= <none>
##$CNST= (0..31)
1 1 145 1 1 1 1 1 1 1 1 1 1 1 1 1 1 1 1 1 1 1 1 1 1 1 1 1 1 1 1 1 
##$CPDPRG= <>
##$CPDPRG1= <>
##$CPDPRG2= <>
##$CPDPRG3= <>
##$CPDPRG4= <mlev>
##$CPDPRG5= <mlev>
##$CPDPRG6= <mlev>
##$CPDPRG7= <mlev>
##$CPDPRG8= <mlev>
##$CPDPRGB= <>
##$CPDPRGT= <>
##$D= (0..31)
0 1.2 0 0 0 0 0 0 0 0.06 0 0.03 0 0 0 0 0.0002 0 0 0 0 0 0 0 0 0 0 0 0 
0 0 0 
##$DATE= 1714732117
##$DBL= (0..7)
120 120 120 120 120 120 120 120 
##$DBP= (0..7)
150 150 150 150 150 150 150 150 
##$DBP07= 0
##$DBPNAM0= <>
##$DBPNAM1= <>
##$DBPNAM2= <>
##$DBPNAM3= <>
##$DBPNAM4= <>
$$ [...]
##$SUBNAM3= <"">
##$SUBNAM4= <"">
##$SUBNAM5= <"">
##$SUBNAM6= <"">
##$SUBNAM7= <"">
##$SUBNAM8= <"">
##$SUBNAM9= <"">
##$SW= 18.0517689322627
##$SWIBOX= (0..15)
0 0 2 0 0 0 0 0 0 0 0 0 0 0 0 0 
##$SW_h= 3612.71676300578
##$TD= 16384
##$TD0= 1
##$TE= 0
##$TE2= 300
##$TE3= 300
##$TEG= 300
##$TL= (0..7)
0 120 120 120 120 120 120 120 
##$TP= (0..7)
150 150 150 150 150 150 150 150 
##$TP07= 0
##$TPNAME0= <>
##$TPNAME1= <>
##$TPNAME2= <>
##$TPNAME3= <>
##$TPNAME4= <>
##$TPNAME5= <>
##$TPNAME6= <>
##$TPNAME7= <>
##$TPOAL= (0..7)
0.5 0.5 0.5 0.5 0.5 0.5 0.5 0.5 
##$TPOFFS= (0..7)
0 0 0 0 0 0 0 0 
##$TUNHIN= 0
##$TUNHOUT= 0
##$TUNXOUT= 0
##$USERA1= <user>
##$USERA2= <user>
##$USERA3= <user>
##$USERA4= <user>
##$USERA5= <user>
##$V9= 5
##$VALIST= <valist>
##$VCLIST= <CCCCCCCCCCCCCCC>
##$VD= 0
##$VDLIST= <DDDDDDDDDDDDDDD>
##$VPLIST= <PPPPPPPPPPPPPPP>
##$VTLIST= <TTTTTTTTTTTTTTT>
##$WBST= 1024
##$WBSW= 4
##$XGAIN= (0..3)
0 0 0 0 
##$XL= 0
##$YL= 0
##$YMAX_a= 335990
##$YMIN_a= -499035
##$ZGOPTNS= <>
##$ZL1= 120
##$ZL2= 120
##$ZL3= 120
##$ZL4= 120
##$ABSF1= 16.40691
##$ABSF2= -1.644993
##$ABSG= 5
##$ABSL= 3
##$ALPHA= 0
##$AQORDER= 0
##$ASSFAC= 0
##$ASSFACI= 0
##$ASSFACX= 0
##$ASSWID= 0
##$AUNMP= <proc_1d>
##$AZFE= 0.1
##$AZFW= 0.1
##$BCFW= 0
##$BC_mod= 2
##$BYTORDP= 0
##$COROFFS= 0
##$CY= -3
##$DATMOD= 1
##$DC= 0
##$DFILT= <>
##$DTYPP= 0
##$F1P= 0
##$F2P= 0
##$FCOR= 1
##$FTSIZE= 16384
##$FT_mod= 6
##$GAMMA= 0
##$GB= 0
##$INTBC= 1
##$INTSCL= 3.70164e-10
##$ISEN= 128
##$LB= 0.24
##$LEV0= 0
##$LPBIN= 0
##$MAXI= 10000
##$MC2= 0
##$MEAN= 0
##$ME_mod= 0
##$MI= 1.114404
##$NCOEF= 0
##$NC_proc= -7
##$NLEV= 6
##$NOISF1= 3.799351
##$NOISF2= 2.8
##$NSP= 0
##$NTH_PI= 0
##$NZP= 0
##$OFFSET= 16.45539
##$PC= 1
##$PHC0= -25295.55
##$PHC1= 7.18731
##$PH_mod= 1
##$PKNL= yes
##$PPARMOD= 0
##$PSCAL= 0
##$PSIGN= 0
##$REVERSE= no
##$SF= 200.129413150178
##$SI= 16384
##$SIGF1= 3
##$SIGF2= 2
##$SINO= 5.538805
##$SIOLD= 16384
##$SREGLST= <1H.CDCl3>
##$SSB= 0
##$STSI= 16384
##$STSR= 0
##$SW_p= 3612.71676300577
##$SYMM= 0
##$S_DEV= 0
##$TDeff= 16384
##$TDoff= 0
##$TI= <>
##$TILT= no
##$TM1= 0
##$TM2= 0
##$TOPLEV= 0
##$USERP1= <user>
##$USERP2= <user>
##$USERP3= <user>
##$USERP4= <user>
##$USERP5= <user>
##$WDW= 1
##$XDIM= 16384
##$YMAX_p= 502520438
##$YMIN_p= -773675
$$ End of Bruker specific parameters
$$ ---------------------------------
##NTUPLES= NMR SPECTRUM
##VAR_NAME=  FREQUENCY,     SPECTRUM/REAL,   SPECTRUM/IMAG
##SYMBOL=    X,             R,               I
##VAR_TYPE=  INDEPENDENT,   DEPENDENT,       DEPENDENT
##VAR_FORM=  AFFN,          ASDF,            ASDF
##VAR_DIM=   16384,         16384,           16384
##UNITS=     HZ,            ARBITRARY UNITS, ARBITRARY UNITS
##FACTOR=    0.220516191357247, 1,           1
##FIRST=     3293.20773001284, 0,            0
##LAST=      -319.509032992929, 0,           0
##MIN=       -319.509032992929, -773675,     0
##MAX=       3293.20773001284, 502520438,    0
$$ Real data points
##PAGE= N=1
##DATA TABLE= (X++(R..R)), XYDATA
$$ [...]
$$ plain form
5329 124661501 114253333 106493335 100680313 96254284 93124749 91154644 90217995 90259074
5321 90259074 91197421 93540678 96860156 101296151 106924637 113576265 121667275 130093000
5313 130093000 138019037 143360180 144457534 139396533 129924439 117806559 105103770 93108752
5305 93108752 82320113 73380771 65911902 59686251 54489477 50099076 46328456 43136980
5297 43136980 39902811 37377940 35156579 33454268 31809058 30497524 29398529 28206113
5289 28206113 26713756 25443137 24269005 22695233 21365226 20466906 19422984 18602992
5281 18602992 17889473 17215232 16496824 15813406 15141639 14477275 14040997 13418423 12937709
5272 12937709 12597458 12541335 12060726 11567075 11003788 10929772 10281521 10157804 10167522 10013062
$$ packed form
5329A24661501j0408168p759998n813022m426029l129535j970105r36649M1079
5321I0259074R38347K343257L319478M435995N628486O651628Q091010Q425725
5313A30093000P926037N341143J097354n061001r472094j2117880j2702789j1995018
5305I3108752j0788639q939342p468869o225651n196774m390401l770620l191476
5297D3136980l234169k524871k221361j702311j645210j311534j098995j192416
5289B8206113j492357j270619j174132j573772j330007q98320j043922q19992
5281A8602992p13519o74241p18408o83418o71767o64364m36278o22574m80714
5272A2937709l40251n6123m80609m93651n63287p4016o48251j23717R718j54460
$$ plain form
5262 10013062 9713933 9138138 8833882 8665629 8455255 8419143 8221756 8255801 8068932 7868441
5252 7868441 7545771 7387696 7138507 6826589 6664397 6712669 6607722 6519018 6473463 6346396
5242 6346396 6336722 6018365 5605959 5454400 5583406 5507034 5354300 5476562 5338280 5336111
5232 5336111 5351532 5246755 5203399 4659771 4672361 4721188 4870704 4922419 4661374 4656466 4765497
5221 4765497 4308484 4551772 4635933 4759896 4729640 4712928 4692140 4923976 4438343 4417207
5211 4417207 4414516 4393606 4526905 4561770 4246903 4126526 4104808 4045976 4064369 4049814 3821629
5200 3821629 3809980 3863113 3572350 3687879 3627781 3616587 3614065 3679161 3663092 3839246 3738507
5189 3738507 3426831 3419033 3643920 3507645 3415653 3409561 3204168 3229017 3386708 3535372 3526786
$$ packed form
5262A0013062k99129n75795l04256j68253k10374l6112j97387L4045j86869k00491
5252G868441l22670j58075k49189l11918j62192M8272j04947q8704m5555j27067
5242F346396r674l18357m12406j51559J29006p6372j52734J22262j38282k169
5232E336111J5421j04777m3356n43628J2590M8827J49516N1715k61045m908J09031
5221D765497m57013K43288Q4161J23963l0256j6712k0788K31836m85633k1136
5211D417207k691k0910J33299L4865l14867j20377k1718n8832J8393j4555k28185
5200C821629j1649N3133k90763J15529o0098j1194k522O5096j6069J76154j00739
5189C738507l11676p798K24887j36275r1992o092k05393K4849J57691J48664q586
$$ plain form
5178 3526786 3380215 3382024 3539006 3497311 3365503 3346629 3412957 3440723 3349758 3435362 3316184
5167 3316184 3378075 3486541 3634803 3585359 3443555 3666111 3440181 3358435 3600192 3542570
5157 3542570 3293196 3498746 3508114 3387780 3431513 3451937 3467504 3440326 3685453 3690073 3658612
5146 3658612 3498122 3467388 3430919 3272839 3169620 3062362 3313890 3468674 3298390 3086151
5136 3086151 3205950 3074933 3167004 3230860 2930646 3172062 3190451 3106188 3096810 3115576 2830376
5125 2830376 2786159 3002933 2995258 2616408 2508348 2701589 2608815 2733530 2825272 2884713 2920455
5114 2920455 2747202 2613234 2824159 3017015 3285806 3160789 2881413 2734713 2898514 3001048
5104 3001048 2871697 3078454 3089506 3271536 3211631 3227120 3153601 3169933 3117311 3019283 3316654
$$ packed form
5178C526786j46571J809J56982m1695j31808j8874O6328K7766r0965Q5604j19178
5167C316184O1891J08466J48262m9444j41804K22556k25930q1746K41757n7622
5157C542570k49374K05550R368j20334M3733K0424J5567k7178K45127M620l1461
5146C658612j60490l0734l6469j58080j03219j07258K51528J54784j70284k12239
5136C086151J19799j31017R2071O3856l00214K41416J8389q4263r378J8766k85200
5125B830376m4217K16774p675l78850j08060J93241r2774J24715R1742N9441L5742
5114B920455j73253j33968K10925J92856K68791j25017k79376j46700J63801J02534
5104C001048j29351K06757J1052J82030n9905J5489p3519J6332n2622r8028K97371
$$ plain form
5093 3316654 3527889 3406565 3161542 3236582 3422780 3573358 3682394 3664315 4109962 4086379
5083 4086379 3878671 3959588 3841851 3895081 3870671 3661034 3631124 3640987 3598138 3626061 3700928
5072 3700928 3657707 3825783 4120333 4002553 4164200 4400589 4615794 4672372 4556763 4723300
5062 4723300 4982273 4968980 4865958 5166876 5441421 5492560 5663023 5597630 5048052 5209465
5052 5209465 5284287 5231830 4971262 5202960 5105909 4970880 5054299 4793596 4792992 4863836 5086836
5041 5086836 5388639 5445589 5457331 5446750 5677747 6150775 6197189 6286101 6025054 6096401 6228736
5030 6228736 6406403 6340173 6350702 6769948 7036255 6698986 6348025 6395747 6300093 6261067
5020 6261067 6251227 6266840 6512382 6466102 6543249 6692411 6713906 7103641 7347641 7389391 7625800
$$ packed form
5093C316654K11235j21324k45023P5040J86198J50578J09036j8079M45647k3583
5083D086379k07708Q0917j17737N3230k4410k09637k9910R863m2849K7923P4867
5072C700928m3221J68076K94550j17780J61647K36389K15205N6578j15609J66537
5062D723300K58973j3293j03022L00918K74545N1139J70463o5393n49578J61413
5052E209465P4822n2457k60568K31698r7051j35029Q3419k60703o04P0844K23000
5041E086836L01803N6950J1742j0581K30997M73028M6414Q8912k61047P1347J32335
5030F228736J77667o6230J0529M19246K66307l37269l50961M7722r5654l9026
5020F261067r840J5613K45542m6280P7147J49162K1495L89735K44000M1750K36409
$$ plain form
5009 7625800 8117388 8246920 8353931 8857470 9023713 9796924 10375632 11129331 11990901 12348176
4999 12348176 12952554 13203388 12953890 12668005 11940250 11336696 11102396 10704985 10349834
4990 10349834 10245070 10155247 9888288 9966086 10167551 10240101 10241159 10156410 10318364 10547998
4980 10547998 10671389 10863335 10885468 10913034 11223667 11741032 12224322 12582001 12736314 13035930
4970 13035930 13456670 14243469 14959896 15468129 15904430 16454955 17247415 18102586 18769303
4961 18769303 19568160 20953163 21809371 22924247 24196155 25677768 27776574 29886446
4953 29886446 32003853 33607883 34430352 34507710 33769532 32483316 31239123 30222462 29413934
4944 29413934 29021155 28658965 28780948 29034293 29409387 30288687 31179358 32205352 33716879
$$ packed form
5009G625800M91588J29532J07011N03539J66243P73211N78708P53699Q61570L57275
4999A2348176O04378K50834k49498k85885p27755o03554k34300l97411l55151
4990A0349834j04764q9823k66959P7798K01465P2550J058q4749J61954K29634
4980A0547998J23391J91946K2133K7566L10633N17365M83290L57679J54313K99616
4970A3035930M20740P86799P16427N08233M36301N50525P92460Q55171O66717
4961A8769303P98857J385003Q56208J114876J271908J481613K098806K109872
4953B9886446K117407J604030Q22469P7358p38178j286216j244193j016661q08528
4944B9413934l92779l62190J21983K53345L75094Q79300Q90671J025994J511527
$$ plain form
4935 33716879 35573741 37325653 39515896 41802031 44316111 47302847 50903431 55216437
4927 55216437 60310251 65666159 71443356 76193756 78444326 77812107 74794806 70009790
4919 70009790 64719955 59580102 55103273 51591653 48513733 46278745 44642778 43833052
4911 43833052 43264647 42862459 43382169 44284972 45201678 46762803 48835686 51143186 53623515
4902 53623515 56289912 59095682 62687091 66782387 71315267 75858460 80529275 83834643
4894 83834643 83923144 80776146 75186763 68410960 62003682 56090970 51289879 47261052
4886 47261052 44227096 41754830 39829071 38440620 37296727 36629430 36429472 36465469 36787144
4877 36787144 37527154 38198656 39142850 39967975 40316184 40403084 40448770 40623809 41031270 41776064
$$ packed form
4935C3716879J856862J751912K190243K286135K514080K986736L600584M313006
4927E5216437N093814N355908N777197M750400K250570o32219l017301m785016
4919G0009790n289835n139853m476829l511620l077920k234988j635967q09726
4911D3833052n68405m02188N19710R02803R16706J561125K072883K307500K480329
4902E3623515K666397K805770L591409M095296M532880M543193M670815L305368
4894H3834643Q8501l146998n589383o775803o407278n912712m801091m028827
4886D7261052l033956k472266j925759j388451j143893o67297j99958L5997L21675
4877C6787144P40010O71502R44194Q25125L48209Q6900M5686J75039M07461P44794
$$ plain form
4867 41776064 42115861 41736455 40463131 38210077 35552192 32735230 30644291 29054600
4859 29054600 27707933 26280999 25153018 24327513 23797808 23260943 22744538 22321830 22431799
4850 22431799 22508816 22651074 22806064 22823453 22787412 22708732 22092011 21410241 20897495 20188359
4840 20188359 19899519 19760217 19563655 19487637 19563390 19715418 19614955 19654388 19767432 19699544
4830 19699544 19748671 19667388 19485814 19599354 19909318 20089824 20184637 20345458 20339442 20608834
4820 20608834 21027049 21612689 21798143 22070537 22419171 22865195 23221906 23620869 23855257
4811 23855257 24228963 24680930 25208126 25960369 26565904 27149300 27475094 27515184 28069350 28546697
4801 28546697 28949591 29487369 30142014 30770536 31098069 31332037 32015288 32906275 33695664
$$ packed form
4867D1776064L39797l79406j273324k253054k657885k816962k090939j589691
4859B9054600j346667j426934j127981q25505n29705n36865n16405m22708J09969
4850B2431799P7017J42258J54990J7389l6041p8680o16721o81770n12746p09136
4840B0188359k88840j39302j96562p6018P5753J52028j00463L9433J13044o7888
4830A9699544M9127q1283j81574J13540L09964J80506R4813J60821o016K69392
4820B0608834M18215N85640J85454K72394L48634M46024L56711L98963K34388
4811B3855257L73706M51967N27196P52243O05535N83396L25794M0090N54166M77347
4801B8546697M02894N37778O54645O28522L27533K33968O83251Q90987P89389
$$ plain form
4792 33695664 34565027 35247978 36512351 37717680 38960966 40237850 41813490 43170257
4784 43170257 44735489 46549263 48789802 51172901 53734018 56535968 59708050 63232823
4776 63232823 67099922 71769042 76916207 82405746 88871901 96524387 106094538 116912668
4768 116912668 128984916 141628274 153320052 161932629 164472797 160257303 151839210 141646565
4760 141646565 130920068 121565134 114077055 108228146 104311053 101881717 100781885 101155704
4752 101155704 102760803 105410168 109118342 113697741 119484475 126465312 135136161 146131465
4744 146131465 160038517 176853651 196759341 219717809 243313009 263001147 270625536
4737 270625536 263108708 244767167 221336504 196755348 174283897 154924915 138885457
$$ packed form
4792C3695664Q69363O82951J264373J205329J243286J276884J575640J356767
4784D3170257J565232J813774K240539K383099K561117K801950L172082L524773
4776F3232823L867099M669120N147165N489539O466155P652486R570151J0818130
4768A16912668J2072248J2643358J1691778Q612577K540168m215494q418093j0192645
4760A41646565j0726497r354934p488079n848909l917093k429336j099832L73819
4752A01155704J605099K649365L708174M579399N786734O980837Q670849J0995304
4744A46131465J3907052J6815134J9905690K2958468K3595200J9688138P624389
4737B70625536p516828j8341541k3430663k4581156k2471451j9358982j6039458
$$ plain form
4730 138885457 126023979 116062287 108331148 102612693 98485037 95205407 92963199 91742548
4722 91742548 91175571 91925064 93539778 95975744 99824275 104676038 110811388 118461686
4714 118461686 126565820 133840486 138568200 138741666 133695913 124127825 113052466 101704985
4706 101704985 91211124 82091730 74661865 68600414 63347302 59157582 55743246 53017730
4698 53017730 50611717 48416752 46592176 44889776 43345015 42137626 41385860 40640282
4690 40640282 40302019 40214993 39912196 39491463 39230256 39326701 39535570 39908075 40126937 39552584
4680 39552584 38771800 38063840 37849876 37513904 36935675 36617172 36314228 36353007 36365333 36496518
4670 36496518 36779972 37252173 37569289 37456537 37994947 38646518 39068290 39662544 40694045
$$ packed form
4730A38885457j2861478r961692p731139n718455m127656l279630k242208j220651
4722I1742548n66977P49493J614714K435966L848531M851763O135350P650298
4714A18461686Q104134P274666M727714J73466n045753r568088j1075359j1347481
4706A01704985j0493861r119394p429865o061451n253112m189720l414336k725516
4698E3017730k406013k194965j824576j702400j544761j207389p51766p45578
4690D0640282l38263q7026l02797m20733k61207R6445K08869L72505K18862n74353
4680C9552584p80784p07960k13964l35972n78229l18503l02944L8779J2326J31185
4670C6496518K83454M72201L17116j12752N38410O51571M21772N94254J031501
$$ plain form
4661 40694045 41470473 42557602 43938694 45414807 46902327 48397979 49856914 50787729
4653 50787729 51062343 50873449 50997771 51514691 51985065 52496229 52982301 54129195 55601783
4644 55601783 57218183 59143408 61228791 63397795 65757202 68391561 71546474 75095497
4636 75095497 78692794 83049722 88423421 95049318 103165343 113471781 125710254 139551597
4628 139551597 153787654 166000485 169418353 163153296 151991370 140555486 130764725
4621 130764725 123151973 116956594 111766144 107705272 104811595 102180861 99500810 97353378
4613 97353378 96011131 95049439 94727037 94782851 95315047 96974908 99710851 103094156 106506558
4604 106506558 110187539 113475498 116583195 120427523 124962885 130882004 137510836 144690950
$$ packed form
4661D0694045P76428J087129J381092J476113J487520J495652J458935R30815
4653E0787729K74614j88894J24322N16920M70374N11164M86072J146894J472588
4644E5601783J616400J925225K085383K169004K359407K634359L154913L549023
4636G5095497L597297M356928N373699O625897Q116025J0306438J2238473J3841343
4628A39551597J4236057J2212831L417868o265057j1161926j1435884r790761
4621A30764725p612752o195379n190450m060872k893677k630734k680051k147432
4613I7353378j342247r61692l22402N5814N32196J659861K735943L383305L412402
4604A06506558L680981L287959L107697L844328M535362N919119O628832P180114
$$ plain form
4596 144690950 152987017 161901316 171808282 182254109 194185817 208784928 225497633
4589 225497633 241653563 256888566 273170685 291329928 310616687 329284711 343902085
4582 343902085 347384807 336950824 319031978 301237773 287477781 278792043 275981956
4575 275981956 278968988 285786385 293024693 295527307 287914346 268962394 243918276 217058321
4567 217058321 192233193 170640698 152681888 138328104 127205703 118194551 111030263
4560 111030263 105396783 100435752 96287366 92309267 88587749 85599695 82752655 80373141
4552 80373141 78406190 76835954 75946765 74953672 74339375 74006770 73486731 72329047 70684162
4543 70684162 68300642 65549740 62783825 59952247 57009512 54320267 51524864 49291512
$$ packed form
4596A44690950Q296067Q914299R906966J0445827J1931708J4599111J6712705
4589B25497633J6155930J5235003J6282119J8159243J9286759J8668024J4617374
4582C43902085L482722j0433983j7918846j7794205j3759992q685738k810087
4575B75981956K987032O817397P238308K502614p612961j8951952k5044118k6859955
4567B17058321k4825128k1592495j7958810j4353784j1122401r011152p164288
4560A11030263n633480m961031m148386l978099l721518k988054k847040k379514
4552H0373141j966951j570236q89189r93093o14297l32605n20039j157684j644885
4543G0684162k383520k750902k765915k831578k942735k689245k795403k233352
$$ plain form
4535 49291512 47008187 45426184 43920218 42556639 41537909 40629523 39651577 38901968 38179784
4526 38179784 37474601 36910003 35966251 35468439 35127352 34638690 34185669 33724222 33547204
4517 33547204 33407029 33693220 33523252 33404048 33410887 33556414 33632506 33764745 34220958 34496313
4507 34496313 35000414 35119106 35220231 35547878 35825543 36407932 36654371 37032945 37716310
4498 37716310 38546904 39547546 40479516 41830327 43107120 44884352 47145175 49821267
4490 49821267 52317063 54249723 54621737 53563405 52194762 50875076 49959849 49182376 49044142
4481 49044142 49148674 49194031 49564187 49993207 50246756 50442830 51086264 52073057 53096017
4472 53096017 54158239 55420954 57174087 58577260 60078364 61598149 62926145 65052703
$$ packed form
4535D9291512k283325j582003j505966j363579j018730r08386r77946p49609p22184
4526C8179784p05183n64598r43752m97812l41087m88662m53021m61447j77018
4517C3547204j40175K86191j69968j19204O839J45527P6092J32239M56213K75355
4507C4496313N04101J18692J01125L27647K77665N82389K46439L78574O83365
4498C7716310Q30594J000642R31970J350811J276793J777232K260823K676092
4490D9821267K495796J932660L72014j058332j368643j319686r15227p77473j38234
4481D9044142J04532M5357L70156M29020K53549J96074O43434R86793J022960
4472E3096017J062222J262715J753133J403173J501104J519785J327996K126558
$$ plain form
4464 65052703 66930692 69294559 72108669 75228796 78210348 81501124 84816738 88266528
4456 88266528 92337247 97401227 104108534 112256934 121676930 131753128 143236609 156091114
4448 156091114 170480671 187435603 208142253 233611181 265548334 305104500 352613658
4441 352613658 406393884 461191469 500470802 502520438 467908252 415162434 358582212
4434 358582212 305805278 259959351 222127726 192268302 169236881 150984969 136053395
4427 136053395 123116319 111572507 101386504 92586756 84904543 78480128 73220429 68784902
4419 68784902 65459716 62020701 58661022 55594424 52966025 50541486 48323055 46613491
4411 46613491 45159840 44060728 42719807 40965098 39545108 37762820 35861105 34625749
$$ packed form
4464F5052703J877989K363867K814110L120127K981552L290776L315614L449790
4456H8266528M070719N063980O707307Q148400R419996J0076198J1483481J2854505
4448A56091114J4389557J6954932K0706650K5468928L1937153L9556166M7509158
4441C52613658N3780226N4797585L9279333K049636l4612186n2745818n6580222
4434C58582212n2776934m5845927l7831625k9859424k3031421j8251912j4931574
4427A36053395j2937076j1543812j0186003q799748p682213o424415n259699m435527
4419F8784902l325186l439015l359679l066598k628399k424539k218431j709564
4411D6613491j453651j099112j340921j754709j419990j782288j901715j235356
$$ plain form
4403 34625749 33764534 33241483 33205758 33376126 33962671 34630306 35122891 34988770 33912466
4394 33912466 32351872 30394494 28465592 26900074 25757925 24535546 23421243 22210982
4386 22210982 21176049 20513141 19886621 19370312 18930441 18552521 18115690 17752219 17494771
4377 17494771 17418184 17244558 16907485 17054196 17342124 17717905 17963439 18193908 18417722 18724856
4367 18724856 19408970 20378311 21414057 22325063 22515842 21851640 20320495 18844226 17380784
4358 17380784 15723906 14507842 13399539 12963697 12252286 11842231 11194206 10709686 10304111
4349 10304111 10054869 9659443 9395934 9313137 9333740 9203138 9155903 9141796 9414631 9464739
4339 9464739 9415487 9233360 9461419 10107529 10136732 10455765 10918370 11446951 11349603 11196743
$$ packed form
4403C4625749q61215n23051l5725J70368N86545O67635M92585j34121j076304
4394C3912466j560594j957378j928902j565518j142149j222379j114303j210261
4386B2210982j034933o62908o26520n16309m39871l77920m36831l63471k57448
4377A7494771p6587j73626l37073J46711K87928L75781K45534K30469K23814L07134
4367A8724856O84114R69341J035746R11006J90779o64202j531145j476269j463442
4358A7380784j656878j216064j108303m35842p11411m10055o48025m84520m05575
4349A0304111k49242l95426k63509q2797K0603j30602m7235j4107K72835N0108
4339I464739m9252j82127K28059O46110K9203L19033M62605N28581r7348j52860
$$ plain form
4329 11196743 10550351 9971127 9704515 9322207 9141765 8948618 8880558 8570666 8116440 7850551
4319 7850551 7342352 7190700 7173027 7068433 6945775 6855984 6497688 6393605 6283353 5799811
4309 5799811 5856685 5801092 5827000 6070245 6098623 5951382 5922400 6076384 5980805 5905215 5847582
4298 5847582 5990064 6043918 6081967 6212784 6400885 6532430 6687553 6867444 6846524 6824935
4288 6824935 6912877 6683131 6849356 6800972 6587155 6370644 6396861 6186499 5812651 5594887
4278 5594887 5429699 5493848 5376387 5065012 4566809 4895578 4782194 4638302 4670280 4491922
4268 4491922 4676225 4943789 5022611 5171979 5403766 5528721 5612469 5358521 5459158 5475531
4258 5475531 5591734 5806765 5913244 6125572 6134233 6303791 5968120 5219334 4749443 4667632
$$ packed form
4329A1196743o46392n79224k66612l82308j80442j93147o8060l09892m54226k65889
4319G850551n08199j51652j7673j04594j22658q9791l58296j04083j10252m83542
4309E799811N6874n5593K5908K43245K8378j47241k8982J53984r5579p5590n7633
4298E847582J42482N3854L8049J30817J88101J31545J55123J79891k0920k1589
4288F824935Q7942k29746J66225m8384k13817k16511K6217k10362l73848k17764
4278E594887j65188O4149j17461l11375m98203L28769j13384j43892L1978j78358
4268D491922J84303K67564P8822J49368K31787J24955Q3748k53948J00637J6373
4258E475531J16203K15031J06479K12328Q661J69558l35671p48786m69891q1811
$$ plain form
4248 4667632 4830482 4807488 4915166 4619385 4540992 4347572 4164165 4048557 4054155 3867796
4238 3867796 3889896 4013945 3699536 3657967 3454900 3485545 3758527 3848602 3838330 3990002
4228 3990002 4049655 3805815 3774289 3564837 3369710 3500707 3655441 3684119 3790201 4062721
4218 4062721 3801389 3324716 3291511 3354104 3177462 3024654 3095893 3211558 3328440 3212470
4208 3212470 3033260 3207680 3313817 3233405 3158874 2986587 2957419 3078245 3245165 3061546
4198 3061546 3078364 3202231 3112133 3100572 2980714 3069549 3337453 3546250 3494214 3487171 3337442
4187 3337442 3020319 2723578 2835512 2971213 3053615 3068503 3029345 3143261 3095175 3271148
4177 3271148 3374536 3032544 3071078 3063178 3050337 3143716 3261316 3157845 3164633 3314853 3497676
$$ packed form
4248D667632J62850k2994J07678k95781p8393j93420j83407j15608N598j86359
4238C867796K2100J24049l14409m1569k03067L0645K72982R0075j0272J51672
4228C990002N9653k43840l1526k09452j95127J30997J54734K8678J06082K72520
4218D062721k61332m76673l3205O2593j76642j52808P1239J15665J16882j15970
4208C212470j79210J74420J06137q0412p4531j72287k9168J20826J66920j83619
4198C061546J6818J23867r0098j1561j19858Q8835K67904K08797n2036p043j49729
4187C337442l17123k96741J11934J35701Q2402J4888l9158J13916m8086J75973
4177C271148J03388l41992L8534p900j2841R3379J17600j03471O788J50220J82823
$$ plain form
4166 3497676 3319215 3402404 3447293 3511355 3535260 3578193 3750681 3793555 3697122 3765895 3745846
4155 3745846 3551681 3840595 4025519 3901865 3983552 4207235 4018664 4437126 4452380 4197458
4145 4197458 4760228 4757808 4596939 5001974 5300608 5344958 5571602 5752526 5871573 5905314
4135 5905314 6131768 6198233 6676770 6690471 6480230 6654294 6735611 6655007 6962491 7137482
4125 7137482 7148680 7363494 7347280 7556274 7677320 8077066 8205429 8187160 8254056 8324520
4115 8324520 8563963 8843809 9084237 9472919 9827739 9925798 10226107 10377316 10755361 11188330
4105 11188330 11190272 11610916 12106547 12168364 12313164 12881274 13170225 13510566 14035518 14212437
4095 14212437 14676540 15285687 15567446 15901619 15956953 16194289 16637072 17436284 17979926 18549115
$$ packed form
4166C497676j78461Q3189M4889O4062K3905M2933J72488M2874r6433O8773k0049
4155C745846j94165K88914J84924j23654Q1687K23683j88571M18462J5254k54922
4145D197458N62770k420j60869M05035K98634M4350K26644J80924J19047L3741
4135E905314K26454O6465M78537J3701k10241J74064Q1317q0604L07484J74991
4125G137482J1198K14814j6214K08994J21046L99746J28363j8269O6896P0464
4115H324520K39443K79846K40428L88682L54820R8059L00309J51209L78045M32969
4105A1188330J942M20644M95631O1817J44800N68110K88951L40341N24952J76919
4095A4212437M64103O09147K81759L34173N5334K37336M42783P99212N43642N69189
$$ plain form
4085 18549115 19236655 19809385 20624341 21247253 22013073 23166485 24359711 25751993 27808793
4076 27808793 29969819 32372168 35358737 38673310 42552443 46546919 51353479 56794042
4068 56794042 63566682 72469003 84210700 99312622 116377742 132541679 142109286 142999130
4060 142999130 135167709 120217788 103143591 87465502 74425832 63819080 55631892
4053 55631892 49881100 45552466 42227494 39577748 37307626 35480782 33992648 32932761
4045 32932761 32040450 31580961 31676465 31900260 32375975 33698055 35357703 37132776 39172517
4036 39172517 41678861 44796874 48434356 53036238 58571863 65759276 74977488 87319372
4028 87319372 102097687 118218048 129500922 132488708 131290416 122737284 107165116 90384799
$$ packed form
4085A8549115O87540N72730Q14956O22912P65820J153412J193226J392282K056800
4076B7808793K161026K402349K986569L314573L879133L994476M806560N440563
4068E6794042O772640Q902321J1741697J5101922J7065120J6163937R567607Q89844
4060A42999130p831421j4949921j7074197j5678089j3039670j0606752q187188
4053E5631892n750792m328634l324972k649746k270122j826844j488134j059887
4045C2932761q92311m59489R5504K23795M75715J322080J659648J775073K039741
4036C9172517K506344L118013L637482M601882N535625P187413R218212J2341884
4028H7319372J4778315J6120361J1282874K987786j198292q553132j5572168j6780317
$$ plain form
4020 90384799 75297480 63088480 53617718 46382117 40963701 36458184 33105972 30183991
4012 30183991 27777528 25699906 23677283 21891196 20801785 19689347 18821681 18220765
4004 18220765 17303879 16665951 16243067 15435193 14700412 14219699 14019632 13743865 13524764
3995 13524764 13704218 13633035 13557611 13400438 13015637 12643684 12212318 11990273 12050921 12159831
3985 12159831 12598096 12556096 12474312 12677331 12966272 13003944 13025919 13098840 13118991 13395539
3975 13395539 13701952 14226141 14841073 15165464 15869500 17158958 18559722 20506346 23142446
3966 23142446 26651989 30985030 35750029 38947632 37489953 33221961 28641204 24107122
3958 24107122 20297598 17478535 15413487 13721503 12252960 11322162 10526047 9889642 9217273
$$ packed form
4020I0384799j5087319j2209000r470762p235601n418416m505517l352212k921981
4012C0183991k406463k077622k022623j786087j089411j112438q67666o00916
4004A8220765r16886o37928m22884q07874p34781m80713k00067k75767k19101
3995A3524764J79454p1183p5424j57173l84801l71953m31366k22045O0648J08910
3985A2159831M38265m2000q1784K03019K88941L7672K1975P2921K0151K76548
3975A3395539L06413N24189O14932L24391P04036J289458J400764J946624K636100
3966B3142446L509543M333041M764999L197603j457679m267992m580757m534082
3958B4107122l809524k819063k065048j691984j468543r30798p96115o36405o72369
$$ plain form
3949 9217273 9031914 8831192 8483430 8349231 8118694 7829362 7696407 7558062 7247199 7252652
3939 7252652 7285621 7060553 7221448 7283351 6936349 6665250 6515399 6169260 5925070 5951006
3929 5951006 5750250 5678121 5585536 5417169 5527162 5489150 5480911 5515482 5500340 5397934 5247907
3918 5247907 5344074 5487390 5774525 5958872 5693550 5762797 5642244 5819309 6096416 6211206
3908 6211206 6417976 6538515 6722399 6597330 6386227 6374240 6159268 5980676 5973687 5630427
3898 5630427 5422702 5007017 4725198 4199637 4037005 3945604 4097511 4169033 4219029 4357822
3888 4357822 4039757 4118814 4112497 4309942 4305632 4398119 4255520 3967501 3998371 3991295 3865076
3877 3865076 3910736 3759881 3881820 4053367 4201566 4353781 3999916 3602730 4057180 3827000
$$ packed form
3949I217273j85359k00722l47762j34199k30537k89332j32955j38345l10863N453
3939G252652L2969k25068J60895O1903l47002k71099j49851l46139k44190K5936
3929E951006k00756p2129r2585j68367J09993l8012q239L4571j5142j02406j50027
3918E247907R6167J43316K87135J84347k65322O9247j20553J77065K77107J14790
3908F211206K06770J20539J83884j25069k11103j1987k14972j78592o989l43260
3898E630427k07725m15685k81819n25561j62632r1401J51907P1522M9996J38793
3888D357822l18065P9057o317J97445m310R2487j42599k88019L0870p076j26219
3877C865076M5660j50855J21939J71547J48199J52215l53865l97186M54450k30180
$$ plain form
3867 3827000 3662915 3734027 3548585 3279403 3260581 3157140 2951539 2893041 2887001 2698413
3857 2698413 2405923 2671151 2651019 2403114 2379400 2471358 2402259 2514697 2599633 2632849 2440276
3846 2440276 2410592 2347810 2337824 2573496 2675481 2582792 2643570 2463330 2276199 2331994 2536698
3835 2536698 2357354 2460707 2488527 2574698 2671743 2395142 2464185 2887293 2651972 2507376
3825 2507376 2345852 2407702 2723777 2818357 2741087 2463444 2336979 2441109 2503596 2268453
3815 2268453 2355011 2418313 2485029 2541297 2516712 2667831 2659371 2903742 2736645 2442194 2384353
3804 2384353 2275145 2301913 2477253 2578232 2669951 2501109 2436787 2593070 2668315 2651886
3794 2651886 2592953 2395047 2604449 2719850 2684694 2723379 2806533 2906039 2956839 2901772 2871316
$$ packed form
3867C827000j64085P1112j85442k69182j8822j03441k05601n8498o040j88588
3857B698413k92490K65228k0132k47905k3714R1958o9099J12438Q4936L3216j92573
3846B440276k9684o2782r986K35672J01985r2689O0778j80240j87131N5795K04704
3835B536698j79344J03353K7820Q6171R7045k76601O9043M23108k35321j44596
3825B507376j61524O1850L16075R4580p7270k77643j26465J04130O2487k35143
3815B268453Q6558O3302O6716N6268k4585J51119q460K44371j67097k94451n7841
3804B384353j09208K6768J75340J00979R1719j68842o4322J56283P5245j6429
3794B651886n8933j97906K09402J15401l5156L8685Q3154R9506N0800n5067l0456
$$ plain form
3783 2871316 2915988 2987146 2970328 3122901 2821434 2852921 3140939 3131293 3144087 3061272 2811105
3772 2811105 2655916 2576216 2663460 2904410 2906842 2755341 2645197 2819580 2844797 2840671 2771441
3761 2771441 3042737 2956787 2973788 2997171 2889015 3165784 3161178 3322899 3343733 3369464 3524344
3750 3524344 3702466 3789983 4220947 4179048 3805310 4016449 3769230 3683608 3570708 3340957
3740 3340957 3384716 3350665 2995944 2924422 2878069 2814464 2756948 2712116 2634506 2603927 2487103
3729 2487103 2381142 2378939 2712047 2818809 2818764 2643033 2818665 2859157 2927967 2882996 3163176
3718 3163176 3245501 3400231 3642871 3476311 3405317 3575839 3839029 4311423 4426068 4670046
3708 4670046 4852506 4716962 4596416 4334694 3763973 3624090 3412285 3498202 3177719 2982041
$$ packed form
3783B871316M4672P1158j6818J52573l01467L1487K88018r646J2794q2815k50167
3772B811105j55189p9700Q7244K40950K432j51501j10144J74383K5217m126o9230
3761B771441K71296q5950J7001K3383j08156K76769m606J61721K0834K5731J54880
3750C524344J78122Q7517M30964m1899l73738K11139k47219q5622j12900k29751
3740C340957M3759l4051l54721p1522m6353o3605n7516m4832p7610l0579j16824
3729B487103j05961k203L33108J06762m5j75731J75632M0492O8810m4971K80180
3718C163176Q2325J54730K42640j66560p0994J70522K63190M72394J14645K43978
3708D670046J82460j35544j20546k61722n70721j39883k11805Q5917l20483j95678
$$ plain form
3698 2982041 3012304 2825985 2675825 2684118 2657116 2762178 2655999 2639133 2766459 2578056
3688 2578056 2829688 2642760 2580946 2401200 2299614 2443928 2615156 2467795 2198181 2290552
3678 2290552 2159305 1912737 2061166 2239961 2261938 2095634 2033794 2150618 2351524 2364150
3668 2364150 2245489 2027496 2239693 1940374 1908407 2025710 1877307 2072538 2146747 1869243
3658 1869243 1979331 2055120 1895455 1736475 1715734 1768618 1848329 1894581 2076723 2131529 1964091
3647 1964091 1935517 2088640 1970823 2144712 2049158 2156924 2030415 1865540 1810346 1748344
3637 1748344 1959659 2105610 1870661 1887503 2077568 2011070 2010267 1912136 2156417 2214977 2110262
3626 2110262 2441264 2264209 2219273 2414181 2394218 2172822 2151881 2223189 2177386 2216661 2032222
$$ packed form
3698B982041L0263j86319j50160Q293k7002J05062j06179j6866J27326j88403
3688B578056K51632j86928o1814j79746j01586J44314J71228j47361k69614R2371
3678B290552j31247k46568J48429J78795K1977j66304o1840J16824K00906J2626
3668B364150j18661k17993K12197k99319l1967J17303j48403J95231P4209k77504
3658A869243J10088P5789j59665j58980k0741N2884P9711M6252J82142N4806j67438
3647A964091k8574J53123j17817J73889r5554J07766j26509j64875n5194o2002
3637A748344K11315J45951k34949J6842J90065o6498q03r8131K44281N8560j04715
3626B110262L31002j77055m4936J94908j9963k21396k0941P1308m5803L9275j84439
$$ plain form
3615 2032222 2070681 1856868 2032906 2060047 1925918 1806217 1765273 1790825 1955409 2049099
3605 2049099 2046270 2121124 1946734 2078429 1858272 1851979 1687789 1721948 1855106 1966309 2086977
3594 2086977 1906924 2012343 1792738 1926728 1800179 1670124 1789902 1923059 1901264 1889115
3584 1889115 1792575 1823068 1846968 1873069 1859346 1913221 1937338 1842052 1844363 1790088 1779375 1968778
3572 1968778 1965681 1806559 1936913 1881460 1937736 2077276 2300852 2291680 2251868 2348151 2164037
3561 2164037 2243261 2333519 2519052 2820040 2761169 2614074 2550905 2638775 2797548 2500419
3551 2500419 2445600 2939053 3063962 2858177 2927734 3081886 2902374 2610455 2746886 2951702
3541 2951702 3071870 3371233 3348167 3026811 2658380 2731885 2943426 3177545 2923949 3053680
$$ packed form
3615B032222L8459k13813J76038K7141j34129j19701m0944K5552J64584R3690
3605B049099k829P4854j74390J31695k20157o293j64190L4159J33158J11203J20668
3594B086977j80053J05419k19605J33990j26549j30055J19778J33157k1795j2149
3584A889115r6540L0493K3900K6101j3723N3875K4117r5286K311n4275j0713J89403
3572A968778l097j59122J30354n5453N6276J39540K23576r172l9812R6283j84114
3561B164037P9224R0258J85533L00988n8871j47095o3169Q7870J58773k97129
3551B500419n4819M93453J24909k05785O9557J54152j79512k91919J36431K04816
3541B951702J20168K99363k3066l21356l68431P3505K11541K34119k53596J29731
$$ plain form
3531 3053680 2865550 2947473 3073982 3013958 3037721 3365908 3359047 3227643 3236825 3267878 3493305
3520 3493305 3383169 3521825 3496468 3657117 3558573 3525655 3266859 3330627 3394023 3542796
3510 3542796 3666896 3586039 3560763 3355639 3269376 3186781 3572953 3739269 3625046 3494009
3500 3494009 3340887 3431180 3618419 3944899 4089745 4126536 3942071 4307666 4628707 4362996
3490 4362996 4650442 4804700 4712285 4750263 4376839 4257984 4285231 4358565 4188872 4360968
3480 4360968 4543511 4737600 4698135 4727574 4849406 4628349 4574875 4625843 4565621 4614109 4353899
3469 4353899 4252495 4434914 4506758 4415894 4293199 4343435 4316751 4342266 4323415 4353205 4400749
3458 4400749 4442649 4493647 4658765 4644398 4424117 4794622 4957068 4783899 4738876 4709582
$$ packed form
3531C053680j88130Q1923J26509o0024K3763L28187o861j31404R182L1053K25427
3520C493305j10136J38656k5357J60649r8544l2918k58796O3768O3396J48773
3510C542796J24100q0857k5276k05124q6263q2595L86172J66316j14223j31037
3500C494009j53122R0293J87239L26480J44846L6791j84465L65595L21041k65711
3490D362996K87446J54258r2415L7978l73424j18855K7247P3334j69693J72096
3480D360968J82543J94089l9465K9439J21832k21057n3474N0968o0222M8488k60210
3469D353899j01404J82419P1844r0864j22695N0236k6684K5515j8851K9790M7544
3458D400749M1900N0998J65118j4367k20281L70505J62446j73169m5023k9294
$$ plain form
3448 4709582 4866294 4987311 5018223 5295837 5660985 5795836 6066125 6336680 6489416 6409726
3438 6409726 6747772 6978788 7349601 7609811 7728726 8050366 8542605 8846642 9095629 8992592
3428 8992592 8555320 8082238 7623225 7413251 6797955 6311087 6039302 5759477 5381371 5026858
3418 5026858 4867959 4716385 4564210 4538136 4287968 4406046 4202267 4223256 4306247 4269030
3408 4269030 4294816 4376648 4334337 4541485 4406490 4453835 4534152 4622590 4605050 4683105 5007040
3397 5007040 4663380 4594891 4616500 4668466 4702453 4829595 4512014 4796428 4769584 4676264 4731302
3386 4731302 4915140 4995269 5005490 4951263 5180677 5137702 5296720 5339224 5406632 5443898 5446017
3375 5446017 5423681 5313585 5417754 5440753 5323269 5525055 5375539 5475420 5368590 5302166
$$ packed form
3448D709582J56712J21017L0912K77614L65148J34851K70289K70555J52736p9690
3438F409726L38046K31016L70813K60210J18915L21640M92239L04037K48987j03037
3428H992592m37272m73082m59013k09974o15296m86868k71785k79825l78106l54513
3418E026858j58899j51574j52175k6074k50168J18078k03779K0989Q2991l7217
3408D269030K5786Q1832m2311K07148j34995M7345Q0317Q8438j7540P8055L23935
3397E007040l43660o8489K1609N1966L3987J27142l17581K84414k6844r3320N5038
3386D731302J83838Q0129J0221n4227K29414m2975J59018M2504O7408L7266K119
3375E446017k2336j10096J04169K2999j17484K01786j49516R9881j06830o6424
$$ plain form
3365 5302166 5351134 5362693 5469889 5509577 5569034 5446368 5496792 5574982 5608981 5590447 5577404
3354 5577404 5769034 5837293 5627987 5695982 5735390 5658537 5718864 5763220 5846336 5994085 6130628
3343 6130628 6271788 6192430 6162220 6419171 6629638 6719423 6754112 6730452 6868267 6675061
3333 6675061 6791066 6807350 6914545 7037988 7665837 7819547 7797784 7753340 7733216 7664788
3323 7664788 7621664 7743300 7742540 8254552 8237741 8268146 8782802 8930304 8959231 8742320 8881019
3312 8881019 8882716 8958806 9207453 9264133 9308798 9410071 9209739 8883186 9072502 9270523
3302 9270523 9454879 9442504 9101203 9013567 8820464 8662598 8805785 8826607 8630196 8660042
3292 8660042 8602704 8714378 8789696 8537090 8418161 8442183 8414211 8491219 8319881 8256139 8176677
$$ packed form
3365E302166M8968J1559J07196L9688N9457j22666N0424P8190L3999j8534j3043
3354E577404J91630O8259k09306O7995L9408p6853O0327M4356Q3116J47749J36543
3343F130628J41160p9358l0210K56951K10467Q9785L4689k3660J37815j93206
3333F675061J16005J6284J07195J23443O27849J53710k1763m4444k0124o8428
3323G664788m3124J21636p60N12012j6811L0405N14656J47502K8927k16911J38699
3312H881019J697P6090K48647N6680M4665J01273k00332l26553J89316J98021
3302I270523J84356j2375l41301q7636j93103j57866J43187K0822j96411K9846
3292H660042n7338J11674P5318k52606j18929K4022k7972P7008j71338o3742p9462
$$ plain form
3281 8176677 8098076 8185825 8082112 8231296 8161330 8068345 8142578 8255730 7992355 8108577
3271 8108577 8223661 7944494 7832264 7779474 7771524 7712888 7660456 7474003 7442348 7482483 7378696
3260 7378696 7450977 7636822 7363342 7231404 7394191 7377430 7049853 7139816 7056029 6843818
3250 6843818 7001669 6899142 6835470 6931286 6763890 6669861 6718226 6605491 6964731 6920844
3240 6920844 6718458 6879906 7081228 7122605 6867461 6781090 6934363 6792152 6680322 6426694
3230 6426694 6633580 6680552 6708401 6606105 6618679 6766228 6716587 6887180 6884726 6537376 6604527
3219 6604527 6719833 6939278 6924189 6895505 7039243 6964185 6950664 6772148 6915988 6876492
3209 6876492 6668031 6950398 7172321 7163736 7440134 7508963 7750329 7754033 7836383 7714485 7863790
$$ packed form
3281H176677p8601Q7749j03713J49184o9966r2985P4233J13152k63375J16222
3271H108577J15084k79167j12230n2790p950n8636n2432j86453l1655M0135j03787
3260G378696P2281J85845k73480j31938J62787j6761l27577Q9963q3787k12211
3250F843818J57851j02527o3672R5816j67396r4029M8365j12735L59240m3887
3240F920844k02386J61448K01322M1377k55144q6371J53273j42211j11830k53628
3230F426694K06886M6972K7849j02296J2574J47549m9641J70593k454l47350O7151
3219F604527J15306K19445j5089k8684J43738p5058j3521j78516J43840l9496
3209F876492k08461K82367K21923q585K76398O8829K41366L704Q2350j21898J49305
$$ plain form
3198 7863790 8179599 8111428 8226860 8610942 8396351 8229667 8352378 8439316 8283293 8352619
3188 8352619 8416924 8591663 8803112 8715704 8682278 8578175 8652987 8874905 8904363 8687033
3178 8687033 8812602 8568071 8404348 8355671 8143258 8197438 8255110 8203643 8326682 8463460
3168 8463460 8422090 8420749 8737301 8398930 8457633 8786319 9008783 9018589 8833080 8671019 8830666
3157 8830666 9045514 8810409 8609124 8865600 8651958 8591168 8935157 8787785 8863043 8710487
3147 8710487 8712897 8841309 8714128 8613656 8894514 9060732 9049497 9326134 9192648 9197452
3137 9197452 9024260 8984634 9137822 9180746 8645747 8803454 9149424 9003314 9075970 8992350
3127 8992350 9299739 9567912 9767026 9463219 9519663 9966226 9960959 9905254 9839164 9908139 9884147
$$ packed form
3198G863790L15809o8171J15432L84082k14591j66684J22711Q6938j56023O9326
3188H352619O4305J74739K11449q7408l3426j04103P4812K21918K9458k17330
3178H687033J25569k44531j63723m8677k12413N4180N7672n1467J23039J36778
3168H463460m1370j341L16552l38371N8703L28686K22464R806j85509j62061J59647
3157H830666K14848k35105k01285K56476k13642o0790L43989j47372P5258j52556
3147H710487K410J28412j27181j00472K80858J66218j1235K76637j33486M804
3137I197452j73192l9626J53188M2924n34999J57707L45970j46110P2656q3620
3127H992350L07389K68173J99114l03807N6444M46563n267n5705o6090O8975k3992
$$ plain form
3116 9884147 10095658 10417394 10406151 10212651 10071320 10206116 10284657 10213988 10009426 10073159
3106 10073159 10321629 10297751 10307177 10503900 10524157 10560595 10559437 10584280 10656854 10848505 10898508
3095 10898508 10922969 11027544 11073644 11239297 11453356 11445153 11630986 11836130 12106671 12091124
3085 12091124 12210528 12561138 12736165 12787557 12883597 12932388 13076247 13227856 13516025 13586979
3075 13586979 13787386 14053107 14342246 14658001 14939570 14959601 15092272 15137400 15470332 15755588
3065 15755588 15890299 16033135 16260450 16306611 16544218 16845995 17054692 17334624 17581175 17643358
3055 17643358 17796980 18295450 18403859 18683728 19409455 19776411 20038690 20514724 20882318
3046 20882318 21059503 21277721 22190070 22679092 23380423 23717525 23780336 24180875 24291047 24478232
$$ packed form
3116I884147K11511L21736j1243j93500j41331J34796P8541p0669k04562O3733
3106A0073159K48470k3878R426J96723K0257L6438j158K4843P2574J91651N0003
3095A0898508K4461J04575M6100J65653K14059q203J85833K05144K70541j5547
3085A2091124J19404L50610J75027N1392R6040M8791J43859J51609K88169P0954
3075A3586979K00407K65721K89139L15755K81569K0031J32671M5128L32932K85256
3065A5755588J34711J42836K27315M6161K37607L01777K08697K79932K46551O2183
3055A7643358J53622M98470J08409K79869P25727L66956K62279M76034L67594
3046B0882318J77185K18218R12349M89022P01331L37102O2811M00539J10172J87185
$$ plain form
3036 24478232 25078625 25691884 26295332 27019875 27804767 28154165 28518984 29386866 30566834
3027 30566834 31232675 32049426 33121468 34104126 35195405 36486295 37453549 38410814 39393195
3018 39393195 40388348 40979109 41635862 42089616 41814125 41376020 40729417 40010947 39157332
3009 39157332 38225643 37243383 36093526 35029322 34136807 33506998 32927649 32478872 31946171
3000 31946171 31621830 31080478 30646762 30146890 29838612 29441076 29535698 28924709 28505204 28547050
2990 28547050 28682141 28825626 28687481 28251263 28282463 28570381 28588635 28520479 28495769 28607649
2980 28607649 28227714 28325717 28132341 28393665 28377874 28491091 28470795 28593552 28703267 28595206
2970 28595206 28576589 28601014 28411506 28588299 28751991 28630679 28514818 28447248 28398053 28410522
$$ packed form
3036B4478232O00393O13259O03448P24543P84892L49398L64819Q67882J179968
3027C0566834O65841Q16751J072042R82658J091279J290890R67254R57265R82381
3018C9393195R95153N90761O56753M53754k75491m38105o46603p18470q53615
3009C9157332r31689r82260j149857j064204q92515o29809n79349m48777n32701
3000C1946171l24341n41352m33716m99872l08278l97536R4622o10989m19505M1846
2990B8547050J35091J43485j38145m36218L1200K87918J8254o8156k4710J11880
2980B8607649l79935R8003j93376K61324j5791J13217k0296J22757J09715j08061
2970B8595206j8617K4425j89508J76793J63692j21312j15861o7570m9195J2469
$$ plain form
2960 28410522 28342238 28236473 28089144 27940045 27789193 28044304 28184582 28079267 27718823 27574509
2950 27574509 27619465 27636301 27340930 27362289 27560393 27589052 27487110 27773642 27788395 27659212
2940 27659212 27862922 27664941 27821771 27675294 27659719 27667347 27776637 27816001 27997448 27892691
2930 27892691 27987618 28199606 28094656 28379270 28648659 29229027 29356954 29880684 30266330 30423299
2920 30423299 30691514 31232633 31651154 31937812 32224499 32267380 32326723 32778328 32904888 32967858
2910 32967858 32884788 33052650 33247716 33551644 33619121 33424480 33410911 33043639 33076385 33156953
2900 33156953 32998072 32951810 32694698 32252844 32010185 32162524 32171581 31836076 31360141 31015566
2890 31015566 30904874 30962228 30503219 30271033 29964323 29721727 29823631 29477715 29581414 29519704
$$ packed form
2960B8410522o8284j05765j47329j49099j50852K55111J40278j05315l60444j44314
2950B7574509M4956J6836k95371K1359J98104K8659j01942K86532J4753j29183
2940B7659212K03710j97981J56830j46477j5575P628J09290L9364J81447j04757
2930B7892691R4927K11988j04950K84614K69389N80368J27927N23730L85646J56969
2920C0423299K68215N41119M18521K86658K86687M2881N9343M51605J26560O2970
2910C2967858q3070J67862J95066L03928O7477j94641j3569l67272L2746Q0568
2900C3156953j58881m6262k57112m41854k42659J52339R057l35505m75935l44575
2890C1015566j10692N7354m59009k32186l06710k42596J01904l45916J03699o1710
$$ plain form
2880 29519704 29579237 29390881 29172537 29172373 29308010 28809299 28646504 28519467 28354236 28492614
2870 28492614 28239453 27973148 28263741 27982598 28180396 28153886 28100384 27985484 28106360 28134493
2860 28134493 28242988 28058606 27984265 28201322 28198239 28020464 28086591 27879574 27838222 27698242
2850 27698242 27249613 27161024 27365822 27121927 26906374 26820525 26682982 26809294 26955804 26787540
2840 26787540 26623814 26730629 26662707 26711693 26862040 26769096 26597037 26742266 26850952 26878781
2830 26878781 26936086 27216631 27311998 27296886 27254822 27331566 27211006 27003570 27077174 27155890 27201897
2819 27201897 27460036 27251312 26960333 26975574 26826563 26815053 26627740 26517121 26593977 26553366
2809 26553366 26791336 26510804 26910649 27172600 27269633 27422172 27304377 26967360 26893775 26983483
$$ packed form
2880B9519704N9533j88356k18344j64J35637m98711j62795j27037j65231J38378
2870B8492614k53161k66305K90593k81143J97798k6510n3502j14900J20876K8133
2860B8134493J08495j84382p4341K17057l083j77775O6127k07017m1352j39980
2850B7698242m48629q8589K04798k43895k15553q5849j37543J26312J46510j68264
2840B6787540j63726J06815o7922M8986J50347r2944j72059J45229J08686K7829
2830B6878781N7305K80545R5367j5112m2064P6744j20560k07436P3604P8716M6007
2819B7201897K58139k08724k90979J5241j49011j1510j87313j10619P6856m0611
2809B6553366K37970k80532L99845K61951R7033J52539j17795l37017p3585Q9708
$$ plain form
2799 26983483 27083550 27078347 27084361 27057001 27198639 27170538 27265001 27485777 27660148 27535531 27243437
2788 27243437 27151434 27445229 27465539 27356818 27354334 27319278 27426588 27504710 27582820 27408053 27487872
2777 27487872 27796263 27932807 27837631 27693025 27894035 28132966 28408956 28562221 28850097 28833374
2767 28833374 28769705 28866324 28578960 28872470 29210659 29254532 29520209 29543491 29740280 29719966
2757 29719966 29925089 30035732 30045358 30466596 30599104 30605832 30782742 31115651 31354408 31553011
2747 31553011 31963416 32147866 32385442 32500843 32689530 33027356 33198366 33566165 33917376
2738 33917376 34114531 34173817 34337451 34469401 34757231 35164227 35436770 35591912 35880268 36103468
2728 36103468 36641453 37004827 37266989 37474655 37654317 38137318 38755625 39231262 39520369
$$ packed form
2799B6983483J00067n203O014k7360J41638k8101R4463K20776J74371j24617k92094
2788B7243437r2003K93795K0310j08721k484l5056J07310P8122P8110j74767P9819
2777B7487872L08391J36544r5176j44606K01010K38931K75990J53265K87876j6723
2767B8833374o3669R6619k87364K93510L38189M3873K65677K3282J96789k0314
2757B9719966K05123J10643R626M21238J32508O728J76910L32909K38757J98603
2747C1553011M10405J84450K37576J15401J88687L37826J71010L67799L51211
2738C3917376J97155N9286J63634J31950K87830M06996K72543J55142K88356K23200
2728C6103468N37985L63374K62162K07666J79662M83001O18307M75637K89107
$$ plain form
2719 39520369 39916723 40555540 40916315 41126885 41837808 42689126 43291678 43812086 44202449
2710 44202449 44386754 44545353 44942238 45019777 45165223 45600023 45981337 46621091 47071215 47405551
2700 47405551 47769570 48298001 48921596 49244363 49771177 50282022 50839038 51249780 51621808
2691 51621808 52118285 52722989 53292752 53914440 54770379 55669496 56388050 56925648 57711084
2682 57711084 58766277 59675674 60373602 61136470 62181586 63000850 63905974 64791517 65579307
2673 65579307 66739466 67414567 68332801 69410773 70547338 71904736 73086849 74297507
2665 74297507 75707866 76936329 77898278 78922893 79800910 81006963 82154982 83661306
2657 83661306 85104115 86389985 87607588 89113858 90187147 91700193 93474694 95121555
$$ packed form
2719C9520369L96354O38817L60775K10570P10923Q51318O02552N20408L90363
2710D4202449J84305J58599L96885P7539J45446M34800L81314O39754M50124L34336
2700D7405551L64019N28431O23595L22767N26814N10845N57016M10742L72028
2691E1621808M96477O04704N69763O21688Q55939Q99117P18554N37598P85436
2682E7711084J055193R09397O97928P62868J045116Q19264R05124Q85543P87790
2673F5579307J160159O75101R18234J077972J136565J357398J182113J210658
2665G4297507J410359J228463R61949J024615Q78017J206053J148019J506324
2657H3661306J442809J285870J217603J506270J073289J513046J774501J646861
$$ plain form
2649 95121555 96474843 98155018 100154318 101838192 103917023 105982669 107721803 109648279
2641 109648279 111940345 113995645 116028108 118424755 120745312 122851564 124902907 127110278
2633 127110278 129160499 131557805 133788326 136156878 138479738 140663649 143229923 145654135
2625 145654135 147768260 150203711 152971355 155507233 158517910 161379725 164561632 167842986
2617 167842986 171266951 174776273 178623537 182659955 187109316 192052809 197517928 203081591
2609 203081591 209225480 215652997 222504175 230293884 238832048 248129134 258799786 269917400
2601 269917400 282155533 295091698 309308092 324478818 340147284 356508849 373821552
2594 373821552 391459958 409386313 426877790 443058658 456756361 466777486 472270268
$$ packed form
2649I5121555J353288J680175J999300J683874K078831K065646J739134J926476
2641A09648279K292066K055300K032463K396647K320557K106252K051343K207371
2633A27110278K050221K397306K230521K368552K322860K183911K566274K424212
2625A45654135K114125K435451K767644K535878L010677K861815L181907L281354
2617A67842986L423965L509322L847264M036418M449361M943493N465119N563663
2609B03081591O143889O427517O851178P789709Q538164R297086J0670652J1117614
2601B69917400J2238133J2936165J4216394J5170726J5668466J6361565J7312703
2594C73821552J7638406J7926355J7491477J6180868J3697703J0021125N492782
$$ plain form
2587 472270268 471891320 465345936 452396814 434835258 414950595 394513198 374754817
2580 374754817 356283933 339808499 324726707 311063714 299364799 288618840 279162454
2573 279162454 270075078 262016259 254996382 248361842 242127710 236465329 231669046 227432324
2565 227432324 223179337 219102359 215259183 211435379 207346474 203483169 200165557 196602820
2557 196602820 192947277 189586227 186152905 183335059 180193381 176900772 173893264 171222508
2549 171222508 168613858 166436378 164210496 161998052 159149755 155147514 150974143 146936499
2541 146936499 143232372 139536399 136195449 132938558 129829114 127242634 124909153 122872126
2533 122872126 121070661 119641531 118284610 116929376 115683052 114462584 113515733 112546011
$$ packed form
2587D72270268l78948o545384j2949122j7561556j9884663k0437397j9758381
2580C74754817j8470884j6475434j5081792j3662993j1698915j0745959r456386
2573B79162454r087376q058819p019877o634540o234132n662381m796283m236722
2565B27432324m252987m076978l843176l823804m088905l863305l317612l562737
2557A96602820l655543l361050l433322k817846l141678l292609l007508k670756
2549A71222508k608650k177480k225882k212444k848297m002241m173371m037644
2541A46936499l704127l695973l340950l256891l109444k586480k333481k037027
2533A22872126j801465j429130j356921j355234j246324j220468r46851r69722
$$ plain form
2525 112546011 111932887 111097803 110312320 110022636 109640984 109618867 109905119 110810816 112249874
2516 112249874 114238725 116647025 118477500 118726939 116471503 113233877 109723831 106403457
2508 106403457 103093964 100541042 98618730 97109053 95854037 94629362 93896909 93613689
2500 93613689 93427651 93447973 93689583 94451102 95837483 97458230 99163423 100864342 102598668
2491 102598668 105053702 108622414 113463219 119716135 127720820 137981820 149419018 161580441
2483 161580441 168931096 164073476 151607534 138139243 126348032 116711076 108477123 102091344
2475 102091344 97158512 93598944 91195198 89731516 88393655 87159489 86493636 86311131
2467 86311131 86572734 87571854 88698597 90371508 92320588 94997895 99120816 105063932
$$ packed form
2525A12546011o13124q35084p85483k89684l81652k2117K86252R05697J439058
2516A12249874J988851K408300J830475K49439k255436l237626l510046l320374
2508A06403457l309493k552922j922312j509677j255016j224675p32453k83220
2500I3613689j86038K0322K41610P61519J386381J620747J705193J700919J734326
2491A02598668K455034L568712M840805O252916Q004685J0261000J1437198J2161423
2483A61580441P350655m857620j2465942j3468291j1791211r636956q233953o385779
2475A02091344m932832l559568k403746j463682j337861j234166o65853j82505
2467H6311131K61603R99120J126743J672911J949080K677307M122921N943116
$$ plain form
2459 105063932 112475670 121608926 131884273 142188715 145444626 136804604 123085450 109724841
2451 109724841 99109858 90956855 84661592 79210060 75245441 72696397 70447298 68255930
2443 68255930 66037066 64107185 62286645 60879263 59423955 58387247 57586070 57243848
2435 57243848 56907089 56339841 55685494 54871564 54352605 53761241 53355538 53245056 53120810
2426 53120810 52432279 51704585 51057734 50169217 49360985 48909393 48155163 47249761 46662777
2417 46662777 46520711 46039822 45389457 45203302 44887927 44405061 43739013 43420648 43069584
2408 43069584 42893336 42658503 42516153 42179918 42192040 42215535 41885433 41349950 40965874 40621475
2398 40621475 40416856 39944243 39509477 39216770 38976863 39031588 38814387 38302497 37577100 37454875
$$ packed form
2459A05063932P411738R133256J0275347J0304442L255911q640022j3719154j3360609
2451A09724841j0614983q153003o295263n451532l964619k549044k249099k191368
2443F8255930k218864j929881j820540j407382j455308j036708q01177l42222
2435E7243848l36759n67248o54347q13930n18959n91364m05703j10482j24246
2426E3120810o88531p27694o46851q88517q08232m51592p54230r05402n86984
2417D6662777j42066m80889o50365j86155l15375m82866o66048l18365l51064
2408D3069584j76248k34833j42350l36235J2122K3495l30102n35483l84076l44399
2398D0621475k04619m72613m34766k92707k39907N4725k17201n11890p25397j22225
$$ plain form
2388 37454875 37282960 36982476 36809160 36333686 35884704 35546949 35342827 35168055 35045394
2379 35045394 34966561 34854070 35014835 34861014 34981710 34910838 34840002 34750390 34664797 34639503
2369 34639503 34348425 34263662 34281713 34256409 34295728 34163073 34288638 34368519 34369947 34184762 34179980
2358 34179980 34219908 33960209 34117546 34029642 34010165 34097731 34349846 34457587 34457531 34715948 34780131
2347 34780131 35142280 35134204 35152711 35431527 35781152 36159029 36752422 37273011 37317202 37740564
2337 37740564 38335131 38894365 38931799 39135647 39346857 39665904 40035098 40456958 40965669 41532699
2327 41532699 42167343 42695643 43535109 44118984 45056102 45864834 46215858 46771592 47063452
2318 47063452 47359447 47757874 47657683 47553387 47828452 48554375 48846531 49249841 49652860
$$ packed form
2388C7454875j71915l00484j73316m75474m48982l37755k04122j74772j22661
2379C5045394p8833j12491J60765j53821J20696p0872p0836q9612q5593k5294
2369C4639503k91078q4763J8051k5304L9319j32655J25565P9881J428j85185m782
2358C4179980L9928k59699J57337q7904j9477Q7566K52115J07741n6K58417O4183
2347C4780131L62149q076J8507K78816L49625L77877N93393N20589M4191M23362
2337C7740564N94567N59234L7434K03848K11210L19047L69194M21860N08711N67030
2327D1532699O34644N28300Q39466N83875R37118Q08732L51024N55734K91860
2318D7063452K95995L98427j00191j04296K75065P25923K92156M03310M03019
$$ plain form
2309 49652860 50253563 50737542 51709506 52359159 53162269 54201786 54688525 55638557 56307345
2300 56307345 57013919 58014471 58982716 60151192 61677685 63223933 64427141 65965164
2292 65965164 67772321 69412991 71166855 72950012 74962963 77014077 78734311 80115749
2284 80115749 81721071 83554389 85474020 87321363 89051238 91027103 92813693 94885580
2276 94885580 96846512 97951686 99146946 100464139 101497097 102516513 103631369 104656980
2268 104656980 105834943 106819901 108215897 109654845 111900442 114354769 116897890 119871619
2260 119871619 123169686 126255428 130159478 134531370 138567423 143107441 148023473 152477104
2252 152477104 157423896 162380702 166606053 169776978 171501679 171788852 170393599 167028242
$$ packed form
2309D9652860O00703M83979R71964O49653Q03110J039517M86739R50032O68788
2300E6307345P06574J000552R68245J168476J526493J546248J203208J538023
2292F5965164J807157J640670J753864J783157K012951K051114J720234J381438
2284H0115749J605322J833318J919631J847343J729875J975865J786590K071887
2276I4885580J960932J105174J195260J317193J032958J019416J114856J025611
2268A04656980J177963R84958J395996J438948K245597K454327K543121K973729
2260A19871619L298067L085742L904050M371892M036053M540018M916032M453631
2252A52477104M946792M956806M225351L170925J724701K87173j395253l365357
$$ plain form
2244 167028242 162335579 157767031 153536116 150328825 147704951 146004302 145125236 144963397
2236 144963397 145896176 147289092 148907980 151028262 153320214 155787122 158419095 161350506
2228 161350506 164563861 167336298 170128156 172705083 175092725 176937146 177200072 176628219
2220 176628219 174801966 172073726 168437427 164539870 160221840 155227837 149777773 144429436
2212 144429436 139598881 135398327 132103531 129563612 126996244 125346270 124387831 123376442
2204 123376442 123046642 122893921 122944476 122586674 122000503 120863384 119501940 118228838 116291662
2195 116291662 113578523 110372622 106832332 102668095 98143956 93774684 89507382 85327427
2187 85327427 81374141 77741116 74701827 71782171 68873465 66642838 64403047 62136274
$$ packed form
2244A67028242m692663m568548m230915l207291k623874j700649q79066j61839
2236A44963397R32779J392916J618888K120282K291952K466908K631973K931411
2228A61350506L213355K772437K791858K576927K387642J844421K62926n71853
2220A76628219j826253k728240l636299l897557m318030m994003n450064n348337
2212A44429436m830555m200554l294796k539919k567368j649974r58439j011389
2204A23376442l29800j52721N0555l57802n86171j137119j361444j273102j937176
2195A16291662k713139l205901l540290m164237m524139m369272m267302m179955
2187H5327427l953286l633025l039289k919656k908706k230627k239791k266773
$$ plain form
2179 62136274 60391136 58756890 57222070 55832938 54402621 53177353 52020815 51205023
2171 51205023 49795383 48859593 47901241 46724921 45389755 43893484 42582846 41065138
2163 41065138 40003472 38983565 37844515 36474598 35375100 34385653 33667470 32963399 32325322
2154 32325322 31471930 30823924 30101104 29354791 28491678 27783844 27029196 26699072 26166215
2145 26166215 25456559 25036918 24710688 24270939 23736483 23545125 23177690 22928128 22767705
2136 22767705 22179212 21712122 21477107 21394122 21008381 20538265 20390715 19941569 19500296 19086280
2126 19086280 18849080 18444283 18026282 17661894 17262437 17100008 16732174 16226417 15955522
2117 15955522 15385898 15254610 14943579 14855611 14559356 14206034 13988974 13696443 13479135 13524215
$$ packed form
2179F2136274j745138j634246j534820j389132j430317j225268j156538q15792
2171E1205023j409640r35790r58352j176320j335166j496271j310638j517708
2163D1065138j061666j019907j139050j369917j099498r89447p18183p04071o38077
2154C2325322q53392o48006p22820p46313q63113p07834p54648l30124n32857
2145B6166215p09656m19641l26230m39749n34456j91358l67435k49562j60423
2136B2767705n88493m67090k35015q2985l85741m70116j47550m49146m41273m14016
2126A9086280k37200m04797m18001l64388l99457j62429l67834n05757k70895
2117A5955522n69624j31288l11031q7968k96255l53322k17060k92531k17308M5080
$$ plain form
2107 13524215 13496903 13176917 12867371 12831363 12730833 12524348 12169331 12027328 11749302 11297218
2097 11297218 11090242 10896564 10845618 10470620 10357202 10253802 10085174 9800443 9388850 9332190
2087 9332190 9408828 9246348 8759174 8598669 8677605 8263306 8156346 8167085 8086492 8151900
2077 8151900 7949516 7846498 7663497 7580775 7358279 7029313 6810704 6807229 6984352 6746398
2067 6746398 6657711 6536785 6444554 6341851 6552897 6543447 6458874 6216939 6003079 5867815
2057 5867815 5958188 5905122 5898594 5539144 5392252 5371073 5149855 5190619 5572381 5679493 5810274
2046 5810274 5582523 5364680 5462289 5357804 5252305 5124034 4934531 4747105 5073553 5231288
2036 5231288 4987525 4811885 4959602 4719296 4820541 4788319 4773064 4653469 4534315 4466307
$$ packed form
2107A3524215k7312l19986l09546l6008j00530k06485l55017j42003k78026m52084
2097A1297218k06976j93678n0946l74998j13418j03400j68628k84731m11593n6660
2087I332190P6638j62480m87174j60505P8936m14299j06960J0739q0593O5408
2077H151900k02384j03018j83001q2722k22496l28966k18609l475J77123k37954
2067F746398q8687j20926r2231j02703K11046r450q4573k41935k13860j35264
2057E867815R0373n3066o528l59450j46892k1179k21218M0764L81762J07112J30781
2046E810274k27751k17843R7609j04485j05499j28271j89503j87426L26448J57735
2036E231288k43763j75640J47717k40306J01245l2222j5255j19595j19154o8008
$$ plain form
2026 4466307 4506837 4604407 4495963 4233614 4062972 4135642 4284138 4392836 4246328 4171569
2016 4171569 4189585 4297344 4231391 4081869 4075767 4053518 4053116 4095809 3993145 3964224 3944168
2005 3944168 4012110 4008355 4045243 4122896 3644292 3517965 3919442 3912167 3376720 3528157 3440519
1994 3440519 3527185 3645522 3588231 3774479 3862990 3707481 3668776 3678487 3618071 3567579 3315422
1983 3315422 3253907 3337009 3350421 3361819 3370085 3643465 3555726 3325911 3410071 3267737 3109738
1972 3109738 3315757 3522555 3701397 3477305 3238787 3197197 3173455 3414780 3689173 3710933
1962 3710933 3492557 3809047 3802626 3788763 3783363 3528645 3504878 3619593 3407833 3347445 3186943
1951 3186943 3220523 3355321 3320160 3257889 3307603 3419802 3316765 3342444 3553887 3474824 3209441
$$ packed form
2026D466307M0530R7570j08444k62349j70642P2670J48496J08698j46508p4759
2016D171569J8016J07759o5953j49522o102k2249m02M2693j02664k8921k0056
2005C944168O7942l755L6888P7653m78604j26327M01477p275n35447J51437q7638
1994C440519Q6666J18337n7291J86248Q8511j55509l8705R711o0416n0492k52157
1983C315422o1515Q3102J3412J1398Q266K73380q7739k29815Q4160j42334j57999
1972C109738K06019K06798J78842k24092k38518m1590k3742K41325K74393K1760
1962C710933k18376L16490o421j3863n400k54718k3767J14715k11760o0388j60502
1951C186943L3580J34798l5161o2271M9714J12199j03037K5679K11443p9063k65383
$$ plain form
1940 3209441 3203895 3288278 3289541 3197307 3380936 3252384 3249822 3268901 3006571 2980855 2680656
1929 2680656 2549243 2728145 2855837 2986664 3084614 3060873 3040723 3060152 2911867 2724373
1919 2724373 2645264 2449051 2499440 2533160 2629604 2676159 2526032 2444288 2335751 2401577 2637885
1908 2637885 2646605 2226884 2160158 2127727 2034907 2272765 2025767 1850963 1752050 1845743 1983133
1897 1983133 1751732 1718035 1853839 1858864 1838283 1710001 1628462 1515249 1579955 1654506 1717223
1886 1717223 1652641 1744380 1478658 1496473 1557987 1338416 1313475 1432555 1327848 1118504
1876 1118504 1434658 1351254 1267048 1435725 1283622 1095644 1331349 1176675 1572756 1529378
1866 1529378 1464015 1247749 1018811 962677 1037331 1036377 1095857 1422206 1482264 1440742 1272814
$$ packed form
1940C209441n546Q4383J263r2234J83629j28552k562J9079k62330k5716l00199
1929B680656j31413J78902J27692J30827R7950k3741k0150J9429j48285j87494
1919B724373p9109j96213N0389L3720R6444M6555j50127q1744j08537O5826K36308
1908B637885Q720m19721o6726l2431r2820K37858k46998j74804r8913R3693J37390
1897A983133k31401l3697J35804N025k0581j28282q1539j13213O4706P4551O2717
1886A717223o4582R1739k65722J7815O1514k19571k4941J19080j04707k09344
1876A118504L16154q3404q4206J68677j52103j87978K35705j54674L96081m3378
1866A529378o5363k16266k28938n6134P4654r54N9480L26349O0058m1522j67928
$$ plain form
1855 1272814 1229768 1094501 1065013 968893 781193 886966 911611 978512 877051 913163 818737
1844 818737 622028 795784 1091780 790379 546032 678095 393437 296875 744682 791845
1834 791845 685354 674477 576303 492084 508000 565693 595806 381360 414334 573433 530885
1823 530885 766996 785445 903213 733268 746718 763366 738564 594326 877696 805535 460476
1812 460476 470037 514974 628098 392273 469100 467801 271951 381309 177842 258657 494726
1801 494726 490048 381897 250344 267828 566547 434923 444294 527384 730058 409335 275402
1790 275402 282481 378766 461467 283096 420901 434017 173354 -199145 -150630 108209 121317
1779 121317 161728 544296 349015 124526 361439 327492 228364 187613 274869 429363 239546
$$ packed form
1855A272814m3046j35267k9488r6120j87700J05773K4645O6901j01461L6112r4426
1844H18737j96709J73756K95996l01401k44347J32063k84658r6562M47807M7163
1834G91845j06491j0877r8174q4219J5916N7693L0113k14446L2974J59099m2548
1823E30885K36111J8449J17768j69945J3450J6648k4802j44238K83370p2161l45059
1812D60476R561M4937J13124k35825P6827j299j95850J09358k03467Q0815K36069
1801D94726m678j08151j31553J7484K98719j31624R371Q3090K02674l20723j33933
1790B75402P079R6285Q2701j78371J37805J3116k60663l72499M8515K58839J3108
1779A21317M0411L82568j95281k24489K36913l3947r9128m0751Q7256J54494j89817
$$ plain form
1768 239546 330047 72692 30349 -15564 -21279 -124367 -196180 -174355 -26756 92809 21013
1757 21013 -11588 91264 95510 14502 281276 428550 207282 223130 83923 107037 172462
1746 172462 146344 333592 48145 -176901 8001 110678 79152 41061 -181342 -74154
1736 -74154 -98012 -48966 -333936 -29524 96636 67022 -29456 -60107 -94419 -56024 -5544
1725 -5544 -78168 -181049 -305738 -66200 -323476 -163204 -153904 -76896 -32236 47080 51843
1714 51843 -95347 -88758 -134092 24364 137301 -212140 -189147 -247608 -91958 -41811 5033
1703 5033 -188075 -302825 -266062 -576703 -334681 -115109 -131765 -28143 -189020 -221137 -318643
1692 -318643 -315663 -451746 -292107 -563760 -651324 -472161 -282933 -105765 -225218 -331412
$$ packed form
1768B39546R0501k57355m2343m5913n715j03088p1813K1825J47599J19565p1796
1757B1013l2601J02852M246q1008K66774J47274k21268J5848j39207K3114O5425
1746A72462k6118J87248k85447k25046J84902J02677l1526l8091k22403J07188
1736g4154k3858M9046k84970L04412J26160k9614r6478l0651l4312L8395N0480
1725e544p2624j02881j24689K39538k57276J60272R300P7008M4660P9316M763
1714E1843j47190O589m5334J58456J12937l49441K2993n8461J55650N0147M6844
1703E033j93108j14750L6763l10641K42022K19572j6656J03622j60877l2117r7506
1692c18643K980j36083J59639k71653q7564J79163J89228J77168j19453j06194
$$ plain form
1682 -331412 -231328 -129981 -315017 -310638 -675132 -539751 -386826 -202923 -78367 -205478
1672 -205478 -483025 -565354 -626060 -500592 -308077 -306548 -142563 -126540 -322153 -239433 -265814
1661 -265814 -295274 -175129 7036 -89732 -225248 -262388 -214612 -274652 -195375 -151281 24183
1650 24183 -215508 -179282 -205580 -252543 -393516 -128044 -273678 -363393 -306881 -338488 -244537
1639 -244537 -179453 49200 -156373 -269499 -345652 -344848 -286820 -232178 -356422 -344753 -284591
1628 -284591 -132302 -101114 39771 -56168 -166149 -242412 -96409 -86441 65468 -83016 -317836
1617 -317836 -328712 -125119 -335928 -76242 285946 60957 -205465 -271823 -84441 -122692
1607 -122692 -240957 -476382 -486853 -443795 -197064 -150603 -307471 -80749 -112534 -99968 -17718
$$ packed form
1682c31412J00084J01347j85036M379l64494J35381J52925J83903J24556j27111
1672b05478k77547q2329o0706J25468J92515J529J63985J6023j95613Q2720k6381
1661b65814k9460J20145J82165r6768j35516l7140M7776o0040P9277M4094J75464
1650B4183k39691L6226k6298m6963j40973K65472j45634q9715N6512l1607R3951
1639b44537O5084K28653k05573j13126p6153Q04N8028N4642j24244J1669O0162
1628b84591J52289L1188J40885r5939j09981p6263J46003R968J51909j48484k34820
1617c17836j0876K03593k10809K59686L62188k24989k66422o6358J87382l8251
1607a22692j18265k35425j0471M3058K46731M6461j56868K26722l1785J2566Q2250
$$ plain form
1596 -17718 -119957 52830 -162366 -315468 -258637 -421329 -453439 -300323 -263600 -263380 -201033
1585 -201033 -157090 -101756 -237419 52677 -58444 -120803 -49856 -138263 -172023 -335362 -76706
1574 -76706 107140 30645 -93405 41684 -42559 31273 307675 73815 80414 -61085 263828
1563 263828 264187 50418 120522 -41287 -228394 -148609 -174777 -127586 -16966 153904 353248
1552 353248 452414 450941 380248 648126 595300 593603 410816 315217 249003 490977 644078
1541 644078 843128 897601 905083 693138 644550 612911 673850 726247 854314 922481 986178
1530 986178 998344 1057089 1017279 992996 1023750 1117260 1380497 1442410 1421444 1362776 1339123
1519 1339123 1297632 1300290 1662814 1685340 1689913 1905380 1848141 1744763 1565239 1669702 1854008
$$ packed form
1596a7718j02239J72787k15196j53102N6831j62692l2110J53116L6723K20O2347
1585b01033M3943N5334j35663K90096j11121o2359P0947q8407l3760j63339K58656
1574g6706J83846p6495j24050J35089q4243P3832K76402k33860O599j41499L24913
1563B63828L59k13769P0104j61809j87107P9785k6168M7191J10620J70870J99344
1552C53248R9166j473p0693K67878n2826j697j82787r5599o6214K41974J53101
1541F44078J99050N4473P482k11945m8588l1639O0939N2397J28067O8167O3697
1530I86178J2166N8745l9810k4283L0754R3510K63237O1913k0966n8668k3653
1519A339123m1491K658L62524K2526M573K15467n7239j03378j79524J04463J84306
$$ plain form
1508 1854008 2168972 2082756 2161831 2079931 2009452 2265461 2351602 2497688 2740574 2915538
1498 2915538 3123548 3276762 3419947 3347023 3136109 3204180 3453151 3737425 3750086 3746728
1488 3746728 3851895 4023419 4175849 4326200 4409628 4658772 4689904 5143195 5099283 5315882
1478 5315882 5576217 5606168 6086005 6250815 6291336 6672665 7484036 7893618 8368180 8551294
1468 8551294 9243996 10225442 11013787 12196103 13436237 14384375 15712411 17072964 18683811
1459 18683811 20500489 22816685 25690788 29333854 34490055 40912541 48627955 58060495
1451 58060495 68547939 77442475 73890254 60707739 48841998 39417525 32425898 27308994
1443 27308994 23079058 19897710 17627710 15826046 14331285 13277213 12287458 11339315
$$ packed form
1508A854008L14964q6216P9075q1900p0479K56009Q6141J46086K42886J74964
1498B915538K08010J53214J43185p2924k10914O8071K48971K84274J2661l358
1488C746728J05167J71524J52430J50351Q3428K49144L1132M53291m3912K16599
1478E315882K60335K9951M79837J64810M0521L81329Q11371M09582M74562J83114
1468H551294O92702R81446P88345J182316J240134R48138J328036J360553J610847
1459A8683811J816678K316196K874103L643066N156201O422486P715414R432540
1451E8060495J0487444Q894536l552221j3182515j1865741r424473o991627n116904
1443B7308994m229936l181348k270000j801664j494761j054072r89755r48143
$$ plain form
1435 11339315 10615148 9876742 8677541 7638764 7243856 6878755 6599837 6174510 5377236
1426 5377236 4827518 4565143 4068987 3823533 3579615 3313464 3243608 3275511 2890716 2742646
1416 2742646 2636824 2074857 2082456 2026625 1756469 1897257 1802122 1733637 1608086 1648834 1528986
1405 1528986 1250785 1010290 1178998 1400342 1365941 1273947 1399298 1072592 1023227 1052804
1395 1052804 1107302 1048061 1223460 985783 772536 842808 861684 629028 512991 353477
1385 353477 420291 590231 256672 319885 238854 391628 379122 403693 230739 199074 356646
1374 356646 200624 425029 328006 332327 330914 365464 475442 283288 246734 184368 336071
1363 336071 409178 23973 -28398 116616 -146918 -46991 -41639 89726 139279 155557 69865
$$ packed form
1435A1339315p24167p38406j199201j038777l94908l65101k78918m25327p97274
1426E377236n49718k62375m96156k45454k43918k66151o9856L1903l84795j48070
1416B742646j05822n61967P599n5831k70156J40788r5135o8485j25551M0748j19848
1405A528986k78201k40495J68708K21344l4401r1994J25351l26706m9365K9577
1395A052804N4498n9241J75399k37677k13247P0272J8876k32656j16037j59514
1385C53477O6814J69940l33559O3213q1031J52774j2506K4571j72954l1665J57572
1374C56646j56022K24405r7023M321j413L4550J09978j92154l6554o2366J51703
1363C36071P3107l85205n2371J45014k63534R9927N352J31365M9553J6278q5692
$$ plain form
1352 69865 -143916 -32764 -252990 -281695 -387421 -267585 -79662 -260234 -343268 -104620
1342 -104620 9910 -283418 -195767 -228539 -330307 -308875 -406180 -365968 -134049 -196796 -168556
1331 -168556 -222872 -120975 -222971 -402006 -418298 -671397 -476225 -119145 -40239 -220991
1321 -220991 -312670 -352727 -431182 -375578 -422827 -309111 -125602 -51420 25391 -152841 -97437
1310 -97437 -281895 -257438 -180459 -20971 30462 -21172 -204106 -541062 -604309 -601832 -590392
1299 -590392 -520606 -316766 -418791 -124702 -97991 -125561 -44826 47268 -86607 27795 -293508
1288 -293508 -325113 -95839 -25385 -229518 -336898 -262510 -478703 -249394 -145887 -152355 -104474
1277 -104474 -107715 23197 37690 -136700 -13348 -27965 44756 -191872 -11889 -64082 -301620
$$ packed form
1352F9865k13781J11152k20226k8705j05726J19836J87923j80572q3034K38648
1342a04620J14530k93328Q7651l2772j01768K1432r7305M0212K31919o2747K8240
1331a68556n4316J01897j01996j79035j6292k53099J95172L57080P8906j80752
1321b20991r1679m0057p8455N5604m7249J13716J83509P4182P6811j78232N5404
1310i7437j84458K4457P6979J59488N1433n1634j82934l36956o3247K477J1440
1299e90392O9786K03840j02025K94089K6711k7570Q0735R2094j33875J14402l21303
1288b93508l1605K29274P0454k04133j07380P4388k16193K29309J03507o468M7881
1277a04474l241J30912J4493j74390J23352j4617P2721k36628J79983n2193k37538
$$ plain form
1266 -301620 -226184 -160228 -185097 -195811 -262405 -227171 -339631 -541115 -447019 -387427 -474794
1255 -474794 -436770 -399190 -264782 -232914 -125053 -229641 -455000 -448892 -498490 -393191 -558045
1244 -558045 -568216 -694503 -545906 -590277 -440531 -470091 -308143 -533225 -463249 -222184
1234 -222184 32518 135526 -381152 -438027 -472148 -340937 -303319 -307729 -386335 -380782 -242599
1223 -242599 -440518 -386815 -168447 -103252 -43604 -241629 -244627 -266001 -89105 -107010 -404183
1212 -404183 -529457 -177875 -84429 -75427 -152015 -286470 -358639 -445480 -208831 -354825 -161150
1201 -161150 -169879 -127798 -242543 -194830 -15008 -119819 -55335 4386 -87992 -249172 -203006
1190 -203006 -307495 -112153 -75996 -242396 -162924 -197790 -374474 -368127 -230090 -16861 -26551
$$ packed form
1266c01620P5436O5956k4869j0714o6594L5234j12460k01484R4096N9592q7367
1255d74794L8024L7580J34408L1868J07861j04588k25359O108m9598J05299j64854
1244e58045j0171j26287J48597m4371J49746k9560J61948k25082O9976K41065
1234b22184K54702J03008n16678n6875l4121J31211L7618m410p8606N553J38183
1223b42599j97919N3703K18368O5195N9648j98025k998k1374J76896j7905k97173
1212d04183j25274L51582R3446R002p6588j34455p2169q6841K36649j45994J93675
1201a61150q729M2081j14745M7713J79822j04811O4484N9721r2378j61180M6166
1190b03006j04489J95342L6157j66400P9472l4866j76684O347J38037K13229r690
$$ plain form
1179 -26551 -43295 -104210 -203063 -399653 -205261 -166385 -70600 -139820 -145280 -346675 -440532
1168 -440532 -492025 -360052 -245250 -149099 -258131 -645042 -472221 -50093 2653 -147316
1158 -147316 -377383 -473574 -256442 -305322 -36234 -130304 -146274 -366712 -593579 -488770
1148 -488770 -424860 -553098 -461712 -499426 -231366 -327931 -375042 -404203 -489590 -223679 272807
1137 272807 157262 -261831 -387948 -303426 -302797 -573828 -429550 -378973 -353258 -125763 -32003
1126 -32003 -202395 -144486 -434460 -542966 -255984 -298235 -427184 -91729 -100422 -327425 -267194
1115 -267194 -296592 -301390 -355953 -476345 -274923 -14171 167374 -118742 -199106 -288463 -369612
1104 -369612 -530529 -633982 -533257 -535422 -284863 -222970 -426628 -310509 -433151 -518453
$$ packed form
1179b6551j6744o0915r8853j96590J94392L8876R5785o9220n460k01395r3857
1168d40532n1493J31973J14802R6151j09032l86911J72821M22128N2746j49969
1158a47316k30067r6191K17132m8880K69088r4070j5970k20438k26867J04809
1148d88770O3910j28238R1386l7714K68060r6565m7111k9161q5387K65911M96486
1137B72807j15545m19093j26117Q4522O29k71031J44278N0577K5715K27495R3760
1126c2003j70392N7909k89974j08506K86982m2251j28949L35455q693k27003O0231
1115b67194k9398m798n4563j20392K01422K60752J81545k86116q0364q9357q1149
1104c69612j60917j03453J00725k165K50559O1893k03658J16119j22642q5302
$$ plain form
1094 -518453 -438137 -242501 -345709 -557948 -582606 -505180 -315649 -260027 -90036 -113529 -230569
1083 -230569 -330173 -312595 -364065 -684973 -610202 -394073 -428593 -168740 -556050 -487523 -353048
1072 -353048 -281860 -320061 -216362 -81725 -357715 -161292 -37176 -288612 -249999 -63302
1062 -63302 -154171 -97772 -213558 -277123 -152026 -154077 -268581 -349516 -99904 -153815 -318544
1051 -318544 -251289 -360386 -256815 -286881 -330617 -286324 -303982 -42861 7182 32735 147927
1040 147927 106125 237567 81075 7368 -180322 -153135 -236142 -472382 -340354 -286905 -140505
1029 -140505 -491396 -631901 -554852 -362310 -244764 -363721 -291962 -379781 -404498 -318907 -318558
1018 -318558 -208441 -367915 -523026 -259036 -442821 -212089 14071 -58051 -186690 -417330
$$ packed form
1094e18453Q0316J95636j03208k12239k4658P7426J89531N5622J69991k3493j17040
1083b30569r9604J7578n1470l20908P4771K16129l4520K59853l87310O8527J34475
1072c53048P1188l8201J03699J34637k75990J96423J24116k51436L8613J86697
1062f3302r0869N6399j15786o3565J25097k051j14504q0935K49612n3911j64729
1051c18544O7255j09097J03571l0066m3736M4293j7658K61121N0043K5553J15192
1040A47927m1802J31442j56492p3707j87690K7187q3007k36240J32028N3449J46400
1029a40505l50891j40505P7049J92542J17546j18957P1759q7819k4717Q5591L49
1018c18558J10117j59474j55111K63990j83785K30732K26160p2122j28639k30640
$$ plain form
1008 -417330 -504586 -468957 -239098 -201865 -398464 -185303 -150611 -274708 -491290 -508610 -77362
997 -77362 132709 -60654 -281177 -308462 -530746 -492152 -364140 -235875 -545880 -578019 -372179
986 -372179 -130508 -105751 -109680 -414239 -583763 -288832 40673 -147826 -298184 -389301 -250220
975 -250220 -92228 -232138 -421684 -277328 -260258 -296396 -539882 -401478 -549921 -413330
965 -413330 -38890 -180388 -90667 -248803 33297 -80789 -120964 -23581 -32265 -108635 -115648
954 -115648 -323744 -278388 -261395 -260093 -172784 -168527 -199657 -291621 53721 -192032 -395727
943 -395727 -224895 -393929 -483496 -153817 -280961 -113913 -3720 -216293 99222 -160791
933 -160791 -166973 102539 -57769 -11065 -91302 -444690 -249541 -389898 -290323 -298646 -355229
$$ packed form
1008d17330q7256L5629K29859L7233j96599K13161L4692j24097k16582j7320M31248
997g7362K10071j93363k20523k7285k22284L8594J28012J28265l10005l2139K05840
986c72179K41671K4757l929l04559j69524K94931L29505j88499j50358r1117J39081
975b50220J57992j39910j89546J44356J7070l6138k43486J38404j48443J36591
965d13330L74440j41498Q9721j58136K82100j14086m0175R7383q684p6370p013
954a15648k08096M5356J6993J302Q7309M257l1130r1964L45342k45753k03695
943c95727J70832j69034q9567L29679j27144J67048J10193k12573L15515k60013
933a60791o182K69512j60308M6704q0237l53388J95149j40357R9575q323n6583
$$ plain form
922 -355229 -302203 -225417 -267717 -287510 -251637 -138716 -150015 -75318 -387613 -394652 -226237
911 -226237 -231183 -339119 -516476 -435960 -197875 -386942 -469788 -478471 -551230 -260596 -234480
900 -234480 -56772 211532 44023 12169 -82501 -24919 114120 -27113 -155782 -137676 -88991
889 -88991 -144546 -25612 161783 277440 -174545 -244331 130603 -142836 -549517 -349638
879 -349638 -46947 -42785 -24436 -183407 -90702 -172379 -291542 -33162 -201563 -263492 -24898
868 -24898 -240866 -329296 -54407 -245370 -139691 -167468 -50007 -121837 -234526 -154974 -80055
857 -80055 3157 243145 -136920 -423265 -492863 -268805 -52534 -333638 -193615 -236985 -20608
846 -20608 -110732 -366440 -216877 -207631 20610 -78122 -9645 -171916 -181585 -162819 -335032
$$ packed form
922c55229N3026P6786m2300j9793L5873J12921j1299P4697l12295p039J68415
911b26237m946j07936j77357Q0516K38085j89067q2846q683p2759K90634K6116
900b34480J77708K68304j67509l1854r4670N7582J39039j41233j28669J8106M8685
889h8991n5555J18934J87395J15657m51985o9786L74934k73439m06681J99879
879c49638L02691M162J8349j58971R2705q1677j19163K58380j68401o1929K38594
868b4898k15968q8430K74889j90963J05679k7777J17461p1830j12689P9552P4919
857h0055Q3212K39988l80065k86345o9598K24058K16271k81104J40023m3370K16377
846b0608r0124k55708J49563R246K28241r8732O8477j62271r669J8766j72213
$$ plain form
835 -335032 -372577 -82790 51425 117440 -79206 -142542 -92549 92876 22204 -61943 -66738
824 -66738 -182205 82627 -237686 -251549 -360911 -68449 -62800 -3430 -17338 -122619 -40650
813 -40650 -243918 -378517 -49371 11089 -187976 -175048 -94400 -87841 -84388 -95083 -5841 287400
801 287400 330193 82837 -121057 -51316 59645 -93196 -218205 -139952 -101945 156138 81882
790 81882 -208287 -159542 105595 -74850 -154186 -164395 -249811 -238775 -41268 -285022 -553286
779 -553286 -404272 -357412 -303082 40833 -261367 -257224 -173877 -240155 -163707 -258047 -258596 -385236
767 -385236 -153022 -68845 -145721 -177178 -238398 -163824 -112587 -209490 -117173 -291554 -282676 -47414
755 -47414 -258631 -269548 -25525 -20770 136233 -3450 -100570 46689 -2115 -75607 60493
$$ packed form
835c35032l7545K89787J34215O6015j96646o3336M9993J85425p0672q4147m795
824f6738j15467K64832l20313j3863j09362K92462N649N9370j3908j05281Q1969
813d0650k03268j34599L29146O0460j99065J2928Q0648O559L453j0695Q9242K93241
801B87400M2793k47356k03894O9741J10961j52841j25009P8253L8007K58083p4256
790H1882k90169M8745K65137j80445p9336j0209q5416J1036J97507k43754k68264
779e53286J49014M6860N4330L43915l02200M143Q3347o6278P6448r4340n49j26640
767c85236K32214Q4177p6876l1457o1220P4574N1237r6903R2317j74381Q878K35262
755d7414k11217j0917K44023M755J57003j39683r7120J47259m8804p3492J36100
$$ plain form
744 60493 -178786 -180694 -113642 -163063 -336186 -63350 115419 10261 -124754 75135 194224
733 194224 -134708 -84430 -35402 -185379 -57135 -104532 -334834 -97237 21538 -83637
723 -83637 -290691 -457733 -341536 -92286 -28567 -126386 6127 57298 43693 93682 77725
712 77725 89173 23231 -75480 -237935 44896 132883 -98985 132609 186654 -15467 39972
701 39972 60762 -108993 -164626 -232173 -184452 -34829 -8624 -3177 -59103 -46860 46317 175670
689 175670 187309 110622 -118408 106429 33911 -101282 -21470 -41757 -246335 -119521 -99152
678 -99152 -179708 -91978 -6709 118591 140755 -78302 -235601 -101579 -209689 -123283 34852
667 34852 -62509 -210404 -216365 62896 263060 285765 40505 -296160 -386211 -286039 -220763
$$ packed form
744F0493k39279j908O7052m9421j73123K72836J78769j05158j35015J99889J19089
733A94224l28932N0278M9028j49977J28244m7397k30302K37597J18775j05175
723h3637k07054j67042J16197K49250O3719r7819J32513N1171j3605M9989j5957
712G7725J1448o5942r8711j62455K82831Q7987k31868K31594N4045k02121N5439
701C9972K0790j69755n5633o7547M7721J49623K6205N447n5926J2243R3177J29353
689A75670J1639p6687k29030K24837p2518j35193P9812k0287k04578J26814K0369
678i9152q0556Q7730Q5269J25300K2164k19057j57299J34022j08110Q6406J58135
667C4852r7361j47895n961K79261K00164K2705k45260l36665r0051J00172O5276
$$ plain form
656 -220763 -199204 -22248 -12535 -20561 -224427 -437660 -120713 -105592 -326337 -303180 41342
645 41342 37523 60555 -52301 -222606 -233634 -251045 49077 -130706 -290955 -140455 -48595
634 -48595 -36919 3088 -102810 1590 19340 -185190 -20576 18237 12295 134921 -28755
623 -28755 87334 -270568 -330774 -369302 -285200 -95425 11928 281241 504904 176526 65843
612 65843 -45304 -107727 62712 276333 33932 -53519 27932 -78889 253664 249099 264343
601 264343 208297 32546 286898 520482 244632 216942 163305 290646 333539 282824 -72162
590 -72162 -383684 -312984 74630 220530 162510 297722 62373 183650 195393 76245 6413
579 6413 -224378 -46407 -63998 -69303 30760 48221 82974 273914 192439 59744 146002
$$ packed form
656b20763K1559J76956R713q026k03866k13233L16947J5121k20745K3157L44522
645D1342l819K3032j12856j70305j1028j7411L00122j79783j60249J50500R1860
634d8595J1676M0007j05898J04400J7750k04530J64614L8813n942J22626j63676
623b8755J16089l57902o0206l8528Q4102J89775J07353K69313K23663l28378j10683
612F5843j11147o2423J70439K13621k42401q7451Q1451j06821L32553m565J5244
601B64343n6046j75751K54352K33584k75850k7690n3637J27341M2893n0715l54986
590g2162l11522P0700L87614J45900n8020J35212k35349J21277J1743j19148o9832
579F413k30791J77971j7591n305J00063J7461L4753J90940q1475j32695Q6258
$$ plain form
568 146002 -73130 -290149 -35027 54588 -7516 -99423 142356 160157 103264 93055 128498
557 128498 19096 -145505 -91027 -7977 65838 316 87902 28702 -303326 -194471 -72405
546 -72405 203547 125794 -45454 6662 135725 -86942 -74249 113631 -47069 -73771 121107
535 121107 115660 -24707 151226 53627 157778 -40037 15574 -57963 316077 404361 54695
524 54695 -235080 -228222 109532 225198 351329 375307 216213 119419 -18180 -105143 -162201
513 -162201 -4640 -68523 42193 -64499 -216266 -85380 -30386 -37935 35695 75596 -14931
502 -14931 -108120 -48207 -167952 -312254 -221324 26395 443346 210251 228976 315525 141502
491 141502 46648 213087 79825 262190 411617 739058 616144 523549 368582 -46744
$$ packed form
568A46002k19132k17019K55122Q9615o2104r1907K41779J7801n6893j0209L5443
557A28498j09402j64601N4478Q3050P3815o5522Q7586n9200l32028J08855J22066
546g2405K75952p7753j71248N2116J29063k22667J2693J87880j60700k6702J94878
535A21107n447j40367J75933r7599J04151j97815N5611p3537L74040Q8284l49666
524E4695k89775O858L37754J15666J26131K3978j59094r6794j37599q6963n7058
513a62201J57561o3883J10716j06692j51767J30886N4994p549P3630L9901r0527
502a4931r3189N9913j19745j44302R0930K47719M16951k33095J8725Q6549j74023
491A41502r4854J66439j33262J82365J49427L27441j22914r2595j54967m15326
$$ plain form
481 -46744 157915 44072 -17309 80493 -33091 12620 173007 12438 -149164 -79680 139272
470 139272 235431 74724 304968 49562 -13832 87084 197299 103605 132893 259330 101144
459 101144 286814 415548 297080 225378 303718 244692 32331 13097 29728 126977 124583
448 124583 148574 270715 245067 233438 271743 421940 49467 -26399 10543 256582 101483
437 101483 44103 -107462 -42719 234193 543649 80642 -354717 -98607 -74361 -175753
427 -175753 -67135 182790 349456 314673 288066 298478 222101 160304 281639 315977 142050
416 142050 358229 425618 407406 539553 349270 336888 530185 411332 259992 401291
406 401291 145695 374695 549390 99450 43866 232913 205149 152849 142436 208770 459984
$$ packed form
481d6744K04659j13843o1381R7802j13584M5711J60387j60569j61602O9484K18952
470A39272R6159j60707K30244k55406o3394J00916J10215r3694K9288J26437j58186
459A01144J85670J28734j18468p1702P8340n9026k12361j9234J6631R7249k394
448A24583K3991J22141k5648j1629L8305J50197l72473p5866L6942K46039j55099
437A01483n7380j51565O4743K76912L09456m63007m35359K56110K4246j01392
427a75753J08618K49925J66666l4783k6607J0412p6377o1797J21335L4338j73927
416A42050K16179O7389j8212J32147j90283j2382J93297j18853j51340J41299
406D01291k55596K29000J74695m49940n5584J89047k7764n2300j0413O6334K51214
$$ plain form
395 459984 300668 160757 115113 111520 45880 122524 46738 48257 191974 115684 158722 310769
383 310769 264046 14276 -81450 25180 65180 244244 163415 201433 209113 181060 147237
372 147237 -66608 91033 135505 318104 395252 217847 161962 321699 235489 57318 19821
361 19821 -89073 6471 339462 277086 214409 253127 469887 393114 87877 80878 210177
350 210177 70398 157874 151945 37563 252284 142791 451617 252827 341777 271043 -30906
339 -30906 -240018 -68429 150513 235548 143783 187391 334954 196394 -192667 75714 139540
328 139540 204332 213802 276280 151308 119993 293102 173809 215519 74484 219240 87253
317 87253 27889 105490 167887 -37036 114 40929 -45136 2268 -122479 -32032 29438 115544
$$ packed form
395D59984j59316j39911m5644l593o5640P6644p5786J519J43717p6290M3038J52047
383C10769m6723k49770r5726J06630M0000J79064q0829L8018P680k8053l3823
372A47237k13845J57641M4472J82599P7148j77405n5885J59737q6210j78171l7497
361A9821j08894R5544L32991o2376o2677L8718K16760p6773l05237o999J29299
350B10177j39779Q7476n929j14382K14721j09493L08826j98790Q8950p0734l01949
339c0906k09112J71589K18942Q5035r1765M3608J47563j38560l89061K68381O3826
328A39540O4792R470O2478j24972l1315J73109j19293M1710j41035J44756j31987
317H7253n9364P7601O2397k04923L7150M0815q6065M7404j24747R0447O1470Q6106
$$ plain form
305 115544 11727 68322 45289 167503 188585 8087 45228 -31470 195314 301449 309671
294 309671 118119 302308 352217 138829 254791 244196 56348 54057 215855 177449 -135684
283 -135684 182996 221078 85582 238559 280830 163061 87379 141623 33755 295769 580379
272 580379 544120 310030 252310 77770 214243 502208 154374 -26724 66737 119489 212794
261 212794 303888 410831 172450 -1431 170618 398820 552345 281828 177105 100164
251 100164 257783 382660 159337 326576 554046 416718 303852 143765 57355 239277
241 239277 457814 497610 168279 291710 277294 506071 507088 254200 127422 47678 140806
230 140806 15379 183021 217849 137039 -137201 129258 346129 523537 208190 249871
$$ packed form
305A15544j03817N6595k3033J22214K1082j80498L7141p6698K26784J06135Q222
294C09671j91552J84189M9909k13388J15962j0595j87848k291J61798l8406l13133
283a35684L18680L8082j35496J52977M2271j17769p5682N4244j07868K62014K84610
272E80379l6259k34090n7720j74540J36473K87965l47834j81098R3461N2752R3305
261B12794R1094J06943k38381j73881J72049K28202J53525k70517j04723p6941
251A00164J57619J24877k23323J67239K27470j37328j12866j60087q6410J81922
241B39277K18537L9796l29331J23431j4416K28777J017k52888j26778p9744R3128
230A40806j25427J67642L4828q0810k74240K66459K16871J77408l15347M1681
$$ plain form
220 249871 194676 -3951 199640 140842 178066 226853 167557 156939 168371 418626 176573
209 176573 35879 143167 349295 512495 530540 356069 205494 205053 326546 238301 204312
198 204312 276212 335883 392575 374549 262103 290029 455229 319988 380056 333038 188864
187 188864 212147 293599 245749 445292 345702 345835 330565 206123 116791 147188 158940 7381
175 7381 141944 35231 -50700 214303 127185 -7389 12582 128896 165521 326056 327819
164 327819 237182 395270 412269 175899 243678 77904 132018 200646 242228 244719 328163
153 328163 498739 620593 532425 272875 41010 168082 136124 74745 24556 10409 206815
142 206815 99660 38992 191266 360345 287555 416122 282172 224543 429806 407218 323030
$$ packed form
220B49871n5195j98627K03591n8798L7224M8787n9296j0618J1432K50255k42053
209A76573j40694J07288K06128J63200J8045j74471j50575m41J21493q8245l3989
198B04312P1900N9671N6692j8026j12446K7926J65200j35241O0068m7018j44174
187A88864K3283Q1452m7850J99543r9590J33j5270j24442q9332L0397J1752j51559
175G381J34563j06713q5931K65003q7118j34574J9971J16314L6625J60535J763
164C27819r0637J58088J6999k36370O7779j65774N4114O8628M1582K491Q3444
153C28163J70576J21854q8168k59550k31865J27072l1958o1379n0189j4147J96406
142B06815j07155o0668J52274J69079p2790J28567j33950n7629K05263k2588q4188
$$ plain form
131 323030 360006 301815 327133 311510 168480 167785 184953 252201 136476 28104 -51436 88537
119 88537 181713 168920 -50117 -8200 111894 49269 57801 126723 187647 253521 900 146549
107 146549 257618 93449 24064 -71899 -42347 18111 -230202 -236659 -156928 -26250 -43226
96 -43226 -3389 91551 164552 300053 36020 60062 15942 -23769 -39555 43902 -22301 -187532
84 -187532 -19404 -19792 -26924 131518 170738 253624 59774 197832 222320 161996 22167 -130356
72 -130356 -93753 -59348 -212845 -167300 -102809 -154521 38598 54993 -9285 161937 -7583
61 -7583 -63891 -183631 61352 37431 80666 104450 -1293 -104583 -87352 -109908 -72347 7425
49 7425 123021 98564 -215774 -147637 69875 135845 35334 -117433 -147630 -193865 -289197
$$ packed form
131C23030L6976n8191K5318j5623j43030o95J7168O7248j15725j08372p9540J39973
119H8537R3176j2793k19037M1917J20094o2625Q532O8922O0924O5874k52621J45649
107A46549J11069j64169o9385r5963K9552O0458k48313o457P9731J30678j6976
96d3226L9837R4940P3001J35501k64033K4042m4120l9711j5786Q3457o6203j65231
84a87532J68128l88p132J58442L9220Q2886j93850J38058K4488o0324j39829j52523
72a30356L6603L4405j53497M5545O4491n1712J93119J6395o4278J71222j69520
61g583n6308j19740K44983k3921M3235K3784j05743j03290J7231k2556L7561P9772
49G425J15596k4457l14338O8137K17512O5970j00511j52767l0197m6235r5332
$$ plain form
38 -289197 -98911 -179941 -150110 -156097 -99958 -103922 -62623 -43543 -101635 -1870 42963 -36249
26 -36249 -79062 -163380 -329689 -233929 -82272 3871 -60360 -29553 -22089 -237675 -404644 -367602
14 -367602 -141463 -288465 -184770 -193570 -170536 -255268 -269859 -180142 -250568 -118181 -3607
3 -3607 -197529 -249552 -337236
0 -337236
$$ packed form
38b89197J90286q1030K9831n987N6139l964M1299J9080n8092R9765M4833p9212
26c6249m2813q4318j66309R5760J51657Q6143o4231L0807P464k15586j66969L7042
14c67602K26139j47002J03695q800K3034q4732j4591Q9717p0426J32387J14574
3c607j93922n2023q7684
0c37236
$$ Imaginary data points
##PAGE= N=2
##DATA TABLE= (X++(I..I)), XYDATA
$$ plain form
16383 -5369026 -5373405 -5185530 -5191080 -5061106 -4943176 -4961796 -4883308 -4706384 -4656536 -4560726 -4556260
16372 -4556260 -4433043 -4312065 -4264404 -4394807 -4295389 -3973640 -4005315 -3944397 -3770984 -3493121
16362 -3493121 -3422464 -3485701 -3519492 -3379591 -3165908 -3346147 -3314561 -3098784 -2970419 -2926284
16352 -2926284 -2804974 -2595929 -2463895 -2537414 -2821409 -2478237 -2318379 -2164356 -2089456 -2107681
16342 -2107681 -2195073 -2122533 -1865353 -1763040 -1797025 -1766401 -1725690 -1519986 -1371806 -1317186
16332 -1317186 -1246462 -1290548 -1309413 -1219645 -1146101 -963489 -758231 -784630 -568633 -537132 -531806
16321 -531806 -330257 -402896 -507334 -406574 -263668 -340667 -414156 -296577 -44383 41480
16311 41480 56523 368070 400985 380800 616614 782603 708903 724008 716878 862523 876866
$$ packed form
16383e369026m379J87875n550J29974J17930j8620P8488J76924M9848R5810M466
16372d556260J23217J20978M7661j30403R9418L21749l1675O0918J73413K77863
16362c493121P0657o3237l3791J39901K13683j80239L1586K15777J28365M4135
16352b926284J21310K09045J32034p3519k83995L43172J59858J54023P4900j8225
16342b107681q7392P2540K57180J02313l3985L0624M0711K05704J48180N4620
16332a317186P0724m4086j8865Q9768P3544J82612K05258k6399K15997L1501N326
16321e31806K01549p2639j04438J00760J42906p6999p3489J17579K52194Q5863
16311D1480J5043L11547L2915k0185K35814J65989p3700J5105p130J45645J4343
$$ plain form
16300 876866 884904 1015701 1069485 982890 916449 1121269 1217119 1332468 1371565 1449867 1686156
16289 1686156 1850015 1801710 1883836 1762275 1971747 2082265 2071681 2014168 2003354 1935847
16279 1935847 2164208 2298609 2169831 2169815 2265011 2437434 2502803 2541810 2505135 2701878 2720091
16268 2720091 2873589 2804197 2803319 2901317 3143672 3205330 3406163 3492819 3193913 3182192 3326565
16257 3326565 3331098 3299789 3408886 3647279 3554267 3616910 3742131 3819655 3849646 3891120 3900493
16246 3900493 3922551 4074325 4172764 4201507 4217658 4127734 4233678 4439495 4299594 4155598
16236 4155598 4330212 4473689 4577910 4679889 4640864 4690776 4720205 4673770 4378274 4547618
16226 4547618 4745408 4652866 4679775 4738414 4729538 4989985 5043798 4875832 4984787 5035922 5081340
$$ packed form
16300H76866Q038J30797N3784q6595o6441K04820R5850J15349L9097P8302K36289
16289A686156J63859m8305Q2126j21561K09472J10518j0584n7513j0814o7507
16279A935847K28361J34401j28778j6R5196J72423O5369L9007l6675J96743J8213
16268B720091J53498o9392q78R7998K42355O1658K00833Q6656k98906j1721J44373
16257C326565M533l1309J09097K38393r3012O2643J25221P7524K9991M1474R373
16246C900493K2058J51774R8439K8743J6151q9924J05944K05817j39901j43996
16236D155598J74614J43477J04221J01979l9025M9912K9429m6435k95496J69344
16226D547618J97790r2542K6909N8639q876K60447N3813j67966J08955N1135M5418
$$ plain form
16215 5081340 5024803 5207616 5228046 5237291 5115248 5220151 5223857 5175990 5092422 5215781 5514271
16204 5514271 5464938 5471327 5374684 5594776 5618115 5670611 5498805 5517723 5695412 5798721 5672637
16193 5672637 5465896 5803839 6133019 5981902 5899861 6118374 6092851 5923721 5913116 6142547
16183 6142547 6322560 6062649 5933680 5970383 5976413 5907407 5939860 6064558 6037974 6109582 5966817
16172 5966817 6087918 6134932 5987653 6101025 5972867 5872279 6086110 6291562 6341378 6286099
16162 6286099 6355531 6527068 6692310 6651178 6531734 6448136 6470160 6428525 6636085 6721607
16152 6721607 6638581 6502080 6477429 6350983 6495020 6920740 6994583 6901718 6791473 6593189
16142 6593189 6753925 6936143 6815675 6983263 6843099 6978742 7005677 7008518 6937045 6825855
$$ packed form
16215E081340n6537J82813K0430R245j22043J04903L706m7867q3568J23359K98490
16204E514271m9333O389r6643K20092K3339N2496j71806J8918J77689J03309j26084
16193E672637k06741L37943L29180j51117q2041K18513k5523j69130j0605K29431
16183F142547J80013k59911j28969L6703O030o9006L2453J24698k6584P1608j42765
16172E966817J21101M7014j47279J13372j28158j00588K13831K05452M9816n5279
16162F286099O9432J71537J65242m1132j19444q3598K2024m1635K07560Q5522
16152F721607q3026j36501k4651j26446J44037M25720P3843r2865j10245j98284
16142F593189J60736J82218j20468J67588j40164J35643K6935K841p1473j11190
$$ plain form
16132 6825855 6771259 6847608 6647727 6857443 6775765 6762867 6776080 6571542 6881879 6766745
16122 6766745 6736179 6709635 6854123 6817543 6650728 6758628 6833859 6973796 7123561 7098080
16112 7098080 6891574 7057554 7131884 7068440 7302942 7288052 7108899 7174778 7396539 7390888
16102 7390888 7243164 7345395 7322728 7166398 6828476 6902569 7194684 7129039 7255478 7127948
16092 7127948 6904957 6966031 7002900 7043220 7134379 7207300 7046405 7085135 7333652 7161016
16082 7161016 6946950 6935802 7090245 7312444 7314682 7172322 7131485 7044954 7077496 7173203 7094140
16071 7094140 6961847 7102137 7105061 7158552 7381697 7210496 7047155 7427304 7539155 7273267
16061 7273267 7322680 7386177 7375453 7254441 7277066 7336402 7369986 7279059 7406824 7490359 7382690
$$ packed form
16132F825855n4596P6349j99881K09716q1678j2898J3213k04538L10337j15134
16122F766745l0566k6544J44488l6580j66815J07900P5231J39937J49765k5481
16112G098080k06506J65980P4330o3444K34502j4890j79153O5879K21761n651
16102G390888j47724J02231k2667j56330l37922P4093K92115o5645J26439j27530
16092G127948k22991O1074L6869M0320R1159P2921j60895L8730K48517j72636
16082G161016k14066j1148J54443K22199K238j42360m0837q6531L2542R5707p9063
16071G094140j32293J40290K924N3491K23145j71201j63341L80149J11851k65888
16061G273267M9413O3497j0724j21012K2625N9336L3584r0927J27765Q3535j07669
$$ plain form
16050 7382690 7310954 7466928 7433579 7270727 7337048 7413001 7349715 7285635 7124112 7136941 7176157
16039 7176157 7255616 7185812 7014066 7231596 7258383 7271613 7039758 7200515 7361040 7346754
$$ packed form
16050G382690p1736J55974l3349j62852O6321P5953o3286o4080j61523J2829L9216
16039G176157P9459o9804j71746K17530K6787J3230k31855J60757J60525j4286
$$ [...]
##END NTUPLES=NMR SPECTRUM
##END=
