##TITLE=1H_EC-3324(2)
 CDCl3
 8 sc, 
 12.4.2024
##JCAMPDX= 6.0         $$ Bruker NMR JCAMP-DX V2.0
##DATA TYPE= NMR SPECTRUM
##DATA CLASS= NTUPLES
##ORIGIN= UXNMR, Bruker Analytische Messtechnik GmbH
##OWNER= root
$$ XWIN-NMR		Version 3.5
$$ Fri Apr 12 13:52:10 2024 Russian Standard Time (UT+4h)  she@DPX200
##.OBSERVE FREQUENCY= 200.1309
##.OBSERVE NUCLEUS= ^1H
##.ACQUISITION MODE= SIMULTANEOUS
##.ACQUISITION SCHEME= undefined
##.AVERAGES= 8
##.DIGITISER RES= 18
##SPECTROMETER/DATA SYSTEM= spect
##.PULSE SEQUENCE= zg30
##.SOLVENT NAME= CDCl3
##.SHIFT REFERENCE= (INTERNAL, CDCl3, 0, 15.575)
##AUDIT TRAIL= $$ (NUMBER, WHEN, WHO, WHERE, WHAT)
$$ ##TITLE= Audit trail, XWIN-NMR		Version 3.5
$$ ##JCAMPDX= 5.01
$$ ##ORIGIN= Bruker BioSpin GmbH
$$ ##OWNER= she
$$ F:/spectra/data/she/nmr/H-F/1/pdata/1/auditp.txt
$$ ##AUDIT TRAIL=  $$ (NUMBER, WHEN, WHO, WHERE, WHAT)
(   1,<2024-04-12 13:50:24.98 +0400>,<she>,<DPX200>,
      <created by zg, POWCHK disabled, PULCHK disabled
       configuration hash MD5:
       00 E9 B6 7A A2 85 ED C7 34 08 36 98 17 FE 4E 26
       data hash MD5: 16K
       40 9A B5 A5 66 B4 F6 33 D5 57 61 FF 6F 82 37 EC>)
(   2,<2024-04-12 13:51:09.84 +0400>,<she>,<DPX200>,
      <Start of raw data processing
       efp BC_mod = 2 LB = 0.24 FT_mod = 6 PKNL = 1 PHC0 = -25301.34 PHC1 = 11.18731 SI = 16K 
       data hash MD5: 16K
       7E 94 BD 94 B1 11 0A 72 89 B2 BE 11 AB D5 5F B4>)
(   3,<2024-04-12 13:51:26.75 +0400>,<she>,<DPX200>,
      <pk PHC0 = -157.2614 PHC1 = -1.2 
       data hash MD5: 16K
       5D 8F 08 94 AC 96 B2 4F 68 F0 C2 45 3A 7B 7D 95>)
(   4,<2024-04-12 13:51:29.71 +0400>,<she>,<DPX200>,
      <abs ABSG = 5 
       data hash MD5: 16K
       9C DA 0C 58 E2 1F 17 09 88 50 98 F5 DD 70 F3 11>)
$$ ##END=
$$ 
$$ hash MD5
$$ 90 80 AD 11 5C 36 4F 0A 10 86 A4 45 EE C5 73 E8
##$RELAX= 
##$RELAX= 
##$RELAX= 
##$RELAX= 
##$RELAX= 
##$RELAX= 
$$ Bruker specific parameters
$$ --------------------------
##$DU= <F:/spectra>
##$EXPNO= 1
##$NAME= <H-F>
##$PROCNO= 1
##$TYPE= <nmr>
##$USER= <she>
##$AMP= (0..31)
100 100 100 100 100 100 100 100 100 100 100 100 100 100 100 100 100 100 
100 100 100 100 100 100 100 100 100 100 100 100 100 100 
##$AQSEQ= 0
##$AQ_mod= 1
##$AUNM= <au_zg>
##$AUTOPOS= <>
##$BF1= 200.13
##$BF2= 200.13
##$BF3= 200.13
##$BF4= 200.13
##$BF5= 200.13
##$BF6= 200.13
##$BF7= 200.13
##$BF8= 200.13
##$BYTORDA= 1
##$CFDGTYP= 0
##$CFRGTYP= 5
##$CHEMSTR= <none>
##$CNST= (0..31)
1 1 145 1 1 1 1 1 1 1 1 1 1 1 1 1 1 1 1 1 1 1 1 1 1 1 1 1 1 1 1 1 
##$CPDPRG= <>
##$CPDPRG1= <>
##$CPDPRG2= <>
##$CPDPRG3= <>
##$CPDPRG4= <mlev>
##$CPDPRG5= <mlev>
##$CPDPRG6= <mlev>
##$CPDPRG7= <mlev>
##$CPDPRG8= <mlev>
##$CPDPRGB= <>
##$CPDPRGT= <>
##$D= (0..31)
0 1.2 0 0 0 0 0 0 0 0.06 0 0.03 0 0 0 0 0.0002 0 0 0 0 0 0 0 0 0 0 0 0 
0 0 0 
##$DATE= 1712915424
##$DBL= (0..7)
120 120 120 120 120 120 120 120 
##$DBP= (0..7)
150 150 150 150 150 150 150 150 
##$DBP07= 0
##$DBPNAM0= <>
##$DBPNAM1= <>
##$DBPNAM2= <>
##$DBPNAM3= <>
##$DBPNAM4= <>
$$ [...]
##$SUBNAM3= <"">
##$SUBNAM4= <"">
##$SUBNAM5= <"">
##$SUBNAM6= <"">
##$SUBNAM7= <"">
##$SUBNAM8= <"">
##$SUBNAM9= <"">
##$SW= 18.0517689322627
##$SWIBOX= (0..15)
0 0 2 0 0 0 0 0 0 0 0 0 0 0 0 0 
##$SW_h= 3612.71676300578
##$TD= 16384
##$TD0= 1
##$TE= 0
##$TE2= 300
##$TE3= 300
##$TEG= 300
##$TL= (0..7)
0 120 120 120 120 120 120 120 
##$TP= (0..7)
150 150 150 150 150 150 150 150 
##$TP07= 0
##$TPNAME0= <>
##$TPNAME1= <>
##$TPNAME2= <>
##$TPNAME3= <>
##$TPNAME4= <>
##$TPNAME5= <>
##$TPNAME6= <>
##$TPNAME7= <>
##$TPOAL= (0..7)
0.5 0.5 0.5 0.5 0.5 0.5 0.5 0.5 
##$TPOFFS= (0..7)
0 0 0 0 0 0 0 0 
##$TUNHIN= 0
##$TUNHOUT= 0
##$TUNXOUT= 0
##$USERA1= <user>
##$USERA2= <user>
##$USERA3= <user>
##$USERA4= <user>
##$USERA5= <user>
##$V9= 5
##$VALIST= <valist>
##$VCLIST= <CCCCCCCCCCCCCCC>
##$VD= 0
##$VDLIST= <DDDDDDDDDDDDDDD>
##$VPLIST= <PPPPPPPPPPPPPPP>
##$VTLIST= <TTTTTTTTTTTTTTT>
##$WBST= 1024
##$WBSW= 4
##$XGAIN= (0..3)
0 0 0 0 
##$XL= 0
##$YL= 0
##$YMAX_a= 605233
##$YMIN_a= -430660
##$ZGOPTNS= <>
##$ZL1= 120
##$ZL2= 120
##$ZL3= 120
##$ZL4= 120
##$ABSF1= 15.53758
##$ABSF2= -2.514306
##$ABSG= 5
##$ABSL= 3
##$ALPHA= 0
##$AQORDER= 0
##$ASSFAC= 0
##$ASSFACI= 0
##$ASSFACX= 0
##$ASSWID= 0
##$AUNMP= <proc_1d>
##$AZFE= 0.1
##$AZFW= 0.1
##$BCFW= 0
##$BC_mod= 2
##$BYTORDP= 0
##$COROFFS= 0
##$CY= -3
##$DATMOD= 1
##$DC= 0
##$DFILT= <>
##$DTYPP= 0
##$F1P= 0
##$F2P= 0
##$FCOR= 1
##$FTSIZE= 16384
##$FT_mod= 6
##$GAMMA= 0
##$GB= 0
##$INTBC= 1
##$INTSCL= 3.70164e-10
##$ISEN= 128
##$LB= 0.24
##$LEV0= 0
##$LPBIN= 0
##$MAXI= 10000
##$MC2= 0
##$MEAN= 0
##$ME_mod= 0
##$MI= 1.114404
##$NCOEF= 0
##$NC_proc= -6
##$NLEV= 6
##$NOISF1= 3.799351
##$NOISF2= 2.8
##$NSP= 0
##$NTH_PI= 0
##$NZP= 0
##$OFFSET= 15.57504
##$PC= 1
##$PHC0= -25458.6
##$PHC1= 9.98731
##$PH_mod= 1
##$PKNL= yes
##$PPARMOD= 0
##$PSCAL= 0
##$PSIGN= 0
##$REVERSE= no
##$SF= 200.129589331321
##$SI= 16384
##$SIGF1= 3
##$SIGF2= 2
##$SINO= 5.538805
##$SIOLD= 16384
##$SREGLST= <1H.CDCl3>
##$SSB= 0
##$STSI= 16384
##$STSR= 0
##$SW_p= 3612.71676300577
##$SYMM= 0
##$S_DEV= 0
##$TDeff= 16384
##$TDoff= 0
##$TI= <>
##$TILT= no
##$TM1= 0
##$TM2= 0
##$TOPLEV= 0
##$USERP1= <user>
##$USERP2= <user>
##$USERP3= <user>
##$USERP4= <user>
##$USERP5= <user>
##$WDW= 1
##$XDIM= 16384
##$YMAX_p= 297542279
##$YMIN_p= -483661
$$ End of Bruker specific parameters
$$ ---------------------------------
##NTUPLES= NMR SPECTRUM
##VAR_NAME=  FREQUENCY,     SPECTRUM/REAL,   SPECTRUM/IMAG
##SYMBOL=    X,             R,               I
##VAR_TYPE=  INDEPENDENT,   DEPENDENT,       DEPENDENT
##VAR_FORM=  AFFN,          ASDF,            ASDF
##VAR_DIM=   16384,         16384,           16384
##UNITS=     HZ,            ARBITRARY UNITS, ARBITRARY UNITS
##FACTOR=    0.220516191357247, 1,           1
##FIRST=     3117.02633171851, 0,            0
##LAST=      -495.690431287265, 0,           0
##MIN=       -495.690431287265, -483661,     0
##MAX=       3117.02633171851, 297542279,    0
$$ Real data points
##PAGE= N=1
##DATA TABLE= (X++(R..R)), XYDATA
$$ [...]
10654 164252 165618 136925 128101 178667 167673 130751 185744 224561 247711 266477 296807 275337
10642 275337 240598 309934 456449 505272 500065 574865 577285 547188 530738 531690 543201 579543
10630 579543 547814 517089 484618 463814 440051 361182 367485 335642 292441 266394 292772 153350
10618 153350 105196 57979 43617 104194 125244 166582 195537 179062 58784 -39730 970
10607 970 59022 78843 79266 55780 48385 52429 76140 86172 64640 87553 56451 54910 30387
10594 30387 39294 44708 77615 131551 88603 106063 69080 83461 103163 42331 -5930 -8727
10582 -8727 82858 77040 73651 22044 18543 78108 51989 78353 69598 26727 89947 79085 74285
10569 74285 52397 11819 33839 43340 90691 137138 73825 66970 61373 66007 81897 48035
10557 48035 85340 113804 157438 129739 125181 86904 64008 38677 81789 127227 115104 144526
10545 144526 163815 159309 95486 136259 169777 193525 266083 254264 190668 199549 153465 123477
10533 123477 176154 222802 233778 233316 205378 243102 271614 254891 193706 154297 225374 221278
10521 221278 221076 234756 224054 183208 219632 207441 225040 262274 287123 314462 245956 284133
10509 284133 291560 288287 282606 351708 364111 361591 381933 368297 362633 385024 429014 383854
10497 383854 382563 373340 418513 509740 524216 450087 453645 470376 503749 511108 543427 486965
10485 486965 496952 510235 544300 567815 542532 592485 581199 603337 626220 598487 663959 758203
10473 758203 735303 734553 735344 734422 733392 695251 779507 774822 761747 804072 873770 838780 870669
10460 870669 888204 909476 861108 877861 886645 899241 926797 881229 915184 961699 945739 952501
10448 952501 922876 911659 965671 1021115 1004669 897997 959763 987606 974584 967019 920328
10437 920328 844603 887490 869848 820041 767400 757311 815548 767022 758544 739943 685772 656324
10425 656324 621781 721984 682465 653655 598297 584070 610013 619328 573784 580463 571778 590831
10413 590831 548803 565453 615935 496754 479430 523092 461995 408697 435814 486511 444853
10402 444853 468132 446082 420977 389457 342050 376781 393165 373567 364178 318231 311758 356223
10390 356223 255856 243789 238110 259392 274065 225827 303291 377637 347810 363915 343007
10379 343007 367933 323283 271546 299436 297876 252140 248387 349880 391333 280243 256730
10368 256730 222289 221924 240004 277800 272484 270783 268494 278699 302161 273530 215495 228095
10356 228095 308465 303741 316426 295066 303471 279276 311939 347396 310450 274196 358038 446927
10344 446927 479356 508386 501180 480992 463157 457847 494070 469384 475537 420538 435334 412415
10332 412415 314463 276341 307507 324467 310987 292036 183166 271305 257322 205575 172709
10321 172709 156056 152357 194056 191145 172873 197770 96175 109551 135281 135791 113653 111645
10309 111645 133162 171268 112318 88596 90844 122445 157888 157830 179768 130243 122800 86049
10297 86049 96302 94344 87086 16542 -2532 -23513 50601 25922 -9695 -4676 -15995 92463
10285 92463 63841 99755 133875 114318 75140 79027 89876 95100 70973 56155 82427 151869
10273 151869 147385 133414 86854 64824 58568 89372 80749 69712 99608 70897 63913 44927
10261 44927 16389 22493 92468 22433 -34094 -26223 4889 88522 126867 49486 71005 102716
10249 102716 89605 78951 54197 39240 4903 24951 85492 75065 34312 51059 48086 25630
10237 25630 14854 -4950 25935 40358 30364 19086 49551 57327 69447 75655 53646 27878
10225 27878 52714 -5223 38282 88357 45622 16903 -23396 -6391 56497 103481 98261 68309
10213 68309 4712 65140 146713 151168 146249 111791 37633 17053 24328 50336 66346 100991
10201 100991 117248 157382 171417 136041 80998 31951 125264 151272 144350 51333 85670 78393
10189 78393 168014 187817 84077 54285 61441 168989 200090 186520 113909 156295 99718
10178 99718 117429 128433 128183 107456 97526 94119 24534 20416 45365 65316 25999 47086 22624
10165 22624 45127 77794 51687 6928 21765 -2491 -56625 -13130 -38363 38304 20965 -51168
10153 -51168 -15495 18496 10306 4877 19453 64686 98240 62731 12961 38432 36450 102506
10141 102506 113462 139326 68747 26977 37296 69750 64193 12223 -8222 40441 120859 107585
10129 107585 21632 24461 105939 79924 84361 60398 43301 75571 107544 102965 152628 124449
10117 124449 133315 169405 179807 175373 99264 41525 61056 132604 162958 173639 157360 146669
10105 146669 231457 273736 217873 238093 267269 256603 192771 144816 194418 263590 214021
10094 214021 176441 275154 291588 259844 236223 254897 305258 318519 300138 329891 416992
10083 416992 484531 443909 428895 422013 494242 617859 716433 744545 810052 835230 877752
10072 877752 781369 727978 715967 684090 681955 731007 738107 669140 708723 750431 733302 708402
10060 708402 712982 640135 603590 567392 495823 471547 484103 427206 452890 438893 384126 339971
10048 339971 354177 396521 442007 463115 414598 355759 397196 417942 534050 551143 609817
10037 609817 617718 609812 681932 775406 805982 722212 654581 680110 588954 450458 463354 386595
10025 386595 299070 277510 380084 307528 261145 280445 256876 250384 226362 228256 227234 203453
10013 203453 180064 191240 165204 211462 258077 182109 162201 122520 149526 226490 199284
10002 199284 177224 234492 223770 235828 307742 255283 202741 277840 272710 263572 296243 268725
9990 268725 205761 271658 333049 316713 250483 297560 340738 422800 426433 339294 340910 264826
9978 264826 264252 292321 285663 252575 182247 200427 258516 227185 228207 186867 162775 203732
9966 203732 157902 145198 168356 220327 241776 189943 200511 240061 202517 190690 219637 203471
9954 203471 167482 242621 294759 211632 145172 171921 179232 213352 217451 258827 298095 330807
9942 330807 368904 366226 363569 299252 327846 331693 329375 332923 357647 403399 351147 394685 411539
9929 411539 400394 344563 234886 278126 315671 373317 398829 372757 369619 408883 455465 510234
9917 510234 495215 423624 462095 447272 487505 540609 538819 545229 570692 581115 532783 490875
9905 490875 496358 615638 656968 686581 644688 682872 730578 747332 775255 787748 751838 713580
9893 713580 695142 759228 676981 655873 687795 668787 699244 746135 729300 781750 771807 766581
9881 766581 812682 784541 823620 847371 861597 801155 756514 802025 788215 752590 740332 752624
9869 752624 744135 774467 801631 816062 790999 748402 803711 829433 884876 792616 762690 748350
9857 748350 759874 731350 674156 717847 669081 718285 707720 652941 676387 668509 666126 694639
9845 694639 692139 613714 588625 568457 702240 796821 723524 661507 623339 616183 650747 685483
9833 685483 659625 675313 673445 711720 679562 657409 674232 696367 757563 781869 762660 693878
9821 693878 616350 639264 687708 702117 685397 652581 663877 699245 762194 747446 776064 800633
9809 800633 851824 869334 880464 904829 885906 886633 1005877 1008769 1011346 1044282 1114876 1090218
9797 1090218 1114269 1053126 953933 1007696 1045836 952383 880249 848910 807438 812035 796032 735858
9785 735858 722729 781392 810657 874429 778898 720995 692138 736523 794360 795108 793005 769088
9773 769088 776360 796313 787902 800799 792886 820021 940467 945838 937560 877034 918367 896798
9761 896798 956008 916791 800946 866094 894630 910889 960024 955485 927171 990094 1004314 1029856
9749 1029856 1075881 1054409 1035028 1015013 916217 889301 936800 975411 1033247 1071790 1019187
9738 1019187 1014359 977596 976950 935724 966688 963531 934312 897061 905268 947464 929695 911576
9726 911576 963762 1060490 994986 946148 914919 873294 965190 953558 934234 962531 963309 1048530
9714 1048530 1124291 1117407 1031976 1023367 1074862 1122212 1135673 1099501 1170113 1198860 1243359 1217331
9702 1217331 1133163 1218480 1339546 1369389 1358711 1318035 1290486 1327265 1350850 1346812 1262812
9691 1262812 1322854 1383897 1439752 1477982 1401245 1410230 1404425 1487521 1540362 1502369 1550329 1556450
9679 1556450 1551575 1605992 1564593 1536989 1602188 1626006 1689459 1681204 1669989 1665965 1640760 1725783
9667 1725783 1719810 1746480 1742639 1801121 1862091 1890114 1860550 1843878 1938623 1970090 1937159 1946536
9655 1946536 1996113 2049115 2111544 2111891 2176396 2195886 2210597 2257727 2334702 2362810 2401843 2402407
9643 2402407 2500944 2567125 2560191 2653010 2688571 2769115 2840436 2913612 2948443 2980844 3077765 3148338
9631 3148338 3256983 3258852 3281506 3364769 3451801 3575775 3661791 3784175 3828758 3975452 4137166
9620 4137166 4200656 4242604 4372942 4521456 4603494 4714558 4822655 4999913 5184306 5290692
9610 5290692 5474770 5650202 5706193 5843801 6011471 6150180 6343724 6461611 6644403 6877615
9600 6877615 7071578 7277229 7442394 7666982 8017679 8220195 8344331 8569850 8829550 9211031
9590 9211031 9511561 9722015 9944682 10354383 10742259 11080400 11368410 11678543 12091208 12424027
9580 12424027 12827407 13279780 13700571 14101081 14587195 15091306 15661986 16329317 16926231
9571 16926231 17604533 18399077 19241370 20176184 21259813 22483563 23924025 25544719 27309296
9562 27309296 29289889 31605263 34091353 36571050 39066720 41736059 44460407 47042792
9554 47042792 49255934 51228438 53481704 55735334 57906504 60145657 62511027 65292099
9546 65292099 68060315 70584348 73186172 75800684 77942087 78932451 78865475 78465971 77734216
9537 77734216 76173499 73715997 70945121 68231258 65549922 62724612 60184823 58205869
9529 58205869 56818084 55886176 55321466 55351770 55812332 56463946 57441765 58716900 60103343
9520 60103343 61411733 62375550 63227570 64305806 65620892 66964659 68233530 69787738
9512 69787738 71875931 74059259 76125277 78202430 80645151 82724748 83098906 82023941
9504 82023941 80617116 78991727 76581780 73159125 69233409 65232526 61222674 56942059
9496 56942059 52747662 48989973 45684675 42627439 39783368 37261022 35025471 32921494
9488 32921494 31042310 29327606 27698078 26296731 25026746 23923501 22852837 21904742
9480 21904742 21118586 20394308 19762160 19260795 18812995 18402851 18075263 17890021 17750482
9471 17750482 17667959 17618733 17609127 17742212 17849723 18145625 18505026 18854971 19350378 19956556
9461 19956556 20724252 21606197 22648712 23716513 24968651 26467634 28062442 29627423
9453 29627423 31184472 32802835 34301878 35376966 35999301 36164210 35759693 34910749 33521893
9444 33521893 31820232 29957542 27930690 25872599 23889432 22105905 20500113 19054125
9436 19054125 17805443 16731298 15757525 15022712 14347310 13757806 13226591 12831441 12493342
9427 12493342 12185991 11933334 11688552 11489409 11346872 11231426 11066515 11017780 10939663 10847690
9417 10847690 10847138 10874607 10951386 10980913 11038726 11225039 11400103 11559318 11739155 12049480 12397590
9406 12397590 12704545 12968089 13284723 13592966 13996539 14371930 14867737 15496000 16222768
9397 16222768 17103426 18004459 18929956 19802849 20397058 20775677 20942094 21004276 21271177 21821050
9387 21821050 22564734 23481837 24398574 25162591 25789437 26443743 27261021 28404144 30036006
9378 30036006 31820658 33335896 34338229 34393180 33633875 32420611 31244739 30610398 30559533
9369 30559533 30993186 31339728 31248702 30300264 28573305 26155400 23362067 20738918 18456801
9360 18456801 16586641 15029560 13707398 12531061 11534023 10749923 10107830 9518498 8974429
9351 8974429 8500305 8084577 7765193 7385602 7109288 6795008 6549280 6350375 6109863 5931455
9341 5931455 5896732 5784529 5606455 5498084 5377640 5333939 5285728 5261619 5202125 5116300 5063682
9330 5063682 4999844 4928060 4830990 4722985 4587530 4504780 4428854 4364363 4280714 4262705 4232443
9319 4232443 4200180 4096663 4076459 4171614 4258117 4276631 4228320 4172499 4118436 4047562 3984163
9308 3984163 4013342 3891467 3866298 3968453 3958481 3865979 3861601 3838405 3754282 3676906 3542360
9297 3542360 3503329 3518893 3410798 3329201 3354354 3309868 3251868 3252128 3238176 3260373 3269737 3266977
9285 3266977 3298802 3310764 3275852 3229873 3234022 3254842 3305470 3244160 3180254 3111390 3153965 3120006
9273 3120006 3010283 2966806 2940630 2953012 2880580 2862101 2777170 2662266 2608350 2604467 2522100
9262 2522100 2534470 2474332 2434065 2509851 2584044 2574080 2612906 2626851 2707544 2778170 2825773 2857365
9250 2857365 2770839 2610827 2448741 2377294 2330970 2298480 2296398 2307453 2216214 2119337 2143579
9239 2143579 2158810 2119687 2072424 2105642 2067057 2039322 2017250 2110074 2111055 2104433 2132557 2120136
9227 2120136 2116916 2096282 2186310 2246647 2282593 2301591 2253314 2295490 2323958 2392087 2412885 2484581
9215 2484581 2546079 2604105 2612864 2597607 2632394 2628530 2807156 2853006 2933615 2999062 3056506 3117910
9203 3117910 3255477 3318371 3332496 3397127 3521105 3544990 3507040 3518362 3512884 3549214 3585738
9192 3585738 3495977 3402061 3367360 3341507 3269741 3184809 3136479 3162544 3245840 3198845 3079960
9181 3079960 3041165 3016606 3022964 3042797 3018415 3004169 2999798 2925189 2912310 2864560 2828374 2835219
9169 2835219 2872863 2933873 2937155 2871277 2946862 2941353 2930828 2945898 2953817 3035695 3071290 3005623
9157 3005623 3119046 3186408 3186617 3238857 3193994 3178472 3235853 3393125 3473800 3527914 3527574 3471849
9145 3471849 3517074 3584843 3576493 3563598 3594259 3644703 3657362 3661046 3632377 3676380 3773973 3791914
9133 3791914 3817300 3858346 3940472 4057544 4199407 4284566 4319896 4395022 4369538 4393594 4351908
9122 4351908 4308346 4280935 4215195 4151704 4148614 4153119 4148367 4209776 4188903 4170494 4230539 4164314
9110 4164314 4196503 4186308 4277947 4320555 4285343 4279897 4305213 4308355 4304785 4300772 4354004 4439195
9098 4439195 4474963 4437395 4449797 4522528 4633854 4727941 4782188 4928397 5099175 5239444 5351076
9087 5351076 5474265 5614183 5650006 5618929 5512301 5465402 5472385 5388000 5268472 5291976 5300608
9076 5300608 5303419 5439130 5469497 5437381 5414201 5564016 5668519 5618438 5513357 5583336 5761848
9065 5761848 5868602 5897838 5922827 6061223 6270399 6415332 6480225 6589931 6779319 6938398
9055 6938398 7053709 7221260 7416901 7615861 7852712 7940936 8137587 8373619 8544036 8741450
9045 8741450 8871954 9015679 9319764 9559507 9777354 9972878 10193353 10439957 10697649 11003331
9035 11003331 11255080 11546111 11886890 12132465 12427667 12724230 13164516 13523502 13879193
9026 13879193 14312067 14862389 15307049 15855131 16527753 17085353 17843126 18449426 19015725
9017 19015725 19681677 20256325 20799655 21373684 21936585 22484260 23044377 23721359 24388051
9008 24388051 25141316 26001098 26906116 27639957 28310447 29055600 29803765 30530572 31250361
8999 31250361 31941584 32583863 33308093 34105065 35098710 36249616 37484073 38855961 40396168
8990 40396168 42225397 44217232 46369008 48807527 51458737 54346351 57557395 60904401
8982 60904401 64231220 67407444 70382604 73186163 75944676 78917376 81892281 84725485
8974 84725485 87573672 90913692 94996543 99657992 104458306 109150979 113021940 115787892
8966 115787892 118249531 121134667 124823321 128946291 132896418 137226311 142613107 148711887
8958 148711887 154546914 158749651 161369156 162850919 163080808 161826324 159450281 157268752
8950 157268752 156197895 156644048 158458522 161226674 164716634 167668600 168050443 165750502
8942 165750502 162388836 158861128 154011043 146460438 137628422 129187126 121520827 114835564
8934 114835564 109388648 104409812 99388566 94169137 89410311 85148362 81618770 78812698
8926 78812698 76645306 75031438 73990651 73523336 73375542 73396425 73326303 73034647 72251717
8917 72251717 70679560 68445125 66201173 64326883 62937874 61544703 59839142 57999358
8909 57999358 56206581 54453336 52676692 51278409 50179920 49395890 48570290 47516563
8901 47516563 46542991 45822110 45488245 45486563 45770391 46371041 47387743 48623884 49919646
8892 49919646 51195483 52444332 53579618 54776128 55735937 56482225 56985280 56963142 56370196
8883 56370196 55248386 53744317 51958148 49899542 47860818 45898933 44030112 42177620
8875 42177620 40316690 38397381 36747171 35409654 34391058 33529905 32952719 32603885 32322423
8866 32322423 32138361 32155169 32283406 32503480 32951655 33627480 34511405 35778663 37389555
8857 37389555 39017831 40636099 41899146 42493619 42520045 42364410 42329363 42441921 42737402
8848 42737402 43109561 43393645 43371487 42843239 41806977 40399655 38995377 37753747 36815392
8839 36815392 36227273 35736635 35402874 35176383 35157956 35169848 35266047 35476461 35989764 36497257
8829 36497257 37071040 37667434 38095501 38514170 39015515 39666193 40564398 41707175 43026823
8820 43026823 44578328 46363518 48201115 49924242 51326318 52270364 52480030 52273368 52146746
8811 52146746 52607354 53893123 55823864 58030038 60240980 61971485 62853179 62860895 62644792
8802 62644792 62416145 62630562 63376597 64766124 66935257 69993884 73655083 77443051 80614238
8793 80614238 82587968 83894612 85362811 87547822 90441479 93574349 96321453 99220996
8785 99220996 103207188 109053007 117101426 128241322 142057843 156501423 171260936 180901060
8777 180901060 171421917 152916615 136956719 123911900 114793595 108647034 104401880 100621938
8769 100621938 97055996 93670648 90828621 88696855 87390658 86916845 87102077 87755283
8761 87755283 89343694 91547159 93853878 95041077 94944715 93632647 91732257 89586516
8753 89586516 87141107 84204971 81157395 78066636 75355366 73204131 71520490 70002547
8745 70002547 68360195 66107293 63375577 60691909 58506331 56920376 55884629 55168589
8737 55168589 54825511 54324465 53194466 51909160 50647343 49393125 48500497 47725320 46873369
8728 46873369 45724905 44525017 43775815 43411787 43423158 43589815 43301965 41784505 39510933
8719 39510933 37286480 35404704 33946182 32664060 31296309 29923872 28506462 27266462
8711 27266462 26198908 25305274 24534061 23791844 23132041 22502919 22001282 21602795 21401770
8702 21401770 21455104 21598606 21720598 21835621 21768267 21198432 20294708 19284865 18266640
8693 18266640 17408816 16658441 16077507 15510060 15091066 14754970 14461550 14147738 13959266
8684 13959266 13856882 13801818 13831944 13953298 14220701 14552703 14981972 15531600 16202485 17118329
8674 17118329 18290748 19679159 21355047 23159105 24830385 26324842 27350490 27439763
8666 27439763 26585081 25024553 22983444 20653335 18463126 16716201 15307749 14069451
8658 14069451 12968134 12173224 11518593 11029859 10634746 10292010 9963958 9697871 9420890
8649 9420890 9098749 8931501 8831727 8688732 8610394 8647339 8598316 8626199 8761396 8909590
8639 8909590 9139137 9518124 9848882 10337596 10949557 11737558 12700440 13854690 14978208
8630 14978208 16055761 16934732 17377462 17247554 16500479 15344931 13871646 12438162 11078150
8621 11078150 9913121 9034418 8282488 7687720 7220140 6822281 6483932 6212287 6064788
8612 6064788 5834209 5618437 5480261 5391228 5259326 5235206 5177827 5010272 4850520 4771931
8602 4771931 4636787 4559750 4426560 4278875 4210051 4119741 4055278 3950048 3898299 3812538 3719425
8591 3719425 3619605 3548566 3484681 3407049 3212763 3208196 3097555 2989079 2887133 2863829 2784560
8580 2784560 2681004 2676486 2601126 2595248 2583884 2568423 2505576 2471260 2476622 2504175 2352602 2306753
8568 2306753 2264671 2229306 2232102 2232064 2212472 2140755 2153794 2156553 2066074 2011003 2053854 2018850
8556 2018850 2054588 2111160 2091234 1958893 1939369 1951731 1879572 1845713 1771349 1593652 1557079
8545 1557079 1478258 1469880 1463403 1390317 1353611 1432455 1432693 1401280 1353662 1292026 1233578 1161605
8533 1161605 1176705 1149394 1131051 1189264 1166077 1159406 1201676 1156089 1124930 1117940 1082850 1057700
8521 1057700 1012611 1016846 1003838 952436 922205 981695 1009399 953418 1027061 925825 860724
8510 860724 850004 870055 811126 796958 767606 789409 773226 776679 755332 758518 709727 732768
8498 732768 711314 730404 717749 692993 788999 774145 753909 724103 687344 709816 769559 772897
8486 772897 751875 690938 668654 714942 779271 706820 658097 606013 677446 675433 664580 678150
8474 678150 642846 602793 572639 545988 545594 558903 509700 477105 515628 534260 522611 485728
8462 485728 440013 457691 509064 560946 496010 471411 529297 570715 567059 538673 527282 498709
8450 498709 486131 507358 516548 442581 398865 483937 480617 455499 511520 494780 477869 418089
8438 418089 470789 511012 512204 497009 475491 538964 542381 627901 624479 603255 602533 632873 640352
8425 640352 594524 535695 556815 504709 529905 530454 539412 558729 490728 452430 465067 437716
8413 437716 402230 412659 438553 477884 497134 475903 525397 597865 564464 547063 557376 529900
8401 529900 504066 512901 514578 552481 579331 614688 493426 558783 561852 549527 547506 546053
8389 546053 465695 454899 475414 424802 422371 345987 377111 412436 450738 389236 410167 428481
8377 428481 372553 398267 365490 344824 375430 345794 335613 384598 395796 358619 242306
8366 242306 200056 249159 230313 254749 267860 209389 199468 269757 220164 196649 230695 207920
8354 207920 213509 192365 132082 110729 69503 100342 173782 206012 233028 172422 108054 123307
8342 123307 137428 112918 72888 41341 70917 68651 26631 11819 32582 24969 12418 108840
8330 108840 161221 108951 68612 105667 84114 28816 30975 40821 91249 125220 132025 138316
8318 138316 153096 129203 185563 161560 140746 162077 196314 157102 124995 189748 173815 192797
8306 192797 190973 171280 250271 406956 477555 502851 659696 618161 491374 429076 335561
8295 335561 281485 244305 208889 176263 64338 52733 88160 65918 80664 29814 29186 53618
8283 53618 14553 -7435 21205 -22446 -53263 11703 11049 -67931 -94223 -66252 -27307 -101582
8271 -101582 -108553 -32565 -5907 -1517 -45031 -82457 -57291 -25211 -189 -36633 -46889 39310
8259 39310 7432 45272 31870 1656 5798 -23994 -26166 7710 -15913 -51050 -59950 23844
8247 23844 -37987 -60557 26190 -72358 -20731 -85234 -48578 -60405 -71194 -89622 -60731 -100730
8235 -100730 -91314 -29651 -7326 13249 54083 36223 31050 140655 151469 146860 122115 173551
8223 173551 84210 49436 29348 35078 25623 26795 -2727 -63392 -31488 20040 -57061 -68584
8211 -68584 -41709 -4214 -66464 -98029 -92461 -135116 -175413 -193205 -86475 -136753 -141492 -23514
8199 -23514 -45915 -117386 -92801 -68492 -55733 -126838 -224588 -483661 -236632 -110985 -134775
8188 -134775 -95774 -157575 -133173 -113647 -40290 -7389 -41254 -109441 -118757 -170290 -131901 -131485
8176 -131485 -149212 -199689 -136673 -97017 -119976 -175251 -83749 -32938 -23972 -68563 -76202 -7513
8164 -7513 -11146 9588 544 13329 89023 82608 8297 53126 101701 100427 68003 55043 5212
8151 5212 -106442 -130755 -84128 -124483 -118392 -95650 -103251 -90064 21995 -20622 -84007 -76114
8139 -76114 -86804 -106373 -156970 -175028 -214112 -182230 -179455 -195618 -150210 -149996 -189532 -95817
8127 -95817 -90919 -140420 -151043 -154316 -192827 -117580 -92920 -83253 -113613 -192224 -182626 -163016 -135818
8114 -135818 -150506 -77559 -144519 -157397 -213203 -205086 -239209 -239249 -216369 -210525 -155405 -169327 -117917
8101 -117917 -120587 -162226 -156016 -144197 -102881 -152756 -155483 -120776 -106653 -117908 -84866 -68622
8089 -68622 -95032 -78350 -67306 -138498 -149566 -128698 -187183 -178575 -243161 -240914 -266941 -171419
8077 -171419 -130190 -160286 -128895 -119632 -171762 -144207 -101928 -167152 -111797 -86101 -127236 -167550
8065 -167550 -175804 -164103 -171522 -178927 -240204 -199140 -203109 -183989 -186378 -255113 -302230 -223180 -188094
8052 -188094 -201737 -202281 -190267 -214229 -197659 -206707 -183122 -203088 -199282 -238021 -213773 -254877
8040 -254877 -276086 -252444 -250969 -200083 -181161 -244714 -241729 -220822 -246196 -218761 -223704 -223248 -202394
8027 -202394 -155176 -220804 -233698 -199314 -218496 -208202 -159743 -159466 -238996 -238802 -159014 -114848
8015 -114848 -172884 -298899 -267736 -287386 -195609 -186312 -153769 -147912 -159341 -254207 -207249 -203872
8003 -203872 -193927 -266445 -187877 -195833 -206771 -155598 -199296 -222717 -183466 -194971 -201276 -173776
7991 -173776 -172148 -181125 -230744 -209389 -248254 -207540 -274853 -265741 -215437 -207896 -209203 -251733 -258643
7978 -258643 -257226 -293558 -249860 -243011 -272034 -360983 -333069 -326552 -306824 -262020 -190639 -198182
7966 -198182 -201715 -207751 -285569 -290671 -264015 -280302 -257343 -270726 -241409 -180592 -281871 -228857
7954 -228857 -215204 -164558 -218145 -288370 -308432 -268959 -248929 -223865 -246274 -271533 -237016 -268986
7942 -268986 -240761 -268470 -275348 -261942 -165316 -244247 -333758 -323915 -289424 -200992 -181016 -194595
7930 -194595 -179269 -218928 -181492 -194887 -227203 -221111 -226236 -166426 -187538 -154710 -179951 -215316
7918 -215316 -223302 -260211 -208211 -252375 -256849 -261377 -237561 -231336 -240596 -243198 -318121 -302512 -268118
7905 -268118 -223454 -231014 -264741 -267448 -222461 -185276 -209488 -240863 -256646 -296413 -265017 -269397
7893 -269397 -326252 -296566 -278896 -277187 -217243 -266572 -287873 -283587 -301083 -284388 -288701 -272268
7881 -272268 -227813 -212969 -231433 -228929 -217037 -214922 -292842 -334696 -298327 -319105 -311555 -298052
7869 -298052 -272010 -245151 -233151 -186965 -234085 -308891 -320470 -270471 -258529 -333522 -296136 -259955
7857 -259955 -321803 -289937 -247721 -204767 -274359 -308957 -332896 -249531 -241636 -235910 -287883 -301461
7845 -301461 -309298 -294138 -267725 -270428 -219116 -243605 -207226 -180405 -161609 -179288 -167324 -197926
7833 -197926 -217627 -215669 -181904 -194010 -251134 -254444 -242528 -280392 -273089 -203572 -154388 -134108
7821 -134108 -131275 -130518 -171287 -191215 -165183 -157970 -232701 -242629 -234711 -229232 -166950 -128688 -185131
7808 -185131 -163344 -211665 -234267 -209118 -219710 -315848 -313145 -260002 -294813 -321663 -366388 -343892
7796 -343892 -348026 -327800 -325057 -276470 -274645 -249900 -259321 -265111 -327296 -317684 -328629 -295838 -224329
7783 -224329 -134115 -197233 -293638 -282960 -250155 -232191 -214836 -241473 -217589 -241454 -225800 -224300
7771 -224300 -288090 -254082 -215658 -258441 -290892 -265639 -293323 -288925 -285354 -257709 -200622 -247004
7759 -247004 -280065 -322992 -295204 -226386 -213830 -212465 -231592 -208284 -224851 -217949 -167000 -207383
7747 -207383 -273743 -241256 -175489 -162600 -254892 -328429 -334408 -247748 -211517 -217123 -226020 -256754
7735 -256754 -251930 -204862 -219086 -257297 -268409 -242531 -270636 -329537 -312830 -300871 -305892 -262758
7723 -262758 -244151 -250149 -255369 -256115 -315081 -324261 -277457 -284459 -322797 -278178 -277813 -240871 -259717
7710 -259717 -269981 -319094 -277886 -287562 -302770 -339616 -321085 -228725 -204101 -245696 -260563 -260005
7698 -260005 -287558 -292278 -331907 -276915 -266001 -261878 -199723 -258734 -326635 -279158 -291625 -321610
7686 -321610 -317031 -268983 -247630 -222766 -314885 -294870 -210976 -276798 -323968 -236305 -245555 -257807
7674 -257807 -234199 -237169 -279543 -281678 -351255 -303645 -240897 -288664 -296742 -206172 -239551 -284892
7662 -284892 -247818 -239146 -266450 -274542 -286693 -303515 -279779 -278825 -308633 -259967 -203261 -270850
7650 -270850 -327671 -344816 -283074 -299717 -293474 -261130 -271363 -284557 -260340 -248067 -197001 -224351
7638 -224351 -236301 -211193 -213889 -232403 -253623 -330676 -281141 -241950 -199973 -208064 -252129 -209074
7626 -209074 -188063 -154746 -135040 -148177 -195927 -244657 -283197 -239618 -200981 -178555 -163640 -161307
7614 -161307 -180615 -157298 -127433 -223710 -189079 -233637 -211540 -201481 -234605 -178664 -221994 -183183
7602 -183183 -189370 -173865 -173305 -97999 -122026 -138058 -140215 -177846 -142437 -109169 -58820 -42458
7590 -42458 -29040 11851 -78480 -71377 -38153 -100311 -153140 -130679 -73607 -90968 -73762 -3109
7578 -3109 12799 -90029 -64446 -57671 -55214 -30546 1846 -19964 -61228 -24674 -67933 -111740
7566 -111740 -105535 -49622 24324 -67557 -87189 -38827 16510 87514 92167 74893 109215 94061
7554 94061 157990 147971 125582 147963 129102 180408 178842 116891 74437 149286 159514 151172
7542 151172 121158 83473 66998 100707 112168 115667 57396 25308 56252 100482 85259 74555
7530 74555 117276 92039 69713 57101 35806 63764 26759 32275 114662 70418 651 -56209
7518 -56209 -72748 -27370 -24761 -23037 -56553 -115556 -37280 28690 -55829 -72054 -114362 -35608
7506 -35608 37667 -20263 -78567 -24255 -49830 -70049 -55790 -41087 -17362 -25020 -49863 -62963
7494 -62963 -50753 -105317 -71064 -81934 -42152 -69639 -30792 -49397 -80861 -109293 -22100 -11239
7482 -11239 -12221 -58172 -54491 -39051 -21494 -65713 -98217 -1592 -32213 -58882 -81324 -122133
7470 -122133 -125082 -75107 -30379 -11300 21001 69073 -30104 -34336 -28389 22955 40898 48970
7458 48970 21057 64990 51353 36636 2762 33565 54380 122268 150629 140544 113175 121873
7446 121873 123032 115549 164246 87255 48390 119360 232410 245466 250701 284011 282456 329275
7434 329275 382474 362196 443967 506273 563807 733565 865625 923144 996220 1094006 1144231
7423 1144231 1191732 1203184 1219253 1197159 1161602 1075647 894641 831547 726884 664962 588271
7412 588271 539625 437599 385718 424396 386073 281007 261739 188862 172928 142713 97110
7401 97110 94274 203397 103540 46892 55784 76857 21535 -19299 39041 33427 -9986 -54928
7389 -54928 2216 -4577 -62423 -91665 -44648 -26881 -30495 15274 13603 -17541 -10349 -74068 -156099
7376 -156099 -143376 -100201 -89714 -35462 -13513 -47868 -49300 -93811 -144782 -86653 -77553 -43337
7364 -43337 -22427 -16770 -45934 -130649 -122221 -74487 -76157 -32190 -45876 -70859 -57097 -53196 -60975
7351 -60975 -22064 -43340 -33556 -40749 -51039 -48890 -8955 -72095 -63765 -19900 -43165 1993 -59859
7338 -59859 -54668 -45896 -4150 71830 2389 -52026 -89352 -86161 -146397 -116180 -145490 -115720
7326 -115720 -105436 -112333 -24170 -9460 -20626 -51849 -18750 42594 7730 52395 -10834 -63841
7314 -63841 12138 41876 54546 -26971 27495 52798 43617 42362 94386 36542 -26677 10869
7302 10869 14639 -5306 -44100 -90935 -33422 -87187 -19752 17510 -10641 16678 -12920 6350
7290 6350 15968 38850 359 71026 56891 56756 37794 61906 30360 67016 67143 27508 -6294
7277 -6294 -84432 -25521 -6054 1840 -12802 -37051 -50705 -45205 -36940 -109701 -114093 -121628 -110704
7264 -110704 -132309 -191673 -185680 -122670 -111061 -99702 -56918 -66555 -38527 -81771 -43643 -45584
7252 -45584 -2993 -73870 -52755 -40083 -39033 -67262 -87111 -109024 -89975 -96997 -146001 -175296
7240 -175296 -165028 -172072 -204596 -125146 -128016 -129171 -208679 -224500 -167586 -105194 -155794 -202275
7228 -202275 -131369 -170632 -172082 -142836 -163829 -203193 -163422 -142374 -151569 -164403 -139614 -154214
7216 -154214 -169254 -175656 -179579 -166030 -210868 -186691 -204985 -233482 -153326 -133726 -196784 -241688
7204 -241688 -191963 -184731 -165747 -221400 -200585 -143736 -193232 -181697 -214957 -193842 -168096 -175812
7192 -175812 -187558 -136366 -130430 -111964 -100393 -77432 -77174 -66826 -96565 -151233 -158741 -115126
7180 -115126 -109193 -119409 -118182 -125300 -48957 -36323 -4499 -74028 -137480 -91873 -116598 -120788
7168 -120788 -83025 -95830 -175673 -183638 -154546 -172742 -188897 -44694 -46883 -147493 -174646 -105870
7156 -105870 -95787 -142433 -153214 -138550 -150436 -75308 -114775 -94480 -66544 -83551 -83164 -99918
7144 -99918 -33420 -74786 -37089 -29030 -45418 -38726 -60088 -52427 -22714 -22005 4932 8075 49609
7131 49609 -9930 24655 3437 -39862 -7 26118 86000 64357 -13076 -45286 -25634 -8518
7119 -8518 -16219 9220 63340 68828 38089 -19972 20721 25405 22178 9219 -36203 22752 39743
7106 39743 -252 -12022 36596 58896 41883 81434 27577 25129 24294 91606 68376 -36116
7094 -36116 -70210 -37138 32859 49735 4223 -10499 21933 51514 36243 -63554 -102823 -20423
7082 -20423 315 12010 38805 -68621 -90390 -96696 -82478 -69245 -52688 -47789 -157847 -147026
7070 -147026 -104521 -197161 -201462 -227108 -182542 -143208 -170783 -167059 -144214 -148604 -183667 -231246
7058 -231246 -160577 -134446 -120955 -65570 -39428 -100638 -111105 -124654 -119095 -142284 -138640 -106720
7046 -106720 -123935 -110290 -91940 -123857 -166024 -179320 -188988 -150401 -154774 -154332 -155580 -99908 -90819
7033 -90819 -39853 -92917 -165787 -198486 -223414 -142302 -85218 -130484 -188273 -197954 -100794 -127313
7021 -127313 -138959 -107521 -149154 -124685 -110577 -78928 -46913 -96549 -54922 -72021 -187878
7010 -187878 -143426 -144980 -181032 -141409 -74964 -11055 -56765 -77334 -78886 -56029 -36845 -64718
6998 -64718 -154685 -164921 -180237 -88920 -70091 -116952 -92251 -172991 -84411 -92801 -47715 -100080
6986 -100080 -110946 954 -41825 11330 2579 -58914 -53568 -16558 -28934 -49730 -68581 -28791
6974 -28791 15236 -11647 29241 -13063 -71601 -61082 -52390 -24794 -86981 -85959 -56380 -35787
6962 -35787 -51564 -118062 -126591 -82185 -73426 -94232 -22834 -26916 -25659 9698 27726 -55182 -25792
6949 -25792 -58144 -70391 -25384 -23215 -39346 -19641 -18705 -38693 12733 -65491 -83804 -10116
6937 -10116 -98597 -89944 -26473 -49100 -47981 24774 10319 -49306 -96854 -59046 -40413 -21982
6925 -21982 28586 -63411 -146775 -102988 -55936 -19941 -9210 -49797 -4889 -63918 -14724 16223
6913 16223 49120 23517 587 68271 72350 96885 72502 65526 49711 50528 124841 172846 164927
6900 164927 53446 101894 147342 176141 162720 117076 82777 89903 162065 166172 75192 93671
6888 93671 184605 178281 143344 118239 28244 56519 86917 45460 -2595 53846 105861 123011
6876 123011 141971 164768 175701 204943 178280 161571 248473 239084 303148 274827 315888 357759
6864 357759 290194 245062 274366 230234 215592 211655 185496 216907 242399 334983 400183 395174
6852 395174 389936 340322 338756 314485 261486 291458 245722 262162 351904 341582 361324 359817
6840 359817 404566 493114 421960 303601 347428 319967 247263 164348 141535 156316 96122
6829 96122 67755 78845 97078 26660 8699 59602 70009 10532 22392 32795 55408 116884
6817 116884 84591 57290 7176 54550 86913 47596 36288 36252 31620 36821 998 -62573 -10719
6804 -10719 14259 -27489 12821 -31564 23183 38724 31986 51486 35127 14071 11393 -57775
6792 -57775 -23861 50239 38912 -21108 -75547 6824 39222 53444 10788 -253 28765 88130
6780 88130 57823 5693 33692 103300 109818 83636 78044 77945 85222 134426 171869 164182 31716
6767 31716 75914 46274 47168 40040 13355 -12037 17508 58880 3867 -28359 21270 42771
6755 42771 58893 80228 82189 40514 34877 119368 101106 76379 51019 50885 15909 -27649 -17102
6742 -17102 -25891 -28965 52863 77592 22595 -9681 -59615 -29852 55613 -8832 -50246 -74569
6730 -74569 -25765 -42524 3844 -18859 -42374 -71933 -29921 27429 32644 3019 -13736 -47753
6718 -47753 -70470 -30482 -11819 4913 -31321 -19833 -2497 13885 40386 12291 -16729 -2305
6706 -2305 2858 5964 -33488 -25410 32085 51356 58094 33862 -15950 20663 80120 67320 89181
6693 89181 41181 -6478 37225 37758 53437 70894 34537 45926 60131 119742 57783 -30959
6681 -30959 5196 79669 137823 118851 36107 -45129 -3630 67818 36832 -40743 -16319 39491
6669 39491 51938 84687 22715 23401 143104 105973 122450 29286 -16617 21638 5303 5229 91899
6656 91899 51964 14216 28299 24996 53833 22299 -16137 -10911 24823 98999 77417 68547
6644 68547 89844 117207 133194 120308 143415 104098 91297 112422 140687 120171 100314 51992
6632 51992 74307 147854 121856 145282 159464 145391 78552 76728 111613 141401 102696 112171
6620 112171 205563 168022 186254 230211 221215 253935 243665 102214 59657 182543 215844
6609 215844 181637 150757 177116 206784 219972 228042 257763 234477 216943 244982 279530 394853
6597 394853 343547 267043 327557 300662 183709 243884 232335 198077 263754 299901 276413
6586 276413 284301 243345 303230 425278 425802 382147 432515 403100 384474 408241 286384 261179
6574 261179 311745 375492 417756 444060 426914 436434 440048 423039 442394 449593 441642 459252
6562 459252 562621 627628 645415 617684 614686 601223 595691 573204 541820 515119 576943 678076
6550 678076 713207 659742 681379 669909 583913 651578 668514 689973 686944 700234 706377 705538
6538 705538 698032 738252 705381 714687 719899 695887 763844 744093 778735 778669 776356 831714 870234
6525 870234 769943 780300 770275 830249 847930 832977 817722 798707 764317 769215 756555 739395
6513 739395 712924 726602 812096 815690 867345 848365 905981 902081 928318 983763 931109 901195
6501 901195 894364 906845 928265 882119 910353 919009 994802 1014535 1030770 1078573 1151194 1166497
6489 1166497 1144700 1143403 1241690 1196650 1216825 1244707 1297202 1306989 1265612 1236170 1210289 1308148
6477 1308148 1275071 1262324 1293424 1281481 1314358 1393042 1354080 1415215 1530376 1643493 1633997
6466 1633997 1612738 1586556 1652591 1736987 1817988 1922432 1970285 1990400 2084326 2215955 2326050
6455 2326050 2456071 2668111 2905748 3105425 3494252 3782326 4217733 4748436 5460786 6133325
6445 6133325 6701915 7197035 7351990 7191183 6838908 6301968 5652598 5039531 4540264 4139025
6435 4139025 3727042 3372140 3104258 2952117 2745866 2607380 2544706 2487365 2447039 2393602
6425 2393602 2376246 2422458 2295950 2307243 2339868 2325178 2291026 2213755 2247841 2285109 2293050
6414 2293050 2295298 2287240 2205772 2268601 2306204 2287213 2282256 2238049 2332613 2423986 2475729 2531410
6402 2531410 2563076 2638121 2712173 2794072 2919996 3002906 3149250 3387588 3761103 4104899
6392 4104899 4433681 4843803 5356677 5991957 6486173 6780958 6839141 6569370 6183409 5669913
6382 5669913 5107164 4581113 4139203 3706544 3389106 3148660 2935271 2816029 2679750 2552450
6372 2552450 2448073 2390448 2399629 2376586 2290454 2259341 2197257 2204061 2230956 2284220 2274532 2355672
6360 2355672 2399005 2337995 2324600 2337935 2382573 2383485 2469043 2479691 2511867 2590511 2601584 2747010
6348 2747010 2905192 2922299 2880747 2897386 2960589 2940816 2935033 3038193 3126691 3163847 3213049
6337 3213049 3254125 3322435 3420837 3467215 3546403 3641485 3768928 3821767 3847825 3867285 3890701
6326 3890701 3878870 3955577 4051307 4134721 4248921 4384237 4442121 4512330 4611048 4667931 4792060
6315 4792060 4836485 5007580 5090058 5141591 5258078 5400161 5521201 5724224 5959864 6131085
6305 6131085 6258358 6461275 6643770 6773625 6911278 7008386 7111468 7310150 7499406 7690426
6295 7690426 7883782 8086293 8215793 8535756 8841955 9101654 9404968 9783019 10190323 10564666
6285 10564666 10940990 11409484 11917553 12369715 13063134 13688990 14299429 14969532 15645233
6276 15645233 16351344 17049177 17569008 18190096 18747126 19407685 20172749 20958421 21776769
6267 21776769 22540199 23339063 24034989 24690907 25337089 25936851 26670194 27611893 28714131
6258 28714131 29936967 31431612 33137498 34875110 36599730 38253745 39561867 40474944
6250 40474944 40998379 41288528 41369313 41401867 41416040 41588797 41862170 42389422 43161194 44040479
6240 44040479 44833948 45423484 45901511 45990049 45905086 45840434 45914362 46334216 47217344 48416172
6230 48416172 50034752 52099288 54439862 56852369 58849948 60078572 60378051 59536052
6222 59536052 57643535 55152388 52655498 50386402 48542370 47174708 46233884 45643853
6214 45643853 45237829 44949218 44532492 43719969 42603999 41247089 39929301 38722244 37769988
6205 37769988 37054190 36615765 36509092 36642725 37006776 37510434 37803268 37803628 37459560 36570347
6195 36570347 35178627 33470872 31869224 30445737 29219021 28272475 27471168 26712713 26043331
6186 26043331 25417601 24658153 23773699 22671154 21428008 20174692 18952449 17923181 17028275
6177 17028275 16205404 15501700 14861487 14329052 13856742 13422701 13118063 12872000 12696547
6168 12696547 12528376 12328163 12213253 12144785 12043456 11973493 11925471 11863249 11691879 11596367
6158 11596367 11376933 11083499 10860209 10537610 10274320 10052990 9783679 9558658 9446437
6149 9446437 9407325 9299142 9208386 9170889 9138397 9131692 9050765 9062015 9099834 9170240 9240076
6138 9240076 9366381 9556192 9773849 9988507 10217563 10505511 10819922 11155592 11556510 12106231
6128 12106231 12603804 13124205 13676575 14242979 14719315 15008751 15125651 15127623 15044834 14889267
6118 14889267 14704514 14530988 14525369 14536660 14607305 14795883 15104206 15569922 16152824 16815157
6108 16815157 17496003 18164000 18867955 19546131 20189896 20923042 21616145 22346408 23058826
6099 23058826 23630293 24023363 24020124 23626769 22883661 21895292 20830041 19794758 18885930
6090 18885930 18244516 17805870 17577121 17498394 17634599 17923413 18387624 18968103 19548216 20076306
6080 20076306 20518370 20809598 20908416 20731376 20400174 19939969 19406680 18946401 18342447 17559923
6070 17559923 16707444 15815190 14912482 14076357 13317220 12707873 12124193 11661959 11365266
6061 11365266 11114412 10878363 10783041 10851593 10943624 11010669 11034126 10992137 10928455 10722788 10349783
6050 10349783 9854557 9334341 8882843 8415597 7975704 7591194 7236154 6967822 6770460
6041 6770460 6605177 6311509 6098581 5983618 5864550 5653205 5599503 5511415 5452959 5452461 5355362
6030 5355362 5301490 5220846 5214092 5189824 5145544 5155504 5096832 5047700 4975722 4961406 4932868 4844147
6018 4844147 4745855 4698713 4627140 4606192 4531180 4468001 4546398 4594786 4621657 4578270 4582374 4637498
6006 4637498 4691794 4739376 4790242 4815475 4833706 4896718 4955497 5025636 5096992 5164746 5258615
5995 5258615 5365816 5363689 5438012 5624854 5796332 6072540 6268744 6455434 6630929 6618044
5985 6618044 6561788 6416893 6277514 6236412 6226597 6306075 6352626 6457245 6550416 6702746 6969164
5974 6969164 7196251 7471663 7709254 7951571 8170742 8395051 8617838 8693333 8705899 8594298
5964 8594298 8533233 8366353 8228803 8053338 8011979 7978106 7944889 7924526 7968977 7953337 7948761
5953 7948761 7961818 7934215 8003423 8138959 8230839 8328443 8536047 8710827 8903599 8967834 8852508
5942 8852508 8684894 8449938 8269746 7985837 7755020 7594023 7488047 7374551 7190637 7059665
5932 7059665 6971052 6959913 7068874 7198058 7211251 7246008 7342834 7431436 7501242 7512847 7423336
5921 7423336 7422596 7408471 7363700 7305836 7284822 7288321 7369225 7464378 7625895 7731708 7856398
5910 7856398 8077070 8237749 8467893 8632094 8752049 8975615 9131063 9248410 9442231 9621923
5900 9621923 9827697 10106746 10432014 10809455 11178261 11617788 12148152 12682883 13217418 13710019
5890 13710019 14054591 14457679 14826295 14958767 15066598 15115843 14963174 14920446 14823016 14654137
5880 14654137 14722117 14972110 15290782 15785455 16334267 16897459 17534193 18183185 18732578 19225405
5870 19225405 19705976 20326662 21054751 21914016 22708817 23491494 24178965 24545055 24689068
5861 24689068 24659690 24239973 23459863 22343120 21114944 19939843 18887461 18072030 17417270
5852 17417270 17013963 16822382 16674922 16733806 17030753 17524090 18093398 18754768 19567533 20307303
5842 20307303 21051671 21604046 21957317 22146064 22045554 21571131 20837996 19952199 19066754
5833 19066754 18242834 17462546 16537159 15710665 14913357 14128547 13344486 12714594 12312012
5824 12312012 11983085 11705466 11615228 11655647 11809582 12078868 12478754 12847403 13074649 13015720
5814 13015720 12651892 12099244 11326883 10622241 10038580 9476550 8983575 8525110 8190144
5805 8190144 7898195 7568383 7347858 7161501 6896522 6682564 6621483 6464320 6292621 6146985
5795 6146985 6197768 6168206 6126365 6074651 6046468 6047023 6009829 6065698 5993685 5952764 5869676 5842602
5783 5842602 5823253 5753114 5748637 5713975 5684805 5662677 5625745 5620407 5602991 5675123 5662937 5612655
5771 5612655 5642304 5618985 5703763 5800777 5795207 5759901 5771974 5806410 5841862 5902830 5936765 5971692
5759 5971692 5994873 6031331 6080911 6079805 6149847 6282195 6358987 6468179 6457764 6513209 6621785
5748 6621785 6697001 6820232 6898783 6981593 7026917 7134170 7285473 7344095 7391454 7514067 7690638
5737 7690638 7763222 7903438 8059764 8228034 8389897 8555492 8787560 8966083 9194472 9442886
5727 9442886 9694868 9973072 10210914 10521935 10839358 11075776 11422323 11789642 12195004 12577332
5717 12577332 12918765 13350291 13878496 14453061 15081559 15727135 16488886 17296233 18102666
5708 18102666 18726007 19322415 19843787 20296694 20637992 20939013 21090436 21478579 21964701
5699 21964701 22477495 23058817 23698270 24474889 25268515 26146301 26948908 27654905 28271783
5690 28271783 28842407 29423675 30171756 31156988 32387615 33879452 35713508 37632931 39678421
5681 39678421 41665814 43677307 45474738 46987058 48143817 48746577 48688228 48114547 47143538
5672 47143538 45975258 44922916 44327639 44143170 44225841 44387500 44457152 44500839 44331683 43910299
5662 43910299 43687778 43736574 44072955 44959748 46098724 47403893 48952840 50707793 52620588
5653 52620588 54810519 57144435 59563949 61595518 62579700 62117841 60275006 57452500
5645 57452500 54142146 51047457 48334297 46046095 44264586 42781952 41548540 40508759
5637 40508759 39574090 38857984 38338280 38119340 38185993 38498248 39049176 39678285 40253712 40676398
5627 40676398 41001855 41241218 41463693 41828551 42178724 42228317 41677169 40498333 38677904
5618 38677904 36580010 34516418 32573807 30803486 29118097 27782828 26659154 25726648
5610 25726648 24911164 24264780 23838341 23610118 23438122 23352429 23353522 23491771 23622728 23567093
5600 23567093 23295289 22832226 22154219 21431177 20662479 19864697 19146404 18382711 17815675
5591 17815675 17378859 16904112 16431498 16046548 15665773 15366422 15136375 14905014 14677702
5582 14677702 14622529 14619980 14556206 14445495 14405329 14411960 14407795 14435909 14485680 14584825 14736547
5571 14736547 14836225 14849586 14719483 14488528 14224469 13950896 13655861 13495984 13281808 13126263
5561 13126263 12894446 12728413 12610785 12475456 12439013 12421748 12459931 12474133 12577643 12636271
5551 12636271 12755204 12864435 13008359 13203577 13297513 13410235 13589237 13767504 13940450 14061255
5541 14061255 14336283 14674074 15114763 15416061 15599347 15734587 15818382 15876047 16069664 16318189
5531 16318189 16628225 16917378 17231064 17679577 18100239 18603853 19066473 19646655 20450353
5522 20450353 21258779 22187172 23235496 24240277 25012910 25620772 26063921 26326227 26358247
5513 26358247 26270913 26106576 25971087 25907893 25798616 25640426 25452704 25359175 25229862 25128535
5503 25128535 25242305 25525726 25891391 26485638 27210296 28151413 29311437 30708805 32211981
5494 32211981 33734613 35099351 36142055 36862909 37120752 36915269 36546516 36030452 35443047
5485 35443047 34816171 34115986 33315778 32394504 31209527 29975450 29002748 28213860 27609408
5476 27609408 27164794 26948925 26895690 26946077 27051157 27428008 27836244 28230951 28632310 28837610
5466 28837610 28890924 28817023 28721867 28573012 28311720 27968244 27644775 27445059 27308979 27123079
5456 27123079 26995211 26989230 26864969 26678318 26769764 26900771 27237897 27724257 28320534 28909494
5446 28909494 29286193 29410348 29200912 28615926 28071853 27658510 27327366 27190531 27288844 27472006
5436 27472006 27779613 28195481 28724608 29408669 30198059 30946165 31667364 32357304 32937788
5427 32937788 33547106 34161713 34881946 35605610 36335965 36894998 37263074 37460791 37573932
5418 37573932 37624252 37617998 37464704 37355504 37152160 37106927 37167585 37233825 37490713 37941327
5408 37941327 38562435 39269421 40142293 41219468 42224249 43216674 44083106 44775458 45206158
5399 45206158 45387305 45504057 45789019 46312747 47067903 48041135 49212249 50543863 52031915
5390 52031915 53782911 55606129 57678663 59875109 62083359 64141795 66295984 68507561
5382 68507561 70884869 73385128 75796997 78232342 80456689 82133029 83097853 83365775
5374 83365775 83150651 82796883 82740043 83235994 84164717 85558857 87433082 89878628 92871292
5365 92871292 96307888 99954811 103920880 107949246 111992593 115783532 119042335 122054271
5357 122054271 125072655 128222848 131821043 136379646 141785661 148211384 155790324 164942701
5349 164942701 176441972 190810938 208160529 228507148 250680037 272253423 289145840
5342 289145840 297542279 296604936 288888344 276651740 260288125 240671316 219522391 198449530
5334 198449530 178673074 161112726 146255029 133974397 124020961 116208521 109917856
5327 109917856 104905750 101022499 97848944 95096346 92605747 90238768 87929973 85586484
5319 85586484 83324056 81329385 79698779 78566980 77940310 77528173 77395244 77461895 77487767
5310 77487767 77593965 77841144 78179059 78370135 78128459 77160238 75282300 72587075 69426621
5301 69426621 66189131 62908945 59857591 57100138 54641489 52411827 50375090 48388079
5293 48388079 46496380 44683927 43024084 41574300 40348459 39259394 38299444 37454362
5285 37454362 36694301 35953359 35290575 34619139 33965743 33376844 32637783 31939098 31295266
5276 31295266 30685540 30148858 29670260 29161724 28777114 28423897 28156353 27921113 27701356
5267 27701356 27600074 27641900 27773413 28042626 28464352 28952009 29501997 30329954 31440746
5258 31440746 32735652 34372418 36177101 37851183 38999483 38972324 37714845 35482184
5250 35482184 33001599 30680093 28644749 26966684 25603442 24579290 23659765 22879097
5242 22879097 22233424 21708044 21274189 20904341 20651347 20436854 20301510 20224595 20136193 20145840
5232 20145840 20059889 19987791 19932221 19811019 19781720 19875618 19908570 20011593 20006490 20084643 20162505
5221 20162505 20194883 20361954 20549433 20643834 20724444 20808651 20880844 21046240 21126819 21329140
5211 21329140 21575340 21742639 21845052 21768170 21659496 21543833 21446294 21447595 21454143 21413948 21539596
5200 21539596 21770261 21959384 22280008 22709110 23350268 24019570 24915841 25959119 27242475
5191 27242475 28623427 30057622 31614824 33201450 34777856 35982061 36654890 36738122 36104585
5182 36104585 34663819 32751902 30862046 29150539 27715100 26618742 25757127 25059368
5174 25059368 24588095 24303106 24108547 24087145 24322880 24505562 24826176 25339328 25849750 26502760
5164 26502760 27281014 28311192 29579494 31029737 32541982 34010152 35296861 36079896
5156 36079896 36143610 35467477 34313855 33117127 32115318 31326136 30950158 30915401 31145162
5147 31145162 31650574 32566870 33718490 35187111 36997437 39115032 41461859 43861472
5139 43861472 46414988 48991138 51478036 53649082 55379490 56671883 57407975 57480499 57009445
5130 57009445 56104557 54956901 53621727 52132560 50425177 48412631 45809213 42851950
5122 42851950 39564006 36191155 33067345 30422992 28131632 26198996 24600911 23238186
5114 23238186 22204449 21457485 20754633 20025830 19344226 18729509 18258718 17876093 17527505
5105 17527505 17310777 17139135 16949207 16919892 16884263 16878907 16992118 17075875 17147746 17294006
5095 17294006 17568099 17802269 17872621 17914944 17727943 17275163 16676557 15989756 15201111 14403024
5085 14403024 13706180 13129307 12699211 12305034 11997346 11811117 11722811 11614320 11419957 11326700
5075 11326700 11214833 11097910 11030897 10872023 10766102 10605372 10489603 10218194 10008355 9896801
5065 9896801 9843589 9828918 9863715 9959600 9996875 10153494 10354162 10516186 10604103 10721490 10744429
5054 10744429 10642581 10415315 10179420 9919429 9668855 9449062 9185035 8927215 8734744
5045 8734744 8578763 8383423 8100153 7883180 7815049 7736545 7635828 7605982 7561859 7652017
5035 7652017 7778842 7851095 7955150 8082210 8179911 8314269 8394299 8498544 8584532 8597528
5025 8597528 8628832 8699317 8817979 8933690 8864313 8801229 8618538 8315441 7945810 7579894
5015 7579894 7234596 6999778 6804100 6623352 6417533 6240961 6064779 5986311 5884083 5726426
5005 5726426 5660265 5621893 5589311 5446850 5402528 5414512 5379806 5349845 5303995 5202675 5160353
4994 5160353 5126652 5104073 5080697 5128262 5152410 5147532 5141648 5235954 5264427 5186972 5064360 5069951
4982 5069951 5071375 4956731 4787693 4700306 4605337 4578829 4538715 4592240 4604171 4516675 4545984
4971 4545984 4541142 4487501 4436817 4412717 4438487 4403336 4328457 4360902 4358006 4343458 4365252 4343057
4959 4343057 4251569 4334348 4452113 4506504 4515154 4448662 4473147 4487811 4489358 4488868 4494917 4506174
4947 4506174 4579583 4590343 4599079 4630722 4622087 4641460 4626008 4586182 4619314 4644802 4718097 4774200
4935 4774200 4725226 4776087 4800671 4810934 4890774 4990537 5062232 5115591 5072407 5165101 5294200
4924 5294200 5389701 5579331 5739268 5881689 6091408 6242562 6466575 6674298 6875320 7033039
4914 7033039 7075025 7058256 7069589 7035919 7090423 7158296 7282249 7378041 7456263 7618584 7627542
4903 7627542 7614354 7578296 7660077 7766441 7796752 7912011 8083304 8243642 8373763 8596030
4893 8596030 8803165 9151503 9499716 9806868 10055036 10354831 10564442 10695396 10907480 11089928
4883 11089928 11272141 11393212 11650348 11794706 11979557 12201559 12416247 12667478 13031261
4874 13031261 13308882 13670487 14093275 14446566 14830844 15236569 15594453 16009880 16458450
4865 16458450 16954386 17470906 17970575 18427397 19050453 19741783 20516708 21298194 22095260
4856 22095260 22969666 23952705 24752542 25396846 25977879 26333783 26549601 26754490 27025393
4847 27025393 27422128 27837892 28314352 28855120 29439491 30182914 30960820 31754314 32670808
4838 32670808 33638497 34589140 35643722 36724768 37780523 38767995 39798122 40894241 42049664
4829 42049664 43294819 44777285 46340361 48176814 50394711 53091193 56132693 59629866
4821 59629866 63722923 68469124 74106274 80983996 89686629 100716603 113925587 127838302
4813 127838302 140274036 150657223 156263548 154788290 147635397 135218568 120116455
4806 120116455 105958868 94543524 86173053 80096790 75793420 72977261 71539160 71328188
4798 71328188 72113484 73931335 76935328 81147472 86892619 94919213 105595256 118419864
4790 118419864 132035282 143384850 149885492 149534536 142649407 130636507 115209232 99990870
4782 99990870 86909308 76471305 68423960 61961945 56739014 52342114 48677638 45867588
4774 45867588 43530974 41629091 40251756 39182796 38230389 37173379 36075544 34729890
4766 34729890 33152447 31538411 30040979 28832144 27788407 26746186 25757317 24955143
4758 24955143 24263447 23653427 23229847 22904976 22595726 22383274 22197920 21869684 21615618
4749 21615618 21434952 21342986 21400658 21514114 21739413 21983615 22219299 22299247 22106485 21763473
4739 21763473 21334747 20966277 20737185 20781485 20960927 21237083 21711894 22429498 23350132 24574704
4729 24574704 26226432 28519832 31395095 34855354 38258927 40994459 42559074 41868688
4721 41868688 39779233 36477070 32296858 28334671 25024265 22402691 20358855 18724829
4713 18724829 17397219 16342489 15539513 14856856 14273982 13783806 13289913 12825799 12371929
4704 12371929 11962763 11631556 11323371 10960464 10576149 10336501 10079163 9786209 9465240
4695 9465240 9251004 9014134 8841476 8692844 8548487 8417508 8325385 8294874 8288267 8218012
4685 8218012 8201742 8173370 8220098 8283596 8390162 8534513 8627742 8765846 8856718 8998090 8964362
4674 8964362 8903424 8710726 8540187 8426684 8218096 8148194 8098349 8066824 7997701 7954460 7963884
4663 7963884 8014133 8029911 8137213 8253191 8251956 8318399 8356112 8519347 8611359 8758995 8918407
4652 8918407 9010815 9194397 9378306 9512476 9732001 9866170 10065038 10279446 10516841 10728840
4642 10728840 10798233 10700149 10627451 10415170 10075959 9800365 9325069 8923500 8625753 8341823
4632 8341823 8129704 7919201 7676133 7580695 7491000 7409024 7315203 7182675 7082674 7067989
4622 7067989 7095369 7055589 7063066 7036695 6991729 7011498 7016755 7005173 7062034 7048178 7044274 7030442
4610 7030442 6997941 7055950 7043094 7055300 7126605 7133338 7105038 7138887 7175540 7262474 7212966 7127658
4598 7127658 7168158 7171317 7208499 7206128 7137506 7113231 7173051 7118874 7078826 7123641 7147274 7151819
4586 7151819 7147442 7111417 7096631 7046220 7008294 7031063 6964699 6918083 6930846 6871931 6869118 6787415
4574 6787415 6730039 6611157 6533785 6526371 6441798 6336533 6244278 6165359 6115285 6091065 5967000
4563 5967000 5902159 5805571 5734463 5657954 5567613 5533842 5512962 5478674 5368745 5192553 5223194
4552 5223194 5171182 5080677 5010914 4941030 4878407 4844688 4787893 4756703 4728473 4675819 4626447
4541 4626447 4559531 4549126 4474577 4431495 4418447 4401552 4433409 4442888 4375360 4353671 4348899 4284633
4529 4284633 4241534 4214736 4116426 4107518 4053514 3977682 3916147 3857020 3787299 3775264 3796697 3708388
4517 3708388 3701206 3710005 3708162 3774394 3819622 3917125 3951288 4093157 4235435 4320004 4496163
4506 4496163 4701089 4961302 5361046 5872100 6243947 6480536 6717698 6827135 6623492 6288134
4496 6288134 5832357 5457733 5056582 4689197 4355209 4034013 3780963 3558802 3403036 3265802
4486 3265802 3206420 3096329 2953749 2859331 2858603 2779557 2762182 2749576 2731568 2733732 2759147 2781441
4474 2781441 2822672 2874881 2828332 2809245 2663221 2567962 2523510 2470946 2397431 2315988 2306434
4463 2306434 2323511 2319917 2278615 2262049 2269222 2211264 2233065 2151375 2168375 2217135 2245369 2268067
4451 2268067 2211658 2212972 2240683 2257675 2269357 2336705 2431528 2477139 2466953 2492685 2552098 2581044
4439 2581044 2533684 2514457 2430135 2420317 2472576 2495155 2551283 2634643 2644383 2626809 2674300 2738470
4427 2738470 2793903 2898344 2933167 3030601 3118368 3148541 3321077 3405387 3482021 3488194 3637477
4416 3637477 3782071 3735683 3718446 3751783 3701978 3672094 3666237 3652989 3614201 3494882 3367388
4405 3367388 3344820 3315596 3264201 3323356 3229540 3239634 3247192 3241877 3239353 3192234 3142455 3081504
4393 3081504 3020603 2967212 2856820 2786276 2720404 2657760 2583922 2532341 2457064 2407551 2487700
4382 2487700 2501531 2513680 2469264 2410337 2371398 2357559 2432146 2418253 2396627 2392327 2383843 2296783
4370 2296783 2266079 2244640 2194291 2238362 2158689 2120677 2095171 2055046 2055215 2022614 2051078 2058762
4358 2058762 2052130 2025063 2022083 2053497 2095017 2166469 2249909 2255323 2309613 2402379 2421222 2406030
4346 2406030 2481836 2608718 2659757 2680256 2689882 2703305 2770146 2826671 2848072 2900627 3044517
4335 3044517 3188964 3330287 3639029 3909479 4129160 4426636 4710941 4892107 5084053 5197020
4325 5197020 5191325 5055480 4738883 4396200 4152845 3905716 3654855 3503941 3405111 3287344
4315 3287344 3255550 3143157 3066774 3017298 2986817 2946953 2796130 2691783 2614635 2474949 2312713
4304 2312713 2186557 2159987 2101083 2064411 1965898 1963188 1915350 1851584 1855999 1786337 1807475 1780221
4292 1780221 1797509 1808595 1868927 1849001 1805418 1877299 1885123 1934221 1873041 1848136 1974813
4281 1974813 2035677 2105550 2142849 2112530 2098801 2146730 2083912 2003640 1968203 2020996 2024202 1940463
4269 1940463 1894826 1976115 2047287 2132397 2177884 2194298 2205262 2179596 2171259 2109529 2080419 1999226
4257 1999226 1896574 1841708 1832039 1839008 1788637 1811886 1827793 1731580 1754815 1667628 1671001 1695546
4245 1695546 1707129 1728045 1758963 1720068 1750907 1776564 1773243 1744963 1764054 1871165 1925051
4234 1925051 1999458 2020548 2037165 2011065 1985253 2073666 2180571 2223087 2374282 2323546 2395416
4223 2395416 2456169 2501565 2531595 2556266 2623770 2781506 2983580 3099478 3245515 3368073
4213 3368073 3507153 3739025 3930843 4232461 4502829 4766824 5104222 5505218 6038147 6525267
4203 6525267 7028559 7682544 8381845 9120468 9893332 10587717 11110316 11340408 11235774 10825789
4193 10825789 10224594 9421354 8583410 7663443 6997321 6344786 5784005 5347719 4838368
4184 4838368 4431899 4116831 3799333 3532126 3379982 3203271 3031869 2837763 2705029 2617472
4174 2617472 2491892 2368933 2262431 2214465 2177765 2092374 2051028 2015239 1953772 1866269 1796926
4163 1796926 1842393 1784809 1715825 1699952 1688520 1697110 1686573 1572373 1599660 1705677 1618752
4152 1618752 1533290 1515825 1492524 1471624 1536133 1520756 1491596 1507481 1531005 1482693 1473864 1476290
4140 1476290 1474326 1490736 1523853 1595215 1582417 1661167 1713359 1675310 1784421 1878997 1885390 1947552
4128 1947552 2024016 2037836 2056968 2079136 2063384 2002807 1955817 1920027 1869731 1768546 1678265
4117 1678265 1622822 1626285 1611875 1593478 1578575 1603452 1575709 1482306 1518056 1531747 1500520 1484275
4105 1484275 1468144 1372275 1349802 1351131 1366008 1416106 1380710 1375530 1439118 1434291 1480268 1475718
4093 1475718 1470280 1477112 1483127 1548440 1566905 1530962 1526521 1585110 1642008 1631069 1538833 1545867
4081 1545867 1573543 1550246 1549418 1619063 1581719 1626778 1625991 1566432 1611273 1635074 1588502 1561233
4069 1561233 1617871 1645483 1638278 1632241 1654420 1633017 1675162 1647394 1570098 1577202 1678867 1745926
4057 1745926 1709659 1764799 1791681 1777822 1833005 1792220 1762140 1804605 1845458 1830246 1818741
4046 1818741 1812211 1823064 1804911 1813328 1898680 1944490 1873913 1853495 1857714 1851696 1918170 1909129
4034 1909129 1932132 1974286 1898666 1957470 1968000 1988614 1998624 2017631 2057128 2021378 2059960
4023 2059960 2071715 2090971 2114856 2140787 2149876 2084691 2062655 2079584 2095047 2113527 2068706 2071166
4011 2071166 2083013 2047079 2075363 2119539 2089789 2094957 2126841 2116663 2086038 2119320 2166741 2247362
3999 2247362 2295211 2307934 2319239 2293533 2306647 2336363 2314321 2344465 2396924 2476300 2383246
3988 2383246 2357252 2366994 2340216 2387160 2466519 2446899 2394320 2418935 2421167 2439036 2392591 2357328
3976 2357328 2390019 2445998 2489488 2467486 2457447 2486236 2475718 2454449 2450139 2565948 2510123
3965 2510123 2436152 2555586 2618633 2706133 2702153 2687821 2707564 2723145 2702674 2695197 2700641 2766007
3953 2766007 2756678 2766526 2724137 2759972 2758881 2813342 2876555 2888733 2930775 2962599 2998362 3003652
3941 3003652 3025014 3013949 2978232 2971172 3054559 3104706 3143199 3116672 3188283 3108198 2996488
3930 2996488 3011910 3027254 3032124 3110109 3085230 3102519 3090473 3134125 3183074 3127156 3104239 3144318
3918 3144318 3246886 3255454 3264315 3303701 3348900 3395830 3443238 3400036 3401965 3388684 3399343 3382439
3906 3382439 3370938 3436113 3483913 3550880 3591516 3616694 3620520 3682437 3627823 3614896 3767919
3895 3767919 3803764 3720654 3799350 3780381 3750593 3768050 3807012 3838542 3931149 4080988 4116214
3884 4116214 4169538 4154607 4191523 4167615 4049920 4060983 4053163 4078069 4042236 3993753 4034227
3873 4034227 4143554 4155941 4102288 4199980 4209921 4233504 4320647 4279116 4289387 4321825 4378025
3862 4378025 4344945 4379051 4367518 4365619 4388869 4474217 4501882 4509956 4519758 4523836 4586119 4603895
3850 4603895 4610766 4595338 4625058 4616744 4691825 4736118 4772589 4761896 4710427 4795591 4820859 4837049
3838 4837049 4919731 5020129 5101444 5058647 5088272 5152224 5183836 5212819 5316508 5379198 5384097
3827 5384097 5417167 5449526 5519668 5623516 5649682 5687655 5738283 5885824 5833903 5862717 5968005
3816 5968005 5957180 6048706 6108258 6126618 6167618 6149494 6174941 6195066 6220971 6249075 6349605
3805 6349605 6382659 6346212 6414677 6365081 6451070 6477310 6503122 6588991 6624079 6681995 6652828
3794 6652828 6660246 6727399 6752406 6740637 6833729 6852810 6897165 6835024 6805358 6805255 6917830 6965442
3782 6965442 6917310 6928460 6938440 6924802 6972539 7009342 7021752 7015686 6964583 7004268 7068464 7033630
3770 7033630 7039147 7067082 7154434 7195779 7233582 7340074 7334744 7413484 7523842 7517156 7550980 7534405
3758 7534405 7541649 7614869 7631382 7632247 7596980 7738912 7735462 7760654 7880108 7875182 7771923 7780856
3746 7780856 7804557 7850801 7811847 7785806 7821535 7799337 7788144 7799284 7781776 7675091 7700461
3735 7700461 7767306 7731677 7742874 7844076 7804245 7792217 7823148 7826448 7810842 7819124 7818178 7844767
3723 7844767 7910831 7995195 7996708 7937200 7985047 8005965 8069062 8153013 8294101 8337130 8330077 8318066
3711 8318066 8263996 8262636 8286799 8234094 8287396 8420964 8452870 8422671 8443364 8443251 8564655 8580404
3699 8580404 8621333 8732000 8809483 8850906 8904562 8949318 8943135 8969699 9033890 9060303 9060200 9114423
3687 9114423 9246506 9269138 9359577 9449058 9551429 9715226 9806213 9901197 9943008 9948556 9948294
3676 9948294 9956461 10035858 10051147 10078088 10126387 10204343 10301446 10411788 10472694 10512470 10610795
3665 10610795 10721595 10771136 10803177 10765501 10799974 10945151 10968661 10972569 11051171 11123943 11168463
3654 11168463 11298054 11362862 11528123 11576016 11619617 11646709 11735396 11764552 11814314 11811227 11762659
3643 11762659 11702091 11672802 11796670 11865059 11883511 11976079 12095554 12183506 12251817 12371237 12457339
3632 12457339 12570487 12636528 12751227 12843456 12854197 12913914 12916262 12907311 12816520 12829128 12762779
3621 12762779 12681800 12620234 12574597 12564729 12554128 12551284 12629396 12622513 12596877 12606221 12647542 12671474
3609 12671474 12597168 12574185 12547018 12637612 12664498 12713302 12800744 12903658 12995434 13045051 13159561
3598 13159561 13244528 13215812 13348987 13341039 13422404 13458565 13419037 13407994 13340563 13323790 13267021
3587 13267021 13243954 13223849 13160129 13147188 13148110 13094809 13054119 12963228 12949286 12903905 12958361 12939196
3575 12939196 12888440 12976663 12989501 13036523 13110173 13165692 13277823 13370238 13439716 13555802 13645116
3564 13645116 13745632 13784380 13885996 13994012 14053315 14178771 14164702 14133481 14195370 14260784
3554 14260784 14244232 14153143 14233076 14286391 14327342 14396537 14438889 14491009 14589579 14701237 14855868
3543 14855868 14965126 15036427 15068282 15171401 15343933 15387476 15507113 15667053 15809309 15983063
3533 15983063 16091661 16197386 16409782 16571614 16702066 16747710 16934487 17103416 17273907 17464229
3523 17464229 17640680 17848024 18071153 18298572 18409851 18552440 18736073 18990661 19161177
3514 19161177 19386518 19623017 19808447 20005262 20234287 20475095 20727749 20970730 21167372
3505 21167372 21362095 21559946 21835619 22023484 22196207 22463447 22755529 23026236 23374247
3496 23374247 23666009 24018963 24303529 24625062 25007094 25394015 25758992 26174672 26613053
3487 26613053 27011057 27354654 27790983 28269856 28728615 29177330 29578132 30089566 30667042
3478 30667042 31262421 31750420 32256143 32812427 33269092 33734644 34247557 34775579 35247437
3469 35247437 35837439 36386705 36999416 37661250 38374065 38978887 39591009 40315499 41142342
3460 41142342 41899865 42606434 43365940 44107526 44952011 45783868 46621669 47474803 48350953
3451 48350953 49230662 50246066 51266699 52356926 53427402 54486429 55626151 56780210
3443 56780210 57828928 58928177 60131962 61346681 62556946 63729666 64978704 66233172
3435 66233172 67486329 68790804 70088477 71320060 72630988 73944900 75246298 76612047
3427 76612047 77994429 79424257 80774626 82102891 83612676 85228294 86849625 88453754
3419 88453754 90234907 92079890 93926860 95881354 97942664 100174487 102442554 104888219
3411 104888219 107453670 110164239 113038106 116174496 119478427 123010217 126908500 131083770
3403 131083770 135465599 140268750 145547959 151298784 157432465 164176654 171469966 179187822
3395 179187822 187312999 195977356 205027864 214492105 224244323 234148893 244096511 253745278
3387 253745278 262718061 270619752 276883343 280900174 282051681 280143612 275098660 267289911
3379 267289911 257713770 247226008 236791366 226830798 217591342 209098752 201178379 193908987
3371 193908987 187290929 181081482 175215490 169718963 164564557 159476457 154589373 149933728
3363 149933728 145392167 141259158 137287663 133521810 129970161 126499990 123167761 119979908
3355 119979908 116943735 113876174 110878409 107908962 104899976 101913285 99136428 96580370
3347 96580370 94084374 91680572 89363765 87165379 85113397 83179004 81389562 79633270
3339 79633270 78039489 76560717 75189870 74011990 72947685 71830061 70632802 69387342
3331 69387342 68150244 67064515 66195944 65385646 64725226 64186517 63802319 63577427 63355587
3322 63355587 63257670 63350584 63314043 63299288 63616458 64267352 64852136 65189886 64910340 63856221
3312 63856221 62313783 60449720 58725470 57231023 55812152 54420067 53246908 52156563
3304 52156563 51164136 50369696 49701266 49098964 48540903 48143842 47762543 47550668 47495468 47567300
3294 47567300 47796967 48120877 48628621 49253605 50044115 51024017 52207079 53735589 55754256
3285 55754256 58092558 60639704 62705692 63606083 62845206 60410723 57148522 53856486
3277 53856486 50752067 48003544 45709258 43737882 42111269 40821892 39656919 38707890
3269 38707890 37858086 37204992 36675159 36214304 35834283 35543406 35340874 35177519 35128840 35220904
3259 35220904 35403376 35629630 35904876 36326637 36856835 37483174 38316850 39308543 40253492
3250 40253492 40735633 40456819 39346031 37786057 36010664 34405154 33049014 31985654
3242 31985654 31091513 30343300 29712280 29187693 28688268 28282920 27944577 27571400 27187230
3233 27187230 26942589 26674077 26446717 26328457 26158320 25954960 25769560 25517787 25325046
3224 25325046 25094922 24870055 24634194 24406810 24176936 23956849 23733456 23508527 23333931
3215 23333931 23112854 22898301 22676300 22501610 22267243 22094999 21923410 21698912 21547729
3206 21547729 21391684 21216856 21001960 20933803 20796603 20650394 20546656 20415702 20181185 20058925
3196 20058925 19940206 19786172 19681885 19569886 19461676 19282644 19068023 18877719 18627316
3187 18627316 18441788 18305229 18059300 17896288 17643476 17450995 17365638 17196192 17034873 16881842
3177 16881842 16781727 16728870 16565453 16470364 16329616 16288228 16174261 16082371 16026890 16057978
3167 16057978 15939504 15850966 15830500 15748409 15749037 15746485 15712226 15688118 15646691 15639738 15652271 15706080
3155 15706080 15639578 15634693 15667309 15596679 15616090 15640810 15642995 15693774 15701786 15761423 15873027 15972535
3143 15972535 16015942 16077463 16174496 16274948 16405642 16513254 16568426 16764422 16991289 17213266
3133 17213266 17394488 17517617 17676940 17923639 18149901 18286629 18491407 18798091 19047474
3124 19047474 19308932 19526493 19796012 20078211 20384074 20723258 21029407 21307539 21530551
3115 21530551 21885094 22248200 22614574 22984936 23390890 23869614 24427801 25021889 25637932
3106 25637932 26275652 27001859 27635360 28255865 28667564 28970563 29244343 29357657 29510586
3097 29510586 29713316 30054056 30433941 30886383 31384336 31994231 32652885 33391563 34283826
3088 34283826 35121964 35983763 36997473 38142040 39300837 40434162 41668539 42957142
3080 42957142 44270729 45493839 46806951 48116207 49482337 50986430 52461534 54067861
3072 54067861 55573027 57015583 58145548 58804028 59130627 59293584 59362045 59546202 59843033
3063 59843033 60313136 60969549 61770886 62892933 64174973 65606382 67228012 69057979 71028279
3054 71028279 73012076 75186970 77531715 79997682 82591473 85318713 87979352 90453326
3046 90453326 92407663 93927628 94894171 95184537 94644698 93272814 91336095 89395281 87678678
3037 87678678 86296993 85309369 84774622 84479996 84488616 84797545 85274311 85900519 86760083 87666795
3027 87666795 88596167 89643947 90733252 91897435 92965811 93927876 94756859 95091874 94983837
3018 94983837 94445884 93477737 92157689 90728417 89144784 87370659 85246888 82839339
3010 82839339 80453873 78237649 76281708 74566758 73143841 71917946 70992534 70179954
3002 70179954 69509406 68908757 68372285 67757832 67069384 66245845 65311264 64248419 63146867
2993 63146867 61799527 60111695 58147904 55932855 53659152 51291963 48924770 46661627
2985 46661627 44538909 42658224 40847853 39117700 37547579 36156240 34928946 33793065
2977 33793065 32775589 31830289 30896939 30110593 29357328 28632046 27939002 27187940 26583539
2968 26583539 25889666 25114760 24522938 23852674 23190087 22503056 21938790 21315986 20669878
2959 20669878 20070622 19514842 19013367 18472909 17899301 17397812 16899424 16520546 16257173
2950 16257173 15859502 15415299 15085041 14781098 14436035 14085609 13743894 13551002 13329759
2941 13329759 13051764 12820022 12612153 12427741 12284169 12092592 11935550 11780901 11604067
2932 11604067 11460285 11265515 11113466 10920305 10705220 10571040 10395038 10109824 9867142
2923 9867142 9645025 9412509 9207642 9005713 8793865 8658615 8468040 8363655 8158866 7960673
2913 7960673 7888007 7784114 7716999 7606287 7503085 7338629 7235157 7177704 7038791 6959777
2903 6959777 6858317 6812422 6656908 6517440 6404678 6333512 6227797 6038137 5963910 5871175
2893 5871175 5783547 5605881 5450622 5388340 5295293 5227053 5024616 4973548 4865310 4762180
2883 4762180 4675659 4563145 4445739 4382900 4354782 4295410 4239968 4149957 4053302 4011150 3989844
2872 3989844 3909439 3860745 3788038 3770854 3695392 3664057 3647374 3613430 3541914 3514462 3471283
2861 3471283 3413391 3369385 3374802 3257220 3240844 3183427 3117923 3049024 3044408 2989208 2956608 2904841
2849 2904841 2891106 2873203 2887439 2834831 2813450 2817846 2782156 2801744 2784610 2740505 2704193 2614195
2837 2614195 2689536 2673960 2687537 2688743 2575089 2557418 2531013 2465888 2435301 2410972 2417946 2435050
2825 2435050 2378620 2402098 2391187 2319069 2338056 2355309 2367195 2322396 2354092 2338850 2312648
2814 2312648 2264508 2236535 2283900 2180434 2161743 2110079 2094382 2158662 2110199 2077585 2103604
2803 2103604 2174089 2169970 2071830 2085113 2070881 2042181 2058696 2075580 2092926 2087198 2081143 2031144
2791 2031144 2031094 2002141 2016301 2062332 2010851 2055967 2054173 2036756 2016507 1980462 1982634 1951964
2779 1951964 1942589 1970429 1893020 1898203 1914540 1953594 1892957 1857966 1938483 1942741 1941498 1962163
2767 1962163 1898019 1887444 1898156 1948913 2004944 1957443 1894952 1929507 1956353 1914686 1830986
2756 1830986 1934275 1860259 1863570 1884646 1840439 1848304 1821143 1849030 1793606 1798353 1758422 1756350
2744 1756350 1741989 1710514 1764576 1728689 1714920 1727957 1691496 1735400 1715000 1661098 1682173
2733 1682173 1702305 1737127 1678399 1691940 1692969 1654465 1613627 1641921 1543676 1494114 1521819 1527700
2721 1527700 1483621 1487474 1523859 1479489 1545534 1529140 1477998 1434191 1448541 1437728 1428859 1362218
2709 1362218 1351351 1328834 1287643 1247594 1240423 1248136 1255696 1288086 1258545 1191204 1241188 1202314
2697 1202314 1157617 1166068 1149222 1082503 1049536 1078545 1033702 1025738 1034592 1005411 1025813 1033191
2685 1033191 973850 981082 951592 1015924 1005471 969807 950621 918798 970244 1005037 934956 902155
2673 902155 884630 921838 926847 839608 826664 832375 829548 889663 809838 856890 870524 847310
2661 847310 850416 850445 853830 804640 805661 829866 841625 794418 814147 792689 783481 749199 737908
2648 737908 768497 765216 743825 757035 725664 632340 653048 680298 607704 606432 623680 633074
2636 633074 616069 580671 604725 627126 594694 616765 571446 577250 570735 558327 588394 612268
2624 612268 596968 631937 643872 620506 542410 579371 539926 524212 513817 458803 505803 483044
2612 483044 465312 516670 504219 473880 492749 456878 399921 442196 492048 481648 499115 507164
2600 507164 508830 489720 458703 461921 464817 455353 371164 409541 420927 410555 379842 360354
2588 360354 386971 431287 381029 270539 295745 318374 254403 286409 350291 363800 347024
2577 347024 354587 316084 243738 307776 310699 297463 289641 251389 300724 325634 251461 286468
2565 286468 268895 254587 242644 213986 195784 168073 259545 265362 277262 276831 279344 280866 187705
2552 187705 194531 161824 177940 183741 169244 172574 223642 199023 112444 138546 188891 172521
2540 172521 124729 91386 115608 97015 41916 71179 125050 138098 181200 193463 199490 82295
2528 82295 120947 134346 87669 118202 149701 150523 116555 107879 145442 184690 173376 141877
2516 141877 122868 183912 118924 101762 95314 10029 19677 117046 104938 99821 108738 138092
2504 138092 153004 110026 87848 92910 106596 51381 71598 38398 90711 132469 134979 90497
2492 90497 103866 22943 32382 39263 25707 -32447 10025 57493 -2206 36121 47752 44821
2480 44821 34145 4341 -7325 104560 187630 124892 21777 34690 83189 69233 6056
2469 6056 34593 52522 80526 34244 16267 36606 16413 6894 36668 41309 12220 88232
2457 88232 59237 -15384 -7928 -8714 1136 3758 20433 20687 3601 -33429 -28722 -18363 952
2444 952 11883 18075 -12964 58605 105555 82260 2491 -28189 -2362 -27718 -49392 -24545
2432 -24545 -24979 -27867 42970 30327 51552 26050 -41217 -82872 -61948 -49390 -38436 35385
2420 35385 18979 4127 -45529 -56846 -16082 -18370 7124 -27302 -27503 31985 -27333 -33880 -28781
2407 -28781 -102632 3019 49138 -7354 -95742 -142101 -31071 -22075 -8968 -16180 -4455 -6333
2395 -6333 -64288 -75468 -27155 -15623 -17343 29286 -33066 -48891 -14005 5471 -11337 -136111
2383 -136111 -13917 -7316 -35020 -7946 -62322 -5354 57557 67317 93277 -33046 -65911 13641
2371 13641 -24084 -24694 -4280 -45142 -51230 4254 5388 -2896 22397 2729 40607 32115 -72458
2358 -72458 -25060 -6359 -48880 -15671 -18105 -68414 -41939 -15179 -11012 -43975 -18092 9722
2346 9722 605 25261 -2591 -37688 -53852 27266 50098 63469 31229 -6141 44087 126677
2334 126677 111739 83359 89969 66555 109826 89572 42000 55973 32607 43761 41390 18551
2322 18551 44308 4259 45954 77124 106231 85346 21336 26965 13889 78189 172943 125858
2310 125858 94554 114589 157788 136239 107611 132340 203383 217877 162990 127224 99746 127408
2298 127408 185670 152107 190027 290702 296885 305331 334862 333298 373574 373951 363454 284980
2286 284980 343951 427401 420569 414140 387495 373292 446501 430955 491807 542038 514908 549420
2274 549420 539863 535417 575584 649694 679234 748742 850180 880983 994093 1057746 1146002 1249626
2262 1249626 1316056 1492648 1637622 1741180 2000978 2218648 2413383 2728968 3204085 3748431
2252 3748431 4473598 5294820 6108892 6889847 6906973 6047776 4917508 3983658 3265901 2782719
2242 2782719 2432710 2149601 1884723 1700009 1452034 1310904 1275025 1205201 1084152 976842
2232 976842 919023 819331 774340 706600 615099 602839 536518 485841 384196 320395 360487
2221 360487 341560 281622 276614 290737 314884 328199 294309 238384 161662 132679 206700 261756
2209 261756 240527 192084 121224 93635 44993 47290 11018 56052 83695 102887 88592 126478
2197 126478 76619 65613 55415 1598 56137 27977 4907 24733 16366 -3702 27315 6496
2185 6496 18748 70450 1440 -50783 2174 24403 -16853 -6587 7641 -28430 14449 -82323
2173 -82323 -35301 -72424 -77150 -63554 -49770 -66741 590 9460 -61816 -71058 -75031 -75178 -54551
2160 -54551 -9512 -29852 -76066 -94740 -91249 -64393 -82313 -85540 -49869 -38312 -44992 -27770
2148 -27770 -62210 5142 -2274 -71468 -67021 -38538 -130721 -137301 -82929 -84182 -93620 -51581 -101822
2135 -101822 -61129 -43285 -78692 -32734 -29614 -16045 -30267 12324 -19633 -44525 -41505 -13899
2123 -13899 -58534 -61981 -70840 -103299 -85360 -46130 -41594 -13516 -64939 -35023 -29684 -81555 -95411
2110 -95411 -39282 -75509 -13156 -95908 -128734 -159114 -107805 -41917 -82345 -96763 -86587 -100363
2098 -100363 -65739 -14366 -45888 -66257 -133843 -71408 -57128 -113598 -99309 -100402 -77330 -70465
2086 -70465 -110797 -106753 -99116 -149921 -101186 -59410 -11420 -72725 -62379 -26918 -76597 -33830
2074 -33830 40136 -17195 -99214 -69235 -112655 -104417 7048 -60556 -110590 -124218 -153962 -89892
2062 -89892 -7398 -63008 -157656 -117415 -74724 -90016 -112071 -102912 -188893 -159337 -113895 -99590
2050 -99590 -66620 -63187 -100758 -74665 -91056 -67420 -45347 -43403 -53276 -113590 -143897 -133799
2038 -133799 -149099 -157714 -87754 -95710 -140115 -142566 -153596 -171930 -148437 -145381 -154622 -94431 -41746
2025 -41746 -41557 -24783 35463 -70219 -34958 2916 -66162 -99408 -132922 -81622 -84787 -122181
2013 -122181 -107142 -93040 -98961 -148749 -118741 -106681 -72231 -83510 -102498 -62374 -47427 -118732
2001 -118732 -149768 -173230 -96850 -25314 -67185 -87670 -103082 -101192 -99235 -149115 -124036 -84504
1989 -84504 -115752 -132650 -115205 -123225 -158193 -63728 -52963 -66762 -64809 3508 -13220 -26340
1977 -26340 -122370 -132568 -105255 -91880 -67565 -96044 -93379 -69313 -68509 -103825 -130316 -135403 -152030
1964 -152030 -129073 -148074 -194755 -129346 -55638 -79589 -110608 -76828 -89843 -90562 -126482 -133643
1952 -133643 -117114 -195508 -160489 -56865 -59027 -94993 -90540 -81684 -43654 -80722 -157409 -80540
1940 -80540 -111682 -115322 -70344 -112818 -54962 -121412 -153417 -173533 -176275 -143509 -113849 -125027
1928 -125027 -90510 -17884 -62063 8566 13841 -1747 -38885 -71379 -98202 -119986 -77026 -107017
1916 -107017 -72918 -42281 -48985 -74505 -99281 -45619 15270 9970 -68388 -81102 -138342 -86936
1904 -86936 -42994 -57747 -94236 -115294 -93346 -76792 -98689 -70367 -94605 -94595 -61394 -5826
1892 -5826 -45356 -65445 -108215 -148575 -130570 -140421 -114892 -110366 -141400 -148608 -87257 -27197 -80235
1879 -80235 -124111 -132472 -95898 -74818 -75877 -50028 -114785 -111339 -104514 -62302 -22504 -59807 -125075
1866 -125075 -53592 -70271 -56300 54554 -32938 -95876 -62260 -122191 -138561 -138682 -129214 -113342
1854 -113342 -70579 -70462 -94735 -104068 -81026 11166 -34258 -94430 -16123 -80047 -114840 -43402
1842 -43402 -82511 -223658 -172783 -120786 -183343 -136523 -85830 -71355 -92230 -117189 -77781 -75230
1830 -75230 -61067 -30248 -80208 -155139 -138845 -174696 -122008 -104491 -71870 -54313 -120701 -88094
1818 -88094 -84162 -25512 -7310 17616 12451 64659 55453 -50383 -37573 21153 -25815 -43623
1806 -43623 -12273 -42188 -116454 -102093 -156499 -138112 -118993 -122450 -88389 -64549 -67608 -63376
1794 -63376 -29603 -67600 23901 -16832 -85490 -141980 -70960 -55382 -129834 -104587 -32451 10926
1782 10926 -11538 -15589 -30339 -9594 -70885 -116354 -36238 2388 -28507 -22643 -12478 -15844
1770 -15844 -22488 -39686 -72740 -74577 -80289 -98618 -92906 -61871 -126725 -111837 -60500 -65608 -83526
1757 -83526 -83026 -21597 -24070 -53531 -111506 -88761 -76965 -113291 -93882 -62568 -52582 -44991 -20709
1744 -20709 -63682 -39825 -65827 -77875 -77609 -88834 -110920 -92420 -52236 -89595 -113179 -110233
1732 -110233 -74855 -51675 -95276 -54668 7957 -19375 -17060 -84827 -107986 -80289 -87859 -99380
1720 -99380 -59585 -136705 -99152 -93082 -135446 -123597 -37578 6398 -58485 -7264 24154 -45084
1708 -45084 -79608 -38262 -54296 -76313 -17194 -8561 -50741 -48311 -78650 -54334 -53714 -25755 21174
1695 21174 46705 53521 28543 8075 -27194 -91445 -90898 -114962 -104903 -78362 -78657 -44988 -46258
1682 -46258 -37903 -58249 -1190 -56620 -62511 -83057 -75960 -71994 -160575 -148768 -166831 -186333 -73284
1669 -73284 -48018 -131489 -74346 -38715 -31838 -91362 -123318 -115216 -57053 -48571 -41424 -17943 -17788
1656 -17788 -38200 -62340 -119931 -79065 -53118 -26721 -66300 -33834 -91247 -122464 -5885 -621
1644 -621 -12469 -68812 -75687 -91870 -64847 -86624 -70232 -39077 -85207 -106956 -71851 -23333
1632 -23333 -90986 -99931 -100793 -53902 -76060 -78769 -12375 10885 25732 -64263 -42942 -58508 -43784
1619 -43784 -69793 -83506 -19540 -52713 -49673 15832 2016 27561 4572 13486 25820 -52445
1607 -52445 -109887 -142980 -171701 -156769 -37383 -20066 -98957 -138214 -119587 -88457 -98105 -65903
1595 -65903 -23218 -62526 -87138 -83604 -101200 -72108 -73996 -130421 -124748 -96746 -63465 -84191
1583 -84191 -33929 -27928 -16520 -14128 -61049 -66753 -98593 -39562 26014 -23375 -33880 -19362
1571 -19362 8973 12565 -33349 -26593 -85119 -140740 -72699 30571 12406 -36420 -53323 -24235
1559 -24235 -31186 -96815 -108457 -33571 -26804 -30943 37535 17464 -9089 -50051 -112019 -94316
1547 -94316 -85195 -83220 -77642 -11403 24400 2584 -56742 -53184 -35543 -43130 -32610 -95581 -129863
1534 -129863 -16722 -17858 24945 15758 -7197 -1559 -34841 -43212 -57982 -108144 -86674 -68644
1522 -68644 -77916 -38243 -38742 -49535 -68366 -44820 -37786 -39344 -76897 -86561 -107469 -61903 -13617
1509 -13617 -52721 -127358 -41998 -21643 -77487 -56346 -79804 -64845 -61599 -54076 -67968 -16813
1497 -16813 -65499 -96053 -125143 -112625 -72385 -58028 -22320 -17436 36064 24619 18970 -17728
1485 -17728 -68349 -41221 -34096 -1494 -32547 -48559 -10410 1030 -37757 -30175 -46225 -148422
1473 -148422 -137928 -99135 -114499 -67905 -66830 -78614 -14024 -59693 -77627 -63430 -45407 -86634
1461 -86634 -106077 -20770 -25828 -63548 -61945 -95886 -86262 -106660 -70462 -84385 -21880 -58254
1449 -58254 -12865 -47609 -35448 -49038 -41928 -53920 -25057 -772 -13570 -12083 -80197 -14916
1437 -14916 -28987 -3574 29999 957 -59218 -86556 -21596 12924 -22267 -47004 -38167 -42151
1425 -42151 -91389 -123750 -104807 -94174 -31661 -63231 -111922 -89469 -84932 -52962 -42842 -25821
1413 -25821 37755 -14728 -54596 -52925 -43445 21266 -15065 -95931 -22088 26498 -13757 -10740
1401 -10740 -26714 915 -40394 -111449 -149932 -113758 -98695 -41530 -13008 -17564 -13075 -49010
1389 -49010 -84852 -25501 -53646 -80075 -80787 -78713 -45234 -49790 -41149 -21568 53358 57151 -19460
1376 -19460 -28250 -29894 45067 44146 -31449 -26231 12986 5064 -11005 886 -8498 -88357 -141018
1363 -141018 -58194 -46830 -39409 -34604 -32523 9068 -31972 -45891 -60901 5688 -19506 -26548
1351 -26548 -23353 -9991 8223 -2437 -23744 -31779 -65030 -10379 -11214 -44603 -40994 -85949 -108735
1338 -108735 -123910 -71427 -63342 -137164 -88937 -63448 -60657 -22789 -37047 -41587 -98281 -163782
1326 -163782 -84144 -29889 -67748 -29008 -32833 -64673 -69476 -14072 -53320 -88515 -47768 -45354
1314 -45354 -64974 -7049 -23812 -35020 -15091 -42602 -52510 -23976 50077 39945 15829 12381
1302 12381 -21454 -39634 -11985 -62806 -43324 -34652 -100289 -25320 21525 -7994 -10362 -56448
1290 -56448 -48123 -78765 -101013 -99188 -5462 -14146 -3849 20069 -26788 -54235 -68654 12159
1278 12159 -9173 -51398 -42904 8134 -3500 -93518 -77136 21294 -89387 -78430 -86489 -14164
1266 -14164 33143 -28406 -58197 -89786 -66776 -40555 -79292 -110962 -85671 -46800 -15052 -68150
1254 -68150 -41647 -5064 -44640 -13549 -74231 -55148 -31609 -45222 -109266 -47822 7231 17582
1242 17582 -14293 471 20329 -72735 -100769 -80578 -34127 -1555 49155 -11896 -48446 -33124
1230 -33124 -41676 -7975 25687 -5268 -30214 -44995 -51307 -27756 -3546 -2262 18010 76742
1218 76742 32909 43253 51033 19365 -7242 -32680 -60823 -51052 1814 -27453 -51551 -78580
1206 -78580 -59358 -22291 4174 -32414 50420 46127 -33987 -27219 -38269 39411 26694 -44765
1194 -44765 -23818 7328 34176 84107 43786 -8916 -8861 -33123 -18169 -13071 -57880 -29921 45476
1181 45476 6179 28092 74941 91687 96691 13921 -70698 -69653 -48029 33255 70724 46148
1169 46148 -4284 9068 27 -65871 18742 67754 60523 -16784 -95105 -125336 -75367 -64606
1157 -64606 -3987 -5074 -32866 -2534 24361 33494 11833 13470 3544 -4663 22771 18795 -71518
1144 -71518 -329 53291 49063 59514 79892 81024 63345 40194 19062 -12316 35538 43357
1132 43357 31943 -33437 -32858 -30861 -14548 3200 -35899 -21194 -39061 -81617 -66140 39850
1120 39850 49310 68530 70201 -1863 23810 25456 32822 -20669 -72446 -77686 -68001 -55581 -42903
1107 -42903 -40349 -42337 44755 36395 14083 31951 38725 50363 38128 18512 -4704 26906 30304
1094 30304 35911 23857 43057 37062 50353 -1394 3612 -11196 19334 35965 35657 66265 77294
1081 77294 29697 43941 21453 -14889 57652 4777 -11047 6347 32823 10325 27987 14324
1069 14324 41405 31524 51566 65929 49259 29155 42977 26211 28306 92951 44353 7008
1057 7008 27376 43924 69231 16002 9272 49167 -10988 -498 62717 40469 39592 -38497 -81580
1044 -81580 -23877 -40455 -49696 24349 45205 57619 1837 -4579 -31354 -34004 -6251 -35931
1032 -35931 -39878 228 1649 -12883 2259 -10119 54310 64347 35888 92299 105255 57176
1020 57176 -46654 -41345 -22592 -14341 45179 -26279 -15923 -1796 -47051 -18308 12142 -29400
1008 -29400 -36845 26013 -18826 -39446 13992 37344 10196 30113 -13015 -37444 48203 99784
996 99784 35078 17514 22167 11911 13243 52549 -53988 -63657 -16935 -46757 -33777 7763
984 7763 72053 60415 27450 21314 49774 52544 78746 116814 61541 41456 136182 116053 -30487
971 -30487 -69857 -9335 21931 12225 29941 57266 89104 117408 72393 23121 9804 85833
959 85833 38625 66767 47523 -3280 -9599 -53716 -47076 11453 -14356 -6834 -22708 -4666 25262
946 25262 9173 -43460 -57513 -10276 12259 -9457 10387 31883 -24699 -35883 5988 21654
934 21654 33070 19313 -8160 55480 31291 9972 -23098 15976 69640 -3826 -16200 -20358
922 -20358 -66197 13782 21864 -11203 51720 89404 73027 27616 36440 75092 80183 23571 6766
909 6766 47191 31252 -44332 -3692 40464 48524 27512 33074 115481 98540 -4059 -34499
897 -34499 31611 32659 28011 74475 80543 70089 -43269 -8352 -4318 17355 -1909 -17735 14698
884 14698 15493 81872 51688 57831 68467 -11375 -41490 13419 -625 -61683 -66920 -23416 -75924
871 -75924 -57091 32596 46379 53265 40604 56816 72171 71900 36782 38332 66293 56731 42682
858 42682 18574 67790 83503 76128 -4411 -9680 15413 -41614 -28621 35893 62209 27644
846 27644 76500 96806 78672 21319 1544 52736 36768 73284 33637 4262 13775 -18442
834 -18442 49093 45338 38540 38182 49365 97989 70892 37831 84754 134140 49433 -17979 21679
821 21679 78275 13372 -35761 39089 31233 37973 50709 40875 77018 16302 -54136 -55132 -39707
808 -39707 22497 1758 16762 20919 22939 48436 -3127 -39448 -31809 49332 -23383 2278 20397
795 20397 8968 -15113 24922 50726 51853 66506 71057 -20173 -49270 -8475 36802 45914 10767
782 10767 44033 46335 77355 113550 143233 67703 -21627 -29217 1803 47630 105953 37828
770 37828 40314 71795 13627 61904 49620 29577 7827 31548 48600 36195 111019 58957
758 58957 33615 65183 8618 91221 96099 42083 41270 -9220 -56625 -43123 3938 22432 30500
745 30500 41468 64412 57377 -39542 -2043 8712 -44758 -10958 37081 31932 51743 -30366
733 -30366 17996 36873 -31778 -31399 -10534 16076 23278 26584 3467 26248 37063 51121 60376
720 60376 31939 -32798 80485 26533 59318 83474 70686 10272 2918 22020 80189 26469
708 26469 26145 51863 67636 98422 60938 85181 20706 15826 58973 60264 36970 55668 77848
695 77848 43037 69001 76347 79506 84945 89827 65721 26491 93373 129992 89916 59258 61492
682 61492 20486 -18163 28820 51740 73701 11770 67234 120870 44408 37417 47627 81474
670 81474 40196 6180 11371 22237 29884 22369 1043 47225 86359 62674 42477 93705 85591
657 85591 -28694 12096 75881 82232 93240 113643 115429 94680 94211 21194 39897 142827
645 142827 84592 38737 39264 47289 52991 68457 79785 44817 34483 9969 28718 10393 -23272
632 -23272 14418 72346 28352 39091 18736 -47460 -68625 1435 -33165 -24541 -28107 -5468
620 -5468 29972 50764 120330 93489 25874 44713 41542 -3603 18946 33899 75116 45056
608 45056 15249 39609 133174 78242 35057 24449 1364 -67035 -19284 -15683 -6542 22788
596 22788 3394 56147 85735 110601 115845 61468 49186 70663 105471 50453 74909 110455
584 110455 102745 44589 -9761 -16984 43664 41344 2678 86345 106796 86697 41170 51489
572 51489 65072 74844 34580 57069 38996 6702 -21566 -22829 43990 86246 40965 71860
560 71860 21909 7605 3470 74578 -13366 -11347 60500 60591 39520 31330 49273 109124 102800
547 102800 95549 78926 36436 84291 153351 83677 42504 -33418 10157 -9923 68181 125002
535 125002 150688 97022 99949 147633 50915 78496 77465 126260 100662 101861 39247 58151
523 58151 65007 54372 27607 96082 92681 62386 115675 88082 47020 95283 49992 89806
511 89806 93187 91876 50258 -34254 -13550 39836 121189 111723 81995 90503 59259 79733 110744
498 110744 132550 129031 149566 100624 101209 55558 111245 143616 100274 47218 84187 65128
486 65128 61079 26755 118596 90529 8892 64276 26058 45943 74086 102921 90471 60896
474 60896 93027 97228 59471 105351 44329 9541 21261 77110 115394 101017 71314 47974
462 47974 74617 54869 93228 144111 89988 62875 45433 27533 36629 38246 70773 100076
450 100076 26661 3363 20500 -14673 52676 89429 25698 30177 28526 42489 3436 41453
438 41453 75506 54864 96779 81446 78286 68015 816 39654 115502 128824 40378 51108
426 51108 64905 72342 48419 3302 32704 53214 44433 50789 48695 80437 22082 -30595 29241
413 29241 25240 68880 11776 53006 114449 117349 62019 17754 56151 87719 33518 6983
401 6983 -14864 -29603 -8999 20872 95115 51620 31684 66241 117366 30000 18325 49134
389 49134 54372 3345 48012 64067 16966 62348 67810 80534 23404 57856 47415 68320
377 68320 50348 48350 79706 137037 114925 105135 149145 77387 83704 63736 44005 48059 84065
364 84065 -9166 -20975 -24902 10833 29700 3943 -43472 -7866 69743 111145 99918 75351
352 75351 18681 11845 5392 24556 61628 83174 106695 66276 53762 23369 72382 10008
340 10008 -18009 20102 93659 71268 8439 67080 36208 13858 6799 58759 77933 67122
328 67122 73533 107684 89073 30095 34420 2519 73425 130161 78591 103728 91840 17001
316 17001 4324 78020 70557 -11040 22755 23765 28331 48006 94876 98410 109706 73688 68458
303 68458 102910 102042 110059 102926 71737 72443 119843 119040 35023 -37110 -13732 -8319 -1518 -15299
289 -15299 -9178 2143 9280 83810 104331 90128 36468 53619 61218 93117 92770 50976 82357
276 82357 89802 26955 23236 91919 99319 114029 121257 84947 117518 94977 60947 105710 86252
263 86252 1844 9487 -44095 -1143 14569 15171 74744 112548 147067 98057 23943 63621 91835
250 91835 115321 64352 54255 22067 -3367 21600 41411 88496 108182 96807 24803 55010
238 55010 43600 58679 11835 88090 51798 82243 31546 34010 36498 -22818 27394 65384
226 65384 92642 105832 54192 103448 96073 104388 116228 69099 106190 88387 88539 66888 87005
213 87005 123117 52556 17835 74109 57129 33905 2656 6653 33501 120125 83251 55885
201 55885 108569 117295 85093 82981 71742 101061 66542 38917 69066 79440 69390 106319
189 106319 122388 111016 112343 64718 -23978 17730 61502 58141 130550 132907 83685 96644
177 96644 119682 130783 90597 36980 62226 45899 92786 117536 79011 81816 28580 790
165 790 30525 63097 117025 113935 101703 106297 75034 47211 66101 10086 5790 58954 88563
152 88563 62279 -39446 -1706 84783 77204 36236 56083 61194 73060 96944 10285 25989
140 25989 119229 104329 106734 154754 107579 82610 53598 78376 65845 115722 106977 88247
128 88247 105922 97377 46038 25905 28336 17446 19416 59292 104693 78393 99069 103497 36956
115 36956 19978 7521 -23829 64242 85988 93697 51783 64473 71565 61690 65352 19281 95798
102 95798 125604 97883 85509 91486 90744 63578 26834 50998 39309 5152 38785 68995 70911
89 70911 66690 59476 58784 98800 28344 35170 95769 107005 103110 105065 79212 85753 111898 88857
75 88857 62388 99848 74561 32681 19184 19356 70348 81765 90035 132845 119234 93144 100050
62 100050 132969 139224 122671 102409 113304 128513 84198 71033 59222 92607 82055 121796
50 121796 119150 133634 132643 89077 93797 100768 106035 61156 57379 53152 123276 119372 132867 135601
36 135601 80960 94987 125570 86664 78280 116515 87117 66833 117359 126050 44570 48564 86510
23 86510 112843 73217 38361 35583 39591 26802 65212 97477 91773 120577 86950 66128 54254
10 54254 78295 76082 38657 42823 105467 100497 119155 95490 58097 70236
0 70236
$$ Imaginary data points
##PAGE= N=2
##DATA TABLE= (X++(I..I)), XYDATA
16383 -1892523 -1859956 -1834195 -1806131 -1784021 -1738817 -1678594 -1696019 -1622559 -1518767 -1455707 -1477211
16372 -1477211 -1465786 -1435909 -1426229 -1383447 -1331238 -1273944 -1223343 -1232666 -1218065 -1158617 -1126903 -1041557
$$ [...]
##END NTUPLES=NMR SPECTRUM
##END=
