##TITLE=1H_EC-3324(1)
 CDCl3
 8 sc, 
 12.4.2024
##JCAMPDX= 6.0         $$ Bruker NMR JCAMP-DX V2.0
##DATA TYPE= NMR SPECTRUM
##DATA CLASS= NTUPLES
##ORIGIN= UXNMR, Bruker Analytische Messtechnik GmbH
##OWNER= root
$$ XWIN-NMR		Version 3.5
$$ Fri Apr 12 13:57:32 2024 Russian Standard Time (UT+4h)  she@DPX200
##.OBSERVE FREQUENCY= 200.1309
##.OBSERVE NUCLEUS= ^1H
##.ACQUISITION MODE= SIMULTANEOUS
##.ACQUISITION SCHEME= undefined
##.AVERAGES= 8
##.DIGITISER RES= 18
##SPECTROMETER/DATA SYSTEM= spect
##.PULSE SEQUENCE= zg30
##.SOLVENT NAME= CDCl3
##.SHIFT REFERENCE= (INTERNAL, CDCl3, 0, 15.5255)
##AUDIT TRAIL= $$ (NUMBER, WHEN, WHO, WHERE, WHAT)
$$ ##TITLE= Audit trail, XWIN-NMR		Version 3.5
$$ ##JCAMPDX= 5.01
$$ ##ORIGIN= Bruker BioSpin GmbH
$$ ##OWNER= she
$$ F:/spectra/data/she/nmr/H-F/1/pdata/1/auditp.txt
$$ ##AUDIT TRAIL=  $$ (NUMBER, WHEN, WHO, WHERE, WHAT)
(   1,<2024-04-12 13:56:28.32 +0400>,<she>,<DPX200>,
      <created by zg, POWCHK disabled, PULCHK disabled
       configuration hash MD5:
       00 E9 B6 7A A2 85 ED C7 34 08 36 98 17 FE 4E 26
       data hash MD5: 16K
       A5 43 34 C4 33 F5 E9 F5 F8 53 E1 71 E9 03 65 CF>)
(   2,<2024-04-12 13:56:31.67 +0400>,<she>,<DPX200>,
      <Start of raw data processing
       efp BC_mod = 2 LB = 0.24 FT_mod = 6 PKNL = 1 PHC0 = -25458.6 PHC1 = 9.98731 SI = 16K 
       data hash MD5: 16K
       78 61 B4 01 10 9A 45 0B F9 B1 09 DE F6 1C 1F E3>)
(   3,<2024-04-12 13:56:48.43 +0400>,<she>,<DPX200>,
      <pk PHC0 = 0.03860971 PHC1 = 0.6 
       data hash MD5: 16K
       07 03 C3 35 A1 B7 6D BA 3C B0 28 A7 3E B6 15 E2>)
(   4,<2024-04-12 13:56:51.73 +0400>,<she>,<DPX200>,
      <abs ABSG = 5 
       data hash MD5: 16K
       7D ED 99 17 39 9C 6E A0 D7 F7 42 48 B2 0E E2 4A>)
$$ ##END=
$$ 
$$ hash MD5
$$ 20 50 29 15 67 F4 57 FD 9C 50 32 74 63 92 B4 4E
##$RELAX= 
##$RELAX= 
##$RELAX= 
##$RELAX= 
##$RELAX= 
##$RELAX= 
$$ Bruker specific parameters
$$ --------------------------
##$DU= <F:/spectra>
##$EXPNO= 1
##$NAME= <H-F>
##$PROCNO= 1
##$TYPE= <nmr>
##$USER= <she>
##$AMP= (0..31)
100 100 100 100 100 100 100 100 100 100 100 100 100 100 100 100 100 100 
100 100 100 100 100 100 100 100 100 100 100 100 100 100 
##$AQSEQ= 0
##$AQ_mod= 1
##$AUNM= <au_zg>
##$AUTOPOS= <>
##$BF1= 200.13
##$BF2= 200.13
##$BF3= 200.13
##$BF4= 200.13
##$BF5= 200.13
##$BF6= 200.13
##$BF7= 200.13
##$BF8= 200.13
##$BYTORDA= 1
##$CFDGTYP= 0
##$CFRGTYP= 5
##$CHEMSTR= <none>
##$CNST= (0..31)
1 1 145 1 1 1 1 1 1 1 1 1 1 1 1 1 1 1 1 1 1 1 1 1 1 1 1 1 1 1 1 1 
##$CPDPRG= <>
##$CPDPRG1= <>
##$CPDPRG2= <>
##$CPDPRG3= <>
##$CPDPRG4= <mlev>
##$CPDPRG5= <mlev>
##$CPDPRG6= <mlev>
##$CPDPRG7= <mlev>
##$CPDPRG8= <mlev>
##$CPDPRGB= <>
##$CPDPRGT= <>
##$D= (0..31)
0 1.2 0 0 0 0 0 0 0 0.06 0 0.03 0 0 0 0 0.0002 0 0 0 0 0 0 0 0 0 0 0 0 
0 0 0 
##$DATE= 1712915787
##$DBL= (0..7)
120 120 120 120 120 120 120 120 
##$DBP= (0..7)
150 150 150 150 150 150 150 150 
##$DBP07= 0
##$DBPNAM0= <>
##$DBPNAM1= <>
##$DBPNAM2= <>
##$DBPNAM3= <>
##$DBPNAM4= <>
$$ [...]
##$SUBNAM3= <"">
##$SUBNAM4= <"">
##$SUBNAM5= <"">
##$SUBNAM6= <"">
##$SUBNAM7= <"">
##$SUBNAM8= <"">
##$SUBNAM9= <"">
##$SW= 18.0517689322627
##$SWIBOX= (0..15)
0 0 2 0 0 0 0 0 0 0 0 0 0 0 0 0 
##$SW_h= 3612.71676300578
##$TD= 16384
##$TD0= 1
##$TE= 0
##$TE2= 300
##$TE3= 300
##$TEG= 300
##$TL= (0..7)
0 120 120 120 120 120 120 120 
##$TP= (0..7)
150 150 150 150 150 150 150 150 
##$TP07= 0
##$TPNAME0= <>
##$TPNAME1= <>
##$TPNAME2= <>
##$TPNAME3= <>
##$TPNAME4= <>
##$TPNAME5= <>
##$TPNAME6= <>
##$TPNAME7= <>
##$TPOAL= (0..7)
0.5 0.5 0.5 0.5 0.5 0.5 0.5 0.5 
##$TPOFFS= (0..7)
0 0 0 0 0 0 0 0 
##$TUNHIN= 0
##$TUNHOUT= 0
##$TUNXOUT= 0
##$USERA1= <user>
##$USERA2= <user>
##$USERA3= <user>
##$USERA4= <user>
##$USERA5= <user>
##$V9= 5
##$VALIST= <valist>
##$VCLIST= <CCCCCCCCCCCCCCC>
##$VD= 0
##$VDLIST= <DDDDDDDDDDDDDDD>
##$VPLIST= <PPPPPPPPPPPPPPP>
##$VTLIST= <TTTTTTTTTTTTTTT>
##$WBST= 1024
##$WBSW= 4
##$XGAIN= (0..3)
0 0 0 0 
##$XL= 0
##$YL= 0
##$YMAX_a= 215998
##$YMIN_a= -159064
##$ZGOPTNS= <>
##$ZL1= 120
##$ZL2= 120
##$ZL3= 120
##$ZL4= 120
##$ABSF1= 15.57504
##$ABSF2= -2.476848
##$ABSG= 5
##$ABSL= 3
##$ALPHA= 0
##$AQORDER= 0
##$ASSFAC= 0
##$ASSFACI= 0
##$ASSFACX= 0
##$ASSWID= 0
##$AUNMP= <proc_1d>
##$AZFE= 0.1
##$AZFW= 0.1
##$BCFW= 0
##$BC_mod= 2
##$BYTORDP= 0
##$COROFFS= 0
##$CY= -3
##$DATMOD= 1
##$DC= 0
##$DFILT= <>
##$DTYPP= 0
##$F1P= 0
##$F2P= 0
##$FCOR= 1
##$FTSIZE= 16384
##$FT_mod= 6
##$GAMMA= 0
##$GB= 0
##$INTBC= 1
##$INTSCL= 3.70164e-10
##$ISEN= 128
##$LB= 0.24
##$LEV0= 0
##$LPBIN= 0
##$MAXI= 10000
##$MC2= 0
##$MEAN= 0
##$ME_mod= 0
##$MI= 1.114404
##$NCOEF= 0
##$NC_proc= -8
##$NLEV= 6
##$NOISF1= 3.799351
##$NOISF2= 2.8
##$NSP= 0
##$NTH_PI= 0
##$NZP= 0
##$OFFSET= 15.52546
##$PC= 1
##$PHC0= -25458.56
##$PHC1= 10.58731
##$PH_mod= 1
##$PKNL= yes
##$PPARMOD= 0
##$PSCAL= 0
##$PSIGN= 0
##$REVERSE= no
##$SF= 200.129599253654
##$SI= 16384
##$SIGF1= 3
##$SIGF2= 2
##$SINO= 5.538805
##$SIOLD= 16384
##$SREGLST= <1H.CDCl3>
##$SSB= 0
##$STSI= 16384
##$STSR= 0
##$SW_p= 3612.71676300577
##$SYMM= 0
##$S_DEV= 0
##$TDeff= 16384
##$TDoff= 0
##$TI= <>
##$TILT= no
##$TM1= 0
##$TM2= 0
##$TOPLEV= 0
##$USERP1= <user>
##$USERP2= <user>
##$USERP3= <user>
##$USERP4= <user>
##$USERP5= <user>
##$WDW= 1
##$XDIM= 16384
##$YMAX_p= 336091464
##$YMIN_p= -1219596
$$ End of Bruker specific parameters
$$ ---------------------------------
##NTUPLES= NMR SPECTRUM
##VAR_NAME=  FREQUENCY,     SPECTRUM/REAL,   SPECTRUM/IMAG
##SYMBOL=    X,             R,               I
##VAR_TYPE=  INDEPENDENT,   DEPENDENT,       DEPENDENT
##VAR_FORM=  AFFN,          ASDF,            ASDF
##VAR_DIM=   16384,         16384,           16384
##UNITS=     HZ,            ARBITRARY UNITS, ARBITRARY UNITS
##FACTOR=    0.220516191357247, 1,           1
##FIRST=     3107.10413670518, 0,            0
##LAST=      -505.612626300594, 0,           0
##MIN=       -505.612626300594, -1219596,    0
##MAX=       3107.10413670518, 336091464,    0
$$ Real data points
##PAGE= N=1
##DATA TABLE= (X++(R..R)), XYDATA
$$ [...]
8146f248j89218J08215l26936J83717J36577K1317j3139j28047J55013j44490
8136b03239j4958L0094n3737J19565k24252K03437j89788r9703J9928J00872k7329
8125c39110J8962r8827J74469K84193j18412j28317j1627O6493j21111K55773
8115a7514j82289k11403K9576J60249L5322r5522m1863J01260j84j71853R6478
8104b97743L52153J49855k19532j15876N5763P379j41397J55185J52617m3771
8094E4633j90512r8274J6104P335l6019L64356p6816j09467N3095j8926J61657
8083A27166n89254k89470M83468K30244j86219L9194N2256J65889J6666j63295
8073a13355P4758K1370j86625j06085k55389M7983J89730L92680q9465O0283O2079
$$ y = [-6248, -195466, -87251, -414187, -230470, -93893, -72576, -85715, -213762, -58749, -203239, -218197, -188103, -241840, -122275, -346527, -143090, -332878, -432581, -412653, -311781, -339110, -320148, -418975, -244506, 39687, -78725, -207042, -218669, -152176, -273287, -17514, -199803, -411206, -381630, -221381, -186059, -281581, -323444, -222184, -222368, -394221, -297743, 54410, 204265, -15267, -131143, -75380, -68001, -209398, -54213, 98404, 54633, -135879, -234153, -218049, -210714, -246733, 117623, 40807, -68660, -15565, -34491, 127166, -462088, -751558, -268090, -37846, -224065, -184871, -132615, 33274, 49940, -113355, -38597, -17227, -203852, -309937, -565326, -517343, -327613, 65067, -24398, 35885, 97964]
8062I7964j53950k10591R2013n7779k66716k2453K24100J18086j51395J38899
8052a91822L4853O5956n2215p3393j31980k8567k5473J53439J25643L0379j7960
8041a11140r0119J20130J27849j39502O632P4156J82167r6491r9851K9824o7508
8030f3853r1421J12092K10855o1938k25151q1302j57106L48256J54885n91041
8020d45724L01967J67899r0930j62112K3656J30971J2773j06632k60782J6485
8010d12429K1939J78755j5203Q0007q1252j47629k057J22421r3085j18204j6956
7999d83693J19545K18827l4144K09182j91761j57838R7012p6260M0559J09553
7989a49018n8802J02240o059q2084J5666m9368j06957l17k10348o2097M93912
$$ y = [97964, -55986, -266577, -174564, -232343, -499059, -521512, -297412, -179326, -330721, -191822, -156969, -91013, -143228, -216621, -348601, -377168, -402641, -249202, -123559, -93180, -111140, -201259, -81129, 46720, -92782, -86150, -11994, 170173, 73682, -26169, 3655, -63853, -155274, -43182, 167673, 105735, -119416, -200718, -357824, -9568, 145317, -445724, -143757, 24142, -66788, -228900, -205244, -74273, -61500, -168132, -428914, -412429, -390490, -211735, -226938, -146931, -228183, -375812, -377869, -255448, -348533, -466737, -483693, -364148, -145321, -179465, 29717, -162044, -319882, -222870, -299130, -258571, -149018, -207820, -105580, -111639, -193723, -178057, -227425, -334382, -334699, -545047, -607144, -113232]
7978a13232m4244j1017o7065j23128R4156n567o3995J61414K11109j70601N5540
7967g6630k35062k7917n1356N9356J82552q9227k66769r5232L5614l8531J94645
7956d08557L8291o0663K47179r6495J17500J06051j22021n1910r2503J01128p6797
7945b98797j5279k4675J59740j70445j02063o8480O8270J92925O1214k11304J90889
7934b18005J03142Q8798p1948p2739k9780J88365J78705j67068o6863q2179k69408
7923d18980j52351J55359J12826N1967l02778L8542J28577J53588k43378j45178
7913f21806M04514m5O1036k76924O1528L46204O0191l03251j21999R4348J38537
7902a57667k0714j9467Q2892m09418J92581J60945M2468n2901k25846j32789N0341
$$ y = [-113232, -157476, -168493, -235558, -358686, -264530, -270097, -334092, -172678, 38431, -132170, -76630, -311692, -339609, -390965, -331609, -149057, -238284, -505053, -600285, -564671, -603202, -408557, -370266, -430929, -183750, -280245, -162745, -56694, -178715, -230625, -323128, -222000, -298797, -314076, -338751, -179011, -349456, -451519, -519999, -451729, -258804, -197590, -408894, -218005, -114863, -26065, -98013, -170752, -200532, -12167, 166538, -530, -67393, -149572, -418980, -571331, -415972, -303146, -251179, -553957, -515415, -386838, -233250, -476628, -621806, -217292, -217337, -156301, -433225, -371697, -25493, 34698, -268553, -390552, -296204, -157667, -178381, -197848, -114956, -524374, -331793, -170848, -128380, -181281, -407127, -539916, -489575]
7891d89575M60328l57694l690J49179j3991Q505j18192J39137j37649J23177K2856
7880b17609l25926M6313k6964k9697M0404Q4445l7882K8189N16793l68690J62811
7869a27813K56095k05335k11502Q6605L468l62J58360K6659k81534k1230r5540
7858d12129J72404K05116j08783k37855R2622j24786N1015J95141j05770p215
7848b80240K8760K25571o9326k13835j58636R1414J95381m2732P5284J56586O4430
7837G2657L7957J0678j34404j07381N7805o1742l21596J17702M33008J649R3960
7826B00293j18491r7438n21j29972J49379l6443q4480k1217j15436K24021R7952
7815F7647K2008r4843m2107j93442L3615k67871J22146q02313M25249O76418k53659
$$ y = [-489575, -29247, -386941, -390631, -241452, -255443, -246938, -365130, -225993, -363642, -240465, -217609, -543535, -497222, -524186, -553883, -513479, -429034, -466916, -438727, 78066, -290624, -127813, 128282, -77053, -288555, -201950, -198482, -198844, -40484, -13825, -295359, -316589, -412129, -239725, -34609, -143392, -381247, -288625, -413411, -362396, -167255, -273025, -280240, -251480, -25909, -95235, -309070, -467706, -376292, -180911, -223643, -148359, 8227, 72657, 110614, 121292, -13112, -120493, -62688, -124430, -446026, -328324, 104684, 106333, 200293, 81802, -15636, -16157, -146129, 3250, -33193, -117673, -138890, -254326, -30305, 67647, 89655, -5188, -47295, -240737, -207122, -474993, -352847, -1155160, -729911, -53493, -307152]
7804c07152M2567J73129k707j37783J72966n11390j84L65598j43087N1653j72553
7793d68943k72034J37993J16005M03390m504o7956k61156K69770K07321j75666
7783a15780l08289m2429J1592J60008J78400K7198K33806j9273n05913k01426
7773e82106K60385J30735p3235j13906M14K58999K58677k18379N3335J20202k13701
7762a18580p9523J24423n8663l0053N674K01476j24176P1204n8397K27254M0333
7751B00972k80161K9778r2943k3415Q2004L6675J68740j92566m9185J80429m04312
7740c43984j07284K3720K65407M1402m8500J20096n2104J48143j75368j57408
7730b85880K56191R4363K5017k79111N9785R5815m3263p6770j1815j263k09069
$$ y = [-307152, -264585, -91456, -94163, -231946, -58980, -570370, -570554, -204956, -348043, -296390, -468943, -740977, -602984, -486979, -83589, -88093, -156049, -417205, -147435, 59886, -115780, -424069, -466498, -454906, -294898, -116498, -89300, 144506, 125233, -380680, -582106, -321721, -190986, -264221, -378127, -377713, -118714, 139963, -78416, -25081, 95121, -118580, -198103, -73680, -132343, -162396, -156722, 44754, -79422, -8218, -66615, 160639, 200972, -79189, -49411, -142354, -165769, -83765, -47090, 121650, -70916, -120101, 60328, -343984, -451268, -427548, -162141, -120739, -169239, -49143, -101247, 46896, -128472, -285880, -29689, 64674, 89691, -189420, -129635, -33820, -77083, -153853, -165668, -166931, -376000]
7719c76000q894J40062r8139J31573j65778j62595K46258q0438m1507K3249Q5862
7708c06347J62541l2881N0410j92132l9931m9861K16345J58056m7265Q7980L3390
7697D0305l22878o6967K26373k28178j5814R0589L9032Q8134n1998j4942J53141
7686f3203k99041L0513J02339N7919J03547n7408l4015k03317o3237O1778J72027
7675a92098J87216j45230m5353l3599j48002n9947j77326K90926K77948r6921
7665a42386j43398K27552j21550O5340K22623j07209l76046J50334L8091j71714
7655c58363J87858j1373L5843M7175R6938l21458K1904r0268R3930j15764L9498
7644c74080j00619J13829P5900J67477J71289k31765k46576O0069j08951K30351
$$ y = [-376000, -384894, -244832, -342971, -211398, -377176, -539771, -293513, -373951, -415458, -392209, -306347, -143806, -176687, -126277, -318409, -358340, -408201, -191856, -33800, -81065, 6915, 40305, -282573, -349540, -123167, -351345, -367159, -276570, -237538, -149404, -201402, -216344, -63203, -362244, -331731, -229392, -171473, -67926, -125334, -159349, -362666, -425903, -364125, -192098, -4882, -150112, -195465, -229064, -377066, -437013, -614339, -323413, -45465, -142386, -285784, -58232, -179782, -114442, 108181, 972, -375074, -224740, -186649, -358363, -170505, -181878, -146035, -98860, -1922, -323380, -301476, -391744, -297814, -413578, -374080, -474699, -360870, -284970, -117493, 53796, -177969, -424545, -364476, -473427, -243076]
7634b43076o1949R6811k20599K2208K24290J05081J817j9166Q2176l27415J4541
7623c25281J22446N7125k8680l2932K2738J69500l96914J8956J7757J77980K3955
7612a73350k85936l4460J6236r8968J67550J509O614K4724R8042j46143l645K07701
7600b20126j54246o7977M1863M6350O2962J0973j9894j91172J47171j65626K72710
7589b37012M3706k34679J45002K02910M6792k98283L9008j00926K53736O8424
7579g1322j54263j15201O5014J84543k42681o1442J94931J56568j31074J33013
7569d1914L4501p2098Q2302r5146L2181j56784O4242M5950j03303L3589k2251
7558a98731l02374J05155K10221Q1254O5532l4477j7338K7295j7841o0445n5596
$$ y = [-243076, -305025, -208214, -428813, -406605, -182315, -77234, -75417, -94583, -12407, -339822, -325281, -202835, -145710, -174390, -207322, -184584, -15084, -411998, -393042, -375285, -197305, -173350, -459286, -493746, -477510, -576478, -408928, -407419, -400805, -376081, -278039, -424182, -427827, -220126, -374372, -442349, -400486, -354136, -291174, -280201, -300095, -491267, -344096, -509722, -237012, -193306, -427985, -282983, -80073, -33281, -331564, -292556, -393482, -139746, -71322, -225585, -340786, -275772, -91229, -333910, -395352, -200421, -43853, -174927, -41914, -7413, -79511, 2791, -92355, -60174, -216958, -152716, -106766, -210069, -176480, -198731, -501105, -395950, -185729, -104475, -38943, -73420, -90758, -63463, -81304, -141749, -197345]
7547a97345J40265J2704N3978O9291K7134J49136J1054k79193k16220L6359j09931
7536c02768J12162L8091N083j76493K27834j28881K30113k12153K45421r5975
7526e7566j63042J38443j92319k18885q0032J87963q3433o561J58238q1349L30210
7515f8333j81324l3187p5603K7596P17498j58075l66255k37815R1069K6884j151
7504b58696K9861J74104j24928j11967j79113K98685n8859J19304j69602P4098
7494b07113K78604j609k42805j00987O9498j38477l9693K54227j76286R9581L69176
7483A64116l2696k13481J09667k97479K06271k74749k47341O7470K55132j56231
7473d19321r930K7676M7129J01787N465J45068N50L5164k59558O8910j43074K31005
$$ y = [-197345, -57080, -44376, 9602, 78893, 106027, 255163, 266217, -12976, -229196, -192837, -302768, -190606, -152515, -147432, -323925, -96091, -224972, 5141, -207012, 38409, -57566, -220608, -82165, -274484, -493369, -573401, -385438, -468871, -475432, -317194, -398543, -68333, -249657, -282844, -358447, -330851, 386647, 228572, -137683, -375498, -284429, -257545, -258696, -228835, -54731, -179659, -291626, -470739, -172054, -230913, -111609, -281211, -207113, 71491, 69882, -172923, -273910, -204412, -342889, -382582, -128355, -304641, -205060, 164116, 131420, -82061, 27606, -269873, -63602, -338351, -585692, -518222, -263090, -419321, -429251, -401575, -354446, -252659, -247194, -102126, -101576, -66412, -325970, -257060, -400134, -169129]
7461a69129j1831J47207j12025n4040J55686K30750k36587l78649L24343K32103
7451A27828r6772L3352L8119o0420j83266j2778k87049K80473K95429j08403m1220
7440a4707J6597k73043J70557J05779j45351J22300J60196J6071j1271j90716
7430d3588p4928l1520J26410k7346l56881j1915O6639J99517l5073J33128j07131
7419a62688p3973P1546j1410J14786r1461j15803j8087J27371k0723R7495J97068
7408A14121k24725Q3103N5619j10366k13733j90209J06872J27880j22764j34530
7398e08732M37348P1725k34075L56317l5889q5506j20245k45204p5796K87731
7388a52326n9093m1123o8915l5911J27246J13966m1107M8186J35286j55006M2065
$$ y = [-169129, -180960, -33753, -145778, -199818, -44132, 186618, -49969, -428618, -104275, 127828, 31056, 64408, 102527, 42107, -141159, -153937, -440986, -160513, 134916, 26513, -14707, 1890, -271153, -100596, 5183, -140168, -17868, 142328, 158399, 147128, -43588, -118516, -150036, -23626, -50972, -407853, -419768, -353129, -153612, -188685, -55557, -162688, -236661, -165115, -176525, -61739, -153200, -269003, -287090, -159719, -180442, -82947, 114121, -110604, -27501, 28118, -82248, -295981, -486190, -379318, -251438, -374202, -508732, -71384, 341, -233734, 122583, 86694, 1188, -119057, -364261, -440057, -152326, -211419, -252542, -321457, -357368, -230122, -116156, -157263, -109077, 26209, -128797, -86732]
7377h6732p7313m8821K6757j12483J18902K79159l3616j22041J03010K20669j81720
7366H5771m8241O5462k81681k36330j08686J42404L05544J2677R4628p4433L31804
7355B88919m4035m38150q6206J14003L3391k1136n5109M96708j1746k3504j3468
7344B39667j08832j27844j1554k09197K86200L4340k80202m0432k4947Q5728P9993
7333g7080J53884j9511J60638J1677n2329O471j87168k64291J98966J38797j25796
7322e5742P6705J30528j10815O5302m6352j71715j66552J08507N3122K20403k68733
7311a65342j94251O9137P0396j18041K06051M0147J7083j05367n6864J0675J57293
7300f9083J09652j23001j07673P0555K65377l44196k58617P9737q101M5898L27415
$$ y = [-86732, -164045, -212866, -186109, -298592, -179690, 99469, 65853, -56188, 46822, 267491, 85771, 37530, 102992, -178689, -415019, -523705, -381301, -75757, -63080, 31548, -42885, 288919, 244884, -193266, -279472, -165469, -132078, -153214, -208323, 288385, 276639, 253135, 239667, 130835, 2991, -8563, -217760, 68440, 102780, -177422, -217854, -242801, -157073, -77080, 76804, 57293, 217931, 229608, 177279, 183750, -3418, -267709, -68743, 70054, -55742, 20963, 151491, 40676, 105978, 59626, -112089, -278641, -170134, -117012, 103391, -165342, -359593, -290456, -220060, -338101, -132050, -91903, -74820, -180187, -237051, -226376, -69083, 40569, -82432, -190105, -119550, 145827, -198369, -456986, -377249, -385350, -339452, -12037]
7289a2037J15507m9643m6739k57527R0374K14306q2118J90768m5549l82943K11307
7278e4294K58627K2415o4019J6186n5270j34981J59590K33070l05068k49126K57347
7267H4477R9842J0933q1113J22790j64485K999K05594N5047j21050q692m0268
7256A66074r4843K42778O1581k515j24810l4762J38106P9373o15787O0309Q6056
7245c8440k77526J68924r323j75953J55191Q7525O3566J02167o9843K00756k07523
7234d79j57312J82354K28266j36471m15566K92270J45054q4823J8906J3789J63727
7223B49715l2613K742p646j09455L9347m50981j2138J66037J24558O4547O7626
7212A01739L6870J04912j54439l59947J44245J83388j94923P368J31367L6597
$$ y = [-12037, 103470, 53827, 7088, -250439, -160065, 54241, -27877, 162891, 117342, -265601, -54294, 204333, 226748, 162729, 178915, 123645, -11336, 148254, 381324, 76256, -172870, 84477, 184319, 195252, 114139, 236929, 72444, 75443, 281037, 336084, 215034, 206342, 166074, 71231, 314009, 375590, 373075, 248265, 213503, 351609, 430982, -184805, -124496, -38440, -315966, -147042, -156365, -332318, -177127, -89602, -26036, 76131, 6288, 207044, -479, -157791, 24563, 252829, 116358, -299208, -6938, 138116, 53293, 72199, 85988, 249715, 217102, 219844, 212198, 102743, 142090, -308891, -321029, -154992, -30434, 34113, 101739, 138609, 243521, 89082, -270865, -126620, 56768, -138155, -130787, 580, 37177]
7202C7177L45360m17170J14125k95302Q7411L48763q5719j34484L36951L2669
7192C69781j27862N1829k60167m9393O95N0031J08099k04428j07283o9659J2984
7181b25373J79858K51704J21816k66281n3926j8703j52894J58933l8428l6902
7171h0196j96932R238q2975j59996J42892L14855q8660O8879l3853J56965M1260
7160I1477M0336l3626k94319k9559J9030J36546j56809L4175k4733J40711o320
7149h3091k1847M1531r4573r6990K19299L08230j6280m61704L3882J04306r5247
7138a62484O5363J18877j31985j01946L50457o0093j17727j77039J28635J39990
7128E2048l00314j32551J36057K33695p2482j21546n0920J71622k5587r5028l3398
$$ y = [37177, 382537, -34633, 79492, -215810, -128399, 220364, 134645, 161, 337112, 369781, 241919, 293748, 33581, -15812, -15117, 34914, 143013, -61415, -168698, -238357, -225373, -45515, 206189, 328005, 61724, 7798, -10905, -163799, -4866, -43294, -80196, -277128, -267890, -350865, -510861, -367969, -53114, -141774, -72895, -106748, 50217, 91477, 131813, 98187, -196132, -225691, -206661, -70115, -226924, -192749, -217482, -76771, -83091, -104938, -63407, -157980, -254970, -35671, 272559, 256279, -205425, -171543, -67237, -162484, -97121, 21756, -110229, -212175, 138282, 78189, -39538, -216577, -87942, 52048, -248266, -380817, -244760, -11065, -83547, -205093, -256013, -84391, -109978, -205006, -238404]
7117b38404J45223j40116J43218N7812K7464Q5825L14467j19308j00651k54382
7107g8852N6170k1829j12754J95676j11941j70327N1184J6157p7507J80097L47711
7096B73785k09035k03198N7191O4082L3299q3108r1111J00924O3601J61370k69783
7085a01983o1277O7622j5345M7625j67019K17410k5639J66819M917p3254l34313
7074b74437K41629p245j04370o1091J61559r245J40310J17180k12508J11595j07690
7063d313j21818P677J56385J32783M3956k98470j02204k02496k0375P2724Q8771
7052b47380M75546K03447j27394l73309J02292J01209k14977O1684K17923n4815
7042A44226r9988j05222j00618J30968j0373J5531L5001j82566Q7319J54903j53516
$$ y = [-238404, -93181, -233297, -90079, -32267, -4803, 81022, 395489, 276181, 175530, -78852, -22682, -44511, -157265, 38411, -73530, -243857, -192673, -176516, -254023, -73926, 273785, 64750, -138448, -81257, -17175, 16124, -66984, -158095, -57171, 6430, 167800, -101983, -163260, -95638, -110983, -63358, -230377, -12967, -38606, 128213, 133130, 59876, -274437, -32808, -40053, -144423, -205514, -43955, -53200, 87110, 204290, -8218, 103377, -4313, -126131, -118454, 37931, 170714, 214670, -83800, -186004, -388500, -408875, -336151, -247380, 228166, 431613, 304219, -69090, 33202, 134411, -80566, -18882, 199041, 144226, 44238, -60984, -161602, -30634, -41007, -25476, 9525, -173041, -85722, 69181, -84335]
7031h4335O4092l5460r3754J67110j28711j20599j00442L87355J16494k31691
7021e9941j43999J19719p5661k9158R0800J74097J0009k47085J9888r1211m208
7010b36750p2414K06389K34755j96011P4681L032J5610j45364J22301l2046R1309
6999F5492P2498p6906l1817k6187o3671K14423J27767j81533j37272j35347J00487
6988g2066K8687j68554O9005L07369O8673J02256k15556k84738J17955K19034
6978A72065o8336j11501N7697N8507O6381N95j8750k6178J66221J32232j08038
6967C20895K79758j52084M4813Q1431j35145K7195M10340j7502k10513m27593
6957B21595l14680J24700K71886L1939R9019m4123j27671q4030P4197n8102j34717
$$ y = [-84335, -20243, -55703, -149457, 17653, -111058, -231657, -332099, 55256, 171750, -59941, -203940, -84221, -159882, -189040, -98240, 75857, 85866, -161219, -141331, -232542, -236750, -309164, -102775, 131980, -64031, 10650, 13682, 29292, -116072, 6229, -25817, 65492, 137990, 61084, 29267, 3080, -60591, 153832, 281599, 100066, -37206, -172553, -72066, -43379, -211933, -142928, 164441, 233114, 335370, 119814, -164924, -46969, 172065, 103729, -7772, 49925, 108432, 174813, 175408, 156658, 130480, 296701, 428933, 320895, 600653, 448569, 493382, 574813, 439668, 466863, 877203, 859701, 649188, 221595, -93085, 31615, 303501, 335440, 434459, 390336, 262665, 178635, 252832, 194730, 60013]
6946F0013J78466L3030m1438J41782m6281k1761k2853K2552J21850L60535l9673
6935G46222J30474J14056L4481P3083k36348j34185l76540K8198J50203r6732
6925D32912J09596o7021j66426O6771j52045L407N0184J93929O5620P21k92643
6914B45005k24522K69710m3977j56566R4478K68862k4886k40928j17414J11974
6904A81736J4477j10335J00373r4254j09727p2426k5666L5062K72203j12739J35359
6893B14063M8925j11121j23929k37802K89363O0898M1576n997j30223l4099N9058
6882G0712j0541J0174Q5587j18731r593R9811j70973J7139k9959L2341J81231
6871A57198j82994j48315J79350P684m2712J47044k32527j01955P3998J09305
$$ y = [60013, 238479, 271509, 230071, 371853, 325572, 303811, 280958, 303510, 425360, 785895, 746222, 876696, 990752, 1025233, 1098316, 861968, 727783, 351243, 379441, 529644, 432912, 542508, 475487, 309061, 375832, 223787, 227194, 277378, 471307, 536927, 537648, 245005, 20483, 290193, 246216, 89650, 184128, 452990, 428104, 187176, 69762, 181736, 196213, 85878, 186251, 91997, -17730, -90156, -115822, -80760, 191443, 78704, 214063, 262988, 151867, 27938, -209864, 79499, 140397, 181973, 175976, 45753, 11654, 70712, 60171, 70345, 155932, 37201, 27608, 127419, -43554, -26415, -56374, -24033, 157198, -25796, -174111, 5239, 12923, -29789, 117255, -115272, -217227, -143229, -33924]
6861c3924O4915R0311k4880p1340j08177L75240l4820O6744n6956k29028K97339
6850C35424L5617l9584j84427q8084n0336J17949P2369J7323q2780k42368K91746
6839A82849k5239K65050k43075n2291p2721P2133O2928k10733L57026n9270o2860
6828B13797p3502M4499j14186Q2734K10778P6760k46590O3321M1342N0529k43309
6817A06173j38039N0787J75025M5532l01103J00512J66574J1954J66685j4895
6807C69205n3493p6755j0149K02759k64042j17134j52701j47850L5961J84575
6797b9624o623Q6091k8703J06007q5843N1525j41824l7913J63998J90912Q817
6786B76820k16655j8740K7019k50900J37823K24550q9130k064m7902K35520n5054
$$ y = [-33924, 30991, 121302, 96422, 25082, -83095, 292145, 257325, 324069, 267113, 38085, 335424, 371041, 331457, 147030, 58946, 8610, 126559, 198928, 216251, 133471, -108897, 182849, 157610, 422660, 179585, 127294, 54573, 126706, 189634, -21099, 335927, 276657, 213797, 140295, 184794, 70608, 153342, 364120, 440880, 194290, 257611, 298953, 349482, 106173, -31866, 18921, 193946, 239478, -61625, 38887, 205461, 217415, 384100, 369205, 315712, 238957, 228808, 431567, 167525, 50391, -102310, -250160, -214199, -29624, -36247, 49844, 21141, 127148, 41305, 92830, -48994, -86907, 77091, 268003, 276820, 60165, 41425, 68444, -182456, -44633, 179917, 90787, 88723, 40821, 276341, 221287]
6775B21287j81271K05762q125r7940K49905l03599J08504N7724K8347N0887P0780
6764D02261j76390j52999R178K72559j69133O6068Q6124j40148J61467l328n0124
6753C05535r7543j0781K7606k86146J6828K05322J40320j47756n1608p7962K9462
6742E3277K15145j94871Q1165Q0792j46647o850k6234K07385P1742j21789n4947
6731A58168J40817r8051m1853j15926R1804o407J85476L0065k2536o8234j0R9267
6719C52580j991j77503K6158K3171P7182J42314k26412j63263j39458j13877K1480
6708a79619K38459j24590K12535K47510J19321m95348R2324J55253m3295q0902
6698A41648j24629R9923l0396L2528K7811p1375M0485k20014L58159J15062n9884
$$ y = [221287, 40016, 245778, 237653, 139713, 389618, 86019, 194523, 252247, 280594, 331481, 402261, 225871, 72872, 82050, 354609, 185476, 251544, 337668, 197520, 358987, 355659, 305535, 207992, 197211, 224817, -61329, -44501, 160821, 301141, 153385, 101777, 23815, 53277, 268422, 73551, 154716, 235508, 88861, 82011, 55777, 263162, 334904, 213115, 158168, 298985, 200934, 159081, 43155, 134959, 128552, 314028, 344093, 321557, 253323, 253313, 352580, 350589, 173086, 199244, 222415, 299597, 441911, 215499, 52236, -87222, -201099, -179619, 58840, -65750, 146785, 394295, 513616, 18268, 110592, 265845, 222550, 141648, 17019, 116942, 86546, 119074, 146885, 75510, 115995, -104019, 254140, 369202, 309318]
6687C09318j09995J20770L0003q2669J16434N7651j19062k57734M139n8508J23497
6676A33844m7428L44365n744k92106J07351n8344p472J80973r8107L1424L40642
6665F29398J56035O1531L7725j1949j85312j68350l59495J26826J04418J71351
6655E62178j14872j54165n954K20092o1182r2630k22848k74475J31103K20533
6645B07780J49924o8697o8730Q7293J566J00842j41009N845J26311L7540J8634
6634D57299p1947L0517P9114j07713j46067J34893L125j61479J79960L6736J79772
6623F14210j72046k13878j53297l17410L43063q8276K8149j24551P2956R6409
6613H5329K8642J36154O6287O9959n1674L1668L2697r7739n4251M08076j32384
$$ y = [309318, 199323, 320093, 350096, 267427, 383861, 441512, 322450, 64716, 68855, 10347, 133844, 86416, 430781, 425037, 132931, 240282, 181938, 174466, 355439, 257332, 288756, 629398, 785433, 846964, 884689, 872740, 687428, 519078, 159583, 286409, 390827, 562178, 447306, 293141, 287187, 507279, 446097, 353467, 130619, -143856, -12753, 207780, 357704, 289007, 220277, 307570, 309136, 409978, 268969, 274814, 401125, 438665, 457299, 385352, 415869, 494983, 387270, 241203, 376096, 379221, 217742, 397702, 434438, 614210, 442164, 228286, 74989, -242421, 100642, 12366, 40515, -84036, -11080, 85329, 113971, 250125, 316412, 386371, 334697, 366365, 399062, 301323, 247072, 655148, 522764]
6602E22764k20565K4865l5030j59786K15600L73112j93271p9252J260J75926J02028
6591G27651J15119k63025K15015k32084J2692k5944m6135J12156n6500r9127Q319
6580D68137k39106l5439J14752K65966r1723j10884M3417K41581j62478n8818
6570D35405K07640P0438M6582j25598j50959L6118O0949J07195k58442l1035M92324
6559H90617J70289j87388N7180o0979n0331J43445m4282j14386j31600J27408
6549G99973j25271j5564J13278Q332K9171l1880O8137J43635k01711O1809m2561
6538H07348L73181O1634n3598j09271J52704L8289k62169n7596N9712Q2490j25595
6527I67129J21970J0830j89886K59490J01249k8276Q6365K24193o9204L9456J41795
$$ y = [522764, 302199, 327064, 292034, 132248, 347848, 720960, 527689, 448437, 449697, 625623, 727651, 842770, 579745, 794760, 562676, 575368, 549424, 503289, 615445, 558945, 459818, 468137, 229031, 193592, 308344, 574310, 482587, 371703, 415120, 656701, 494223, 435405, 643045, 713483, 760065, 634467, 483508, 519626, 580575, 687770, 429328, 398293, 890617, 1060906, 873518, 930698, 869719, 819388, 962833, 918551, 804165, 672565, 799973, 674702, 659138, 772416, 780748, 809919, 778039, 846176, 989811, 788100, 849909, 807348, 1180529, 1242163, 1188565, 1079294, 1231998, 1270287, 1008118, 950522, 1010234, 1092724, 967129, 1089099, 1099929, 910043, 1169533, 1270782, 1242506, 1328871, 1553064, 1483860, 1523316, 1665111]
6516A665111P8590j51641o4149K52862M4057K22737k16386l33195j73719p9996
6506A244271r0375M6629M41357r8140l33295p3221K81323J39738p9597P877j33052
6495A353515J14775Q4788j43368L11810m2162J78623J09237k73543q119L45167
6485B030723k5572n570J30508k40585K67898k12706l51262P0766K0676M0404l67462
6474A357818Q4353K76810R1593l31895K4593K92755o8045k10302m7830j3519k5774
6463A430557j76843M2421M1450J21677J72260j29538k00050m4805M00340l6724
6453A620745j75761o6986K29025P4867J7433j18982l2469l8429M3647N6320N3970
6442A663380j67732j57486M44285j37640j7130J79307m7893Q2965P4147K18379
$$ y = [1665111, 1743701, 1592060, 1527911, 1780773, 1824830, 2047567, 1831181, 1497986, 1324267, 1244271, 1153896, 1200525, 1641882, 1543742, 1210447, 1137226, 1418549, 1558287, 1478690, 1486567, 1353515, 1468290, 1553078, 1409710, 1721520, 1679358, 1857981, 1967218, 1693675, 1685556, 2030723, 2005151, 1999581, 2130089, 1889504, 2157402, 1944696, 1593434, 1664200, 1684876, 1725280, 1357818, 1442171, 1718981, 1810574, 1478679, 1503272, 1796027, 1727982, 1517680, 1469850, 1456331, 1430557, 1253714, 1296135, 1337585, 1459262, 1631522, 1501984, 1301934, 1257129, 1657469, 1620745, 1444984, 1377998, 1607023, 1681890, 1699323, 1580341, 1547872, 1509443, 1553090, 1609410, 1663380, 1495648, 1338162, 1782447, 1644807, 1627677, 1806984, 1759091, 1842056, 1916203, 2134582]
6432B134582j8874n4617j07153J17627j44766q2936P4585L8411k09661j00758
6422A646440L05166J6701Q2451K80494j84320k48712J4057K9020J74226k2877
6412B092646M3344J29103l0976J13601J41813J79067L9327K08614P6941j00343
6402B893137R7340o3165j81113m4335L4806p7014l4825J07858R028J82144n9427
6391B864434l3954j88040L9074O5488K80064K24321K14708K42229r3723j4255
6381C600346r6280k01623r5152K34990K35205K67290L6494o8297K8849L52918
6371D294740o1583p7805L55865K84208Q5913Q7147M9303J75177n5771K8385P9638
6360E245217Q2651J10032j10237J8137J68822j06794j08933Q4718m3894J81829
$$ y = [2134582, 2115708, 2061091, 1953938, 2071565, 1926799, 1843863, 1918448, 1956859, 1747198, 1646440, 1951606, 1968307, 2050758, 2331252, 2146932, 1898220, 1912277, 1941297, 2115523, 2092646, 2135990, 2265093, 2234117, 2347718, 2489531, 2668598, 2707925, 2916539, 2993480, 2893137, 2990477, 2927312, 2746199, 2701864, 2736670, 2659656, 2624831, 2732689, 2741717, 2923861, 2864434, 2830480, 2642440, 2681514, 2747002, 3027066, 3251387, 3466095, 3708324, 3614601, 3600346, 3504066, 3302443, 3207291, 3442281, 3677486, 3944776, 3981270, 3912973, 3941822, 4294740, 4233157, 4155352, 4511217, 4795425, 4881338, 4968485, 5017788, 5192965, 5137194, 5165579, 5245217, 5327868, 5437900, 5327663, 5345800, 5514622, 5407828, 5298895, 5383613, 5339719, 5521548]
6350E521548Q8044P8191L69692M91984l0974R1139K95999K51315K46753M25984
6340G829675L11957j35864J40617k0055R129k75549j72805r223l2197j43699P2012
6329G573998j49056J975j70556L8368J43904j15334K19508r6950l3716J74542
6319G586683M137j27748Q1562K94648J66605M9651L35223J59358J33985j04261
6309H579843P2197M240K23620L26078O0377k57460m3757k04797N4556P0023J43679
6298I028599K02122r2522K60833J28764M2825k05971K24799L13716M1514J52086
6288A0096765K52315K36049K58952o3539L76665K18716k0L72831K50102K71146
6278A2269982M76203K36625M91538L39856K92083J65234K76153N56339N33549
$$ y = [5521548, 5609592, 5687783, 6057475, 6549459, 6518485, 6609624, 6905623, 7156938, 7403691, 7829675, 8141632, 8005768, 8146385, 8126330, 8135459, 7859910, 7687105, 7677882, 7645685, 7501986, 7573998, 7424942, 7426917, 7256361, 7294729, 7438633, 7323299, 7542807, 7445857, 7412141, 7586683, 7590820, 7463072, 7544634, 7839282, 8005887, 8055538, 8390761, 8550119, 8684104, 8579843, 8652040, 8656280, 8879900, 9205978, 9266355, 9008895, 8965138, 8760341, 8814897, 8884920, 9028599, 9230721, 9138199, 9399032, 9527796, 9570621, 9364650, 9589449, 9903165, 9944679, 10096765, 10349080, 10585129, 10844081, 10780542, 11157207, 11375923, 11375903, 11748734, 11998836, 12269982, 12746185, 12982810, 13474348, 13814204, 14106287, 14271521, 14547674, 15104013, 15637562]
6269A5637562L49010M88902M49466L55780P40844K61785J65783K18503L45486
6260A9013121L30598O44805P56142K53357N56213L49097P03359J016257P45932
6251B4368881P47194J005144J081804R90680J414752J480276J526438J927917
6243C4543086K058090K104931K488187K585029K694631K828878L233834L994267
6235E6530933N072186N016049M967318M651909K823295N60695j560518l137318
6227G4924549l428444l113812k500423k070683j063741o20377M67125J118360
6219F3712554J817345K503224L252019L769427M473447N375184O009792P741503
6211I8654495Q729268J0041458J0909445J1519219J0689321P041030J543153m166723
$$ y = [15637562, 15986572, 16475474, 16924940, 17280720, 18021564, 18283349, 18449132, 18667635, 19013121, 19343719, 19988524, 20744666, 20998023, 21554236, 21903333, 22606692, 23622949, 24368881, 25116075, 26121219, 27203023, 28193703, 29608455, 31088731, 32615169, 34543086, 36601176, 38706107, 41194294, 43779323, 46473954, 49302832, 52536666, 56530933, 61603119, 66619168, 71586486, 76238395, 79061690, 79622385, 78061867, 74924549, 71496105, 68382293, 65881870, 63811187, 62747446, 62127069, 62594194, 63712554, 65529899, 68033123, 71285142, 75054569, 79528016, 84903200, 90912992, 98654495, 107383763, 117425221, 128334666, 139853885, 150543206, 157584236, 159127389, 154960666]
6203A54960666r614436j2798508j2675306j1112697r242949p405156n800162m195673
6195H2115779l257301k009225o27532k0448J179999J896278K720347L454395M549515
6186I0001807N458434O584151Q184879Q953218Q070577N996238J561735m275005
6178A30536034q508777j0877152j1488733j0597455q980410p609526o283174n394621
6170F0796186m341178l711468k857746k189160j506328j188425q46588l47523
6162D3807770L21220J89088O43243Q54796J145716J728858J337139O57678k81344
6153E0404164j658956k837599l763551l607570l322000l213664k328374k198916
6145B7473534j945820j675996j327999q62351j141045q34213m98558r33151m49754
$$ y = [154960666, 145346230, 132547722, 119872416, 108759719, 99516770, 92111614, 86311452, 82115779, 78858478, 76849253, 76221721, 76201273, 77381272, 79277550, 81997897, 85452292, 90001807, 95460241, 102044392, 110229271, 119182489, 127253066, 133249304, 134811039, 130536034, 122027257, 111150105, 99661372, 89063917, 80083507, 72473981, 66190807, 60796186, 56455008, 52743540, 49885794, 47696634, 46190306, 45001881, 44155293, 43807770, 44128990, 44318078, 44961321, 45816117, 46961833, 48690691, 50027830, 50685508, 50404164, 48745208, 45907609, 42144058, 38536488, 35214488, 32000824, 29672450, 27473534, 25527714, 23851718, 22523719, 21661368, 20520323, 19686110, 19187552, 18254401, 17804647]
6136A7804647n44769l41839m52305k39913m06825j14223n9643q6259k97133m30450
6126A4831288p08437o68603j98005m21237m76028k38150R0901k58363l50134k66549
6116A1336683M788k58237J04543l3458k31072l01403r3258l11247j05873l33294
6106I778172l24013l4722J39304j35351j0325n9172K27219K8818J60036J59900
6096I929866k32487L06159J69525K10766J99323M23937L81384j3658r0079l0097
6086A1254639l12171M9094m3400J062k29809k56591M431M5642J17114K21821P3547
6075A0925379j49329K30199K09592J90250K85784L34122L58970K22868M67853
6066A3075688J14005K21731N05835K45143J08159N72339J03864L58637J33974
$$ y = [17804647, 17259878, 16918039, 16465734, 16225821, 15818996, 15704773, 15645130, 15558871, 15261738, 14831288, 14122851, 13454248, 13256243, 12835006, 12358978, 12120828, 12211729, 11953366, 11603232, 11336683, 11341471, 11083234, 11187777, 11154319, 10923247, 10621844, 10528586, 10217339, 10111466, 9778172, 9454159, 9419437, 9558741, 9423390, 9413065, 9353893, 9581112, 9609930, 9769966, 9929866, 9697379, 10003538, 10173063, 10383829, 10583152, 11007089, 11388473, 11374815, 11284736, 11254639, 10942468, 10991562, 10948162, 10949224, 10719415, 10462824, 10467255, 10512897, 10630011, 10851832, 10925379, 10776050, 11006249, 11215841, 11406091, 11691875, 12025997, 12384967, 12607835, 13075688, 13189693, 13411424, 13917259, 14162402, 14270561, 14842900, 14946764, 15305401, 15439375]
6057A5439375L09291K93112l8414l4478J7981M99588J14840L72294N09376N53821
6047A8036786O12664N51141M96740L48924K65490K69102N02354L81747L85433
6038B1850381N29872O76628N27983P51944P32494O64747P39870Q55762J140221
6029B8469902R14882J399289J214520J966568J887342K500414K454603K722134
6021D3529654L055414L604355L651359L772182M090990L918689L513117K098118
6013G1233878M22623j211195k355513l355909k705476k560290k261947j469700
6005E5736471r39427k44409M34953O62280J500990K208568K837970L548245M175511
5996F9921152M597802N787325O670284P509649Q173891Q480434O737127L944200
$$ y = [15439375, 15748666, 16041778, 16003364, 15968886, 15986867, 16486455, 16601295, 16973589, 17482965, 18036786, 18649450, 19200591, 19697331, 20046255, 20311745, 20580847, 21083201, 21464948, 21850381, 22380253, 23056881, 23584864, 24336808, 25069302, 25734049, 26473919, 27329681, 28469902, 29384784, 30784073, 31998593, 33965161, 35852503, 38352917, 40807520, 43529654, 46585068, 50189423, 53840782, 57612964, 61703954, 65622643, 69135760, 71233878, 71656501, 70445306, 68089793, 64733884, 62028408, 59468118, 57206171, 55736471, 54797044, 54552635, 54987588, 55649868, 57150858, 59359426, 62197396, 65745641, 69921152, 74518954, 80306279, 86976563, 94486212, 102660103, 111140537, 117877664, 121821864]
5988A21821864m3864m225117p760283r551307r933952q244831p184295o181070
5980F8697145m906342m150832k984958k016772j598517j178604l09325M28571
5972E1980366P21397J191936J868772K602466L173456L488254L161758K293007
5964G0481412R70413j328910l126818m886308n660085n625583n064498m373063
5956D1386560l927765l399954k755580k804829k258150j913403j685474j685054
5948B0956351j229685j101109j064366r32799o70622m45803p41424q31462p11905
5939A3227176o73191j21007n98117n14107l59106j18756k12813m58851m40322
5930I730906j81073k75382k88282k3952l81077l39453p3520n037J89132l29715
$$ y = [121821864, 121778000, 117552883, 109792600, 100241293, 90307341, 82062510, 74878215, 68697145, 63790803, 59639971, 56655013, 54638241, 53039724, 51861120, 51551795, 51980366, 52701763, 53893699, 55762471, 58364937, 61538393, 65026647, 68188405, 70481412, 71451825, 70122915, 66996097, 62109789, 56449704, 50824121, 45759623, 41386560, 37458795, 34058841, 31303261, 28498432, 26240282, 24326879, 22641405, 20956351, 19726666, 18625557, 17561191, 16628392, 15957770, 15511967, 14770543, 13939081, 13227176, 12553985, 12432978, 11834861, 11320754, 10961648, 10842892, 10630079, 10171228, 9730906, 9549833, 9274451, 8986169, 8962217, 8581140, 8241687, 8168167, 8163130, 8352262, 8022547]
5920H022547k77551j79560p3692j433p3823j19314J57059m93318k07861j8092
5910F734962r5801J3718l75068j86562r9481j74001q6945K4716J87766n8795j14309
5899E770200j54902j61920k9214P8810J52785r4565k24735K9865r3102l66701
5889D906521q4565l73241o2710m6306L5007J58130j4110O354K28326k19735n77889
5878C955782O6746L02703l670J6930l2082l5126J80401k07663q4299J83884L1386
5867D374992j20748j57777k4875k81275P1118j212J45428k82391k40484k6830
5857C455946J02775j4528l00151m7283Q9684j29176K92261J01468L12744k93000
5847C570740k10262J31022q1135l6850J75293O5179J10680j01974O1350j63376
$$ y = [8022547, 7744996, 7565436, 7491744, 7490311, 7416488, 7297174, 7454233, 6960915, 6753054, 6734962, 6639161, 6652879, 6277811, 6091249, 5991768, 5817767, 5730822, 5755538, 5943304, 5884509, 5770200, 5615298, 5453378, 5424164, 5502974, 5655759, 5561194, 5336459, 5366324, 5273222, 4906521, 4821956, 4448715, 4386005, 4339699, 4374706, 4532836, 4518726, 4525080, 4753406, 4533671, 3955782, 4022528, 4325231, 4321561, 4338491, 4306409, 4271283, 4451684, 4244021, 4159722, 4343606, 4374992, 4254244, 4096467, 4071592, 3790317, 3861435, 3860223, 4005651, 3723260, 3482776, 3455946, 3558721, 3544193, 3244042, 3196759, 3286443, 3157267, 3449528, 3550996, 3863740, 3570740, 3360478, 3491500, 3410365, 3373515, 3548808, 3613987, 3724667, 3622693, 3684043, 3520667]
5837C520667j56492J84199J07196j29300L6323Q47M6099M33483q8533j76165J08617
5826C886941J95957K97275N3751j31367O9953J90234j83103o5110K2078P4064
5816D410673j5541K3683K30234j06093Q3493R5776Q9372Q5541j4219p2754P4191
5805D884356K3151M96672L82616J51112M46680K20136K32770K8825k44041j00577
5795F521700J85271o2056L17020o3056n70219r8463K13842j4530k01612K6665
5785F254562r9661L22951L00706K42859o0944K24800J8292n6271k5234K73710
5775G395770K74718K68225K37492j29306j43605j84900K624k14j09856j5033l21988
5764G273927j97607l80795K03328J59379k60266J82630J11431L7743L1152m181
$$ y = [3520667, 3364175, 3548374, 3655570, 3526270, 3562593, 3563440, 3609539, 4043022, 3954489, 3778324, 3886941, 4082898, 4380173, 4433924, 4302557, 4372510, 4562744, 4379641, 4314531, 4336609, 4410673, 4395132, 4418815, 4649049, 4542956, 4626449, 4722225, 4811597, 4897138, 4882919, 4810165, 4884356, 4907507, 5404179, 5786795, 5937907, 6384587, 6604723, 6837493, 6866318, 6622277, 6521700, 6706971, 6644915, 6961935, 6898879, 6328660, 6230197, 6444039, 6429509, 6227897, 6254562, 6154901, 6477852, 6778558, 7021417, 6960473, 7185273, 7203565, 7147294, 7122060, 7395770, 7670488, 7938713, 8176205, 8046899, 7903294, 7718394, 7721018, 7720804, 7610948, 7595915, 7273927, 7076320, 6695525, 6898853, 7058232, 6797966, 6980596, 7092027, 7129770, 7160922, 7156741]
5754G156741K95731J00938L28370K50784k1469k15075N59023M62351J7136k95785
5744H638745o09740k14991j34485j38767l9255Q773j76206k71097k5676M26926
5734G464227l0590J241J51398J50922K63902R5661J89696K26847L13727K79448
5724I106479K88898M76356J26608j552k01767m60528j23081k76917O4305j37754
5714H861047k53443j01785Q8301k83595J69110J97124J80005M27523N8620O2592
5704I405499P5538L81222J34922O1247K02921M14371K33404p6005K14315J47415
5694A1194849N3685K73899q9279j15267N4747L45760J11427J08286K49923J25260
5684A2313290J35444M18144K97102J71737J37011N19508N0371j8940N50151N7496
$$ y = [7156741, 7452472, 7553410, 7881780, 8132564, 8111095, 7896020, 8455043, 8917394, 8934530, 8638745, 8029005, 7814014, 7679529, 7540762, 7501507, 7510280, 7334074, 7062977, 7037301, 7464227, 7433637, 7434878, 7586276, 7737198, 8001100, 8096761, 8286457, 8513304, 8827031, 9106479, 9395377, 9871733, 9998341, 9996789, 9795022, 9334494, 9211413, 8934496, 8998801, 8861047, 8607604, 8505819, 8594120, 8310525, 8479635, 8676759, 8856764, 9284287, 9342907, 9405499, 9481037, 9862259, 9997181, 10058428, 10261349, 10675720, 10909124, 10833119, 11047434, 11194849, 11248534, 11522433, 11433154, 11317887, 11372634, 11718394, 11829821, 11938107, 12188030, 12313290, 12448734, 12866878, 13163980, 13335717, 13472728, 13992236, 14042607, 14023667, 14573818, 14631314]
5674A4631314L87554K73468K53731L88684J20662M21782O8900L89289N79677L66167
5664A7881228N97364N57706J26579L20738L27511J032884M54777M57474M37761
5655B2194022O65992N05691N23216P19586P94366Q86720P74967Q45254Q59007
5646B8768821Q69741R64594J362129J377583J446001J563075J889007J964729
5638D0205680K515436K846274L260247L849415M126437M706366N246600O098709
5630G2855164O769249O966544N486448K980447O8866k331285l919297m029397
5622H4846739l153085k426889j267252j41129J006396J850505K928041L770939
5614H7414265M311052M692734L947656K818714K562036K724849L413526M825780
$$ y = [14631314, 15018868, 15292336, 15546067, 15934751, 16055413, 16477195, 16546095, 16935384, 17515061, 17881228, 18478592, 19036298, 19162877, 19483615, 19811126, 20844010, 21298787, 21756261, 22194022, 22860014, 23365705, 23888921, 24608507, 25402873, 26289593, 27064560, 27909814, 28768821, 29638562, 30603156, 31965285, 33342868, 34788869, 36351944, 38240951, 40205680, 42721116, 45567390, 48827637, 52677052, 56803489, 61509855, 66756455, 72855164, 79624413, 86590957, 92077405, 95057852, 95126718, 92795433, 88876136, 84846739, 81693654, 79266765, 77999513, 77858384, 78864780, 80715285, 83643326, 87414265, 91725317, 96418051, 100365707, 103184421, 105746457, 108471306, 111884832, 116710612]
5606A16710612P196027R105810J0287785R672397O110168p7092o702775j0875017
5598A41427915j1348719j0434205q422156o328674m517463k797948j103515O45000
5590I7120235J935713L392326M079035M550984L363167N01727k011848m530796
5582A08400543m581564l041818j793119q70546J23557L4585j098008l449180n885827
5573H7838623p027364o465654n492173m796604l812811k966751k460417j457740
5565E3359109r56470o49934N321O11360N96267N28508k38196j758450k619217
5556D8878298l162383l530944l123698k796611k115019j871577j856169j383820
5548B9038077j560598j139963n49470p47808o42250o26614l25223n29899m30398
$$ y = [116710612, 123906639, 133012449, 143300234, 152972631, 159082799, 159005707, 152302932, 141427915, 130079196, 119644991, 111222835, 104894161, 100376698, 97578750, 96475235, 97120235, 99055948, 102448274, 106527309, 111078293, 114441460, 114943187, 112931339, 108400543, 103818979, 100777161, 98984042, 98113496, 98237053, 98271638, 97173630, 93724450, 87838623, 80811259, 74345605, 68853432, 64056828, 60244017, 57277266, 54816849, 53359109, 52402639, 51752705, 51758026, 52369386, 52965653, 53494161, 53255965, 51497515, 48878298, 45715915, 42184971, 39061273, 36264662, 34149643, 32278066, 30421897, 29038077, 27477479, 26337516, 25788046, 25040238, 24397988, 23771374, 23446151, 22916252, 22485854]
5539B2485854j25879m17651o4898l54351l63661k05882l94630k40814K08063j56807
5529B0369344O8930L62079K95394N6638J94881L13152M03676K54667K57916K44208
5519B2820885L08481K72489L07514P8715j55790J89078K59594m59064j23312J7124
5509B3515714j50083Q7548L39185N70856N12034J91065O05455O19268N14717O10403
5499B7416162R72592P31042P32403P03531N18419P42577L82628M07492L90413
5490C2997259M15958P23431N28819M02439M86825P43525Q89356M74675O62695
5481C8324982M66899O70083O94554J005877J463574R73043J188343J919631K230348
5472D8937334K422762K482659L169418L471779M409154N043896N602562N461806
$$ y = [22485854, 22359975, 21942324, 21877426, 21523075, 21159414, 20953532, 20558902, 20318088, 20526151, 20369344, 20438274, 20800353, 21095747, 21152385, 21347266, 21660418, 22064094, 22318761, 22576677, 22820885, 23129366, 23401855, 23709369, 23788084, 23632294, 23821372, 24080966, 23621902, 23498590, 23515714, 23365631, 23453179, 23792364, 24363220, 24875254, 25066319, 25671774, 26291042, 26805759, 27416162, 28388754, 29119796, 29852199, 30555730, 31074149, 31816726, 32199354, 32606846, 32997259, 33413217, 34136648, 34665467, 35067906, 35554731, 36298256, 37187612, 37662287, 38324982, 38791881, 39461964, 40156518, 41162395, 42625969, 43599012, 44787355, 46706986, 48937334, 51360096, 53842755, 57012173, 60483952, 64893106, 69937002, 75539564, 81001370]
5464H1001370N320415M221577K035013o51484k839102l856587m205345m072765
5456G6953092l064108k258017j394253n10686k61444P00115J598112J586891K503044
5447G5852746L612666M379685N625191O629029P522971P750422P755070Q516785
5439A27644565Q171132N608830J283364m387821q261524j0681467j0796593r287445
5431I9293041q162623p313948n915040m849952l865789l054604k562285j274032
5423F2294768o46914J46556Q02711J953393K828099L038129L280290K379405J631962
5414G7708399J193682N66244j132515l269344m816672n527907n814668n051345
5406E3855874m584429m366336l958418l243952k873038k186885k106177j783540
$$ y = [81001370, 86321785, 90543362, 92578375, 91926891, 89087789, 85231202, 81025857, 76953092, 73888984, 71630967, 70236714, 69726028, 69464584, 70164699, 71762811, 73349702, 75852746, 79465412, 83845097, 89470288, 96099317, 103622288, 111372710, 119127780, 127644565, 135815697, 141424527, 142707891, 138320070, 130058546, 119377079, 108580486, 99293041, 91130418, 83816470, 77901430, 73051478, 69185689, 66131085, 63568800, 62294768, 61647854, 61794410, 62597121, 64550514, 67378613, 70416742, 73697032, 76076437, 77708399, 78902081, 79468325, 78335810, 75066466, 70249794, 64721887, 58907219, 53855874, 49271445, 44905109, 40946691, 37702739, 34829701, 32642816, 30536639, 28753099]
5398B8753099j448938j086578r08460q93080r78562j169919q01658p94723o23694
5389B0047487o39437p03810j80789l09823n43442l01011k89431l53009m03750
5380A6322985n59799n7342m16758k45395j2663l57072Q1663R097j54334k50016
5370A4360366L1067j10849m5305k12090J3217j67904O0489l79606j54797M08997
5360A3803585P2559Q7974M0336K09319J93399j06001k71360K06067L34819j1266
5350A4559431K27816J09850j8896K64102L8403K2127K02126J38034K8735M19847
5340A5991575L97600M01010L94724J04900L81234Q3503M46797M03789K35070M15460
5330A9255662L60749L80422M53014N43568L20340R02872M26134N41945M44017
$$ y = [28753099, 27304161, 26217583, 25309123, 24416043, 23437481, 22267562, 21465904, 20671181, 20047487, 19408050, 18704240, 18523451, 18213628, 17670186, 17369175, 17079744, 16726735, 16322985, 15763186, 15705844, 15289086, 15043691, 15031028, 14673956, 14755619, 14764716, 14610382, 14360366, 14391433, 14280584, 14235279, 14023189, 14036406, 13868502, 13928991, 13549385, 13394588, 13803585, 13876144, 13964118, 14004454, 14213773, 14407172, 14301171, 14029811, 14235878, 14570697, 14559431, 14787247, 14897097, 14878201, 15142303, 15180706, 15202833, 15404959, 15542993, 15571728, 15991575, 16389175, 16790185, 17184909, 17289809, 17671043, 17754546, 18201343, 18605132, 18840202, 19255662, 19616411, 19996833, 20449847, 20993415, 21313755, 22216627, 22642761, 23184706, 23628723]
5321B3628723K13137O65115O97010O05163P03457N39730L21216Q08704J064694
5312B9246949M68664P99779J275664J270663R53451J296843R44971R00291J344698
5303C8501973J506402J714709J572904K328765K282062K365439K673666L478117
5295E6424037L596002M108144M506679N477197O326897P767947R189884J1304171
5287A08700958J3023056J3542920J2284820O264330l179410j0717471j2848768
5280A27070435j1621353r274322p073384n474614m333236l060545k185878j534335
5272H2512768o74960l23296P63087R62614J010584J381762J751186K624700K775618
5263I2784063L519031M058782L694221L034556K164125K134504K881684L703047
$$ y = [23628723, 23841860, 24506975, 25203985, 25809148, 26512605, 27052335, 27373551, 28182255, 29246949, 29715613, 30515392, 31791056, 33061719, 34015170, 35312013, 36256984, 37157275, 38501973, 40008375, 41723084, 43295988, 45624753, 47906815, 50272254, 52945920, 56424037, 60020039, 64128183, 68634862, 74112059, 80438956, 88206903, 97396787, 108700958, 121724014, 135266934, 147551754, 153816084, 150636674, 139919203, 127070435, 115449082, 106174760, 99101376, 93626762, 89293526, 86232981, 84047103, 82512768, 81837808, 81514512, 82277599, 83240213, 84250797, 85632559, 87383745, 90008445, 92784063, 96303094, 100361876, 104056097, 107090653, 109254778, 111389282, 114270966, 117974013]
5255A17974013N104199O143046Q051611R882909J1395171J3503209J5338169J6723542
5247B04115869J8829034K0440697K0599678J9990445J8484182J5932853J1512886
5240C29905644O185820n56341o859587j2684930j7589266k0560398k1831560k2591992
5232B33417390k2793025k1039220j8865157j6626751j5114736j3438802j1369788
5225A14169911r190162q133777o364202m731846l887459l159196k495925k349664
5217G3857680k913554l747541l465393l373060k739421j984022k220242k282332
5209E1132115j904242j878460j870422j763221j720542j241054j581025j835582
5201C7337567j727600j858621j690516j148384j279430j367333j284556j343808
$$ y = [117974013, 123078212, 129221258, 137272869, 147155778, 158550949, 172054158, 187392327, 204115869, 222944903, 243385600, 263985278, 283975723, 302459905, 318392758, 329905644, 336091464, 335535123, 328675536, 315990606, 298401340, 277840942, 256009382, 233417390, 210624365, 189585145, 170719988, 154093237, 138978501, 125539699, 114169911, 104979749, 96845972, 90481770, 85749924, 81862465, 78703269, 76207344, 73857680, 70944126, 67196585, 63731192, 60358132, 57618711, 55634689, 53414447, 51132115, 49227873, 47349413, 45478991, 43715770, 41995228, 40754174, 39173149, 37337567, 35609967, 33751346, 32060830, 30912446, 29633016, 28265683, 26981127, 25637319]
5193B5637319j078492j445919r58183j032770j129349q45245r14298p09645o55355
5184A6868063m79917n83237o19480o22541j26567l82561o02574n21232k39647
5175A2690307k63821p18403k78024Q475k77974l24965m97334k25178k65385k60767
5165I586931m18791r2355l35936n74261k16209M0945l75056M2802m9882l34384
5155G273804j04132k16407j88123L1454m5291k82314p4123j76572j63033j18265
5145E936998q6018j90359o9211j5685j14676j15667m8012n2493p8127n4356j68707
5134D943687r3277j76670k29668j54690Q549o0096p0258j74114R264M0083P6168
5123D118978J49239j61947P8689m75685j262J1119M1807k20160J22110P5368J11148
$$ y = [25637319, 24558827, 23112908, 22154725, 21121955, 19992606, 19147361, 18233063, 17523418, 16868063, 16388146, 15804909, 15185429, 14562888, 14436321, 14053760, 13451186, 12929954, 12690307, 12426486, 11708083, 11430059, 11438534, 11160560, 10835595, 10338261, 10113083, 9847698, 9586931, 9168140, 9075785, 8739849, 8165588, 7949379, 7990324, 7615268, 7658070, 7608188, 7273804, 7169672, 6953265, 6765142, 6796596, 6751305, 6468991, 6394868, 6218296, 6055263, 5936998, 5850980, 5660621, 5591410, 5575725, 5461049, 5345382, 5297370, 5244877, 5166750, 5112394, 4943687, 4850410, 4673740, 4444072, 4289382, 4297931, 4237835, 4167577, 3993463, 4002727, 4042810, 4118978, 4268217, 4106270, 4184959, 3709274, 3708012, 3719131, 3760938, 3540778, 3662888, 3738256, 3849404]
5112C849404j75636k7973k40945k82777K8925m4985J18603l36363j14843J63971
5102B937381J04562m1110j77786M0585j19584m06788l5114J56848k7357k6944
5092B404693L2648r4971p5519k59387j29633K97245M7484j29051L2150o0848R4154
5081B158965j16844j78903K39038l26239l9381M9226r2024j58182Q8576J95644
5071A819876j27766j20643O6957J67341j16306k06774j96929j39198K37102L85347
5061A769007j1640j96111L4855R5081q9520K15975k56077j13232l5884K36028
5051A648482n6895p3635k2199M5439J7580k0062k35815Q668N4082J09734j64003
5040A311376K6784k85906K69663K31838j52526J70724q0530j17081J7913j7527
$$ y = [3849404, 3673768, 3645795, 3404850, 3122073, 3150998, 3106013, 3224616, 2888253, 2773410, 2937381, 3041943, 3000833, 2823047, 2863632, 2744048, 2337260, 2302146, 2458994, 2431637, 2404693, 2437341, 2342370, 2266851, 2007464, 1877831, 2175076, 2222560, 2093509, 2125659, 2064811, 2158965, 2042121, 1863218, 2102256, 1776017, 1736636, 1785862, 1693838, 1535656, 1624232, 1819876, 1692110, 1571467, 1638424, 1805765, 1689459, 1482685, 1285756, 1146558, 1383660, 1769007, 1757367, 1561256, 1596111, 1691192, 1601672, 1817647, 1561570, 1448338, 1412454, 1648482, 1591587, 1517952, 1495753, 1541192, 1558772, 1538710, 1302895, 1311563, 1365645, 1475379, 1311376, 1338160, 1052254, 1321917, 1553755, 1401229, 1571953, 1491423, 1374342, 1392255, 1374728]
5030A374728M3510o603j14787l93016K01963J21140P9322j89525j59016K76255
5020A233971k38808j6570J94276K59363l28790j03017K44284j16634j80634N0248
5010I97689j53637j23331J70594l9638r2775k3809N4106K56372n3628J29011k9263
4999A091691j86060J2935P6615k9417O8211M6160L5933j72795j27209J1745J72392
4988A000201j4449Q6997k468k2418l5787j33717L36345K75886k46231j46435k309
4977A095615j82665R4459m9144K15223L8777l45425j28499o7120K25063K53495
4967A149779K24825j15346n4552j84006j10928j849Q0574l5871j1682J15777M7841
4956A104562J95969R4219j35614o1299j29935M66913p6407j12707m7068j42519
$$ y = [1374728, 1418238, 1411635, 1296848, 903832, 1105795, 1226935, 1306257, 1116732, 957716, 1233971, 995163, 978593, 1172869, 1432232, 1103442, 1000425, 1244709, 1128075, 947441, 997689, 844052, 720721, 891315, 851677, 758902, 735093, 789199, 1045571, 991943, 1120954, 1091691, 905631, 918566, 995181, 965764, 1033975, 1080135, 1116068, 943273, 816064, 827809, 1000201, 985752, 1072749, 1070281, 1047863, 1012076, 878359, 1214704, 1490590, 1244359, 1097924, 1095615, 912950, 1007409, 958265, 1173488, 1212265, 866840, 738341, 671221, 896284, 1149779, 1374604, 1259258, 1204706, 1020700, 909772, 907923, 988497, 952626, 940944, 1056721, 1104562, 1300531, 1394750, 1259136, 1197837, 1067902, 1534815, 1458408, 1345701, 1298633, 1156114]
4946A156114J66622j0057J7333j56039j07047o4285J41156J57166k00026M9842
4936A150779o4935J94128J29378k83063j0671o5815l0905R4511J49514j06750
4926A156171J38248J27250m2978j77265o208m5176k2112r7720o1916J49152K9409
4915A146855R0997Q9296j85569o6894J73204j82186J28628n5512o3556P5576k10026
4904I40813J29196j54212N7796K36563k77218j6166k8661j97870l39182K46564
4894E97623K28824j01124M0010L7626j15646J59910K8555m5173n2139l1129K4618
4883G71955J70760k61759p3630K45741p855k74017j09062o1867k26097K01868
4873C76037l3033n9472n4842N6213O6485O1544o7948K03078m3673j8460n8893
$$ y = [1156114, 1322736, 1312679, 1330012, 1173973, 1066926, 1002641, 1143797, 1300963, 1100937, 1150779, 1085844, 1279972, 1409350, 1126287, 1115616, 1049801, 1018896, 1113407, 1262921, 1156171, 1294419, 1421669, 1378691, 1201426, 1195218, 1150042, 1127930, 1030210, 968294, 1117446, 1146855, 1237852, 1327148, 1141579, 1074685, 1247889, 1065703, 1194331, 1138819, 1075263, 1150839, 940813, 1070009, 915797, 973593, 1210156, 932938, 916772, 888111, 690241, 351059, 597623, 826447, 725323, 765333, 802959, 687313, 847223, 875778, 830605, 778466, 747337, 771955, 942715, 680956, 607326, 853067, 845212, 571195, 462133, 400266, 174169, 376037, 343004, 283532, 228690, 284903, 351388, 412932, 344984, 548062, 504389, 485929, 427036]
4862D27036p126J0058n6411j42589l5001n1059J87684J16971J53387q8682J4063
4851E28331l7132P9730K9835k94800R7850k4602j53915J86204J26729o6748j73496
4840B97986j82224J04750K75559m8487o0916n4317P2227j09333o859Q4941k26294
4829A47033j51919L16581j88370J43856K4429k5033J8303J40688k4493L8434j13382
4818C26127j44369M0158O8159L6416j89860J08590N5133J10537J07926O8379k94733
4807B92463O0367j9615k81981N0109L39660J1225p479j35277k38780K74245j3940
4796C30997l6645K09956m33917o3479J16781J77278J75691J16868k03294J11736
4786E01972l0218j09540j80699m2897P1966R5731n6390J62273J5684j78874k9033
$$ y = [427036, 419910, 429968, 373557, 230968, 195967, 144908, 332592, 449563, 602950, 514268, 528331, 491199, 570929, 600764, 305964, 403814, 379212, 225297, 411501, 538230, 471482, 297986, 115762, 220512, 496071, 447584, 386668, 332351, 404578, 295245, 288386, 373327, 147033, -4886, 311695, 123325, 267181, 291610, 266577, 284880, 425568, 401075, 439509, 326127, 181758, 221916, 290075, 326491, 136631, 245221, 300354, 410891, 518817, 587196, 292463, 352830, 333215, 51234, 101343, 441003, 452228, 444749, 309472, 70692, 344937, 330997, 294352, 504308, 70391, 6912, 123693, 300971, 476662, 593530, 390236, 501972, 471754, 362214, 181515, 138618, 210584, 306315, 249925, 412198, 427882, 249008, 219975]
4775B19975q8669J39786L7165K01836k1075k42477K51136l5519J05149n1656j45490
4764C70161j20392j01448J83058J57694l2748L1428P685j16733N1709n7090N9109
4753D32433K42821k96273k35302K51349J63374j03609j58172k9699M3457j07118
4743B03261L1942K21776q9428k303P005k38837K29117o901P612J05629k29948
4732B38925O3820o9451k1051K05727L2929N0202J39818o3123k8204q3619O0975
4721E26948o8584j3610j63493P8488K22866J5549j3318R5326o5598n6023j23805
4710D34746J7929m5730j01151l61618J23029J91949j0436o4837m0573K23104K9565
4699C95977k8436j06865o6775m7645J83404q0215J22540J06090r9131J62493o270
$$ y = [219975, 131306, 271092, 308257, 510093, 489018, 246541, 497677, 462158, 567307, 515651, 370161, 249769, 148321, 331379, 489073, 456325, 487753, 495438, 378705, 430414, 373324, 432433, 675254, 378981, 143679, 395028, 558402, 454793, 296621, 266922, 310379, 203261, 235203, 456979, 367551, 365248, 372253, 133416, 362533, 355632, 363244, 468873, 238925, 302745, 233294, 212243, 417970, 450899, 501101, 640919, 577796, 549592, 465973, 526948, 458364, 444754, 281261, 359749, 582615, 598164, 584846, 680172, 614574, 558551, 434746, 452675, 406945, 305794, -55824, 67205, 259154, 248718, 183881, 143308, 366412, 395977, 367541, 260676, 193901, 146256, 329660, 249445, 371985, 478075, 378944, 541437, 535167]
4688E35167m0318J93192O7022j88048j60412q595j05269k9863Q7924j07400j35764
4677A07636K56200J69950k015n8891r0710l5226J7115j08445P3030L5554j6010
4666C48188N5448j27939r4534O861J39594O1882m6624J97056j53692k20403r320
4655A56517J26862P1625k7674q9394m0099M7246n372K39115J81605j42171o5339
4644D52921j60732J51316K00155j41410J15576N4010k13156j39131j54354J98400
4634C63595R6080J48212j55116l38063L89786n3268j01609J72309K06805k55079
4624D73652r7908p1042j77270R1569J92513O6118J42389L535k03204J95086Q1152
4613F96590J55668J4985O2542m2154k43062P0557k45560r314J81596L8048J9301
$$ y = [535167, 494849, 688041, 755063, 567015, 406603, 398008, 292739, 262876, 350800, 243400, 107636, 363836, 533786, 531771, 472880, 382170, 346944, 364059, 255614, 328644, 364198, 348188, 403636, 275697, 181163, 188024, 327618, 389500, 342876, 539932, 386240, 165837, 156517, 283379, 355004, 327330, 237936, 197837, 245083, 239711, 478826, 660431, 518260, 452921, 292189, 443505, 643660, 502250, 617826, 671836, 458680, 319549, 165195, 363595, 459675, 607887, 452771, 114708, 504494, 451226, 349617, 521926, 728731, 473652, 375744, 304702, 127432, 219001, 411514, 477632, 620021, 623556, 420352, 615438, 696590, 852258, 867243, 929785, 887631, 644569, 715126, 469566, 460252, 641848, 679896, 699197]
4602F99197Q3936J16179K33398j59049j04577K0494q2068j35183j09884N5428
4592F17871J42272J95034K56720j04417n2339J2639J24796k8577m04840M8025
4582H07184o4667J03780N1980j61983n5228j40929l5773J29015J2189j86449J8579
4571D77698J67508K71863k13999K30382R4318J08975k8491k83306j94785J97340
4561H27503k61831j3977J91530n8664K25259L0225k35281L3778R7937j87477K11565
4550H60567k0315R9083J25446l09721M0476K00378m60844L11840R5653n2505m726
4539H85332j90587j61101l4686J68939N7046j07455J41097J79093M0505j35351
4529H42832J69235k52890k44433L6013J603J85051N3994l5768O841j2750J16557
$$ y = [699197, 783133, 899312, 1132710, 973661, 869084, 889578, 807510, 672327, 562443, 617871, 760143, 955177, 1211897, 1107480, 1055141, 1067780, 1192576, 1163999, 759159, 807184, 742517, 846297, 898277, 736294, 681066, 540137, 504364, 633379, 645568, 459119, 477698, 645206, 917069, 703070, 933452, 1027770, 1136745, 1108254, 824948, 630163, 827503, 565672, 551695, 743225, 684561, 909820, 940045, 704764, 738542, 836479, 649002, 860567, 840252, 939335, 1064781, 755060, 795536, 995914, 535070, 846910, 942563, 890058, 885332, 694745, 533644, 498958, 667897, 724943, 617488, 758585, 937678, 978183, 842832, 1012067, 759177, 514744, 550757, 552360, 737411, 791405, 755637, 762478, 749728, 866285]
4518H66285J6482K8287N4530L4611o1599j9027k87573j40035J18276O3740M30683
4507A104660k68287j70296J04996j95621K62683J26175r9236J82687j03449j87692
4497G56620R1235Q3596j44425j97121J17907L17433j04552q9828j70525J27708
4487G88048O0438K41095R485L1229P4407n189n8671J48205K82545k90802J13996
4476A394786n6130M92452k80093p7759Q8716J5791j05827K8345K69598J27320
4466A897199k71303l157m6753l5825L86750m4198l8731m6528J07888n1149k0762
4455A833431K97470l9454K56489k8904J4273R8672l97686j79L11420L68256J53249
4444B867037j2606j91893j20047K27160J94754J57096l3499R2926L56000j57031
$$ y = [866285, 882767, 911054, 965584, 1000195, 938596, 919569, 631996, 491961, 610237, 673977, 1104660, 836373, 666077, 771073, 575452, 838135, 964310, 865074, 1047761, 944312, 756620, 847855, 931451, 787026, 589905, 707812, 1025245, 920693, 830865, 660340, 788048, 848486, 1089581, 1099066, 1130295, 1204702, 1199513, 1140842, 1289047, 1571592, 1280790, 1394786, 1338656, 1831108, 1551015, 1473256, 1561972, 1577763, 1471936, 1500281, 1769879, 1897199, 1625896, 1622739, 1575986, 1540161, 1926911, 1882713, 1843982, 1797454, 1905342, 1854193, 1833431, 2130901, 2091447, 2347936, 2319032, 2333305, 2431977, 2034291, 2034112, 2345532, 2713788, 2867037, 2854431, 2662538, 2542491, 2769651, 2964405, 3121501, 3088002, 3180928, 3536928, 3379897]
4434C379897K45180J36780J6710M55222K08458N7197M93145N65254N40775J86679
4424F285297P19706P33045J048828J060330R11094J039132J715964J719273K124105
4415A7356774K365014J959931J704991O9169j159058k167855k912263k403071
4407A4813632j788272j709082j311415j148413q69934r41018o72595n53581n53390
4398E265932l53978j19761k67842m34194n71539j43035J06281l14646j60396j86537
4388B820285o6782j52808j96926l7235J1601j53002M8101l2545k1186m11649m7427
4377A760427m968J13423l44018r4131K47015J54357j92108m4874p3631J68102
4367A689594Q1646m68094J09443Q2329J3974J1447k00476k70321J65350R7562
$$ y = [3379897, 3625077, 3761857, 3778567, 4233789, 4442247, 4499444, 4992589, 5557843, 6098618, 6285297, 7005003, 7738048, 8786876, 9847206, 10758300, 11797432, 13513396, 15232669, 17356774, 19721788, 21681719, 23386710, 23455879, 22296821, 20128966, 17216703, 14813632, 13025360, 11316278, 10004863, 8856450, 7986516, 7045498, 6372903, 5819322, 5265932, 4911954, 4792193, 4524351, 4090157, 3518618, 3375583, 3481864, 3167218, 3006822, 2820285, 2753503, 2600695, 2403769, 2366534, 2378135, 2225133, 2273234, 2240689, 2219503, 1807854, 1760427, 1755459, 1868882, 1524864, 1430733, 1677748, 1832105, 1639997, 1595123, 1521492, 1689594, 1771240, 1303146, 1412589, 1494918, 1508892, 1520339, 1319863, 1049542, 1214892, 1312454]
4357A312454j25514q5705K2568j3118j31008p8256j18241J50591O4193k85728
4347G12236J42392K38081q3925N7499l6158j39552j96713R3833J34828k60161
4337F62360L50398J4291k47661R577J71537J35667k41456q3372j58741K72663
4327H85263m255J15009J01479m28515j35604L2095L24634k2787j95760J69514
4317H41073o988n6014K36104k94139O3699J7624J11845P569K9077q8440K36734
4306A098144n8307j86184k92383Q6168j69761J96829j9794m2429J86837l301j79251
4295F16568L5213J0024K03975l0426j8225r8395L9074R7339j42553O9230J6613
4284G98437J97562k73796N2178l5338j06914o8532j2657M21277L31948j5962J38979
$$ y = [1312454, 1186940, 1101235, 1123803, 1110685, 979677, 901421, 783180, 933771, 997964, 712236, 854628, 1092709, 1008784, 1066283, 1030125, 890573, 693860, 787693, 922521, 662360, 1012758, 1027049, 779388, 788965, 960502, 1096169, 854713, 771341, 612600, 885263, 881008, 996017, 1097496, 668981, 533377, 565472, 890106, 867319, 671559, 841073, 834085, 778071, 1014175, 720036, 783735, 801359, 913204, 920773, 949850, 861410, 1098144, 1039837, 853653, 561270, 647438, 477677, 674506, 654712, 612283, 799120, 795819, 616568, 651781, 661805, 865780, 835354, 817129, 718734, 757808, 855147, 712594, 781824, 798437, 995999, 722203, 774381, 739043, 632129, 563597, 550940, 972217, 1304165, 1288203, 1427182]
4273A427182J24920j01788j80374J58687m7158j06003l28043J89492q4494j83987
4263H68434k4624l0932l05356J46905J40259n7988K33303j34813J09907J6549
4253I61644l07038p7947P8961J70735N0149k08981j52867L07731J23513j26308
4243H19592o6085p4638j82188k38622m0954K86790L3396j73377M19239j56323
4233F26830j12985K78293K29489l80771l59325m5260J00260J2111j8484R8764
4223D28922j49332N8686m0867J6181o2932J03422m451n509L27821K9056k6802
4212F74195R0793M3985k47764J70830N637q3075K22726k99059j5870j24589J3426
4201D51235P7080R5367Q9518p2382j71011p5806M2902p0191L28038j15987k17735
$$ y = [1427182, 1552102, 1450314, 1269940, 1428627, 1381469, 1275466, 947423, 1136915, 1052421, 868434, 843810, 812878, 507522, 654427, 794686, 736698, 970001, 835188, 945095, 961644, 654606, 576659, 655620, 826355, 876504, 667523, 514656, 822387, 945900, 819592, 753507, 678869, 496681, 258059, 217105, 503895, 537291, 363914, 783153, 626830, 513845, 792138, 1021627, 640856, 281531, 236271, 336531, 348642, 330158, 428922, 279590, 338276, 297409, 313590, 250658, 354080, 349629, 344120, 671941, 700997, 674195, 764988, 808973, 561209, 732039, 737676, 654601, 877327, 578268, 562398, 437809, 451235, 528315, 623682, 713200, 640818, 469807, 394001, 436903, 366712, 694750, 578763, 361028]
4190C61028J5111P5977K22008j78574Q9483J88561j17169l78228L44148j85726
4180D36619P0507J42520j5025k32886j20980K20009k70248j35401L97759L84632
4170H77506j00639j75664R4222N3728k51199l763L06806O893j32504J32997q8310
4159G20073o3439M2457p3536o7105J66347Q5049Q4035j47847j4154J27319k84673
4148E74526m012j09165k1692L57776K3820J39706l9249j07784k41678J12685K29586
4137I14519Q3258k76678n6571J32051L96331j07719q7650n7438m06032L74947
4127I09018K06306j81717j70049J54498J29922k03563N0325P0543J28232m4429
4117A049086N0653k4096j11797r848l1000p9250k1604K48561J66197O5444k20533
$$ y = [361028, 376139, 452116, 674124, 495550, 585033, 773594, 656425, 278197, 622345, 436619, 507126, 649646, 634621, 401735, 280755, 500764, 230516, 95115, 492874, 877506, 776867, 601203, 695425, 749153, 497954, 494191, 800997, 807890, 675386, 808383, 720073, 656634, 699091, 625555, 558450, 724797, 809846, 893881, 746034, 731880, 859199, 574526, 570514, 461349, 439657, 797433, 821253, 960959, 921710, 813926, 572248, 684933, 914519, 997777, 721099, 664528, 796579, 1192910, 1085191, 997541, 940103, 534071, 909018, 1115324, 933607, 763558, 918056, 1047978, 844415, 894740, 965283, 1093515, 1049086, 1099739, 1075643, 963846, 953998, 922998, 843748, 822144, 1070705, 1236902, 1302346, 1081813]
4106A081813R7475Q7355j23776j00904r9625L65420P1062j74117j87326J8681
4096A036058j50414K44671K83597j06213J67170n4207j00431j43085n639p4212
4086A097295J14191n9898Q0563Q7337l1759Q3944j11290j15328r6374L81412q3221
4075A346872j12145J83482k97545k6737M1765L47701j05119n9926J09169K3447
4065A450964j29991N2845K7401k23553R0781J17923M9105L8447l3639J78717o5107
4054A553893l21358J03168R2421J32552j46483j21340J64224K71874j57219j49890
4044A421842J80273J28582l01416L76324j62039l11412j08856L484K61271n4954
4034A433099K46795r8165J70364j64185j69343J25192J20682r1580L9698k00763
$$ y = [1081813, 1179288, 1266643, 1142867, 1041963, 942338, 1307758, 1378820, 1204703, 1017377, 1036058, 885644, 1130315, 1413912, 1307699, 1474869, 1420662, 1320231, 1177146, 1171507, 1097295, 1211486, 1151588, 1232151, 1319488, 1287729, 1371673, 1260383, 1145055, 1048681, 1430093, 1346872, 1234727, 1418209, 1120664, 1093927, 1135692, 1483393, 1378274, 1318348, 1427517, 1450964, 1320973, 1373818, 1401219, 1177666, 1268447, 1386370, 1435475, 1473922, 1440283, 1619000, 1553893, 1232535, 1335703, 1428124, 1560676, 1414193, 1292853, 1457077, 1728951, 1571732, 1421842, 1602115, 1730697, 1429281, 1805605, 1643566, 1332154, 1223298, 1226782, 1488053, 1433099, 1679894, 1581729, 1752093, 1587908, 1418565, 1543757, 1664439, 1572859, 1612557, 1411794]
4024A411794p3739N11879o87k8364J72995j28705n5106j41148J2799J93563j6687
4013A858594k23316p0802M7755j5696q5638K24483n4171J5380Q5125l9764k3852
4002A718098r6553N6814J17476l1571J46299J39384l8813L8845p8740J0056P8540
3991B059835K73180p3117j0040j31223j3622n2739K66031j02229k73103n2764
3981A890209J00184J90787J21557Q635n6066P863K84217J04426J8276j17581j48959
3970B403548l2465K22021J1859k25908J41309J18018J15225j8393p209r299P0185
3959B788891K28001o6801J03300P5170k66187o9346K3915O1887j12052q798L8257
3948B796237k72156m0077O9042K37243q5039J13811l8251j43960J86163j8944
$$ y = [1411794, 1338055, 1849934, 1849247, 1820883, 1993878, 1865173, 1810067, 1668919, 1681718, 1875281, 1858594, 1635278, 1564476, 1612231, 1596535, 1510897, 1735380, 1681209, 1696589, 1781714, 1741950, 1718098, 1621545, 1678359, 1795835, 1764264, 1910563, 2049947, 2011134, 2049979, 1971239, 1981295, 2059835, 2333015, 2259898, 2249858, 2118635, 2105013, 2052274, 2318305, 2216076, 1942973, 1890209, 1990393, 2181180, 2302737, 2311372, 2255306, 2263169, 2547386, 2651812, 2670088, 2552507, 2403548, 2371083, 2593104, 2604963, 2379055, 2520364, 2638382, 2753607, 2735214, 2728005, 2718706, 2788891, 3016892, 2950091, 3053391, 3128561, 2862374, 2793028, 2816943, 2878830, 2766778, 2757980, 2796237, 2524081, 2484004, 2553046, 2790289, 2705250, 2819061, 2780810, 2636850, 2823013, 2804069]
3938B804069K0879j79976R1601o3547R1313K02292j16677j7901J14937l450j21439
3927B822101L1880k979J8286J92508o4855m65k39057O007K7879P4075K48759l9678
3915C074461N5459L5101k94763o3618J58388K43536q0807N7936J9749Q729r0287
3904C123884j39769m7704L16592o7779K01256j01084L3679J78576o98m9869J18223
3893C565307k65389Q5883J1319j15344K35342J47454K21018j69784J2756k5193
3883C703369K9061l94474K4733M81987L20685o2161J646R9349p1575j91077J34992
3872D076535J20538j59559J01864J36021K02360J62474L1150N3018j90879J5992
3862D549514q7334J55333K60742J66921j56845j76785j46151Q3523J52844J68765
$$ y = [2804069, 2824948, 2644972, 2736573, 2673026, 2764339, 2966631, 2849954, 2832053, 2946990, 2943540, 2822101, 2853981, 2851002, 2869288, 3061796, 2996941, 2996476, 2757419, 2763426, 2791305, 2865380, 3114139, 3074461, 3129920, 3165021, 2870258, 2806640, 2965028, 3208564, 3127757, 3185693, 3205442, 3214171, 3123884, 2984115, 2936411, 3253003, 3185224, 3386480, 3285396, 3319075, 3497651, 3496953, 3447084, 3565307, 3299918, 3385801, 3397120, 3281776, 3517118, 3664572, 3885590, 3715806, 3728562, 3703369, 3732430, 3337956, 3362689, 3844676, 4165361, 4103200, 4104846, 4204195, 4132620, 3941543, 4076535, 4197073, 4037514, 4139378, 4275399, 4477759, 4640233, 4671383, 4724401, 4533522, 4549514, 4462180, 4617513, 4878255, 5045176, 4888331, 4711546, 4565395, 4648918, 4801762, 4970527]
3852D970527J2101J27123R5782k34821n0344J31361j3173k58439K04773O4138
3842E049028M3457j63477M9384j47000O9704J74547k63337M4038q1473R3755K1232
3831D889858K23322l5840J7170J12780K57098j24124p0977J75988l5179j77372
3821E232724K1685J69680o4607l03J91037r726j06416r81J33079j24976M1711
3810E482907m2055j66254K30756K414K5132K23200Q4155o4435k98010K00473k24171
3799E454112K96029O3010j37375J97529r2156j36005j01534J71615K18104M7203
3789E980532j00655K8565l21203q7704L34210L6882L5542K57417O0353k33742
3779E990197k54267K30668J01631N2468k78847J05304j84952n7228O3991k6509
$$ y = [4970527, 4982628, 5109751, 5205533, 4970712, 4920368, 5051729, 5038556, 4780117, 4984890, 5049028, 5092485, 4929008, 4978392, 4831392, 4901096, 5075643, 4812306, 4856344, 4774871, 4868626, 4889858, 5113180, 5077340, 5094510, 5207290, 5464388, 5340264, 5269287, 5445275, 5410096, 5232724, 5254409, 5424089, 5359482, 5359179, 5550216, 5540490, 5434074, 5433093, 5566172, 5441196, 5482907, 5440852, 5274598, 5505354, 5507768, 5532900, 5756100, 5840255, 5775820, 5477810, 5678283, 5454112, 5750141, 5813151, 5675776, 5873305, 5781149, 5645144, 5543610, 5715225, 5933329, 5980532, 5879877, 5908442, 5587239, 5499535, 5833745, 5870627, 5906169, 6163586, 6223939, 5990197, 5735930, 5966598, 6068229, 6120697, 5841850, 5947154, 5762202, 5704974, 5768965, 5742456]
3769E742456K47167J26259R6272k25865K14397O6655O0813K2212q5860K00019
3759F464525J87235k00083n6155N07056J73526n1955j35331p03P36J36986J31109
3748G156946j4243p744M51637j23465Q1910R7249k5438Q2197j69968J47647K77431
3737G954159J40446Q573l1813r8279O4834O0253l8072J63806M9639m5115J06270
3726H334701J42469K68736K6088L1493K93288O3538J10175P2501K6965K8949j1310
3715I387593K38424M32855K76121M57186N0560K59059n0572N55262L81417Q2156
3705A2070061L75778L71551M77892P30937O14277P48895J012113J078340J219232
3696A8699076J161353J609215J680774K149757K254943L046446L664309M402340
$$ y = [5742456, 5989623, 6115882, 6212154, 5986289, 6200686, 6267341, 6328154, 6350366, 6264506, 6464525, 6651760, 6451677, 6395522, 6902578, 7076104, 7024149, 6888818, 6888115, 6888851, 7025837, 7156946, 7142703, 7134959, 7586596, 7463131, 7545041, 7642290, 7616852, 7699049, 7529081, 7676728, 7954159, 8094605, 8103178, 8071365, 7973086, 8037920, 8098173, 8060101, 8223907, 8273546, 8228431, 8334701, 8477170, 8745906, 8771994, 8803487, 9096775, 9160313, 9270488, 9342989, 9369954, 9398903, 9387593, 9626017, 10058872, 10334993, 10792179, 10842739, 11101798, 11051226, 11606488, 11987905, 12070061, 12445839, 12817390, 13295282, 14026219, 14640496, 15389391, 16401504, 17479844, 18699076, 19860429, 21469644, 23150418, 25300175, 27555118, 30601564, 34265873, 38668213]
3688C8668213N036925N224346L318275n45939m246969n893511n465083m495885
3680C1600372l814745l085255k499361j906306j458437j352776r53934q49081
3672A5680477j025944m35703n16444o24206m20388m48013j77633j26993k13249
3663A1691904j73847m37325k38640j41720k66916l49745l6939q4392m19415j1523
3653I531442j01042j2532l29133J01731p0295j40796M8932J13417j16936l04851
3643H719937K21203r1948l91447L80834L55933j22974l7062r3414L8349o3452
3633H915959L21498j51230j35643m01285L0924j7293P9525J3140K57689J18824
3623I032108l47529j57887j76529J77225q8310l5648L84014k93311J11045L75258
$$ y = [38668213, 43705138, 48929484, 52247759, 51701820, 47454851, 41561340, 36096257, 31600372, 27785627, 24700372, 22201011, 20294705, 18836268, 17483492, 16529558, 15680477, 14654533, 14218830, 13702386, 13078180, 12657792, 12209779, 12032146, 11905153, 11691904, 11518057, 11080732, 10842092, 10700372, 10433456, 10083711, 10046772, 9962380, 9542965, 9531442, 9430400, 9417868, 9088735, 9190466, 9120171, 8979375, 9028307, 9141724, 9024788, 8719937, 8941140, 8849192, 8457745, 8838579, 9194512, 9071538, 9034476, 8941062, 8979411, 8915959, 9237457, 9086227, 8950584, 8549299, 8580223, 8562930, 8642455, 8655595, 8913284, 9032108, 8684579, 8526692, 8350163, 8527388, 8439078, 8403430, 8787444, 8494133, 8605178, 8980436]
3613H980436l26446m1823j71608M6510L56826J63735O2167j36472n9568K15575
3603I089332q8443j84181J66898j36956J58601K15136Q1889J21792k66536K80656
3593I438188J09662P539J06626l27555K67201R4276j45785O0328l11223K53706
3583I552963Q4679K4957J89458K4603K17903J61808q2498O0296m4603O1032K76776
3572A0527374K78804k00545J02691j26078J53115M50210N7855J65526K83094l0006
3562A1662040j65838J78165n0921P9814J49393L49492K80317k0931j23401Q758
3552A2346888j59908J85408L44547J06678L5922j4200L14594K06199J71148J7897
3542A3555173M8350j8512J29929K62427M85625n8265m1422L13539J87093J85054
$$ y = [8980436, 8653990, 8612167, 8440559, 8487069, 8843895, 9007630, 9069797, 8933325, 8873757, 9089332, 9000889, 8816708, 8983606, 8846650, 9005251, 9220387, 9302276, 9424068, 9157532, 9438188, 9547850, 9555389, 9662015, 9334460, 9601661, 9695937, 9550152, 9610480, 9299257, 9552963, 9637642, 9662599, 9852057, 9876660, 10094563, 10256371, 10173873, 10234169, 10189566, 10250598, 10527374, 10806178, 10605633, 10708324, 10582246, 10735361, 11185571, 11243426, 11408952, 11692046, 11662040, 11496202, 11674367, 11623446, 11703260, 11852653, 12202145, 12482462, 12461531, 12338130, 12346888, 12186980, 12372388, 12716935, 12823613, 12859535, 12845335, 13159929, 13366128, 13537276, 13555173, 13603523, 13585011, 13714940, 13977367, 14462992, 14404727, 14363305, 14676844, 14863937, 15048991]
3532A5048991O2140J76809J47483q3506M04715L87594L6003R8797J50843N22958
3522A6952827J72621J79583L15604P4940K31629M13244L54142K0494N09953N61178
3512A9786215Q1231L05324J73037N05072J75324J71119J54489K54263K45016M82129
3502B2333219O80581K11200J39771M94595N14987L87768L44366L87898L04777
3493B5799162L28573O42347P05850N10605M51546N89420K88171N66965L29128
3484C0211767O65428N59104P28211N76229J56455K60834N74547M95964O72720
3475C4901259O48383O89221P45818M58977O49075N63210N05504N40054N82815
3466D0284316Q58034Q43885O92916Q10948P49287R80818P25863Q20161J128348
$$ y = [15048991, 15111131, 15287940, 15435423, 15351917, 15756632, 16144226, 16180229, 16279026, 16429869, 16952827, 17125448, 17305031, 17620635, 17695575, 17927204, 18340448, 18694590, 18715084, 19225037, 19786215, 19867446, 20172770, 20345807, 20850879, 21026203, 21197322, 21351811, 21606074, 21851090, 22333219, 23013800, 23225000, 23364771, 23859366, 24374353, 24762121, 25106487, 25494385, 25799162, 26127735, 26770082, 27475932, 27986537, 28438083, 29027503, 29315674, 29882639, 30211767, 30877195, 31436299, 32164510, 32740739, 32897194, 33158028, 33732575, 34228539, 34901259, 35549642, 36238863, 36984681, 37443658, 38092733, 38655943, 39161447, 39701501, 40284316, 41142350, 41986235, 42679151, 43490099, 44239386, 45220204, 45946067, 46766228, 47894576]
3457D7894576J409849R17743R72044J259796J302230J357842J620652J534990
3449E8269722J703436K180114K205510K573826K560398K797874K956997L276248
3441G8524125L774565L759538L703233M228094M790249M194514M555583M709649
3433A12239550M437037L646005L235188K491060J022594o86847j917328l621410
3425A20845849m549662m945912n521858m944898m546636m443250l974467l585733
3417H4333433l349662k744888k376528k426827k307064k094123j834835j579421
3409F5620085j583897j357555j383127j066813j113769j268008r55446o82492
3401E6208978j207829j100117j063964j029820j115922j313791r81420p15937
$$ y = [47894576, 49304425, 50222168, 51194212, 52454008, 53756238, 55114080, 56734732, 58269722, 59973158, 62153272, 64358782, 66932608, 69493006, 72290880, 75247877, 78524125, 82298690, 86058228, 89761461, 93989555, 98779804, 102974318, 107529901, 112239550, 116676587, 120322592, 123557780, 126048840, 127071434, 126384587, 124467259, 120845849, 116296187, 111350275, 105828417, 100883519, 96336883, 91893633, 87919166, 84333433, 80983771, 78238883, 75862355, 73435528, 71128464, 69034341, 67199506, 65620085, 64036188, 62678633, 61295506, 60228693, 59114924, 57846916, 56891470, 56208978, 55001149, 53901032, 52837068, 51807248, 50691326, 49377535, 48396115, 47680178]
3393D7680178j288532j122932j200431j026435r42878j337409r42386r40657p57102
3384C8121416r94105o97178q51439q66178n55020o09406n81594m99258k96184
3375C2171054m23955p49588o98921m45109n71886l48063l61377n07995m53912
3366B7610248o58540n06843l50527l21796j08610l08492l27826o46628j29866
3357B4251120l29083m18124k47617O2518j70827l89275k84139l05640k52359k12457
3347B1704117l86571j54428k34353P949k03191k83389o1838l99482j44323p8979
3337A9765512k82068l43702m1741j55767j23851j97315p4519j80802l678j46007
3327A8216062j97826l51625l6113M7407j67363j53629k99283k24795k41887J67622
$$ y = [47680178, 46391646, 45268714, 44068283, 43041848, 42098970, 40761561, 39819175, 38878518, 38121416, 37127311, 36430133, 35578694, 34712516, 34157496, 33548090, 32966496, 32467238, 32171054, 31747099, 30997511, 30298590, 29853481, 29281595, 28933532, 28572155, 28064160, 27610248, 26951708, 26444865, 26094338, 25772542, 25663932, 25355440, 25027614, 24380986, 24251120, 23922037, 23503913, 23256296, 23318814, 23147987, 22758712, 22474573, 22168933, 21916574, 21704117, 21317546, 21163118, 20928765, 20936714, 20733523, 20450134, 20388296, 19988814, 19844491, 19765512, 19483444, 19139742, 19098001, 18942234, 18818383, 18621068, 18546549, 18365747, 18362069, 18216062, 18018236, 17666611, 17630498, 17677905, 17510542, 17356913, 17057630, 16832835, 16590948, 16758570]
3317A6758570j80378k63003j74145j70275N6690k79937j10677R784p8376k92233
3307A5276020J98978m4859k75984j95672k71986r9042q0750k2186Q1838j57310
3297A4409047r1889j15462j1739k39765P1497j62700j43800k02930j01577l122
3287A3407560N7114p6314j87209m4394q4358j65607Q5205o7421P7821k06327j86184
3276A2609886Q6803Q1898O4131K2191K7159j06645K78501o222l38041M7419r2681
3265A2674399k38326M710l424K6094l36775j68973k15900k4650q2542K41603j13294
3254A1762922j39576j01525K6961M3151m0768j82759k4450l6445K7079l45565
3244A0989025K1668L34950j49193j47329p8341n9609k33397J16242O3662n0635
$$ y = [16758570, 16578192, 16315189, 16141044, 15970769, 16027459, 15747522, 15636845, 15646629, 15568253, 15276020, 15474998, 15430139, 15154155, 14958483, 14686497, 14587455, 14506705, 14484519, 14566357, 14409047, 14317158, 14201696, 14189957, 13950192, 14021689, 13858989, 13715189, 13512259, 13410682, 13407560, 13464674, 13388360, 13201151, 13156757, 13072399, 12906792, 12991997, 12924576, 13002397, 12796070, 12609886, 12696689, 12778587, 12842718, 12864909, 12892068, 12785423, 13063924, 13057702, 12719661, 12767080, 12674399, 12436073, 12440783, 12437359, 12463453, 12126678, 11957705, 11741805, 11717155, 11634613, 11876216, 11762922, 11623346, 11521821, 11548782, 11591933, 11551165, 11368406, 11343956, 11307511, 11334590, 10989025, 11010693, 11345643, 11196450, 11049121, 10970780, 10911171, 10677774, 10794016, 10857678, 10807043]
3234A0807043r8617J88856Q348m20329J75690k77143K1009J16056k57349j98894
3224A0064670Q8426k61581l9592j21898n0903M16959k79633k67384l9780j08768
3214I400516j19880M7309j407l2734J4688Q4812N9620j17001j25124J87635K23701
3203I622135m6153L2576k027J01797J94181O4670K88125j12583o3020m131j61073
3192I914497J57524J55496j28332J83688J17396r7970N8768r611K668K75234m0664
3181A0588694K07439J05009M9241r1356K4031L21867J87009J89519Q8176K04810
3171A1874439q0299O9680J85430N3949j34868L08775L9674J63395k2380m3006
3161A2414789Q7793K38306K40131Q3699L93874L34573l2023K78542L24670L2602
$$ y = [10807043, 10708426, 10897282, 10905630, 10485301, 10660991, 10383848, 10404857, 10520913, 10263564, 10064670, 10153096, 9891515, 9851923, 9730025, 9679122, 10096081, 9816448, 9549064, 9509284, 9400516, 9280636, 9327945, 9326538, 9293804, 9308492, 9393304, 9452924, 9335923, 9210799, 9398434, 9622135, 9575982, 9608558, 9606531, 9708328, 9902509, 9967179, 10255304, 10142721, 10079701, 10075570, 9914497, 10072021, 10227517, 10099185, 10282873, 10400269, 10302299, 10361067, 10351456, 10354124, 10629358, 10588694, 10796133, 10901142, 10950383, 10859027, 10883058, 11204925, 11391934, 11581453, 11669629, 11874439, 11794140, 11863820, 12049250, 12103199, 11968331, 12277106, 12316780, 12480175, 12457795, 12414789, 12502582, 12740888, 12981019, 13064718, 13458592, 13793165, 13761142, 14039684, 14364354, 14396956]
3151A4396956J33807Q1263L37388J12460L17141n0530J96918L87752L56287L88856
3141A6658298M37488M64584l8773Q1626J95717J76541M80542O35540P03201L42065
3131B0136829M47459L90397N07718Q96520P36120L90798N23507P01177L11950
3122B5042475L78079J030911N43776P11156M84763J73650O15515L55112p4768
3113B9260669M35118J63422L99990L98508L42218M30587N61762P14589P06826
3104C3413689J190518P94310Q98031J011645J189627J277510J159677J267506
3096D2202513J243472J129478J543447J453558J388493P98032O19031K66106l36397
3087E0307733j000794j440453j400625j263076o98104n94355o18781l64940l08759
$$ y = [14396956, 14530763, 14612026, 14949414, 15061874, 15379015, 15328485, 15525403, 15913155, 16269442, 16658298, 17095786, 17560370, 17521597, 17603223, 17798940, 17975481, 18456023, 19091563, 19794764, 20136829, 20584288, 20974685, 21482403, 22378923, 23115043, 23505841, 24029348, 24730525, 25042475, 25420554, 26451465, 26995241, 27706397, 28191160, 28364810, 28980325, 29335437, 29260669, 29695787, 29859209, 30259199, 30657707, 30999925, 31430512, 31992274, 32706863, 33413689, 34604207, 35398517, 36296548, 37308193, 38497820, 39775330, 40935007, 42202513, 43445985, 44575463, 46118910, 47572468, 48960961, 49758993, 50378024, 50644130, 50307733, 49306939, 47866486, 46465861, 45202785, 44504681, 43910326, 43291545, 42926605, 42617846]
3078D2617846J02479K98151N02085O30243Q09988O98198O92732Q76854J044936
3069D8273512Q16309J045938Q71529O10545P27241J23934m9449n24880p59912
3060E1134767r98761j156789j208122j781223j700652j510739j190598j248782
3052D0339101r34209q44520o15272p53575m99376m8066j96180j01969l68658j0365
3042C5966911J04163R898l16318o60019q45304p15140q64587o06558r61879j357215
3032B9753952j089903j175677j405820j303623j245596j099023q57919n99921
3024B0976470r91818p72123o55970m39239p26873l65440m04704j67201j51450
3015A6301652l60956m10647l65819n49115j31426j83545n71990l16383k23545
$$ y = [42617846, 42720325, 43018476, 43520561, 44150804, 44960792, 45658990, 46351722, 47228576, 48273512, 49089821, 50135759, 51007288, 51617833, 52345074, 52469008, 52419559, 51894679, 51134767, 50136006, 48979217, 47771095, 45989872, 44289220, 42778481, 41587883, 40339101, 39404892, 38560372, 37945100, 37191525, 36692149, 36644083, 36447903, 36345934, 35977276, 35966911, 36071074, 36080972, 35764654, 35104635, 34259331, 33544191, 32679604, 32073046, 31111167, 29753952, 28664049, 27488372, 26082552, 24778929, 23533333, 22434310, 21576391, 20976470, 19984652, 19212529, 18556559, 18117320, 17390447, 17025007, 16620303, 16453102, 16301652, 15940696, 15530049, 15164230, 14615115, 14483689, 14300144, 13728154, 13411771, 13188226]
3006A3188226m70698n46114p4191m99882m28584j85659j38823m20521j01592l05032
2996A0017130j85624m27276l41377k33369J71703l04789k40682o4985m31856O2516
2986H021391j91417k97838j7469l62767J63615p4949l1710J39547j37201k29674
2976F981528k68238L8759q6775p9729j35704j46372j18661l29132Q8123j28092
2966E815707k22725j56105K7408k19734j82038j66014J89964l5487n55188j93272
2956D302516p0900q8184N6089Q0927P8025J44255J52857k91996k13398k60387
2946C889804K1073O7024q3125J4918o6415R9073o7551j75848r6911n2878l20468
2935C228696K45679j16854j60154k442m5731J22191J93141k16136k10635k56115
$$ y = [13188226, 12717528, 12171414, 12097223, 11597341, 11168757, 10983098, 10844275, 10423754, 10322162, 10017130, 9831506, 9404230, 9062853, 8829484, 9001187, 8696398, 8455716, 8390731, 7958875, 8021391, 7829974, 7532136, 7514667, 7151900, 7315515, 7240566, 7208856, 7348403, 7211202, 6981528, 6713290, 6752049, 6665274, 6585545, 6449841, 6303469, 6184808, 5855676, 5943799, 5815707, 5592982, 5436877, 5464285, 5244551, 5062513, 4896499, 5086463, 5050976, 4495788, 4302516, 4231616, 4143432, 4199521, 4280448, 4358473, 4502728, 4655585, 4363589, 4150191, 3889804, 3910877, 3977901, 3894776, 3909694, 3843279, 3942352, 3874801, 3698953, 3602042, 3549164, 3228696, 3474375, 3357521, 3197367, 3194925, 3149194, 3271385, 3464526, 3248390, 3037755, 2781640]
2925B781640J08475p0968J19898j3114k04705R2960k99539N7323m5167k49830
2915B276973Q0541p464J67603p1781j60281k18941j85875J45707J43445q6754
2905B083173Q7182n6355l22k248J82287j98868j52519O1665j52319l9101K66301
2894B078876j08880R6739j66063l28815L21091L4872K14984j68948j20715P443
2884A860584j17640o3598L05866J57761k21327l2887J78956r4810l58520k2256
2874A592129O5442P9111l669J83998p299j27697j00336q0214k10247n2288J4982
2863A353912o4021R0209k42981J17242K38114J96887L7555j33201O4442j42959
2853A515199p4396K03296R2519l07031k15848P7222K29923J55847k13858k18277
$$ y = [2781640, 2890115, 2819147, 2939045, 2925931, 2721226, 2814186, 2514647, 2571970, 2526803, 2276973, 2357514, 2350050, 2517653, 2445872, 2285591, 2066650, 1880775, 2026482, 2169927, 2083173, 2170355, 2114000, 2113678, 2111430, 2293717, 2094849, 1942330, 2003995, 1851676, 1812575, 2078876, 1969996, 2066735, 1900672, 1571857, 1892948, 1927820, 2142804, 1973856, 1853141, 1860584, 1742944, 1679346, 1985212, 2142973, 1921646, 1888759, 2067715, 1972905, 1614385, 1592129, 1657571, 1736682, 1733013, 1917011, 1909712, 1782015, 1681679, 1601465, 1391218, 1338930, 1353912, 1289891, 1380100, 1137119, 1254361, 1492475, 1689362, 1726917, 1593716, 1658158, 1515199, 1440803, 1644099, 1736618, 1429587, 1213739, 1290961, 1520884, 1676731, 1462873, 1244596]
2843A244596J39913L54840j80749J22720L1758l29179m08514k5930J22361j53155
2833I18661K06481J37864k5165K9821q397j03129k3788J51736P52n3922R8795
2822A329709q2499j85141Q5403J35415k40782j7508J82889o6491N9519l013J28650
2811A326151k02756O2934Q3794l23964r9579K85481J35062m9804j50090P760K6187
2800A101176k42854j17816m2429K9000O3697M31655J43869l27213o2115J13151
2790A090121l3336O3113N5111R087l6301m7772M54902k26798k55922k20780l0599
2779H20826P7279J0738P7337k07262R8430j5446o1886o1921n2459M04295k9661
2768A060270m51427k4198Q9593K23442K14312j2226m24183L26941l5756j90540
$$ y = [1244596, 1384509, 1739349, 1558600, 1681320, 1713078, 1383899, 975385, 949455, 1071816, 918661, 1125142, 1263006, 1237841, 1267662, 1259265, 1156136, 1132348, 1284084, 1284836, 1230914, 1329709, 1247210, 1062069, 1147472, 1282887, 1042105, 1024597, 1207486, 1140995, 1200514, 1197501, 1326151, 1123395, 1186329, 1270123, 946159, 846580, 1132061, 1267123, 1217319, 1067229, 1074989, 1101176, 858322, 740506, 698077, 727077, 790774, 1222429, 1366298, 1039085, 976970, 1090121, 1056785, 1119898, 1175009, 1184096, 1147795, 1100023, 1554925, 1328127, 1072205, 851425, 820826, 898105, 908843, 986180, 778918, 877348, 861902, 800016, 738095, 685636, 1089931, 1060270, 608843, 584645, 674238, 897680, 1111992, 1099766, 675583, 1002524, 966768, 776228]
2758G76228p977J02226J15528j05258l58101n7771K46325R490o1814j50850K49771
2747G57797M933p5366J50570n3727l02960J59483N777m5332N2060l2790K67256
2736H87701Q3372k07083j41136J60403q9630L3054n0685M5017J4274k9168N9875
2725G65994l55174k675N7176K51539l4357n8976j27966N2728n2657n6130J08416
2714E47918l3761r0775J3292L13079j33241l1950m7762Q3671K13145l0082P1042
2703H74576m9659j09447k07295K85631O014j50355k82748M9822K00565J1090R5246
2692G23440J26179N4252j64783j00498j05228p7617j6318J43676j30578j53823
2682B98702R0390K3287L2023n1183k7881Q4712P4134J4482r5940k3806J65644
$$ y = [776228, 768251, 870477, 986005, 880747, 522646, 464875, 711200, 720690, 658876, 508026, 757797, 762730, 687364, 837934, 784207, 481247, 640730, 646507, 601175, 653235, 620445, 887701, 971073, 763990, 622854, 783257, 693627, 726681, 675996, 721013, 735287, 706119, 765994, 410820, 408145, 465321, 716860, 682503, 623527, 495561, 548289, 495632, 439502, 547918, 514157, 423382, 436674, 749753, 616512, 584562, 536800, 620471, 833616, 803534, 874576, 824917, 715470, 508175, 793806, 799820, 649465, 366717, 416539, 617104, 628194, 723440, 849619, 903871, 739088, 638590, 533362, 455745, 439427, 583103, 452525, 298702, 389092, 412379, 444402, 393219, 365338, 450050, 524184, 538666, 442726, 418920, 584564]
2671E84564L1484k01366K30010k32047r4210J74247k28517l8135J06810K332J26430
2660D61602j2514j27107k24021K38290n9872j50003j72488K39091J0049K094N6328
2649B61449M4663k52243J23086K58528P5959j11782k1628j1461j70837M9587j63210
2638H2111N7348J1442N0473J49110p2226j99601j62556J2745L54729j24612p7845
2627H1118j20770r9416J35651K9785K30695j69006k097J09018n7158j39284j68956
2616a70420J66179Q7940k0628j02687K3148M273q3164K20442Q8499l2102J21480
2605C02960j08392J21782j54388n9747p8105j47016J53253k8201P5968l6763j23507
2594h2156L75105J37317j57894q8356J90185k01515J06684K5107M1888o2462P6094
$$ y = [584564, 616048, 414682, 644692, 412645, 318435, 492682, 264165, 226030, 332840, 335172, 461602, 449088, 321981, 97960, 336250, 276378, 126375, -46113, 192978, 203027, 205121, 261449, 306112, 53869, 176955, 435483, 511442, 399660, 378032, 366571, 195734, 245321, 82111, 139459, 150901, 201374, 350484, 278258, 78657, -83899, -71154, 283575, 158963, 81118, -39652, -139068, -3417, 26368, 257063, 88057, 85960, 194978, 137820, -1464, -170420, -4241, 83699, 63071, -39616, -16468, -12195, -95359, 125083, 213582, 181480, 302960, 194568, 316350, 161962, 102215, 24110, -122906, 30347, 2146, 78114, 41351, -82156, 292949, 430266, 272372, 184016, 374201, 172686, 279370, 304477, 346365, 283903, 359997]
2583C59997j3234n5571p5889o6599M8031J98420j29279j09030J2528j28195J07082
2572A48261n8282p1941j85902K87105M3583O2815L254j11515o2796J68302M5214
2561B68098j3342j79435j84651n5563J48104L989N4884J23741o0691k1092Q1094
2550A65136k9880N7557m7750j47525K41498K0044k69975j45920l1588O035p3233
2539b55601O0829K68687j63807O6249J6182n1720r1416j17103k264K01240l2565
2528a01289k7586l3984M976L76069Q5394k28121n9451k8411J08967n8846J14399
2517A52117m3966j30085R3498j29310j42426J3269Q0596q4216n2824J80119r7322
2506a60550K49139K11932k25538k08394K67821M6646k75679m4136j13931J19704
$$ y = [359997, 346763, 291192, 215303, 148704, 196735, 395155, 265876, 156846, 169374, 41179, 148261, 89979, 18038, -167864, 119241, 162824, 225639, 228893, 117378, 54582, 222884, 268098, 254756, 75321, -109330, -164893, -16789, -12800, 42084, 165825, 105134, 84042, 165136, 135256, 192813, 145063, -2462, 239036, 259080, -10895, -156815, -188403, -182368, -255601, -194772, 73915, -89892, -23643, -7461, -59181, -150597, -267700, -269964, -68724, -101289, -128875, -162859, -157883, 218186, 303580, 75459, 16008, -12403, 96564, 37718, 152117, 108151, -21934, 71564, -57746, -200172, -186903, -106307, -190523, -243347, -63228, -160550, 88589, 300521, 74983, -133411, 134410, 181056, -94623, -138759, -252690, -132986]
2496a32986J58861J14690L4538j4546p37o3310q6063k0502m4543J4222k2274O3151
2484E01k5513K6219K19020j0029L7847O3059m2798j79701M4995L0092Q9086R5165
2472C47943l51935Q490J83683K1831R297J7484P8171J97650q2860J07593o1238
2461D76109n9730m28983n5580j3002P1044j8239J80349k085j10890J78675M8947
2450B66615l55782n4267J14150K76029q3067k20686L05703k29796j61797m0059
2440a82957M51378q2347J1193M9998j08590J50903n1438o1379j83751P649L36419
2429C37078j4444L0304k78683k5343O4539J4561j77520O4546N01187j82134k05789
2418A28302L0874j40504j30361K31906J35772j35726K39116K55179l82785Q2248
$$ y = [-132986, 25875, 140565, 175103, 160557, 159820, 96510, 10447, -10055, -54598, -40376, -62650, 501, -25012, 1207, 220227, 210198, 248045, 311104, 268306, 88605, 133600, 163692, 252778, 347943, -3992, 4498, 188181, 210012, 219309, 236793, 314964, 512614, 429754, 537347, 476109, 416379, -12604, -68184, -81186, -10142, -28381, 151968, 149883, 38993, 217668, 266615, -89167, -143434, -29284, 246745, 163678, -57008, 248695, 18899, -142898, -182957, 268421, 186074, 197267, 247265, 138675, 289578, 238140, 176761, -6990, 659, 337078, 322634, 352938, 74255, 48912, 113451, 128012, -49508, 15038, 516225, 334091, 128302, 159176, 18672, -111689, 120217, 255989, 120263, 359379, 614558, 231773, 314021]
2408C14021J36878J63231l42840j9385j01324j90642J97228P7388j82272L03459
2398C55742K5134j74179J51055J44780q7852j36604J83472j06444k22243J71251
2388C04112J03132K6083k3384M7926L86230p7917Q2896L841n2713j56900J71536
2377H14842k0084j03996K51447q2781k9461l1169l0316N6561J01773k22208O1501
2366G66109J66134J57228J33822j12345k7877j74131K69069l0423j2271K9113
2356A164428K03255J52394j7684J9461L7792j3824M0653P4223j59447L08969L14974
2345B125194q3962j93143k1237j19225K31617K39989j4318q1348k0667R1687k06109
2334A948478K57008L17166P0204k91132J86322L31641J28694p1256M11648M8834
$$ y = [314021, 450899, 614130, 271290, 251905, 150581, -40061, 157167, 234555, 52283, 355742, 380876, 206697, 357752, 502532, 414680, 278076, 461548, 355104, 132861, 304112, 407244, 433327, 409943, 457869, 844099, 766182, 849078, 852919, 800206, 643306, 814842, 794758, 690762, 942209, 859428, 829967, 798798, 768482, 825043, 926816, 704608, 766109, 932243, 1089471, 1223293, 1110948, 1083071, 908940, 1178009, 1147586, 1135315, 1164428, 1367683, 1520077, 1502393, 1521854, 1559646, 1545822, 1586475, 1660698, 1501251, 1810220, 2125194, 2041232, 1848089, 1826852, 1707627, 1939244, 2179233, 2164915, 2083567, 2062900, 2154587, 1948478, 2205486, 2522652, 2592856, 2301724, 2488046, 2819687, 2948381, 2877125, 3288773, 3337607]
2324C337607Q0284J60460K0977J96605J87402j08074Q5741J58721L35180K59268
2314D714171K68845J71596O52772L30516L75623Q88944P13326M64357O99107O39383
2304I918640P74771J383738J264605J676922J905582K325294L250732M509002
2296B7009286N184207O260565O958322L084897m575159p773893p017296n247822
2288B3883107l828226l165245k510290k227691j671552j067137r83530n92532
$$ y = [3337607, 3417891, 3578351, 3599328, 3795933, 3983335, 3875261, 3961002, 4119723, 4454903, 4714171, 4983016, 5154612, 5807384, 6137900, 6513523, 7402467, 8115793, 8580150, 9279257, 9918640, 10693411, 12077149, 13341754, 15018676, 16924258, 19249552, 22500284, 27009286, 32193493, 38454058, 45412380, 48497277, 43922118, 36148225, 29130929, 23883107, 20054881, 16889636, 14379346, 12151655, 10480103, 9412966, 8429436, 7836904]
$$ [...]
##END NTUPLES=NMR SPECTRUM
##END=
