##TITLE=1H_EC-3323(2)
 CDCl3
 8 sc, 
 9.4.2024
##JCAMPDX= 6.0         $$ Bruker NMR JCAMP-DX V2.0
##DATA TYPE= NMR SPECTRUM
##DATA CLASS= NTUPLES
##ORIGIN= UXNMR, Bruker Analytische Messtechnik GmbH
##OWNER= root
$$ XWIN-NMR		Version 3.5
$$ Tue Apr  9 14:05:47 2024 Russian Standard Time (UT+4h)  she@DPX200
##.OBSERVE FREQUENCY= 200.1309
##.OBSERVE NUCLEUS= ^1H
##.ACQUISITION MODE= SIMULTANEOUS
##.ACQUISITION SCHEME= undefined
##.AVERAGES= 8
##.DIGITISER RES= 18
##SPECTROMETER/DATA SYSTEM= spect
##.PULSE SEQUENCE= zg30
##.SOLVENT NAME= CDCl3
##.SHIFT REFERENCE= (INTERNAL, CDCl3, 0, 15.6555)
##AUDIT TRAIL= $$ (NUMBER, WHEN, WHO, WHERE, WHAT)
$$ ##TITLE= Audit trail, XWIN-NMR		Version 3.5
$$ ##JCAMPDX= 5.01
$$ ##ORIGIN= Bruker BioSpin GmbH
$$ ##OWNER= she
$$ F:/spectra/data/she/nmr/H-F/1/pdata/1/auditp.txt
$$ ##AUDIT TRAIL=  $$ (NUMBER, WHEN, WHO, WHERE, WHAT)
(   1,<2024-04-09 14:04:40.68 +0400>,<she>,<DPX200>,
      <created by zg, POWCHK disabled, PULCHK disabled
       configuration hash MD5:
       00 E9 B6 7A A2 85 ED C7 34 08 36 98 17 FE 4E 26
       data hash MD5: 16K
       18 A6 78 80 7B B8 0B 82 08 BD A0 E4 01 9C 9E E0>)
(   2,<2024-04-09 14:04:43.53 +0400>,<she>,<DPX200>,
      <Start of raw data processing
       efp BC_mod = 2 LB = 0.24 FT_mod = 6 PKNL = 1 PHC0 = -25301.59 PHC1 = 12.58731 SI = 16K 
       data hash MD5: 16K
       94 85 98 DF B8 17 D8 37 48 16 5F EC 27 B6 4D 58>)
(   3,<2024-04-09 14:05:01.40 +0400>,<she>,<DPX200>,
      <pk PHC0 = -158.192 PHC1 = 0.6000001 
       data hash MD5: 16K
       0C 0B D4 8E 46 FB 05 34 AB D8 84 1A 4F A9 DB 76>)
(   4,<2024-04-09 14:05:04.26 +0400>,<she>,<DPX200>,
      <abs ABSG = 5 
       data hash MD5: 16K
       6A 08 49 74 09 80 C6 60 B3 42 3C 1D 93 C8 2B 4C>)
$$ ##END=
$$ 
$$ hash MD5
$$ 2F 36 87 28 8B A9 12 8A 0A B2 08 BC 91 FC D5 2F
##$RELAX= 
##$RELAX= 
##$RELAX= 
##$RELAX= 
##$RELAX= 
##$RELAX= 
$$ Bruker specific parameters
$$ --------------------------
##$DU= <F:/spectra>
##$EXPNO= 1
##$NAME= <H-F>
##$PROCNO= 1
##$TYPE= <nmr>
##$USER= <she>
##$AMP= (0..31)
100 100 100 100 100 100 100 100 100 100 100 100 100 100 100 100 100 100 
100 100 100 100 100 100 100 100 100 100 100 100 100 100 
##$AQSEQ= 0
##$AQ_mod= 1
##$AUNM= <au_zg>
##$AUTOPOS= <>
##$BF1= 200.13
##$BF2= 200.13
##$BF3= 200.13
##$BF4= 200.13
##$BF5= 200.13
##$BF6= 200.13
##$BF7= 200.13
##$BF8= 200.13
##$BYTORDA= 1
##$CFDGTYP= 0
##$CFRGTYP= 5
##$CHEMSTR= <none>
##$CNST= (0..31)
1 1 145 1 1 1 1 1 1 1 1 1 1 1 1 1 1 1 1 1 1 1 1 1 1 1 1 1 1 1 1 1 
##$CPDPRG= <>
##$CPDPRG1= <>
##$CPDPRG2= <>
##$CPDPRG3= <>
##$CPDPRG4= <mlev>
##$CPDPRG5= <mlev>
##$CPDPRG6= <mlev>
##$CPDPRG7= <mlev>
##$CPDPRG8= <mlev>
##$CPDPRGB= <>
##$CPDPRGT= <>
##$D= (0..31)
0 1.2 0 0 0 0 0 0 0 0.06 0 0.03 0 0 0 0 0.0002 0 0 0 0 0 0 0 0 0 0 0 0 
0 0 0 
##$DATE= 1712657080
##$DBL= (0..7)
120 120 120 120 120 120 120 120 
##$DBP= (0..7)
150 150 150 150 150 150 150 150 
##$DBP07= 0
##$DBPNAM0= <>
##$DBPNAM1= <>
##$DBPNAM2= <>
##$DBPNAM3= <>
##$DBPNAM4= <>
$$ [...]
##$SUBNAM3= <"">
##$SUBNAM4= <"">
##$SUBNAM5= <"">
##$SUBNAM6= <"">
##$SUBNAM7= <"">
##$SUBNAM8= <"">
##$SUBNAM9= <"">
##$SW= 18.0517689322627
##$SWIBOX= (0..15)
0 0 2 0 0 0 0 0 0 0 0 0 0 0 0 0 
##$SW_h= 3612.71676300578
##$TD= 16384
##$TD0= 1
##$TE= 0
##$TE2= 300
##$TE3= 300
##$TEG= 300
##$TL= (0..7)
0 120 120 120 120 120 120 120 
##$TP= (0..7)
150 150 150 150 150 150 150 150 
##$TP07= 0
##$TPNAME0= <>
##$TPNAME1= <>
##$TPNAME2= <>
##$TPNAME3= <>
##$TPNAME4= <>
##$TPNAME5= <>
##$TPNAME6= <>
##$TPNAME7= <>
##$TPOAL= (0..7)
0.5 0.5 0.5 0.5 0.5 0.5 0.5 0.5 
##$TPOFFS= (0..7)
0 0 0 0 0 0 0 0 
##$TUNHIN= 0
##$TUNHOUT= 0
##$TUNXOUT= 0
##$USERA1= <user>
##$USERA2= <user>
##$USERA3= <user>
##$USERA4= <user>
##$USERA5= <user>
##$V9= 5
##$VALIST= <valist>
##$VCLIST= <CCCCCCCCCCCCCCC>
##$VD= 0
##$VDLIST= <DDDDDDDDDDDDDDD>
##$VPLIST= <PPPPPPPPPPPPPPP>
##$VTLIST= <TTTTTTTTTTTTTTT>
##$WBST= 1024
##$WBSW= 4
##$XGAIN= (0..3)
0 0 0 0 
##$XL= 0
##$YL= 0
##$YMAX_a= 681910
##$YMIN_a= -775056
##$ZGOPTNS= <>
##$ZL1= 120
##$ZL2= 120
##$ZL3= 120
##$ZL4= 120
##$ABSF1= 15.66429
##$ABSF2= -2.387599
##$ABSG= 5
##$ABSL= 3
##$ALPHA= 0
##$AQORDER= 0
##$ASSFAC= 0
##$ASSFACI= 0
##$ASSFACX= 0
##$ASSWID= 0
##$AUNMP= <proc_1d>
##$AZFE= 0.1
##$AZFW= 0.1
##$BCFW= 0
##$BC_mod= 2
##$BYTORDP= 0
##$COROFFS= 0
##$CY= -3
##$DATMOD= 1
##$DC= 0
##$DFILT= <>
##$DTYPP= 0
##$F1P= 0
##$F2P= 0
##$FCOR= 1
##$FTSIZE= 16384
##$FT_mod= 6
##$GAMMA= 0
##$GB= 0
##$INTBC= 1
##$INTSCL= 3.70164e-10
##$ISEN= 128
##$LB= 0.24
##$LEV0= 0
##$LPBIN= 0
##$MAXI= 10000
##$MC2= 0
##$MEAN= 0
##$ME_mod= 0
##$MI= 1.114404
##$NCOEF= 0
##$NC_proc= -5
##$NLEV= 6
##$NOISF1= 3.799351
##$NOISF2= 2.8
##$NSP= 0
##$NTH_PI= 0
##$NZP= 0
##$OFFSET= 15.65547
##$PC= 1
##$PHC0= -25459.78
##$PHC1= 13.18731
##$PH_mod= 1
##$PKNL= yes
##$PPARMOD= 0
##$PSCAL= 0
##$PSIGN= 0
##$REVERSE= no
##$SF= 200.129573235993
##$SI= 16384
##$SIGF1= 3
##$SIGF2= 2
##$SINO= 5.538805
##$SIOLD= 16384
##$SREGLST= <1H.CDCl3>
##$SSB= 0
##$STSI= 16384
##$STSR= 0
##$SW_p= 3612.71676300577
##$SYMM= 0
##$S_DEV= 0
##$TDeff= 16384
##$TDoff= 0
##$TI= <>
##$TILT= no
##$TM1= 0
##$TM2= 0
##$TOPLEV= 0
##$USERP1= <user>
##$USERP2= <user>
##$USERP3= <user>
##$USERP4= <user>
##$USERP5= <user>
##$WDW= 1
##$XDIM= 16384
##$YMAX_p= 412686909
##$YMIN_p= -195158
$$ End of Bruker specific parameters
$$ ---------------------------------
##NTUPLES= NMR SPECTRUM
##VAR_NAME=  FREQUENCY,     SPECTRUM/REAL,   SPECTRUM/IMAG
##SYMBOL=    X,             R,               I
##VAR_TYPE=  INDEPENDENT,   DEPENDENT,       DEPENDENT
##VAR_FORM=  AFFN,          ASDF,            ASDF
##VAR_DIM=   16384,         16384,           16384
##UNITS=     HZ,            ARBITRARY UNITS, ARBITRARY UNITS
##FACTOR=    0.220516191357247, 1,           1
##FIRST=     3133.12250877705, 0,            0
##LAST=      -479.594254228724, 0,           0
##MIN=       -479.594254228724, -195158,     0
##MAX=       3133.12250877705, 412686909,    0
$$ Real data points
##PAGE= N=1
##DATA TABLE= (X++(R..R)), XYDATA
$$ [...]
6724b1012R907k266k811j261j7762K5516k2730l263j4247J4410J7110J3500j0352
6711a5261K0951j494m072O924k2661K551j8713K0145J9997r287J3771k6463J5631
6698B019k3413k4691n073K8139P793K0155J1102j7305Q82n169j5174M665j3338
6685b9408N5006J70J758j2384k2684J6254M002K840q093k9703J9143K8556n1393
6672b5936N460O978M5136J6761l3659j8091l089J5162K7693n942K1776k6299O710
6659C2660j7903q932K5568N791j0561m85M372J4138k646m3728n478o905J1806
6646b303J4415K4452N364k7752j7045l0283J4708r99J2702o799R520L0902m0345
6633a3463K4403J5872q680J1987J53j5188m5185L2724Q437J179m2761K001K0387
$$ plain form
6724 -21012 -11105 -13371 -16182 -17443 -35205 -9689 -32419 -35682 -49929 -35519 -18409 -4909 -15261
6711 -15261 5690 4196 124 7048 -15613 -13062 -31775 -11630 8367 -920 12851 -13612 2019
6698 2019 -21394 -46085 -51158 -23019 -15226 4929 16031 -1274 -392 -5561 -20735 -16070 -29408
6685 -29408 25598 25768 27526 15142 -7542 8712 12714 15554 7461 -22242 -3099 25457 -25936
6672 -25936 -20476 -13498 31638 48399 14740 -3351 -6440 8722 36415 30473 52249 25950 32660
6659 32660 14757 5825 31393 37184 26623 26138 30510 44648 42002 -1726 -7204 -14109 -2303
6646 -2303 12112 36564 41928 14176 -2869 -33152 -18444 -19443 -6741 -13540 -4020 26882 -13463
6633 -13463 10940 26812 18132 30119 30272 15084 -30101 2623 11060 12239 -30522 -28521 -8134
6620h134Q759L1409k1319k891N465J5271j2055M208N103p022Q70K6365o836n3
6606C9140j759l1003J9343M8578q049k2292m607q512q327j078q265K3972O047
6593D3188m726j3777J9399J2376o956j9326l749K02J5827N277n282r834O868j3432
6579B6055k2730J9574K8706k3829J486J1210K2041L214j2659K8801K5394K696
6567A09959J2364j5675j3948l3002K333K7546j048L6376k950l2910J1092J677
6555A01814j9424J8094N680j83P266M6838k7391R062L7596j0304q854N001J5868
6542A81063J9776j8817Q420N0146q283J5697J2102N14J2400L2638j5956k0857
6530B68843K1306l4538j6492p551J6126j4595m2953K5756J9576P775J602J0682
$$ plain form
6620 -8134 625 32034 10715 7824 13289 28560 16505 20713 25816 18794 19664 46029 39193 39140
6606 39140 37381 6378 25721 74299 66250 43958 39351 30839 22512 21434 13169 37141 43188
6593 43188 38462 24685 44084 56460 49504 30178 26429 26631 42458 47735 42453 32619 39487 26055
6579 26055 3325 22899 51605 27776 29262 40472 62513 65727 53068 81869 107263 109959
6567 109959 122323 106648 92700 59698 62031 89577 88529 124905 121955 89045 100137 101814
6555 101814 82390 100484 106164 105981 113247 160085 132694 141756 179352 169048 160194 165195 181063
6542 181063 200839 182022 190442 240588 232305 248002 260104 260618 273018 305656 289700 268843
6530 268843 290149 255611 239119 231568 247694 233099 190146 215902 235478 243253 244855 255537
6518B55537P296L5850k1016J7437L9013J6668M9715R737K8734o888l269J1590
6506D40404k1628n8124n745k8251k8556j276P627J7457j7712m9962l213j2054
6494B38967l0089l226K4066O244K6008m011r021L882J5518R00Q969M133L451P755
6480B93546P690k4725j0983k7420K662p515r173R492K7571j39l2701K0773r904
6467B39174j8619k5212P0621k6839m7800o847Q345J205k3717J5028R151M927j7375
6454A82042m695M306J8532l128m200J622R501r310j1490R1o428L8167p079P069
6440B15000K014K0487J4517j5946J9723J1404k3934p075L6424M79j7820l1840
6428B23433O464j9834l7234j7018k301N763J1255J5211q10M158L026k095J8812
$$ plain form
6518 255537 262833 298683 277667 295104 334117 350785 400500 410237 438971 432083 428814 440404
6506 440404 418776 360652 354907 326656 298100 296824 304451 321908 304196 254234 251021 238967
6494 238967 208878 205652 229718 235962 261970 257959 248938 252820 268338 269238 278207 282340 285791 293546
6480 293546 301236 276511 265528 238108 240770 233255 224082 233574 261145 261006 228305 249078 239174
6467 239174 220555 195343 265964 239125 191325 184478 192823 194028 170311 185339 194490 199417 182042
6454 182042 177347 181653 200185 197057 192857 194479 203980 194670 183180 183271 176843 215010 207931 215000
6440 215000 217014 237501 252018 236072 255795 267199 243265 236190 272614 273093 255273 223433
6428 223433 229897 210063 172829 155811 153510 159273 170528 185739 184929 189087 192113 190018 208830
6415B08830K865l792N540k1572L2141l2348M406N0563r897k5579M221j9990l6511
6402A58877J4940j9960l1207N7273l1728k0508J8557J0541n991O320N264l3581
6390A28797o836R530q779M6129J3638p273q626J6310k0879K4041j6569l868K7326
6377A92941m8725J6424L6577k2220k1555J4519J347J6728j4474J206j6898p139
6365A48731J2400J9515j3334M7449M399l2202K8484o229o039j9533k1149L8112
6353B00604p342J1666n4509Q961M8868k9244P026N525K4134j7337j3265J3051
6341A98138k6876j0276J0685O1249k862L036l161j7239O160J4827j163K152K5064
6328B59734P357R709k7629L7376q387l5584N143J9186L4059q11o156j1715j9416
$$ plain form
6415 208830 211695 207903 213443 191871 224012 191664 196070 246633 236736 211157 215378 195388 158877
6402 158877 173817 153857 122650 179923 148195 127687 146244 156785 150794 157114 162378 128797
6390 128797 121961 131491 122712 168841 182479 175206 166580 182890 162011 186052 169483 165615 192941
6377 192941 144216 160640 197217 174997 153442 167961 169308 186036 171562 172768 155870 148731
6365 148731 161131 180646 167312 214761 219160 186958 215442 209213 203174 183641 162492 200604
6353 200604 193262 204928 150419 159380 208248 179004 186030 191555 215689 198352 185087 198138
6341 198138 171262 160986 171671 232920 230058 233094 229933 212694 218854 233681 232518 234670 259734
6328 259734 267091 276800 249171 286547 278160 242576 247719 266905 300964 300153 293997 282282 262866
6315B62866P623J1203j306J543J3591r20q411l64k101J4167J8481J1404j688J338
6301C27426N238J1890j378J2482N338k10l70J2437M985n862q049P434j1878P625
6287C67108M3729k4082k4108K1744K75K9239l798j3009K2066j8369M5113L5993
6275D81901K6070q360q001K7942J5389j9715l2175K2128N0068m9502L1864k589
6263E35020j3536J5362L677k836j431N7600q524j2362j6343L8113L0193k7454
6251E97479M0132J3234Q97n26K8857K0410K0979Q337j012L3245p757J2981K3864
6238G91120J1324J597J5895L3936K7214K5606J7187J01O6765J7269J562R918N6511
6225A076005M1753J8624J6536K2407L1285K4840N7799N3388J1260N7542N6565
$$ plain form
6315 262866 270489 281692 280386 281929 295520 294600 286189 285825 283724 297891 316372 327776 326088 327426
6301 327426 332664 344554 343176 355658 360996 360786 360416 372853 377838 371976 363927 371361 359483 367108
6287 367108 410837 386755 362647 384391 384666 413905 410107 397098 419164 400795 445908 481901
6275 481901 507971 499611 491610 519552 534941 515226 483051 505179 555247 505745 537609 535020
6263 535020 521484 536846 540523 537687 536256 593856 585332 572970 556627 594740 624933 597479
6251 597479 637611 650845 651742 651216 680073 700483 721462 729799 728787 762032 754275 767256 791120
6238 791120 802444 804041 819936 853872 881086 906692 923879 923980 990745 1008014 1009576 1019494 1076005
6225 1076005 1117758 1136382 1152918 1175325 1206610 1231450 1289249 1342637 1353897 1411439 1468004
6214A468004L4770M3318O8921L9502N2219O2639P5536L8302L3299O2980M6349
6203B025839O3711M6298M4365N1998N4482N6594N4153M1585M7357O1179O6184
6192B613745Q2355Q9973P9715Q4386Q1504J08025J06174J08716J18471J12225
6182C585289J10034J59649J50755J63396J79449J20140J44109J50882J67949J37433
6172E069085J74623K20258J78874K29618K58679L25078L63778L90724M41280M60199
6162H112196N53267O34486O95952P69550Q02731Q54156Q70922P91857O69896M54021
6152A5209034K37907l5393k67461l84473n00468m60672l87937k71615k03349p1733
6142A2863840P4609J84790L05279M83457N75538P01146Q57684J044466J212515
$$ plain form
6214 1468004 1502774 1546092 1615013 1654515 1706734 1769373 1844909 1883211 1916510 1979490 2025839
6203 2025839 2089550 2135848 2180213 2232211 2286693 2343287 2397440 2439025 2486382 2547561 2613745
6192 2613745 2696100 2786073 2865788 2950174 3031678 3139703 3245877 3354593 3473064 3585289
6182 3585289 3695323 3854972 4005727 4169123 4348572 4468712 4612821 4763703 4931652 5069085
6172 5069085 5243708 5463966 5642840 5872458 6131137 6456215 6819993 7210717 7651997 8112196
6162 8112196 8665463 9299949 9995901 10765451 11568182 12422338 13293260 14085117 14755013 15209034
6152 15209034 15446941 15411548 15144087 14759614 14259146 13798474 13410537 13138922 12935573 12863840
6142 12863840 12938449 13123239 13428518 13911975 14487513 15188659 16046343 17090809 18303324
6133A8303324J352481J479659J639275J621977J448372J013356M88413j44395
6125B7202462q70896j424582j747904j815420j761272j577910j389724j144597
6117A5470157q97229p36356n19381m11944k83363j03673M0194J25534K42317L62881
6107A3289137M30731N76802N86939N39077L72234J34433j45519n01235p84260
6098A4498339r65192j076648j087090j026052r64576r28429p90892o55902o06085
6089F397473n03623m07101l77215l78305l37574k57446k41904k26951k24428j72653
6079C270273j21732j47111j64336j21942j08255j39706j11165q3057n5509p8378
6069B139082j06236r8245l6899l3472q3664q7289m8368l4179n0104l2727m6920
$$ plain form
6133 18303324 19655805 21135464 22774739 24396716 25845088 26858444 27346857 27202462
6125 27202462 26331566 24906984 23159080 21343660 19582388 18004478 16614754 15470157
6117 15470157 14572928 13836572 13317191 12905247 12621884 12518211 12558405 12683939 12926256 13289137
6107 13289137 13719868 14296670 14883609 15422686 15794920 15929353 15783834 15282599 14498339
6098 14498339 13533147 12456499 11369409 10343357 9378781 8450352 7659460 7003558 6397473
6089 6397473 5893850 5486749 5109534 4731229 4393655 4136209 3894305 3667354 3442926 3270273
6079 3270273 3148541 3001430 2837094 2715152 2606897 2467191 2356026 2272969 2217460 2139082
6069 2139082 2032846 1934601 1897702 1864230 1780566 1693277 1644909 1610730 1560626 1527899 1480979
6058A480979l0195q4414l2748n6876k8246k6749n1153m1219j9405m4813r578L063
6046A058646P578n9987j7768N85k7135o5305r544o41m1049k2216j1005l1047j1570
6033G69542j8096m1040J3534l80l0068L597K2854j1481m5008j8540k4335j8570
6021F02009R087j1425r333l1243k07k9189l1378J82J1204L2390j4685r109L7059
6008E55362m9634m9208K2187K3984l9578J2938j6441m899m1286J5976L9040k0943
5996D47498m2660p910K757j6136O855K6901M279K2811K025n7504P239J3L371k5528
5982C74011j1218k6005j5092P963J1421O949k9093J5283k68p759j0513k4581j5883
5969B75215M4750L3333K5572k8954K056R907o749J7685M662N924K197O895j6482
$$ plain form
6058 1480979 1450784 1366370 1333622 1276746 1248500 1221751 1170598 1129379 1109974 1065161 1055583 1058646
6046 1058646 1066224 1006237 988469 989054 961919 896614 887070 886429 845380 823164 812159 781112 769542
6033 769542 751446 710406 723940 723560 693492 697089 719943 708462 663454 644914 620579 602009
6021 602009 611096 599671 590338 559095 558888 529699 498321 498503 509707 542097 527412 518303 555362
6008 555362 505728 456520 478707 502691 463113 476051 459610 454711 413425 429401 468441 447498
5996 447498 404838 396928 399685 383549 390404 417305 421584 444395 446420 388916 396155 396168 399539 374011
5982 374011 362793 336788 321696 329659 341080 348029 318936 334219 333951 326192 315679 291098 275215
5969 275215 319965 353298 378870 349916 351972 361879 355130 372815 377477 383401 385598 392493 376011
5956C76011P389j0319k7384j3351k1242Q29l2057K6886K1115J270J8515J2729
5944C60391j6114r221o7009K7818L0495P615J3190R20K6490K9359k266k7035R454
5931C84087m5754o229p350j518J0675l5980j1899K1029p20K9345N658N582k2302
5918C24624K8503m276m8847J4756J9535Q315j4761l647m587M66N247n947J4309
5905C33690k3581k0291m299J2498M8006j4349k9628k63J9796j2631n035J2746
5893C16659j7818n360J1490L1092K599k3580K9743O919j3544j8018l8279K9459
5881C11362K0159q739O101M08K7749J7828K589k168J890M6126K2580L2523j1135
5868D67273K9480Q314L6091M2341M5873P3360N7752m463m0665q4327n9950l8309
$$ plain form
5956 376011 383400 373081 345697 332346 311104 311933 279876 306762 327877 329147 347662 360391
5944 360391 344277 335056 268047 295865 326360 333975 347165 348085 374575 403934 401668 374633 384087
5931 384087 338333 332104 324754 323236 333911 297931 286032 307061 306341 335686 341344 346926 324624
5918 324624 353127 348851 300004 314760 334295 342610 327849 324202 319615 320081 325328 319381 333690
5905 333690 310109 289818 285519 298017 346023 331674 302046 301783 321579 308948 303913 316659
5893 316659 298841 293481 304971 336063 338662 315082 344825 351744 338200 320182 281903 311362
5881 311362 331521 322782 328883 329291 357040 374868 377457 375289 377179 423305 445885 478408 467273
5868 467273 496753 505067 541158 583499 629372 702732 760484 756021 715356 631029 571079 532770
5856E32770j9823j5115m6211k7453r809J6642J3359J1365k1307N44p86J4834L9588
5843D88598k0672J9182K6376M6776j000J1098K804l9685l5049l7472K668J5784
5831D79408l572p891O266j1756m891j0229J8382L5772J7799J9700n09m127r72
5818E33380J1604O4232J3831J512K0001N792k1488Q55j9539k8626j5982l490k0734
5805E41348J0095j4077r72K3360j5115J8402k4104l9595K4242M5821K9926Q242
5793F07573m296L6042N2600k087l4909L3502O7637O452K5351k7235m6687m7850
5781F66093L481k0341J18j7185j9886j2513L9673J2967l3409L812o900n555j3038
5768E97317K9368L8722K3044k0181J7099J8804L037J3747l995K5857M1774j2274
$$ plain form
5856 532770 512947 497832 451621 424168 414359 431001 444360 455725 434418 434962 434176 449010 488598
5843 488598 467926 487108 513484 560260 559260 570358 573162 533477 498428 460956 463624 479408
5831 479408 475836 467945 474211 462455 457564 447335 465717 501489 519288 538988 538479 534352 533380
5818 533380 544984 609216 623047 624559 644560 650352 628864 629719 610180 581554 565572 562082 541348
5805 541348 551443 537366 536394 559754 544639 563041 538937 499342 523584 569405 599331 607573
5793 607573 603277 639319 691919 689832 654923 688425 756062 762514 787865 760630 713943 666093
5781 666093 669574 649233 649351 632166 612280 599767 639440 652407 618998 622810 615910 610355 597317
5768 597317 626685 665407 688451 668270 685369 704173 707210 720957 716962 742819 784593 772319
5756G72319j920K2789J9279l8977k8706K233K275J2725J6401j8761M203K2226
5744G86086K3380k1348P490O5805L375j3516K6660K8820j1975L6646J1241N8309
5732A000973J9553K944M8377K3211K3915L2145K2391L4440k8053O1758N4638M2275
5720A338567L0498K5195K3940J3442K6246J4505N2655k3533M6567M8462M4158
5709A640702N505L5799M7229K2698J0757O1769N6863O8317N1756K9697N7361O5267
5697B153720M4446M8178R9008Q2345Q9357R9753O6777O2063O3771L4337J5987
5686B859742L3625L3957J7169M6758P4383P1815O9096N4145O2757Q8956R5800
5675C508203J03590Q5059J23344J16086J39296J44134J47827J65771J69639J63013
$$ plain form
5756 772319 770399 793188 812467 773490 744784 747017 749292 762017 778418 759657 763860 786086
5744 786086 809466 788118 795608 861413 864788 851272 877932 906752 894777 931423 942664 1000973
5732 1000973 1020526 1023470 1071847 1095058 1118973 1151118 1173509 1207949 1179896 1241654 1296292 1338567
5720 1338567 1369065 1394260 1418200 1431642 1457888 1472393 1525048 1501515 1548082 1596544 1640702
5709 1640702 1646207 1682006 1729235 1751933 1762690 1824459 1881322 1949639 2001395 2031092 2088453 2153720
5697 2153720 2198166 2246344 2345352 2427697 2517054 2616807 2683584 2745647 2809418 2843755 2859742
5686 2859742 2893367 2927324 2944493 2991251 3065634 3137449 3206545 3260690 3323447 3412403 3508203
5675 3508203 3611793 3696852 3820196 3936282 4075578 4219712 4367539 4533310 4702949 4865962
5665D865962J46598J59731J44882J83500J52542J97828K41199K10069K46058L45631
5655F894000L70935M17599M72812N22906N68434O66249P79271P93655R05935J088470
5645A3480266J119223J149388J110922R27742O48760K26232j81685m81430o92031
5636A7307387p62025p22970n96628m77704l74246k08660n5129J45566K34154L73877
5626A4863622N27730P11269R22897J073078J308965J526002J815312K006935K073732
5617B6829542J856402J257036L87155n97969j429332j959527k054693j931407
5609B2357207j760838j578428j417042j233534j058824q53067o59628m97003l45134
5600A2953709j59077o2343l0801J21786K40992L56662M43283M76535M54225L68123
$$ plain form
5665 4865962 5012560 5172291 5317173 5500673 5653215 5851043 6092242 6302311 6548369 6894000
5655 6894000 7264935 7682534 8155346 8678252 9246686 9912935 10692206 11485861 12391796 13480266
5645 13480266 14599489 15748877 16859799 17787541 18436301 18662533 18480848 17999418 17307387
5636 17307387 16545362 15822392 15225764 14748060 14373814 14165154 14110025 14255591 14489745 14863622
5626 14863622 15391352 16102621 17025518 18098596 19407561 20933563 22748875 24755810 26829542
5617 26829542 28685944 29942980 30330135 29732166 28302834 26343307 24288614 22357207
5609 22357207 20596369 19017941 17600899 16367365 15308541 14455474 13795846 13298843 12953709
5600 12953709 12794632 12732289 12701488 12823274 13064266 13420928 13864211 14340746 14794971 15163094
5590A5163094J30848j33683m29509p03534q97656r40094r15201q40237p16543
5581I717485o99520o17634n02226m89174l78036l00193l61760l29956l05244k82029
5571E451713k69473l21549k25751j80135j48873j22385j27716j40527j02776n5075
5561C757453n6908m0491q6799o1944k3888j7769l0696k016J0684J4750j2458q5590
5549C364328m4704j03515r7475j41726j28564r2029r8766o0221o0892o8138k5864
5538B442434o9359p9561M344k4095l1179m3548l2824l6381k8154J2872r684L9883
5526B144748K3242k6827K938j4661k6745n446p269J1041j7088q117M0468l8066
5514B078218L5436J330M835J1945k8323J2057K9818J6825M6636N1765P1908K9870
$$ plain form
5590 15163094 15293942 15160259 14730750 14027216 13129560 12189466 11274265 10434028 9717485
5581 9717485 9017965 8400331 7898105 7408931 7030895 6730702 6368942 6038986 5733742 5451713
5571 5451713 5182240 4860691 4634940 4454805 4305932 4183547 4055831 3915304 3812528 3757453
5561 3757453 3700545 3660054 3573255 3511311 3487423 3469654 3438958 3436942 3447626 3462376 3449918 3364328
5549 3364328 3319624 3216109 3118634 2976908 2848344 2756315 2657549 2597328 2536436 2468298 2442434
5538 2442434 2373075 2293514 2297858 2273763 2242584 2199036 2166212 2129831 2101677 2114549 2104865 2144748
5526 2144748 2167990 2141163 2144101 2129440 2102695 2097249 2089980 2101021 2083933 2075816 2116284 2078218
5514 2078218 2113654 2114984 2119819 2131764 2103441 2115498 2145316 2162141 2208777 2260542 2332450 2362320
5502B362320L7729J3688K3921N2229P9373J21169J08654J03550J02271J46022
5492C150926J54275J04546P7869O4061L288k4501K2230N7083O3897K0869p1552
5481C622991q3307n3939r3630j23681n5837o3331l2901k238L620Q3535P4466R3903
5469C369651J65944R1121J13974J44648P2579J8789r265j0477r208q3720j05632
5458C758404r7447j14945q2251q9554q0478m7710m0325k5418k9484l9610l3096
5447C078086R628M0289L353o4732l8432m2487j8285K7541K0206K0211l6440k0735
5435B978203J7339K634K2764N3495K8577N2021L4536k0582J3148O8937O8454N4528
5423C374054L6081L7635J839p5067j01193q8185p3484o5251j2238n0551n8069
$$ plain form
5502 2362320 2400049 2413737 2437658 2489887 2569260 2690429 2799083 2902633 3004904 3150926
5492 3150926 3305201 3409747 3487616 3551677 3554965 3530464 3552694 3609777 3673674 3694543 3622991
5481 3622991 3539684 3485745 3392115 3268434 3212597 3149266 3116365 3114127 3117747 3201282 3275748 3369651
5469 3369651 3535595 3626716 3740690 3885338 3957917 3976706 3967441 3956964 3947756 3864036 3758404
5458 3758404 3660957 3546012 3463761 3374207 3293729 3246019 3205694 3180276 3150792 3111182 3078086
5447 3078086 3087714 3128003 3131356 3066624 3028192 2985705 2967420 2994961 3015167 3035378 2998938 2978203
5435 2978203 2995542 2998176 3020940 3074435 3103012 3155033 3189569 3168987 3182135 3251072 3319526 3374054
5423 3374054 3410135 3447770 3449609 3374542 3273349 3185164 3111680 3046429 3034191 2983640 2925571
5412B925571m7266l0406J6286m169J2981Q536L9054L9134K4762O7246P1953P1216
5400C194898Q8928O8847P8698N1142K5049K0125R655k826j8409R4595K6353J8880
5388C655935O5364P5410R5265Q1071M9024M0290R9459O7179J32708J01644P1023
5377D534372R7183J19219J24382J15982R4677J12886J32023J09494J57125J42379
5367E739722J14157J78725J57451J20911J67714J81829J31148K24595K28854K31468
5357G476574K25688K47361K76689K21192K90533K73552L05641L69755L70428L31828
5347A0389241L88015M08516L83271L74237L65150L38747L53214M11242M61774
5338A3873407M74291M42332M91395M81598M77266N07890N02414M95369N16980
$$ plain form
5412 2925571 2878305 2847899 2864185 2860016 2872997 2881533 2920587 2959721 2984483 3051729 3123682 3194898
5400 3194898 3283826 3352673 3431371 3482513 3507562 3527687 3537342 3534516 3516107 3610702 3637055 3655935
5388 3655935 3721299 3796709 3891974 3973045 4022069 4062359 4161818 4228997 4361705 4463349 4534372
5377 4534372 4631555 4750774 4875156 4991138 5085815 5198701 5330724 5440218 5597343 5739722
5367 5739722 5853879 6032604 6190055 6310966 6478680 6660509 6791657 7016252 7245106 7476574
5357 7476574 7702262 7949623 8226312 8447504 8738037 9011589 9317230 9686985 10057413 10389241
5347 10389241 10777256 11185772 11569043 11943280 12308430 12647177 13000391 13411633 13873407
5338 13873407 14347698 14790030 15281425 15763023 16240289 16748179 17250593 17745962 18262942
5329A8262942M76192M99885O44234P06279Q57663J010612J160363J147075J086187
5320B5851432R64264R20816R04480J023488J219114J534357J889787K166868K472230
5311C8946836K752552L029749L274160L476506L486846L424661L390593L420228
5303F5202131L302479K975953K322167J397000M51474m63914j356510k291209
5295G1539571l082946l506796l605159l558016l481107l489247l410163l187029
5287D4219108k813034k493379k135259j676588j320123q70838m59714o0811K55886
5278C2645248M65887M77399K98055o1594n15909r39247j206527j348257j271071
5269B8543984j099544r56941p78945o26424n13729l37133j90990n5780K6430J81330
$$ plain form
5329 18262942 18739134 19239019 19883253 20589532 21447195 22457807 23618170 24765245 25851432
5320 25851432 26815696 27736512 28640992 29664480 30883594 32417951 34307738 36474606 38946836
5311 38946836 41699388 44729137 48003297 51479803 54966649 58391310 61781903 65202131
5303 65202131 68504610 71480563 73802730 75199730 75651204 75187290 73830780 71539571
5295 71539571 68456625 64949829 61344670 57786654 54305547 50816300 47406137 44219108
5287 44219108 41406074 38912695 36777436 35100848 33780725 32909887 32450173 32389362 32645248
5278 32645248 33111135 33588534 33886589 33824995 33309086 32369839 31163312 29815055 28543984
5269 28543984 27444440 26487499 25708554 25082130 24568401 24231268 24040278 23984498 24010928 24192258
5259B4192258L12327M88358P69815J032447J368043J601279J768893J685003J295195
5250C4513618N98796l10238j116566j758672k152291k301500k223388j944727
5242B3305032j639505j349712j098488q21693o33709m36846l21684k20864j05129
5233A6677402N9560J59298K79521M58644O38623P92670P70272N53974J53761m75815
5223B0067910j037999j425084j604777j497804j447223j259176j101780q97766
5215I796301p93731p06868o35529n23750m18549l63007l45855l15096k67948k19397
5205E206571j98420k08164k38068j91555j30901j59611j12285r5084j08009j15495
5195C648979j48853j47879j26726j15784j08758j09441r5518r6994n8185o8167
$$ plain form
5259 24192258 24504585 24992943 25762758 26795205 28163248 29764527 31533420 33218423 34513618
5250 34513618 35112414 34802176 33685610 31926938 29774647 27473147 25249759 23305032
5242 23305032 21665527 20315815 19217327 18395634 17761925 17325079 17003395 16782531 16677402
5233 16677402 16736962 16896260 17175781 17634425 18273048 19065718 19835990 20389964 20543725 20067910
5223 20067910 19029911 17604827 16000050 14502246 13055023 11795847 10694067 9796301
5215 9796301 9002570 8295702 7660173 7136423 6717874 6354867 6009012 5693916 5425968 5206571
5205 5206571 5008151 4799987 4561919 4370364 4239463 4079852 3967567 3872483 3764474 3648979
5195 3648979 3500126 3352247 3225521 3109737 3000979 2891538 2796020 2699026 2640841 2572674
5185B572674p0156p1409l8083o3479l2659p3092p2654n3850l1842o439p8747m8855
5173A931409n7666k7253m8229m6418l6177l5112k1991o9424k5161K8992k1833
5162A571137o0090l1734l8574k0574l1827k8484m7359n99j0479l2085j9785k3947
5150A225600J0593m3873m3205M968k5411k3980k6826l9654k6810L58m4039k2030
5138I45691k2505r243k6098o218l5287j5864j9297l4802j7463l906m570k1893
5126G28545p909j9041K0990r496n293j2828k5159l2590M86l6839K0467J6512k7163
5113F10682r40L0712j8549J0576n323j6256j1407n776n392j6584K442k8235J3355
5100E59305n326j7229k3045J559P131J1887o715m358Q613p783l0071j868o2195
$$ plain form
5185 2572674 2502518 2431109 2393026 2329547 2296888 2223796 2151142 2097292 2065450 2059011 1980264 1931409
5173 1931409 1873743 1846490 1798261 1751843 1715666 1680554 1658563 1589139 1563978 1592970 1571137
5162 1571137 1511047 1479313 1440739 1420165 1388338 1359854 1312495 1311896 1301417 1269332 1249547 1225600
5150 1225600 1236193 1192320 1149115 1154083 1128672 1104692 1077866 1038212 1011402 1011760 967721 945691
5138 945691 923186 913943 887845 881627 846340 830476 811179 776377 758914 755008 750438 728545
5126 728545 720636 701595 722585 713089 707796 694968 669809 637219 637705 600866 621333 637845 610682
5113 610682 609742 640454 621905 632481 627158 610902 599495 593719 588327 571743 574185 545950 559305
5100 559305 553979 536750 513705 515264 522395 534282 527567 523209 531822 524039 493968 492100 429905
5087D29905J7094K4829l2998n343j7424J6347n2245p131q018J2403J7854j5059
5075C80214J0959j7301o356R021j5224j2566o756K1216m634J2547l2079K404Q098
5062C49543j3435O620j784k571N20n2396m865L0036o777J4473o435p41k2315j1646
5048B78227k647q283K3195J2200K6476J2592l5387Q365m8002J504J7116J504r767
5035B77093J1054J3041J053j2473j923p55K1980J2399n8596J3611J1894K6681
5023C15059m251l3187J5976K0786R667M420l1361m337N0217J5117K8600J0584
5011C97290j6155k4899K822j3008j1429K0834K6493j1766p939J3082m104k7563
4999C43658K2267K1764k0537K1129Q406j4189J2964k2679L1084M5658o546n814
$$ plain form
5087 429905 446999 471828 438830 433487 416063 432410 380165 373034 365016 377419 395273 380214
5075 380214 391173 373872 367516 376537 361313 348747 341991 363207 358573 371120 339041 341445 349543
5062 349543 336108 342728 340944 338373 338893 286497 281632 311668 304891 319364 312929 312188 289873 278227
5048 278227 275580 267297 290492 302692 329168 341760 306373 314738 266736 268240 285356 286860 277093
5035 277093 288147 301188 302241 289768 287845 287090 309070 321469 262873 276484 288378 315059
5023 315059 310808 277621 293597 314383 324050 328470 297109 292772 342989 358106 386706 397290
5011 397290 381135 356236 359058 346050 334621 355455 381948 370182 362243 375325 371221 343658
4999 343658 365925 387689 367152 388281 396687 382498 395462 372783 403867 449525 442979 437165
4987D37165M238J0762j1532k8231l9019L6901p062j685l2005j7829K2512O098
4975C80313k9747L5839K6891j8045J3607J1046k9680J9929P148J1858K4896k9534
4963D24521k0148P445o086K4455K1817n2476K8989q401k855k0934n407J8282k5463
4950C83739n699l6039J2133K1194j2837r281k2071n919M3241J660m2038L852L041
4937C34976J9132k8717j3574K472N3807k677q997L8319J1416L4412j1593j6011
4925D12965m6277n3304j997P303k0185k9577k1317K6858r778m268n806P172Q061
4912B69850J2744j5510m882k930J3620l404M989r837J5714K8963k3144j802M639
4899B89010J6465k0107L4621j0070k0735L5280m322m0461k5691J2137L4709N73
$$ plain form
4987 437165 441403 452165 440633 412402 373383 410284 403222 401537 369532 351703 374215 380313
4975 380313 350566 386405 413296 395251 408858 419904 390224 410153 417301 429159 454055 424521
4963 424521 404373 411818 405732 430187 452004 399528 428517 420116 417261 396327 390920 409202 383739
4950 383739 378040 342001 354134 375328 362491 353210 331139 325220 368461 370121 328083 331935 334976
4937 334976 354108 325391 311817 314289 368096 365419 356422 394741 406157 440569 428976 412965
4925 412965 366688 313384 311387 318690 298505 268928 247611 274469 264691 260423 254617 261789 269850
4912 269850 282594 267084 262202 259272 272892 269488 274477 264640 280354 309317 286173 284371 289010
4899 289010 305475 285368 319989 309919 289184 324464 320142 279681 253990 266127 300836 301409
4887C01409j6204J274J8987J380k0092j6417J3703m95J1183J2177K7659j0043
4875C24521K3211k1369J5845l976L6384k125m601M3311l1988o812L0572J1429
4863D14402P540J1555k1063O90K710K6476k1047L0169Q681q045J3567L2536K0464
4850E18635k860l5860r948K4843P311J4443l964J6502J0943o774J3505J9516K8207
4837E94499K0030L5370L9926M224K3364n832k0245j9747n9413J6282j2570l2245
4825E83643J8248l4884n075j6251N699N1977j8171l9337r19q642K285K0805o362
4812E53016j0335L1241O69K5496N1709M516J5477K7727l021N9542M9085J1422
4800H16544J2020P498K6068q764j0754l3049l4378o5339k6456q998k4599q065
$$ plain form
4887 301409 285205 286479 305466 306846 286754 270337 284040 283545 294728 306905 334564 324521
4875 324521 347732 326363 342208 338232 374616 372491 367890 411201 379213 372401 402973 414402
4863 414402 421942 433497 412434 413124 415834 442310 421263 451432 460113 452068 465635 498171 518635
4850 518635 515775 479915 469967 494810 502121 516564 512600 529102 540045 533271 546776 566292 594499
4837 594499 614529 649899 689825 694049 717413 711581 691336 671589 612176 628458 615888 583643
4825 583643 601891 567007 561932 545681 551380 603357 585186 545849 544930 536288 538573 559378 553016
4812 553016 542681 573922 574591 600087 651796 656312 671789 699516 696495 756037 805122 816544
4800 816544 828564 836062 862130 853366 842612 809563 775185 709846 683390 674392 649793 641728
4788F41728L200j9165m3690l1285J5089K506K807J8867O577L100K84j4093M9681
4775F35606J8652K8594K8939N770L4990j6362N0056O487l039r15L655R3k778k9209
4761G60539m6087l1042o2336J512k2681M793j5733L349K18j1396j6073l4166N2016
4748E82913K1225k3266K5492o108j9707p715J1942J697J2140J2372L257q635M809
4735F10416k613k243K127M1088j6804p636L9557K2205K0715J7296r676J5923J2715
4722G43070J4025L6298O1286R865m100N5551P2295K2960J5567O098M3748O1299
4710A137962N6256P3040M7951M4552j0955m0913k0851j137m5337J452j8101J6976
4698A240895k231L035j9473k5940l814P1789J1400K3959K7130O7186N6649Q0906
$$ plain form
4788 641728 644928 625763 582073 550788 565877 568383 571190 590057 596634 599734 600018 585925 635606
4775 635606 654258 682852 711791 717561 752551 736189 786245 792732 789693 788778 792433 792526 789748 760539
4761 760539 714452 683410 621074 622586 599905 604698 588965 592314 592532 581136 565063 530897 582913
4748 582913 604138 580872 606364 600256 580549 572834 584776 586473 598613 610985 614242 605607 610416
4735 610416 607803 605560 607687 648775 631971 624335 663892 686097 706812 724108 714432 730355 743070
4722 743070 757095 793393 854679 864544 860444 915995 988290 1011250 1026817 1032915 1076663 1137962
4710 1137962 1194218 1267258 1315209 1359761 1348806 1307893 1287042 1285905 1240568 1242020 1223919 1240895
4698 1240895 1238664 1241699 1222226 1196286 1192472 1264261 1275661 1299620 1326750 1393936 1450585 1531491
4686A531491J01475P2978M6949K7524j09j7788n7703q1227j12691p0766m1153
4675A398980n6892k2446l4037l1650J963J3877j784k8311K9363K5387K9863N2634
4663A376947M5498N2727L7243K3881Q2095N4451r563m5639p3471j3913Q735k2259
4651A516732M477o7234j9975J7164M0378K9141j9959p961K6625L3886L5303N6706
4639A645283K335L3334J2168L3606M4062N5192M7579K6347J9145O9928P251M2631
4627B038861M5817J9243P4591P4136L8350K2299N5394R0881M2332Q7784M2988
4616B632676O1154P0260M4494Q4075J04951P0753Q8956J24067N0243J15972R7079
4605C544680P5252J35618J21965J30449J50706J60984J54001J84310J42017K16913
$$ plain form
4686 1531491 1632966 1705944 1752893 1780417 1780308 1762520 1704817 1623590 1510899 1440133 1398980
4675 1398980 1342088 1319642 1285605 1253955 1255918 1269795 1268011 1239700 1269063 1294450 1324313 1376947
4663 1376947 1422445 1475172 1512415 1536296 1618391 1672842 1663279 1617640 1544169 1530256 1538991 1516732
4651 1516732 1521209 1453975 1434000 1451164 1491542 1520683 1500724 1492763 1519388 1553274 1588577 1645283
4639 1645283 1647618 1680952 1693120 1726726 1770788 1825980 1873559 1899906 1919051 1988979 1996230 2038861
4627 2038861 2084678 2103921 2178512 2252648 2290998 2313297 2368691 2459572 2501904 2589688 2632676
4616 2632676 2693830 2764090 2808584 2892659 2997610 3068363 3157319 3281386 3331629 3447601 3544680
4605 3544680 3619932 3755550 3877515 4007964 4158670 4319654 4473655 4657965 4799982 5016895
4595E016895J96833K00626J93385K00823K23062K61799K74288L27859L58692L84456
4585G638718M48518N04473N70606O54299P69290Q49541R71675J115447J277344
4576A4799911J358806J364988J108592O56720J53205m06650p57576q99535q99401
4567A6479060p73646n84859m19084k07758l8728P8679J72516K46750L89110N28481
4557A5870521P25722R31147J151477J413741J657651J804099J803253J599442
4549B6957053J143275M14602m63655j231460j795299k049346k047033j841063
4541A9087074j581227j303581j073478q14038o61562m63846l60975l36789j31131
4532A2360447n0524J35435K98204M31028N44518P24328Q02412O99701L71015j44883
$$ plain form
4595 5016895 5213728 5414354 5607739 5808562 6031624 6293423 6567711 6895570 7254262 7638718
4585 7638718 8087236 8591709 9162315 9816614 10585904 11435445 12407120 13522567 14799911
4576 14799911 16158717 17523705 18632297 19289017 19442222 19035572 18277996 17378461 16479060
4567 16479060 15705414 15120555 14701471 14493713 14454985 14533664 14706180 14952930 15342040 15870521
4557 15870521 16596243 17527390 18678867 20092608 21750259 23554358 25357611 26957053
4549 26957053 28100328 28514930 28051275 26819815 25024516 22975170 20928137 19087074
4541 19087074 17505847 16202266 15128788 14314750 13653188 13189342 12828367 12491578 12360447
4532 12360447 12309923 12445358 12743562 13174590 13719108 14443436 15245848 15945549 16316564 16171681
4522A6171681o55968j059288j369339j359393j205438j115769r79093p67845p15999
4513F943549o37314n10914m42278l59153k99514l12606k64630k21551k15239j88258
4503C492092j51640j50817j35164j27769j29020q7694q0934r7964o6532j10345
4493B354213n1013m0364r1951p2134j9045o4856r2149k02m9323k5289l5412l9278
4481A773197n0991l4738n1640n2146k0470l1617j1658m0371k1664k1961o46j5216
4469A420079q266m7398l4991K9819m1246k4484l519k0906L6578J0716J2635p554
4457A321463l3832K4094k3722L0761K8682j291J7044N901k5172l6113l1626k8412
4445A247777N865n061l0659k3158N365P809K3637N539N1590M116J5732J4292L2210
$$ plain form
4522 16171681 15515713 14456425 13087086 11727693 10522255 9406486 8427393 7659548 6943549
4513 6943549 6306235 5795321 5353043 4993890 4694376 4381770 4117140 3895589 3680350 3492092
4503 3492092 3340452 3189635 3054471 2926702 2797682 2709988 2629054 2531090 2464558 2354213
4493 2354213 2303200 2262836 2170885 2098751 2079706 2014850 1922701 1922499 1873176 1847887 1812475 1773197
4481 1773197 1722206 1687468 1635828 1583682 1563212 1531595 1519937 1479566 1457902 1435941 1435295 1420079
4469 1420079 1411813 1364415 1329424 1359243 1317997 1293513 1289994 1269088 1305666 1316382 1329017 1321463
4457 1321463 1287631 1311725 1288003 1318764 1347446 1346155 1363199 1369100 1343928 1307815 1276189 1247777
4445 1247777 1253642 1248581 1217922 1194764 1200129 1207938 1231575 1237114 1288704 1292820 1308552 1322844 1355054
4432A355054M8976O6549L9331R199K303P991j164n9931l5234l3218m4723k4949
4420A330184N318l1823K445l226j585J448k0516k5813l673k1185K5807j4257l4627
4407A208497k3966K925L778L567L4222k8761k7428J1461J1691K3332K158L4454
4395A255930L1643M7131q839M7048M3900L7295L0482j6023l0858l1721J1358j3796
4383A403550l6870l744L91m730j5497J3993J7089L0915N2842L5403M5643P1350
4371A610335J02359J02028P1694N4508N1524L2916j7718l3995r9108o1085q1533
4360A731925q8254n7977q7389n2465l7690k5165k8282k661j741Q651K393J231
4348A362576K472P332m813J2583K1664R324J6370L5857J9183N323M0515M6063
$$ plain form
4432 1355054 1404030 1470579 1509910 1519109 1521412 1529403 1528239 1468308 1433074 1399856 1355133 1330184
4420 1330184 1335502 1303679 1306124 1302898 1301313 1302761 1282245 1256432 1252759 1231574 1257381 1243124 1208497
4407 1208497 1184531 1187456 1191234 1194801 1229023 1200262 1172834 1184295 1195986 1219318 1221476 1255930
4395 1255930 1287573 1334704 1325865 1372913 1416813 1454108 1484590 1468567 1437709 1405988 1417346 1403550
4383 1403550 1366680 1362936 1363327 1358597 1343100 1357093 1374182 1405097 1457939 1493342 1538985 1610335
4371 1610335 1712694 1814722 1886416 1940924 1992448 2025364 2007646 1973651 1874543 1813458 1731925
4360 1731925 1643671 1585694 1498305 1445840 1408150 1382985 1354703 1352042 1350301 1358952 1361345 1362576
4348 1362576 1365048 1372380 1367567 1380150 1401814 1411138 1427508 1463365 1482548 1487871 1528386 1574449
4336A574449R233L7368m760J718K8021M2970M3541J944l2570L3401J575J6155
4324A753045k9956j2566j4259m2140l1105l6998K4433K8491K2221n1731l716j0654
4312A595065J1812M5939Q279k3402j2124K2383J6494L1047M3076M172K9k2141
4300A720629l6912n3001k0590m3047k8157m1804n0807K0585j9669k3863m6071
4289A377293m2374L401j0617j3074L5779n550q334J3956N1993l0456J5859P355
4277A395231K5398J3077j7798l688j2437J2492K4917k4901n805N435J8946l0186
4265A400681j2702k4928J169L1573r071L2556K567q965J0K9370n941J6095k4495
4252A427919L4294K9568K2495K5480K7282L6194L2301J0869O562J6326M065N4709
$$ plain form
4336 1574449 1583682 1621050 1616290 1618008 1646029 1688999 1732540 1734484 1701914 1735315 1736890 1753045
4324 1753045 1723089 1710523 1696264 1654124 1623019 1586021 1610454 1638945 1661166 1609435 1605719 1595065
4312 1595065 1606877 1652816 1661095 1637693 1625569 1647952 1664446 1695493 1738569 1742741 1742770 1720629
4300 1720629 1683717 1630716 1610126 1567079 1538922 1497118 1446311 1466896 1447227 1423364 1377293
4289 1377293 1334919 1338320 1327703 1314629 1350408 1344858 1336524 1350480 1402473 1372017 1387876 1395231
4277 1395231 1420629 1433706 1415908 1412220 1399783 1412275 1437192 1412291 1406486 1411921 1430867 1400681
4265 1400681 1387979 1363051 1364220 1395793 1386722 1419278 1421845 1412880 1412890 1442260 1436319 1452414 1427919
4252 1427919 1462213 1491781 1514276 1539756 1567038 1603232 1635533 1646402 1652964 1669290 1673355 1728064
4240A728064L8223K0117L6952M1515L2377J4085K9523J3852J803J740k290P00
4228A956661n4158P360P0684O192K1053l228k1621L2003N9133K7400L4626M1355
4216B177460O8304P1989L0137J03955J00342O2455k1855j01020j02588q0638l2877
4205B275664j8796j3505p448J0279J9942j0265M239K7186K2748k0578k0014M3144
4193B312596L0528J235K2156N0863N5063M4884K460J8826N3663N2607L9916N8347
4181B743144O4612R2237M8675Q1265P0982P7937Q2457P2473J09615J44743J45172
4170C733312J19518J62744K64777L06094L09363K66732J08356p8995k50697l09717
4160D631487k24215k08744j70909j06641l1909p8722o1911J4955j2319O091K0374
$$ plain form
4240 1728064 1766287 1786404 1823356 1864871 1897248 1911333 1940856 1954708 1956511 1958251 1955961 1956661
4228 1956661 1902503 1909863 1980547 1986739 2007792 2004564 1982943 2014946 2074079 2101479 2136105 2177460
4216 2177460 2245764 2317753 2347890 2451845 2552187 2614642 2592787 2491767 2389179 2308541 2275664
4205 2275664 2256868 2243363 2235915 2246194 2266136 2255871 2260110 2287296 2310044 2289466 2269452 2312596
4193 2312596 2343124 2344359 2366515 2417378 2472441 2517325 2519785 2538611 2592274 2644881 2684797 2743144
4181 2743144 2807756 2899993 2948668 3029933 3100915 3178852 3261309 3333782 3443397 3588140 3733312
4170 3733312 3852830 4015574 4280351 4586445 4895808 5162540 5270896 5191901 4941204 4631487
4160 4631487 4407272 4198528 4027619 3920978 3889069 3810347 3748436 3763391 3751072 3757163 3777537
4149C777537K4962N1552Q5433K5186P1720P1494N4283Q2756P8138R4546Q8133
4138D505740Q7702R1445J13888J19976J40584J23768R2804J34742J44338J25820
4128E680807J10034J03380J01699J47615J27685J33704J66319J83138J77687J64084
4118G096152J85787K12587J61478J86407K22702K17728J79007J93448J59691J54881
4108H969868K06689K31081K32829K46635K45775K72831K48898K35091K82218K94195
4098A1466110L04392K53420L37591L39435L41438L66940L84878L84980M27132
4089A4606316M23427L92077M48677M73934M86388N25414N71463N79834O51069
4080A9158599O70751O68893P54128Q33591Q59948R16656R75724J026041J129021
$$ plain form
4149 3777537 3802499 3854051 3939484 3964670 4036390 4107884 4162167 4244923 4323061 4417607 4505740
4138 4505740 4593442 4684887 4798775 4918751 5059335 5183103 5275907 5410649 5554987 5680807
4128 5680807 5790841 5894221 5995920 6143535 6271220 6404924 6571243 6754381 6932068 7096152
4118 7096152 7281939 7494526 7656004 7842411 8065113 8282841 8461848 8655296 8814987 8969868
4108 8969868 9176557 9407638 9640467 9887102 10132877 10405708 10654606 10889697 11171915 11466110
4098 11466110 11770502 12023922 12361513 12700948 13042386 13409326 13794204 14179184 14606316
4089 14606316 15029743 15421820 15870497 16344431 16830819 17356233 17927696 18507530 19158599
4080 19158599 19829350 20498243 21252371 22085962 22945910 23862566 24838290 25864331 26993352
4071B6993352J159744J221215J342861J395634J486484J544103J666234J749009
4063C8558636J826145J956000K055561K137127K223290K337464K363266K484078
4055E5941567K550435K631795K638901K685973K743530K711518K818998K842614
4047G7565331K849737K847172K846628K831208K830280K751683K663247K582141
4039I9767427K383996K267707K071063J886066J728846J556510J387997J240497
4031A14290109J120519R40241P94442N96105L71290J08825j47787m78022q34518
4022A16761204j079238j334675j495412j706563j894947j979432k021261k097092
4014A03152584k218906k326129k508755k662206k874927k929336l032837l154045
$$ plain form
4071 26993352 28153096 29374311 30717172 32112806 33599290 35143393 36809627 38558636
4063 38558636 40384781 42340781 44396342 46533469 48756759 51094223 53457489 55941567
4055 55941567 58492002 61123797 63762698 66448671 69192201 71903719 74722717 77565331
4047 77565331 80415068 83262240 86108868 88940076 91770356 94522039 97185286 99767427
4039 99767427 102151423 104419130 106490193 108376259 110105105 111661615 113049612 114290109
4031 114290109 115410628 116350869 117145311 117741416 118112706 118221531 118073744 117595722 116761204
4022 116761204 115681966 114347291 112851879 111145316 109250369 107270937 105249676 103152584
4014 103152584 100933678 98607549 96098794 93436588 90561661 87632325 84599488 81445443
4006H1445443l213567l224814l209944l082793l035508k907232k820579k744144
3998E7206862k675326k655633k577718k538961k471526k408758k321003k246171
3990C7311766k143184k021172j846217j779296j672209j554813j446391j346452
3982B3502032j191959j135623j075892r97159r21243r01258q62337p15486o73836
3973A5027239o77878o32653n08491m92360m73319m10099l84108l45761l36571
3964A0765999l12891k79058k67256k35878k78633k31798j74926j92346j97105
3955H596108j84506j70171j63958j23821j47900r5556j19174j07006j04833n0634
3945G328549q9957j35708p2760l9374o7729o6679o1360q8577p4653o3512o1102
$$ plain form
4006 81445443 78231876 75007062 71797118 68714325 65678817 62771585 59951006 57206862
3998 57206862 54531536 51875903 49298185 46759224 44287698 41878940 39557937 37311766
3990 37311766 35168582 33147410 31301193 29521897 27849688 26294875 24848484 23502032
3982 23502032 22310073 21174450 20098558 19101399 18180156 17278898 16416561 15701075 15027239
3973 15027239 14349361 13716708 13208217 12715857 12242538 11832439 11448331 11102570 10765999
3964 10765999 10453108 10174050 9906794 9670916 9392283 9160485 8985559 8793213 8596108
3955 8596108 8411602 8241431 8077473 7953652 7805752 7710196 7591022 7484016 7379183 7328549
3945 7328549 7238592 7102884 7030124 6990750 6923021 6856342 6794982 6706405 6631752 6568240 6507138
3934F507138l7082n9704m2145k1252m5229p4055j9881l4028o9855m1644o0385
3923F001878m0723l5361n7765l5756q0440l2256k2923l2799o1023n1701j0434
3912E540697O734j6876k9042j6819J6672K746n5141m9j5670j4750k8310L1223
3900E421415O321L3573K3888N931N1421Q7482N6660L9707J06968R0857N4972M3885
3888F023080L4799L1995k653l9367J7394K23l6123r241p2652k743J5741k9857
3876E930596m9290o6486k4702n7652q0008p494m6531r6052p2225n4182p1381j08647
3864E195946p8606l7746o6167n9458k3677n6569o3189j2279L425J0968j590J2683
3852D823741M591p2j2793J7573j414L6737J2964J6471m335L1118M6353k447J2145
$$ plain form
3934 6507138 6470056 6410352 6368207 6346955 6301726 6227671 6207790 6173762 6103907 6062263 6001878
3923 6001878 5961155 5925794 5868029 5832273 5751833 5719577 5696654 5663855 5602832 5551131 5540697
3912 5540697 5547431 5530555 5501513 5484694 5501366 5504112 5448971 5448922 5433252 5418502 5390192 5421415
3900 5421415 5427736 5461309 5485197 5491128 5542549 5630031 5686691 5726398 5833366 5924223 5979195 6023080
3888 6023080 6057879 6089874 6087221 6047854 6065248 6065471 6029348 6020107 5947455 5944712 5960453 5930596
3876 5930596 5881306 5814820 5790118 5732466 5652458 5644964 5598433 5502381 5430156 5375974 5304593 5195946
3864 5195946 5117340 5079594 5013427 4953969 4930292 4873723 4810534 4798255 4801680 4812648 4811058 4823741
3852 4823741 4828332 4828260 4815467 4833040 4831626 4868363 4881327 4897798 4893463 4924581 4970934 4968487 4980632
3839D980632P6409L1431J0587J0509K0309P2485Q888N0044L8126K2812M2698M4468
3827E409398L9604K3512J5224O9429O2198L3691J7222M5187L2553L3961O5933
3816E847912O6526P4806M9819K4298O1766O4805O9103L7301P1630P9383N6165
3805F503514O8184M7451M4875Q0807O9573Q9666Q1502P5228R4652O3288O8730
3794G287470R1870R0188R2570J06563R9041J68468J53431R6841J04847J43041
3784H434330J17520J11567J51732J57075J49960J24149J36325J51516J44489J28818
3774I807481J56620J54500J67593J30482J52000J62736J36009J70250J57530J50461
3764A1345662J69146J75290J75582J78453J61894J84613J88410K30898K22525
$$ plain form
3839 4980632 5057041 5088472 5099059 5109568 5129877 5202362 5211250 5261294 5299420 5322232 5364930 5409398
3827 5409398 5449002 5472514 5487738 5557167 5619365 5653056 5670278 5715465 5748018 5781979 5847912
3816 5847912 5914438 5989244 6039063 6063361 6125127 6189932 6259035 6296336 6367966 6447349 6503514
3805 6503514 6571698 6619149 6664024 6744831 6814404 6904070 6985572 7060800 7155452 7218740 7287470
3794 7287470 7379340 7469528 7562098 7668661 7767702 7936170 8089601 8186442 8291289 8434330
3784 8434330 8551850 8663417 8815149 8972224 9122184 9246333 9382658 9534174 9678663 9807481
3774 9807481 9964101 10118601 10286194 10416676 10568676 10731412 10867421 11037671 11195201 11345662
3764 11345662 11514808 11690098 11865680 12044133 12206027 12390640 12579050 12809948 13032473
3755A3032473J93075K39494K16923K60898K73997K99229L07417L31913L34392
3746A5489811L82251L92239M12681M37715M62765N07276M70975N47601N75900
3737A9679214O11276O64972O71388P76306P65836Q26333Q44474Q52740R18378
3728B6610917R39114J006349J017828J022597J061117J145118J143277J228367
3720C5174684J266546J320221J319102J324404J325270J221675J170542J092482
3712D5214926R86255R23501Q45269Q12314P85886Q24070Q53898Q49418Q21767
3703E2917304Q52955Q06749P32093N98811M88797M21812L06148K41515J98743
3694E7564927K37482L05434M27244M97869O13159P64824Q82419R72700J063270
$$ plain form
3755 13032473 13225548 13465042 13681965 13942863 14216860 14516089 14823506 15155419 15489811
3746 15489811 15872062 16264301 16676982 17114697 17577462 18084738 18555713 19103314 19679214
3737 19679214 20290490 20955462 21626850 22403156 23168992 23995325 24839799 25692539 26610917
3728 26610917 27550031 28556380 29574208 30596805 31657922 32803040 33946317 35174684
3720 35174684 36441230 37761451 39080553 40404957 41730227 42951902 44122444 45214926
3712 45214926 46201181 47124682 47969951 48782265 49568151 50392221 51246119 52095537 52917304
3703 52917304 53770259 54577008 55309101 55907912 56396709 56818521 57124669 57366184 57564927
3694 57564927 57802409 58107843 58535087 59032956 59646115 60410939 61293358 62266058 63329328
3685F3329328J137483J291667J403737J504060J684184J871711K046834K295288
3677G6564292K517032K685711K927822L087108L251313L472793L683814L903432
3669A02093317M157499M407357M731941N012627N256600N496231N631365N638135
3661A42425072N725475N628528N420545N308605N173804N083500N060943N126341
3653A84952813N252369N389492N455776N546981N531600N433090N171051M878251
3645B27611423M463157M003842L589264L184047K826597K483444K205242J944503
3637B52311519J677542J447945J230022R87981P88761O71885N96540N34306L48604
3628B60595105P8976j60457k59279k87028k86317k57496k12681n0708K59460P99525
$$ plain form
3685 63329328 64466811 65758478 67162215 68666275 70350459 72222170 74269004 76564292
3677 76564292 79081324 81767035 84694857 87781965 91033278 94506071 98189885 102093317
3669 102093317 106250816 110658173 115390114 120402741 125659341 131155572 136786937 142425072
3661 142425072 148150547 153779075 159199620 164508225 169682029 174765529 179826472 184952813
3653 184952813 190205182 195594674 201050450 206597431 212129031 217562121 222733172 227611423
3645 227611423 232074580 236078422 239667686 242851733 245678330 248161774 250367016 252311519
3637 252311519 253989061 255437006 256667028 257655009 258443770 259115655 259712195 260246501 260595105
3628 260595105 260674081 260513624 260254345 259967317 259681000 259423504 259210823 259160115 259419575 260219100
3618B60219100J463294K171712K859819L754159M760016N996068P518217R205181
3610B97947566J0969123J2567395J3789438J4507562J4635142J3957431J2470613
3603C90844270J0192982P247303L839305N63049k304103m461432n641957n954460
3595C94324957n624112n015588m489350m219792m275262m974633o514974q988029
3587C50223217j1882179j4906807j7557568j9452936k0502829k0801109k0388696
3580B24731093j9251720j7543640j5492859j3449929j1611706j0144013q813894
3573A28423332p661225o603523n799089n141348m586943m208524l844668l577171
3565H7000841l394467l222318l077186l009429k922573k834393k690624k544745
$$ plain form
3618 260219100 261682394 263854106 266713925 270468084 275228100 281224168 288742385 297947566
3610 297947566 308916689 321484084 335273522 349781084 364416226 378373657 390844270
3603 390844270 401037252 408284555 412123860 412686909 410382806 405921374 400279417 394324957
3595 394324957 388700845 383685257 379195907 374976115 370700853 365726220 359211246 350223217
3587 350223217 338341038 323434231 305876663 286423727 265920898 245119789 224731093
3580 224731093 205479373 187935733 172442874 158992945 147381239 137237226 128423332
3573 128423332 120762107 114158584 108359495 103218147 98631204 94422680 90578012 87000841
3565 87000841 83606374 80384056 77306870 74297441 71374868 68540475 65849851 63305106
3557F3305106k439290k282396k194447k105067j930858j794791j717183j750672
3549D7090402j803959j767996j705714j630453j558687j499474j459831j390234
3541C4274054j299809j250139j139357j044728j006843r55201q59630p96707p84700
3532B5136940o88057o46195o54069o56594o25929n57568n13861n05985m84658
3523A9804024m68893m88199m82460m16440l99021l95223l91685l69838l47445
3514A6044820l69394l14737k96072l39625l01584k63681k53095k46350k62033
3505A3398249k41618k64543j99794j78647k28010k37525k21328k01548j58734
3496A1466502k00204j36431j78269j71642j82295j75019j28909j27779j21044
$$ plain form
3557 63305106 60865816 58583420 56388973 54283906 52353048 50558257 48841074 47090402
3549 47090402 45286443 43518447 41812733 40182280 38623593 37124119 35664288 34274054
3541 34274054 32974245 31724106 30584749 29540021 28533178 27577977 26718347 25921640 25136940
3532 25136940 24448883 23802688 23148619 22492025 21866096 21308528 20794667 20288682 19804024
3523 19804024 19335131 18846932 18364472 17948032 17549011 17153788 16762103 16392265 16044820
3514 16044820 15675426 15360689 15064617 14724992 14423408 14159727 13906632 13660282 13398249
3505 13398249 13156631 12892088 12692294 12513647 12285637 12048112 11826784 11625236 11466502
3496 11466502 11266298 11129867 10951598 10779956 10597661 10422642 10293733 10165954 10044910
3487A0044910j73147j13086j32163j26262j36577j48446q4747r8205r3634r4471
3477H844172r1487j04378j36928l3400o6474p0819r6684p3246l1044l5621n090
3466H099001m3491K698m8805m3955o9565j12583q1331n5425m0666n6437p1853
3455G477588o6854j9555n9352l9536l4936l1440j2728m0238m0408j3770M361p737
3443G115395p0279n082k5571q944P410l3737L228J1576j2796J7265J6449j9084
3431F995830K8148L1756k9222L610K2267J5945Q297L6621K0042M3743M2801L8561
3419G258399M6372M3026O8013R8114N5611L5977N1407J13957J09522O7091J34854
3408H082343J23808J38777J21666J04359J04385J07063J62753J59140J34286J41167
$$ plain form
3487 10044910 9871763 9758677 9626514 9500252 9363675 9215229 9130482 9032277 8938643 8844172
3477 8844172 8752685 8648307 8511379 8477979 8411505 8340686 8244002 8170756 8139712 8104091 8099001
3466 8099001 8055510 8058208 8009403 7965448 7895883 7783300 7701969 7646544 7605878 7549441 7477588
3455 7477588 7410734 7391179 7331827 7292291 7257355 7225915 7213187 7172949 7132541 7118771 7123132 7115395
3443 7115395 7045116 7040034 7014463 7005519 7012929 6979192 6982420 6993996 6981200 6998465 7014914 6995830
3431 6995830 7023978 7055734 7026512 7030122 7052389 7068334 7076631 7113252 7133294 7177037 7219838 7258399
3419 7258399 7304771 7347797 7415810 7513924 7569535 7605512 7656919 7770876 7880398 7947489 8082343
3408 8082343 8206151 8344928 8466594 8570953 8675338 8782401 8945154 9104294 9238580 9379747
3398I379747J19320J55872J98839R5960J13331K08177J54434J77618J45359J41428
3388A0890085K09578K26183J61323K17144J89073J85617K56289K20804K13541
3379A2769637K63477K69149L01141L11481K58835K83359L18547K78873L26607
3370A5381106L60611L58186L39354L42976L50777L97162M47103L98527M14316
3361A8790118M55249N01916M76795M50342M90782N69952N66715N54245N98888
3352B3455002O43907O69460O83997O72945P26701P79477P75921Q24628Q76275
3343C0108313Q82415R29821R63632J014297J056918J120537J176164J258045J323638
3334C9833780J349905J442343J520982J580680J585063J623033J713237J808511
$$ plain form
3398 9379747 9499067 9654939 9853778 9949738 10063069 10271246 10425680 10603298 10748657 10890085
3388 10890085 11099663 11325846 11487169 11704313 11893386 12079003 12335292 12556096 12769637
3379 12769637 13033114 13302263 13603404 13914885 14173720 14457079 14775626 15054499 15381106
3370 15381106 15741717 16099903 16439257 16782233 17133010 17530172 17977275 18375802 18790118
3361 18790118 19245367 19747283 20224078 20674420 21165202 21735154 22301869 22856114 23455002
3352 23455002 24098909 24768369 25452366 26125311 26852012 27631489 28407410 29232038 30108313
3343 30108313 30990728 31920549 32884181 33898478 34955396 36075933 37252097 38510142 39833780
3334 39833780 41183685 42626028 44147010 45727690 47312753 48935786 50649023 52457534
3326E2457534J792956J822795J816171J736025J777472J713521J607291J528945
3318F6252710J319204J153574R10110O93163M85665K01189o2820k81097m99975
3309G0171723p48537r54051j143058j341101j473012j593230j674208j733475
3301E9511051j716300j728980j754002j723954j688180j678653j648932j688266
3293D5883784j661189j642547j567029j463996j451441j385376j302187j242954
3285C4167065j210889j157902j062330j078660j023023r61731q78360q19476q11955
3276B5162739q05319p72965o85786p10595o33522n97814n51666n33545m44362
3267A9427165m19992l55193l02489l53285l42975l53698l39794k46652j84877
$$ plain form
3326 52457534 54250490 56073285 57889456 59625481 61402953 63116474 64723765 66252710
3318 66252710 67571914 68725488 69635598 70328761 70814426 71015615 70952795 70671698 70171723
3309 70171723 69423186 68469135 67326077 65984976 64511964 62918734 61244526 59511051
3301 59511051 57794751 56065771 54311769 52587815 50899635 49220982 47572050 45883784
3293 45883784 44222595 42580048 41013019 39549023 38097582 36712206 35410019 34167065
3285 34167065 32956176 31798274 30735944 29657284 28634261 27672530 26794170 25974694 25162739
3276 25162739 24357420 23584455 22898669 22188074 21554552 20956738 20405072 19871527 19427165
3267 19427165 19007173 18651980 18349491 17996206 17653231 17299533 16959739 16713087 16528210
3258A6528210j85728m03003n15157o38619o33478n87240m76286m39224m01663
3249A2247812l32140l08311k98493k68445j94572j92854k04475k12862j71831
3240A0063829j75927j57093j32925j07862q6754n0779L5535Q0266J37151J71709
3230I777150K788k04824m19143m86883m41607l60137k76324k79643k36626k33249
3220F841502k00031j67738j21945j39120j60206j16355p8653j25574j37305j14006
3210E480569r7647p7603j42351j31143j05763r0793q6328m7931p6643m9127o9696
3199D505544j07650r8456q1362m8807m9658n0809n2960r8182o3974k3156n4217
3188C776313q5075n4431p6841l0792m9709n0240j5528n1872m9491n4662p3917
$$ plain form
3258 16528210 16342482 15939479 15424322 14785703 14152225 13564985 13088699 12649475 12247812
3249 12247812 11915672 11607361 11308868 11040423 10845851 10652997 10448522 10235660 10063829
3240 10063829 9887902 9730809 9597884 9490022 9403268 9352489 9388024 9468290 9605441 9777150
3230 9777150 9779938 9575114 9155971 8669088 8227481 7867344 7591020 7311377 7074751 6841502
3220 6841502 6641471 6473733 6351788 6212668 6052462 5936107 5857454 5731880 5594575 5480569
3210 5480569 5382922 5305319 5162968 5031825 4926062 4835269 4748941 4701010 4624367 4575240 4505544
3199 4505544 4397894 4299438 4218076 4169269 4119611 4068802 4015842 3917660 3853686 3830530 3776313
3188 3776313 3691238 3636807 3559966 3529174 3479465 3429225 3413697 3361825 3312334 3257672 3183755
3177C183755l8129k2518l6715l4544j5370n1814n4692l7948l4961k7603n4841
3166B774620j3257k1488k9380n3470m8288n6923o992l5342l0658j0571l7141l8551
3154B392559k644m6156l8821l3135m0590l8692K1816l9904n9599N120n4978j0366
3142B054610n0971k9288k49j8393l0714j4303j7896l4461j0783m6398l5563L5554
3130A801145p890l8402k266J5300k5146k9065k3258j7269m806l5952k2758l0318
3118A579315k093j0828k2050j1460j4392j4834l9314O699k4659r051P677j387
3106A443623j5730o558k7225k2452p898K0584k4704l4781K6336p908k3626r436
3094A310225k88J4143r458j1188k8336j4171n574k7130M0j5564m194M000l0737
$$ plain form
3177 3183755 3145626 3123108 3086393 3051849 3036479 2984665 2929973 2892025 2857064 2829461 2774620
3166 2774620 2761363 2739875 2710495 2657025 2608737 2551814 2544822 2509480 2478822 2468251 2431110 2392559
3154 2392559 2389915 2343759 2304938 2271803 2231213 2192521 2214337 2174433 2114834 2119954 2064976 2054610
3142 2054610 2003639 1974351 1974102 1955709 1924995 1910692 1892796 1858335 1847552 1801154 1765591 1801145
3130 1801145 1793255 1754853 1752587 1767887 1742741 1713676 1690418 1673149 1668343 1632391 1609633 1579315
3118 1579315 1577222 1566394 1544344 1532884 1518492 1503658 1464344 1471043 1446384 1437333 1445010 1443623
3106 1443623 1427893 1421335 1394110 1371658 1363760 1384344 1359640 1324859 1351195 1343287 1319661 1310225
3094 1310225 1309937 1324080 1314622 1303434 1275098 1260927 1255353 1228223 1228263 1212699 1208505 1212505 1181768
3081A181768RN137l6184P564J7930j0897r299l3235m827j7282L530j357j6615
3068A086242M734K4555j2945p426m000k0237j9427K9277J2983j1236p676K2428
3056A097272k7089l4077k333J0750k286o722P699l6029r989L1486J181l0312K8213
3043A027764R843j352k109l188n447o459j0384K2167j5762K045n56k5363J4585
3030A005784M243k7284J2485l003L8518l4193M3080J222j3763k1673P934R941
3018A023291J7314K2916M818k347K0301P216J3804K5210J4798K1697p541K8799
3006A190276K3023J4132L3919N4068M9444k4282M84K9687K8357J0354j0767R772
2994A408467j094j0844k2941L975R425n0032j5776j0295R317P1111k5015j5779
$$ plain form
3081 1181768 1181777 1186914 1150730 1158294 1176224 1165327 1156028 1122793 1117966 1100684 1104214 1102857 1086242
3068 1086242 1090976 1115531 1102586 1095160 1091160 1070923 1051496 1080773 1093756 1082520 1074844 1097272
3056 1097272 1070183 1036106 1033773 1044523 1042237 1035515 1043214 1007185 997196 1028682 1029863 999551 1027764
3043 1027764 1037607 1036255 1034146 1030958 1025511 1019052 1008668 1030835 1015073 1017118 1016562 991199 1005784
3030 1005784 1010027 982743 995228 992225 1030743 996550 1039630 1040852 1027089 1005416 1013350 1023291
3018 1023291 1040605 1063521 1068339 1065992 1086293 1093509 1107313 1132523 1147321 1169018 1161477 1190276
3006 1190276 1213299 1227431 1261350 1315418 1364862 1340580 1341064 1370751 1399108 1409462 1398695 1408467
2994 1408467 1407373 1396529 1373588 1377563 1386988 1336956 1321180 1310885 1320202 1391313 1366298 1350519
2982A350519k2188M8116M1672P660L7652N4969L4690N4868N3044R0658P4209L316
2970A829185l7669n7154p3384n3667m2295m6960o8581r1082l6081k9196n829k7998
2958A259289l0612l4504l8484O513p559k1219L3214k761q218j6383k635L8962
2946A175603m197K3423q642K598r685m3996j9755K1000k7504m4159m1308j282
2934A022096j0175m8311m4375j1886m5224j6639J3355j6380j7854o063J9949j5552
2922H22941l5131k8862j3799m051K155J6582k5288N593k7111k8286l2266j0566
2910F41911k2718m6157L514j5233O382Q809k9952L78l7472J3379q100j3078m29
2897E01234l1034J1044K3349J234k5648J0572j7m04m7067J9028k5100m635K928
$$ plain form
2982 1350519 1328331 1376447 1418119 1425779 1463431 1518400 1553090 1607958 1661002 1751660 1825869 1829185
2970 1829185 1791516 1734362 1660978 1607311 1565016 1518056 1449475 1358393 1322312 1293116 1287287 1259289
2958 1259289 1228677 1194173 1155689 1162202 1154643 1133424 1166638 1163877 1155659 1139276 1136641 1175603
2946 1175603 1171406 1194829 1186187 1188785 1179100 1135104 1115349 1136349 1108845 1064686 1023378 1022096
2934 1022096 1011921 963610 919235 907349 862125 845486 858841 842461 824607 818544 838493 822941
2922 822941 787810 758948 745149 741098 743253 759835 734547 740140 713029 684743 652477 641911
2910 641911 619193 573036 576550 561317 567699 576508 546556 546934 509462 522841 514741 501663 501234
2897 501234 470200 481244 504593 505827 480179 490751 490734 490330 443263 462291 437191 432556 435484
2884D35484l5753L0093J5554l1208j109k47l530j2266j9767k6013l361N3177j4268
2871C86786j7978J6692k3931P712o648q135j3495l0467l2422r676K9408M736k485
2858C00097k4579R008J9235J3855N990o207m2576l3109J3268M8964j5667l795
2846B84484j0993M734K949O645M0487k0523j4725k6789J0920L894J7617j8086
2834B80614K1898q341j7700j1297l5103j8390J2890L7999L5145M721l4987k0818
2822B46631j1755j6846J0524j5023J9308L8478J5151l5338J754o682k8273J0862
2810B28791J5766j4456k6041J0203j9346K5242J6730L2036k0458j4897m32l7716
2798A95422R196K0504j6347l5168J8171M554J5795j4031J2017P585L878J814k6134
$$ plain form
2884 435484 399731 429824 445378 414170 413061 412814 409284 397018 377251 351238 347877 401054 386786
2871 386786 368808 385500 361569 369281 362633 354498 341003 310536 278114 268438 297846 302582 300097
2858 300097 275518 284526 303761 317616 323606 317399 274823 241714 254982 303946 288279 284484
2846 284484 273491 278225 281174 287819 328306 307783 293058 266269 277189 281083 298700 280614
2834 280614 302512 294171 276471 265174 230071 211681 224571 262570 297715 302436 267449 246631
2822 246631 234876 218030 228554 213531 232839 271317 286468 251130 252884 246202 217929 228791
2810 228791 244557 230101 204060 214263 194917 220159 236889 268925 248467 233570 233138 195422
2798 195422 204618 225122 208775 173607 191778 196332 212127 198096 210113 217698 221576 223390 197256
2785A97256m6464M5778J2392k4720m947k997J6068o943k7387j3824K7502P029
2773A78743M481p512j4063j2855j4k235R12l503K6479k4946j8254K417K2856J7543
2759A70049j5543k0217L0947k0274J2712k7669J0627j6409j0461P845K881j876
2747A22612p133L1613J3805l2081q642K1555P272j9525j5451P336J4207o379Q591
2734A37780K4828n297L4878m8255j2151k0966J0365L2445k5459j1923o347k3231
2722H6667K6878m907J7406Q791m0185j2491Q502K8645r142o326J4476L5026j6776
2709A36564m587J7987J0246k6355k4479k694j028M6437k3843j266k4284R657M583
2696A16938Q815m495m6094N997J6391J2672J823j2350k685J2348J2549k2683L804
$$ plain form
2785 197256 150792 196570 208962 184242 179295 176298 192366 185423 158036 144212 171714 178743
2773 178743 183224 175712 161649 148794 148780 146545 147457 143954 170433 145487 127233 129650 152506 170049
2759 170049 154506 134289 165236 144962 157674 130005 140632 124223 113762 121607 124488 122612
2747 122612 115479 147092 160897 128816 120174 141729 149001 129476 114025 121361 135568 129189 137780
2734 137780 162608 157311 192189 143934 131783 110817 121182 153627 128168 116245 109898 86667
2722 86667 113545 108638 126044 134835 94650 82159 90661 119306 110164 103838 118314 153340 136564
2709 136564 131977 149964 160210 133855 109376 106682 105654 152091 128248 126982 102698 112355 116938
2696 116938 125753 121258 75164 81161 97552 110224 112047 99697 97012 109360 121909 99226 103030
2683A03030j7271J2143L5108k2049P007n186j6727m074K1326P826m7516k0517
2671E3100j681N3362k1063j0598j2163J1980K5137r371Q401k7638L335j7852K4960
2658G9909p218M181J4828O174j9467j4564K358M6822N813m5270J0604k6894j0223
2645D7053j82j238P2639m5715R271q632j0114J9740L2412j7206j7214N95k2229
2632E9180P905N660R24J0388k0495K3879k2397k6737K5751j5513N1492J846l1053
2619G0830K431J0903Q608l3561R383n170K4354Q58p500l0774j0407J7885J4214
2606G2054p699l346l3644O538l406K7047n901L334L0038k472M0791m8317J693
2593G6710n171j7416j1220L3020j163k3436J7169R632n9093M9576l209J3294j5722
$$ plain form
2683 103030 85759 97902 133010 110961 117968 112782 96055 91981 113307 121133 73617 53100
2671 53100 51419 104781 83718 73120 60957 72937 98074 88703 97104 69466 72801 54949 79909
2658 79909 72691 76872 91700 97874 78407 63843 66201 113023 118836 73566 84170 57276 47053
2645 47053 46871 45633 118272 72557 81828 73196 63082 82822 115234 98028 80814 81409 59180
2632 59180 67085 72745 73669 84057 63562 87441 65044 38307 64058 48545 100037 101883 70830
2619 70830 73261 84164 92772 59211 68594 63424 87778 88636 81136 50362 39955 57840 72054
2606 72054 64355 61009 27365 33903 30497 57544 51643 54977 85015 82543 123334 75017 76710
2593 76710 71539 54123 42903 75923 74760 51324 68493 78125 19032 68608 65399 78693 62971
2580F2971l734k1675K8143k8685J4597n259K9871M460l7868Q802r797P088n742
2567D3172J7471J3184m5336O875K697j1133Q763K1588k143j5949M429K790J5102
2554F1510j1731P961m643P91j400N763k5107j411Q665N978j4884K8533j5057J7526
2540F2494k1275j4576J022q484K1252k3363K368K1369j9094j2551K6019j3644
2528B1537M1235k2503j9145K1494j7190j9236k30L914K0484J1183m705J3994k0835
2515B9997j7864K2158k0483N1074l161m4471K6164O180j0681P207O738l7214J5167
2502C0811J4137j6695j877J472p363N341k1491J8519j314J277j739J8241j6899
2489B2420J360j9678L0219k903J882L6889j5285j7036j8595k6166j651J6687m834
$$ plain form
2580 62971 59237 37562 65705 37020 51617 46358 76229 80689 42821 51623 41826 48914 43172
2567 43172 60643 73827 28491 35366 38063 26930 35693 57281 55138 39189 43618 46408 61510
2554 61510 49779 57740 53097 53888 52488 58251 33144 31733 40398 46376 31492 60025 44968 62494
2540 62494 41219 26643 27665 19181 40433 17070 19438 40807 21713 9162 35181 21537
2528 21537 62772 40269 21124 42618 25428 6192 5962 9876 30360 41543 36838 50832 29997
2515 29997 12133 34291 13808 64882 61721 17250 43414 49594 38913 46120 52858 15644 30811
2502 30811 44948 28253 26376 27848 20485 25826 4335 22854 21540 22817 21078 39319 22420
2489 22420 23780 4102 34321 31418 33300 70189 54904 37868 19273 -6893 -8544 8143 3309
2476C309J4839O324j8706q342r907L3949j5851Q73L654K6392m77j7368J9503R749
2462D7941J5156j5930l1174l9959K2613K5247j3850J2753l2634k068M8387j0369
2450B6113l5109l8630J4145K9671K2603K1074m078J7127J59j5468m175J7209p542
2437D3099p872J3384k1644K9978j9095k5152J6651l237k5833J3411k8149q43L8101
2424B2799J8161m596j2015m872k7058K3864k51l3974L6178N923q477J4718j0493
2411A9907o852J2675K5586j4589J65j1555j1857l8070l200M3080J7389l8221Q627
2398C085K1182j6253J6282L938k0919j539K0209k3966k588l240K00N7010m930
2385D8471k5543j1778J8075k0868k9590K9662j666J1564j1111L8484j0036k4965
$$ plain form
2476 3309 18148 24472 5766 -2576 -12483 21466 5615 6488 10142 36534 36057 18689 38192 47941
2462 47941 63097 47167 15993 -23966 -1353 23894 10044 22797 -9837 -11905 36482 26113
2450 26113 -8996 -47626 -33481 -3810 18793 39867 35789 52916 53075 37607 33432 50641 43099
2437 43099 35227 48611 26967 56945 37850 12698 29349 26112 279 13690 -14459 -15302 22799
2424 22799 40960 36364 24349 19477 -7581 16283 16032 -17942 18236 24159 15682 30400 19907
2411 19907 13055 25730 51316 36727 36892 25337 13480 -24590 -27790 15290 32679 -5542 3085
2398 3085 24267 8014 24296 28234 7315 5776 25985 2019 -569 -3809 -3609 53401 48471
2385 48471 22928 11150 29225 8357 -21233 8429 6763 18327 7216 45700 35664 10699
2373A0699p789J3807k4122k4993J0037K5123j2920j8051L7914J2244l3744M3030
2361C1235q369j2129k9029J9652J6066p077K3857k9298l7489J2275L2665R60j573
2348A1746k534J8794n909l8717L9071p122j702J7440k5233O053J7237k6810K9701
2335C2015K385k1665j3060O248J0803K9478N807k6477M374l7163J6710j9243R051
2322g37J4746K7703l3897o374k3237L4735l651j0306M967k387l875r884J3049
2309H52L7746j415m2351N854J5151J0583j8674L876M657j6271j735J5693K9436
2296D3402j3184o1992K670K7170K4075j284j5644L144J908l333j1357n992q5J1638
2282A136J0028J1879O914j6060l9300K6659L312O12K265j2025J5226Q460m871
$$ plain form
2373 10699 2910 16717 -7405 -32398 -22361 2762 -10158 -28209 9705 21949 -11795 31235
2361 31235 22866 10737 -18292 1360 17426 10349 34206 4908 -32581 -20306 12359 13319 11746
2348 11746 9212 28006 22097 -16620 22451 15329 13627 31067 5834 11887 29124 2314 32015
2335 32015 34400 12735 -325 5923 16726 46204 52011 25534 29908 -7255 9455 -9788 -737
2322 -737 14009 41712 7815 1441 -21796 12939 9288 -1018 3949 1562 -2313 -12197 852
2309 852 38598 37183 -5168 686 15837 26420 7746 11622 16279 8 -1727 13966 43402
2296 43402 30218 -31774 -29104 -1934 22141 20857 5213 8357 10265 6932 -4425 -10417 -10502 1136
2282 1136 11164 23043 29957 13897 -25403 1256 4568 5180 7445 -4580 10646 19106 14235
2269A4235L3657J2855M621l810j3621o824l312j6189K524K2061J8423J2166K5138
2256A01924N80k7502J960p880J632O84L3768l3765K4769K2712l2456p216P827
2243H7037K7780q702k464M066p05J5613m703R897J0742Q167K1464j5630k8405
2230A24157j0362L3424K0349k6652L604K6730p96K440K1698L5363J1864k837l2346
2217B06636k5110M1480J140J7522K1444k2865n697K0084O382K7552K0307J558
2205C10433M170L767K8566M493m554Q400q842J7003M7906M4076J9485L3368M2369
2192E50640O2046R2457N5501K5718N7179R9874Q6425R8205J23661J14947J99119
2181A565772K40628K92766M34740N06170O59842O34567K00681m27132p11503o56315
$$ plain form
2269 14235 47892 60747 65368 61558 47937 41113 37801 21612 24136 46197 64620 76786 101924
2256 101924 102504 75002 76962 69082 70714 71398 105166 71401 96170 118882 86426 79210 87037
2243 87037 114817 106115 103651 107717 107012 122625 117922 127819 138561 146728 168192 152562 124157
2230 124157 113795 147219 167568 140916 144520 171250 170454 172894 194592 229955 241819 238982 206636
2217 206636 181526 223006 224146 241668 263112 240247 234550 254634 261016 288568 308875 310433
2205 310433 314603 318370 346936 351429 346875 355275 346433 363436 411342 455418 474903 508271 550640
2192 550640 612686 705143 760644 786362 843541 943415 1029840 1128045 1251706 1366653 1565772
2181 1565772 1806400 2099166 2533906 3040076 3699918 4334485 4535166 4108034 3396531 2740216
2171B740216m76648l21691k90723l03950j92793j12386j07212j27032o2472l7608
2161G07701m3502l8293n3014o5933q0086j9988k3080L607k7659k3120n2223q819
2149B75591k5851K236l2003j4342J1519m3690q416M56R27J0230J9703k2194j8253
2136A55913P619j6570p246L986k2393o179K7982k8812k7885K9593P065m336l4593
2123H4144R796j4648K7913J6262k7369j7344L516M846n583j5086m719J8330l9001
2110D1057J434J181k6072J5745O770q518J3178l0108J4573K0161k6132j7540K2355
2097B8084L6378Q343l8941j2287m1725k212J9121O83M817K294j2460j0636Q173
2084a0368j1149l94J9995m191J3661M22o607J1716N793N0284j3142l2242k1959
$$ plain form
2171 2740216 2263568 1941877 1651154 1347204 1154411 1042025 934813 807781 745309 707701
2161 707701 664199 625906 572892 506959 426873 406885 383805 387412 359753 336633 284410 275591
2149 275591 249740 251976 219973 205631 217150 173460 165044 165500 166427 176657 196360 174166 155913
2136 155913 163532 146962 139716 143702 121309 115130 143112 114300 86415 116008 123073 118737 84144
2123 84144 93940 79292 107205 123467 96098 78754 82270 87116 81533 66447 61728 80058 41057
2110 41057 42491 43672 17600 33345 40115 31597 44775 14667 29240 49401 23269 5729 28084
2097 28084 64462 72805 33864 21577 -20148 -22360 -3239 -2556 2261 4555 -7905 -18541 -10368
2084 -10368 -21517 -21911 -1916 -6107 7554 7976 1369 13085 18878 69162 56020 23778 1819
2071A819l866K470m91J5879p838r303K3970j8248J0753K2488k1681k5002j6268
2058b5318M782R027L0194k377m14j193j2337q39J2492o025k8550R986J5350k2446
2044a7668R208p323k4442J2837K0285J7299L4542l9262n0828L2869J141p600l4015
2031e2957k2018L4767M7187j0322J0309l0227J298k703r150j4709j466j6098J284
2018f4805M0657J2219m0580J5518j595J1617k571k5257K0756J7981J9265l7382
2006c4177M918j5546r253K0782p697o856J8698l844j4709J4339k3144P263j9155
1993f8381M755O0527j5638r075L98M026J3248j03j5697k105K0021q575j431k7647
1979d5677k3265K3601j0512o495N062r289j8970J9532J7047k945k4121J587n20
$$ plain form
2071 1819 -2047 423 -68 15811 7973 -1330 22640 4392 15145 37633 15952 -9050 -25318
2058 -25318 -20536 -11509 18685 16308 15894 14701 2364 1525 14017 7992 -20558 -10572 4778 -17668
2044 -17668 -8460 -15783 -40225 -27388 -7103 10196 44738 5476 -45352 -12483 -11342 -18942 -52957
2031 -52957 -74975 -40208 6979 -3343 6966 -23261 -21963 -24666 -33816 -48525 -49991 -66089 -64805
2018 -64805 -24148 -11929 -52509 -36991 -38586 -26969 -29540 -54797 -34041 -16060 3205 -34177
2006 -34177 -29259 -44805 -54058 -33276 -40973 -47829 -29131 -32975 -47684 -33345 -56489 -49226 -68381
1993 -68381 -63626 -3099 -18737 -27812 -27414 -23388 -10140 -10243 -25940 -28045 -8024 -16599 -18030 -45677
1979 -45677 -68942 -45341 -55853 -62348 -57286 -66575 -85545 -66013 -48966 -51911 -76032 -74445 -74965
1966g4965L483J1512j413K8785R923j3112R217P157O025j6766q267J7666J4679
1953f076p133o277j6409j1443K522J2872J2831l1053O328R398L615j0477m4047
1940h5349M4503J7381r53J558L475M055p971J2721J3081j4357J1497p164n273
1927a2796j0448j7999j0017K3406N38J2595J5463r385J4829J4597o901j4920j6226
1914a7264j8521L3968J2373n232j0505J797K6793j1009P099o073l9302k9623l881
1901e9380L3310N0650k4409m0376L5401P648L8568k9256K9849j1068l1548j8700
1889a9311n701J5940Q122j6749l696J5852J5054j1374j0646K854K5395q444k4312
1876a7016R391l8242j8578p270J5516l196j0915n468K0126N7398J7785k5578q494
$$ plain form
1966 -74965 -71482 -59970 -61383 -32598 -22675 -35787 -26570 -19413 -13388 -30154 -38421 -20755 -6076
1953 -6076 -13209 -19486 -35895 -47338 -44816 -31944 -19113 -50166 -43838 -34440 -30825 -41302 -85349
1940 -85349 -40846 -23465 -24418 -22860 -19385 -15330 -23301 -10580 2501 -11856 -359 -7523 -12796
1927 -12796 -23244 -41243 -51260 -27854 -27316 -14721 742 -8643 6186 20783 13882 -1038 -17264
1914 -17264 -35785 -1817 10556 5324 -5181 -3384 23409 12400 19499 13426 -25876 -55499 -59380
1901 -59380 -26070 24580 171 -40205 -4804 2844 41412 12156 42005 30937 -611 -19311
1889 -19311 -25012 -9072 -950 -17699 -21395 -5543 9511 -1863 -12509 -9655 15740 7296 -17016
1876 -17016 -7625 -45867 -64445 -71715 -56199 -59395 -70310 -75778 -55652 1746 19531 -6047 -14541
1863a4541k9965M3815l9549L811L2454L126P560j9620m3287M2724K4122o8683
1851e8033n155L2387Q170K973m9033N189N782K7071K2010J526k09k5349j791K252
1837c2210J3113l4502Q183l169K7516j2092j7957Q891J4075r487L4655j4542K0822
1824C296k4138j9440k1596M558J8551j0430K0383J0091k972M572k2331K6468J7692
1811D704m214r60m3964k459j6416L8977J0164m3690J2827K008j5427J3864J9658
1798b4928J2481j0241J9549N93j5447l8979N182K9458L1090l1753K287j7117J8029
1785a9796L1459K9047j9728m6737k0122o806M0354p641j5828k0215L1924J9020
1773e069p656k1634n1277J0146K0031J0333j0131J0942P330J3949l2674n946M5141
$$ plain form
1863 -14541 -44506 -691 -40240 -36429 -3975 -849 6711 -12909 -56196 -13472 10650 -58033
1851 -58033 -63188 -30801 -22631 -19658 -68691 -63502 -57720 -30649 -8639 -7113 -7322 -32671 -34462 -32210
1837 -32210 -19097 -53599 -45416 -48585 -21069 -33161 -51118 -42227 -28152 -37639 -2984 -17526 3296
1824 3296 -20842 -40282 -61878 -57320 -38769 -49199 -28816 -18725 -21697 -17125 -39456 -12988 4704
1811 4704 490 -470 -44434 -46893 -63309 -24332 -14168 -57858 -45031 -43023 -58450 -44586 -24928
1798 -24928 -12447 -22688 -3139 -2546 -17993 -56972 -51790 -22332 8758 -22995 -20708 -37825 -19796
1785 -19796 11663 40710 20982 -25755 -45877 -52683 -12329 -19970 -35798 -56013 -24089 -5069
1773 -5069 -12725 -34359 -85636 -75490 -55459 -45126 -55257 -44315 -36985 -23036 -55710 -61656 -16515
1760a6515j5321K3637l7399J0478K215R82O002o572j7498J8581Q851j9282l715
1747d5556J2844L71k9050P893k054o702n475K451J6984O051p033k145M4268k4063
1733c1216m6266k22J8227K7190j6269r777k2992L5598J2900P477q160l1527J4531
1720e0506J0308M450J8331P244k8876L040p132j478j5008K6642j2066J698K1692
1707b1661l62L2400n777k4702K9765j4722o265k9543N917K434q034K6961j275
1694a4864j3561K3868K1990j7480j0341k2668M1251k6843l596K1460O039o46j7356
1681a2747j4162j1310R26R954P800k4607J5482K1679k8585M2190J1450k6083J0783
1668B770k7722j405n537q465K429l372J8095k9014R314P363P107J7131K1401l6677
$$ plain form
1760 -16515 -31836 -8199 -45598 -35120 -32905 -31923 -25921 -32493 -49991 -31410 -22559 -41841 -45556
1747 -45556 -32712 -32341 -61391 -53498 -55552 -62254 -67729 -65278 -48294 -42243 -49276 -51421 -7153 -31216
1733 -31216 -77482 -77704 -59477 -32287 -48556 -58333 -81325 -45727 -32827 -25350 -33510 -65037 -50506
1720 -50506 -40198 -35748 -17417 -10173 -39049 -36009 -43141 -44619 -59627 -32985 -45051 -43353 -21661
1707 -21661 -22023 10377 4600 -20102 9663 -5059 -11324 -40867 -34950 -32516 -40550 -13589 -14864
1694 -14864 -28425 -4557 17433 -47 -10388 -33056 8195 -18648 -22244 -784 5255 4609 -12747
1681 -12747 -26909 -38219 -37293 -27339 -19539 -44146 -28664 -6985 -35570 6620 18070 -8013 2770
1668 2770 -24952 -26357 -31894 -40359 -37930 -41302 -23207 -52221 -42907 -35544 -28437 -11306 10095 -26582
1654b6582k9039J5044J6047j0770K3668m0238J4386J9699j8118r581K5093m51
1642b0842j2608K6578K692j4121j789j1999L2050l934l0197q225M764J2192j1384
1629c6823M238K7916j0905K96r109O749K387j7609L8637k5222k1155J9267r625
1616c0958j6475L5708L401J1866j0955p864k3001J4528J3335l4515K1063o721
1604c0588j4219L0920L650J295L3K9901j2070q478k5618N490P227q878k206J4261
1590i280J5617j7058k6643Q153O253o612R500J7254k8325J2937j3532Q62k566
1577c3440l5L2529j653m3138Q159L704l3178L4442J2320j0236J523l1751K7459
1564c3295K5507j3524q700L397j1425J6281j489m837Q068j2485J1790J1710j7298
$$ plain form
1654 -26582 -55621 -40577 -24530 -35300 -11632 -51870 -37484 -17785 -35903 -45484 -20391 -20842
1642 -20842 -33450 -6872 -4180 -18301 -20090 -32089 -39 -3973 -34170 -42395 -37631 -25439 -36823
1629 -36823 -32585 -4669 -15574 -15278 -24387 -17638 -15251 -32860 5777 -19445 -40600 -21333 -30958
1616 -30958 -47433 -11725 -8324 3542 -7413 -15277 -38278 -23750 -10415 -44930 -23867 -30588
1604 -30588 -44807 -13887 -10237 -8942 -8909 20992 8922 444 -25174 -19684 -12457 -21335 -23541 -9280
1590 -9280 6337 -10721 -37364 -29211 -22958 -29570 -20070 -2816 -31141 -18204 -31736 -30874 -33440
1577 -33440 -33475 -946 -2599 -45737 -37578 -33874 -67052 -32610 -20290 -30526 -29003 -60754 -33295
1564 -33295 -7788 -21312 -30012 -26615 -38040 -21759 -23248 -28085 -20017 -32502 -20712 -9002 -26300
1551b6300r555j1941J5392k1579p207j924k1993M0460J5007k2111L393J5880k3368
1538e5846J3745J7454N521J6598n220l5331K9143k5433J3464O214l308l290K0692
1525e597q988j0450J4327p027j1148M43J9808j0929p103N01q850q026l672K0944
1511b5767J0046n198P854K3252j3518L802o128n5120K4557K2445m1099J2748K0566
1498b1560J0167j6900q451J1834J0768j2359L562L3594J7198j1690r929J2567
1486A8801M980k0196j0895k4122j6986M1855K3839O138M076o066k6882N317j6674
1473a6815j1267R066j8232O495N935k6770J4131Q765l251j6868K83M0672j31j7965
1459b5952P71L236l8356J2044k2827K864L0774j2348q706j9467L4249R347j9859
$$ plain form
1551 -26300 -35855 -47796 -32404 -53983 -61190 -63114 -85107 -44647 -29640 -51751 -48358 -32478 -55846
1538 -55846 -42101 -24647 -19126 -2528 -7748 -43079 -13936 -39369 -25905 -19691 -22999 -26289 -5597
1525 -5597 -14585 -25035 -10708 -17735 -28883 -28440 -8632 -19561 -26664 -26163 -35013 -43039 -46711 -25767
1511 -25767 -15721 -20919 -13065 10187 -3331 471 -5657 -60777 -36220 -13775 -54874 -42126 -21560
1498 -21560 -11393 -28293 -36744 -24910 -14142 -26501 -22939 10655 27853 16163 6234 18801
1486 18801 23781 3585 -7310 -31432 -48418 -6563 17276 23414 27490 21424 -5458 -141 -16815
1473 -16815 -28082 -19016 -37248 -30753 -24818 -51588 -37457 -28692 -31943 -48811 -48528 -7856 -7987 -25952
1459 -25952 -25181 -21945 -60301 -48257 -71084 -68220 -37446 -49794 -58500 -77967 -43718 -34371 -54230
1446e4230K1554L7631p975l1857j9848k2751l765L0035J2347o738R502o723l0346
1433g3164L4562L6450k6656m0500Q729O737L631K381K1877N224r212L027j082
1420b7996j1956k0955O4493P010k5076k3515R638j1307l4617N177K5330O790J881
1407c5103K6782l0508l903J862M1882m176j6910n626j411L0348K410m099l0323
1394b8775J3893j7807J2938L9816l3931K576k745N39Q128J2135J7472k6452p315
1381i528n527j5693l32L0597l1985K0726n054j4331j1974O612L7649o546o52j6026
1367b2064j235k9291N370K43J1000K9347L301n4076o943L0385M2812p0718J6443
1354d5426M7884j9734k4407J777L400K0714K9741m5594J0911J3064j7372Q169
$$ plain form
1446 -54230 -32676 4955 -3020 -34877 -54725 -77476 -81241 -51206 -38859 -45597 -36095 -42818 -73164
1433 -73164 -38602 -2152 -28808 -69308 -60579 -53842 -50211 -47830 -25953 -20729 -29941 -26914 -27996
1420 -27996 -39952 -60907 3586 10596 -14480 -37995 -28357 -39664 -74281 -69104 -43774 -36984 -35103
1407 -35103 -8321 -38829 -42732 -40870 1012 -3164 -20074 -25700 -27111 3237 5647 1548 -28775
1394 -28775 -14882 -32689 -19751 20065 -13866 -11290 -14035 -13496 -5368 6767 24239 -2213 -9528
1381 -9528 -15055 -30748 -31080 -483 -32468 -11742 -16796 -31127 -43101 -36489 1160 -5386 -6038 -22064
1367 -22064 -23299 -52590 -47220 -46977 -35977 -6630 -3329 -57405 -64348 -33963 8849 -61869 -45426
1354 -45426 2458 -17276 -41683 -39906 -36506 -15792 13949 -31645 -20734 -7670 -25042 -16873
1342a6873K0571m2573L8856J1529K763k834J200j1623l556j567j4700k4644Q545
1329c4906L2328K251K2010m2201l6293l541O1112J7882k1386k5776J8047o413
1317a6886j194K1298j315j3278K2704o135m0325J3690n250o02J4926K8531j8703
1304b539q219q889K08j2681j2197O588J588J9136j2395m171J2272J7949q716J2838
1290G72k4619l0185J8205J879O185r1j3248J6384K1970J1028r936l391j3066K2745
1276D632l65q181j2651l245k8805j4982K4476k846L3245m7106L4690J9015m4754
1263d6877L5941k880j0131k03R760K3467k2245j294r547K3216j4245p585J7596
1250e027Q189L872J392K2191j567j6152r280l572N088J7904m753J4511l984j1812
$$ plain form
1342 -16873 3698 -38875 -19 11510 14273 11439 12639 1016 -2540 -4107 -18807 -43451 -34906
1329 -34906 -2578 -327 21683 -20518 -56811 -60352 760 18642 -2744 -28520 -10473 -16886
1317 -16886 -18080 3218 1903 -11375 11329 5194 -35131 -21441 -26691 -27293 -12367 16164 -2539
1304 -2539 -10758 -19647 -19439 -32120 -44317 -37729 -36141 -17005 -29400 -33571 -21299 -3350 -12066 772
1290 772 -23847 -54032 -35827 -33948 -27763 -27854 -41102 -24718 -2748 8280 -1656 -5047 -18113 4632
1276 4632 4267 -3914 -16565 -19810 -48615 -63597 -39121 -41967 -8722 -55828 -21138 -2123 -46877
1263 -46877 -10936 -13816 -23947 -24150 -14390 9077 -13168 -14462 -24009 -793 -15038 -22623 -5027
1250 -5027 3162 7034 8426 30617 29050 12898 3618 46 5134 23038 18285 32796 28812 17000
1236A7000k9025k4448q959J287K4033K280J9785k2411K4362j2145q077q122o749
1223c1189K6503Q979M318j7059j439J1161k5591J6441M618j7749J5254K1717k3052
1210g088R544L334K1554j4320o54J931k1654m3134J9484K1804k997k3947o941
1197d3084l712p547K1298K5214j229k5995K1039K2931L480j0371R036J6270j9377
1184G953m2236M5390k5739Q334k4L2774k0611n0147K62L7299l0879J6734J7582
1171c308Q893m0282J5230K9917R605J8897l2630l4194j2084J77J2109j9663J8195
1158b9138O344j5529N954Q873Q901o828j065L4360J7868l9419k1082l1228M465
1145e7524n544M8329j3347p602K8901J01J5142n512j1206N179J1797J898j0032
$$ plain form
1236 17000 -12025 -36473 -45432 -44145 -20112 -17832 1953 -20458 3904 -8241 -16318 -24440 -31189
1223 -31189 -4686 4293 8611 -8448 -9887 1274 -24317 -7876 -3258 -21007 -5753 15964 -7088
1210 -7088 2456 5790 27344 13024 12370 14301 -7353 -50487 -31003 -9199 -12196 -36143 -43084
1197 -43084 -46796 -54343 -33045 -7831 -9060 -35055 -14016 8915 12395 2024 11060 27330 7953
1184 7953 -34283 11107 -14632 -6298 -6322 26452 5841 -44306 -44044 -6745 -37624 -20890 -3308
1171 -3308 5585 -34697 -19467 10450 20055 38952 6322 -27872 -39956 -39779 -27670 -47333 -29138
1158 -29138 -22794 -38323 -32369 -23496 -14595 -21423 -22488 11872 29740 -9679 -30761 -61989 -57524
1145 -57524 -63068 -14739 -28086 -35688 -6787 -6686 8456 2944 -8262 -3083 8714 10612 580
1132E80L455P839p108m4K690O513j0575n409j7027k8061K853J4176j7887J6847
1118c1158J0703M92n037k7457O551J5916o54K0404j1117n10j6416M762p315J0645
1104c0191Q11J1819J2805k4813O078j8381K314k195K0169l0470J0300m242J4426
1091c1570j7364N1201L890j7135J965j4061o817J4476J7090j969J562N6362o8406
1078a0776n1669L6291n312K204J4064o853K092R800L443K1284r510L75k0997k386
1064a7950r394L138K6537Q525j7712J3741j5024n1411J0081l385R220N0839k1673
1051a4468j4730J0588J4807R437j2053j1047J6804j6622M434j6255J910N636j268
1038b2827L4105J0462l1113m939J2518K7845j2250l3778m608l914j3498L0813
$$ plain form
1132 580 4035 11874 4766 4722 7412 13925 3350 -2059 -19086 -47147 -44294 -30118 -48005 -31158
1118 -31158 -20455 -19963 -25000 -52457 -45906 -29990 -30644 -10240 -21357 -21867 -38283 -33521 -40836 -30191
1104 -30191 -29380 -17561 -4756 -29569 -23491 -41872 -39558 -41753 -21584 -52054 -41754 -45996 -31570
1091 -31570 -48934 2267 6157 -10978 -9013 -23074 -29891 -15415 1675 -294 1268 57630 -10776
1078 -10776 -62445 -26154 -31466 -29262 -15198 -22051 -19959 -10159 -6716 14568 5058 5433 -15564 -17950
1064 -17950 -27344 -24206 2331 10856 -6856 6885 -8139 -59550 -49469 -52854 -43634 7205 -14468
1051 -14468 -29198 -18610 -3803 5634 -6419 -17466 -662 -17284 -12850 -29105 -27195 -21559 -22827
1038 -22827 11278 21740 -9373 -14312 -1794 26051 13801 -19977 -24585 -28499 -41997 -11184
1026a1184k8963j9418N3497J1520N600j3571J9004K247K448O818j2829k0929j3833
1013a9593K7814k3027n116N475l975K0075M581k0942J6117r622l845j3441O1L8175
999A2737J2412j0436q895L0467j8009l73k3599K8456k5026r083K8974L316k8953
986h012J9111K5570k0633l9793k255R584l686J6202K9673j6952r205r033O821
973b608M037j8936j0888K8266J9797j1896k6837o955J6987k1869K9532K0725j2944
960F411k8023L0588k920n917J867K6119J897j09j3656q25j6389J6421J4544k3584
946F424p79j04r431j807k454L4796j3041j8056n174M962R917K1133j923k243J3799
931C6019l1214k4209J1793j299K4316O944q179n136m4427O794p498R598K0014
$$ plain form
1026 -11184 -40147 -59565 -6068 5452 11052 -2519 16485 18732 21180 27998 15169 -5760 -19593
1013 -19593 8221 -14806 -19922 -14447 -18422 1653 6234 -14708 1409 -8213 -12058 -25499 -25438 12737
999 12737 25149 14713 5818 36285 18276 17903 -5696 22760 -2266 -11349 17625 20941 -8012
986 -8012 11099 36669 16036 -23757 -26012 -16428 -20114 -3912 25761 8809 -396 -9429 -2608
973 -2608 1429 -17507 -28395 -129 19668 7772 -19065 -26020 -9033 -30902 -1370 19355 6411
960 6411 -21612 8976 6056 139 2006 28125 30022 29913 16257 15432 -957 15464 30008 6424
946 6424 5645 5541 -3890 -5697 -8151 26645 13604 -4452 -9626 -4664 5253 26386 24463 22220 36019
931 36019 4805 -19404 -7611 -8910 15406 22350 14171 9035 -35392 -28598 -36096 -26498 -6484
918f484j0836N063j5556J6252N5614K8944j5436o6584N63P873O280J4031k9159
905i435r888N4461l2315O923J0825k1423o735J4519J4964j489o9817K8846M4535
892B3971j090J3329j3247r727p998j3132j6339L3165k2495O075Q280l148M8471
879D6115k17k0637j4884k5109m7292N7716J6491n4897r774M0120p617p297Q637
866a8645J218J8660j7837L8367q77m8894M1058L137l5233M8225N070l4141O880
853F988K3035l3721K5790L737k2454j9630J920L9455j9877j8606L9133k1006P886
840A2650j8108K808K0852k4106k6504L5142N251J8765J0653m037k6575J2378k036
827A7133L661O708k9077M2776j6822O516J1512k2406O734Q660K018k3911k280
$$ plain form
918 -6484 -17320 -12257 -27813 -11561 44053 72997 57561 -9023 -8460 -587 5693 19724 -9435
905 -9435 -19323 35138 2823 9746 20571 -852 -7587 6932 21896 20407 -49410 -20564 23971
892 23971 22881 36210 22963 13236 5238 -7894 -24233 8932 -13563 -7488 792 -2356 46115
879 46115 45898 25261 10377 -14732 -62024 -4308 12183 -42714 -52488 -12368 -19985 -27282 -18645
866 -18645 -17427 1233 -16604 21763 20886 -28008 13050 16187 -19046 29179 34249 108 6988
853 6988 30023 -3698 22092 25829 3375 -16255 -14335 25120 5243 -13363 25770 4764 12650
840 12650 -5458 -2650 18202 -5904 -32408 2734 7985 26750 37403 33366 6791 19169 17133
827 17133 20794 27502 -1575 41201 24379 30895 42407 20001 26735 35395 37413 13502 11222
814A1222M2254k3999l4678K203j5533O325J7090l2476Q669R710k3794K2234L7253
801B6480K1536k3681k2892K0726N933J0654J218K101P90J7033n1191j8780J3752
788C679J085l0479J0770M978k1911L2620K7015j4982K642O159m074o176J0861
775B2187J2452O925l3042m588m394J3875M1028l6614J3544q336j948k7466r493
762a5870J3335k6246J8970o292J2878q851J5869L2541l1432k5955j2570K0259
750a3364K656J5774M190k019J7733k4286N2016n867n3215Q450n056j4584K31J3222
736d119Q615l424Q087P733p235K4615N032l2624k505Q195N576r210J7007L751
722B9494k317n563k8310P718l2406k478R557J4510l035L8692n378k4983L5816
$$ plain form
814 11222 53476 29477 -5201 -2998 -18531 -12206 4884 -27592 -18923 -9213 -33007 -10773 26480
801 26480 48016 24335 1443 22169 28102 38756 39974 42075 42865 59898 8707 -10073 3679
788 3679 4764 -25715 -14945 -9967 -31878 742 27757 12775 15417 21576 17502 11326 22187
775 22187 34639 41564 8522 3934 -460 13415 54443 17829 31373 23037 21089 -6377 -15870
762 -15870 -2535 -28781 -9811 -16103 -3225 -12076 3793 36334 4902 -21053 -33623 -13364
750 -13364 -10708 5066 9256 7237 24970 684 52700 46833 -6382 2068 -2988 -17572 -17341 -4119
736 -4119 4496 1072 9159 16892 9657 34272 39304 6680 4175 12370 17946 8736 25743 29494
722 29494 27177 21614 -6696 1022 -31384 -33862 -24305 -9795 -12830 25862 20484 -4499 31317
709C1317R158j3876L2652l034l9528k021J0201j2588J4491l3613q771J6337r062
696h337n551n5K7620R432K1055r579L359j5395l238j8599J4332k4292m5324L0041
682b4531J2642J1804J9470J35J128J4758k9851l2546O489L1270N087J0963q651
669A8167j4372P140j8598P914J887l2771j5741j2497J4502K1726L0157L6261R111
656E2886m3922k8328J7588L723q194K2081K6403k1372k8165M8119j5912k69J8244
643D2882j173N582j2252j8138l7772J6992r914K9714L0003n3098q850J7601o4607
630f3030J3117L4719J6792K8424j2257j4772K6538r09k81k2068l15J0768M745
617B1471J4145n6978j6372L6714K379L0847J5256j8303L067K1835r742l693j7796
$$ plain form
709 31317 40475 26599 59251 56217 16689 14668 24869 12281 26772 -6841 -15612 725 -8337
696 -8337 -13888 -13943 13677 23109 44164 34585 37944 22549 19311 712 15044 -9248 -54572 -24531
682 -24531 -11889 -85 19385 19520 20648 35406 5555 -26991 -20502 10768 15855 26818 18167
669 18167 3795 10935 -7663 251 2138 -30633 -46374 -58871 -44369 -22643 7514 43775 52886
656 52886 8964 -19364 -1776 1947 -6247 15834 42237 20865 -7300 40819 24907 24638 42882
643 42882 41709 47291 35039 16901 -20871 -3879 -13793 15921 45924 -7174 -16024 1577 -63030
630 -63030 -49913 -15194 1598 30022 17765 2993 29531 28622 28341 6273 5958 16726 21471
617 21471 35616 -21362 -37734 -1020 1359 32206 47462 29159 32226 54061 44319 40626 22830
604B2830l129k0855J7763N84J059j335k1823L7365K8489R210n5383M0161K2733
591G7669l1917K3572k5893k8026K6939k9251J0448j033J7315j2233J0757n481
579C2866k5532m093K6927l4221J0080Q034j7237J5125j1760L6100o67M0028m223
566G1427n809l2084j2822r455M842J9315J427j4659m268j1792J933K7763K6597
553F2415j6668J8221k6453k2922K9315j22K311L738L5615p3219k9034j4096J8607
540a2292J6786J3143m44J8835K029k8118j0937j8556K0290N514j164J6497O70
527B2253J1858K3280j5384r296j7714L115R184j1729j9598K9963J2678k2502J9376
514C5484k5024J72J9152j3164L1052q294J2856j2212k9674j6318K7778j3555l6531
$$ plain form
604 22830 19701 -1154 16609 17193 18252 16917 -4906 32459 60948 70158 14775 54936 77669
591 77669 45752 69324 43431 15405 42344 13093 23541 22508 39823 27590 38347 32866
579 32866 7334 3241 30168 -4053 6027 14061 -3176 11949 189 36289 35622 75650 71427
566 71427 65618 33534 20712 11257 16099 35414 36841 22182 17914 6122 8055 35818 62415
553 62415 45747 63968 37515 14593 43908 43786 46097 49835 85450 12231 -16803 -30899 -12292
540 -12292 4494 17637 17193 36028 38057 9939 -998 -19554 736 6250 5086 21583 22253
527 22253 34111 57391 42007 32711 14997 18112 27296 15567 -4031 25932 38610 16108 35484
514 35484 10460 10632 29784 16620 47672 39378 52234 40022 10348 -5970 21808 8253 -28278
501b8278J6856K6666m471k4468l651K4378J1398J2758J7822p962j7197j4657k8442
488a9248L7993J7053Q043j9191j5018L2657l2301R571O471O869N23m640j3053
475A5729m488K6371J1173j8952l849k5858L1533O91j893n421J9441K6119m3835
462B6761p440K2656q386J3244p37K7221l7241j1282K2755k9849k693K700K8289
449D5998q654P384n702K445o947J5993J4635j0690j5476M295J1030l6899j1031
436F381N3903J3044o422k1819L25L285n275l5307N509J0731k288K6020J2121M90
422F0698l4954J6151k1541k6889p156J2425K2471J3056k7351j517L3380l1201
410G572J4828L7802j9507O43p067J2105J5422J5001j9946r603K0491l2350k6779
$$ plain form
501 -28278 -11422 15244 10773 -13695 -17346 7032 18430 31188 49010 41048 23851 9194 -19248
488 -19248 18745 35798 43841 24650 9632 42289 9988 19559 26030 32899 33422 28782 15729
475 15729 11241 37612 48785 29833 25984 126 31659 32350 30457 25036 44477 70596 26761
462 26761 19321 41977 33591 46835 46098 73319 36078 24796 47551 17702 15009 17709 45998
449 45998 37344 44728 39026 41471 34524 50517 65152 54462 38986 43281 54311 17412 6381
436 6381 60284 73328 66906 45087 45412 48697 43422 8115 13624 24355 22067 48087 60208 60698
422 60698 25744 41895 20354 -6535 -13691 -1266 21205 34261 6910 5393 38773 7572
410 7572 22400 60202 40695 41338 34271 46376 61798 76799 56853 47250 67741 35391 8612
397H612N717o853j0481j3359L5893j8179q484K0095J4302Q817J0808J6418k6232
384C7074J7998J0662p147j1622n724l9295R796M5656N937p920j8292R463J5156
371F1742j0043k0608J4176K5497k060l942k0489k145l919q116j6636K2515P584
358D3556J4609j990j15k5370k5401L0792Q930r70k0047j0419K1744q520K6977
345E3776J6298j7418k9235L6500K914k4975P242M926k107r257J0687P542j1122
332D5771Q335J955m422J919j9223j0399P118p043L2228p934j8010J7653L2662
319H0610j7746k2465N015J6427K1889n9297m87l014n1M1681K3802j2932l0964
306D2468o029J992k983J7333m678J3786k2809k544N374j5935L4737L8923l3963
$$ plain form
397 8612 14329 7476 -3005 -16364 19529 1350 -7134 12961 27263 36080 46888 63306 37074
384 37074 55072 65734 58587 46965 41241 1946 11742 57398 63335 55415 37123 46586 61742
371 61742 51699 31091 45267 70764 68704 64762 44273 42128 38209 30093 13457 35972 43556
358 43556 58165 56175 56060 30690 5289 36081 45011 44041 23994 13575 35319 26799 53776
345 53776 70074 52656 23421 59921 62835 37860 45102 50028 47921 38664 49351 56893 45771
332 45771 54106 56061 51639 53558 34335 23936 31054 24011 56239 48305 30295 47948 80610
319 80610 62864 40399 45414 61841 83730 24433 23946 20932 20881 62562 86364 73432 42468
306 42468 36439 38431 35448 52781 48103 61889 39080 36536 41910 25975 60712 99635 65672
293F5672k2071j3906K2209j9803n472j8260L449K475P683k0800N313m112N3849
280E6226J1837q248l9474j3974N5458j0050j7225L5586k0225j7986M0375j0876
268F1424l1075R26R421L081K0418p304l424k3677L2764K1290J4424l7975k8105
255C2188j7750J7558M5377k6766M59O626k8250Q442r548m358q79O792j5215l65
241A4311L1104K4041M971M041j6708j3311J7154L1420m9687R644q348Q299l1205
228B5726k5184J8287J332K2261M956o480j8037K7319L5149k6032L794l0006O743
215C9828K8200k6837j9863R521J9416L4734j3849k0420K007L042k5181j2520q043
202A0035J5860K8941o645N728J551j2301j4852L6856m4678m324M5650P725p382
$$ plain form
293 65672 43601 29695 51904 32101 26629 8369 11818 14293 21976 1176 6489 2377 56226
280 56226 68063 59815 20341 6367 61825 51775 34550 70136 49911 31925 72300 61424
268 61424 30349 31275 40696 43777 64195 56891 53467 29790 62554 83844 98268 60293 32188
255 32188 14438 31996 77373 50607 51066 57692 29442 37884 28336 23978 23099 29891 14676 14311
241 14311 45415 69456 74427 78468 61760 48449 65603 97023 47336 56980 48632 56931 25726
228 25726 542 18829 20161 42422 47378 40898 22861 50180 85329 59297 63091 33085 39828
215 39828 68028 41191 21328 30849 50265 84999 71150 50730 52737 55779 30598 18078 10035
202 10035 25895 54836 48191 53919 55470 43169 28317 65173 20495 16171 61821 69546 62164
189F2164k1875Q881l692P570J6709j2004L1630j4981M405n8764O998J6091K3727
176F6859K0942j8409k4648L456J3284J4364j7632j1503J1117k2171o759L687L366
163C5953K3368K2448L958K9509j3854l0031l1659M6319O417j4014l2311r879K0359
150E6583j1737M996l331P636p606k606K6556R443j5929k6127M693Q218p56J8921
136F8954L777p787l56j4570k1739L243j8385J1250K8254J0798o347J6282l6396
123C6978j1077J4254J9977Q525R91o531k2803j368L392k521j5005P322N592j4381
109B3345L791J171N386K0555L6605o770j4582R349j3696j8877J6101J1982K623
$$ plain form
189 62164 40289 49170 45478 53048 69757 57753 89383 74402 78807 20043 27041 43132 66859
176 66859 87801 69392 44744 48200 61484 75848 58216 46713 57830 35659 28900 32587 35953
163 35953 59321 81769 85727 115236 101382 71351 39692 86011 92428 78414 46103 36224 56583
150 56583 44846 49842 46511 54147 46541 43935 70491 79934 64005 37878 42571 50789 50033 68954
136 68954 72731 64944 64588 50018 28279 31522 13137 24387 52641 63439 57092 73374 36978
123 36978 25901 40155 60132 68657 69648 63117 40314 38946 42338 39817 24812 32134 37726 23345
109 23345 27136 28307 33693 54248 90853 84083 69501 78850 65154 46277 62378 74360 76983
$$ [...]
##END NTUPLES=NMR SPECTRUM
##END=
