##TITLE=1H_EC-3323(1)
 CDCl3
 8 sc, 
 9.4.2024
##JCAMPDX= 6.0         $$ Bruker NMR JCAMP-DX V2.0
##DATA TYPE= NMR SPECTRUM
##DATA CLASS= NTUPLES
##ORIGIN= UXNMR, Bruker Analytische Messtechnik GmbH
##OWNER= root
$$ XWIN-NMR		Version 3.5
$$ Tue Apr  9 14:00:57 2024 Russian Standard Time (UT+4h)  she@DPX200
##.OBSERVE FREQUENCY= 200.1309
##.OBSERVE NUCLEUS= ^1H
##.ACQUISITION MODE= SIMULTANEOUS
##.ACQUISITION SCHEME= undefined
##.AVERAGES= 8
##.DIGITISER RES= 18
##SPECTROMETER/DATA SYSTEM= spect
##.PULSE SEQUENCE= zg30
##.SOLVENT NAME= CDCl3
##.SHIFT REFERENCE= (INTERNAL, CDCl3, 0, 15.6643)
##AUDIT TRAIL= $$ (NUMBER, WHEN, WHO, WHERE, WHAT)
$$ ##TITLE= Audit trail, XWIN-NMR		Version 3.5
$$ ##JCAMPDX= 5.01
$$ ##ORIGIN= Bruker BioSpin GmbH
$$ ##OWNER= she
$$ F:/spectra/data/she/nmr/H-F/1/pdata/1/auditp.txt
$$ ##AUDIT TRAIL=  $$ (NUMBER, WHEN, WHO, WHERE, WHAT)
(   1,<2024-04-09 13:59:08.15 +0400>,<she>,<DPX200>,
      <created by zg, POWCHK disabled, PULCHK disabled
       configuration hash MD5:
       00 E9 B6 7A A2 85 ED C7 34 08 36 98 17 FE 4E 26
       data hash MD5: 16K
       0B 48 EE 08 B2 C0 D5 91 D9 B8 57 41 E2 92 91 1B>)
(   2,<2024-04-09 13:59:59.15 +0400>,<she>,<DPX200>,
      <Start of raw data processing
       efp BC_mod = 2 LB = 0.24 FT_mod = 6 PKNL = 1 PHC0 = -25304.27 PHC1 = 16.78731 SI = 16K 
       data hash MD5: 16K
       51 CA 9F 63 51 DF CB F4 6B 02 92 F6 EF 09 FF 83>)
(   3,<2024-04-09 14:00:14.23 +0400>,<she>,<DPX200>,
      <pk PHC0 = 2.678485 PHC1 = -4.2 
       data hash MD5: 16K
       EB 26 F6 88 D2 75 43 D5 AB 52 10 AE 12 C9 D1 46>)
(   4,<2024-04-09 14:00:17.23 +0400>,<she>,<DPX200>,
      <abs ABSG = 5 
       data hash MD5: 16K
       4F 52 D3 1F 2C F2 24 DF DE 2D 5E CD 0A BE 0D B9>)
$$ ##END=
$$ 
$$ hash MD5
$$ E8 FE 19 71 95 BB D2 06 A4 7E 61 6B 09 AF D1 79
##$RELAX= 
##$RELAX= 
##$RELAX= 
##$RELAX= 
##$RELAX= 
##$RELAX= 
$$ Bruker specific parameters
$$ --------------------------
##$DU= <F:/spectra>
##$EXPNO= 1
##$NAME= <H-F>
##$PROCNO= 1
##$TYPE= <nmr>
##$USER= <she>
##$AMP= (0..31)
100 100 100 100 100 100 100 100 100 100 100 100 100 100 100 100 100 100 
100 100 100 100 100 100 100 100 100 100 100 100 100 100 
##$AQSEQ= 0
##$AQ_mod= 1
##$AUNM= <au_zg>
##$AUTOPOS= <>
##$BF1= 200.13
##$BF2= 200.13
##$BF3= 200.13
##$BF4= 200.13
##$BF5= 200.13
##$BF6= 200.13
##$BF7= 200.13
##$BF8= 200.13
##$BYTORDA= 1
##$CFDGTYP= 0
##$CFRGTYP= 5
##$CHEMSTR= <none>
##$CNST= (0..31)
1 1 145 1 1 1 1 1 1 1 1 1 1 1 1 1 1 1 1 1 1 1 1 1 1 1 1 1 1 1 1 1 
##$CPDPRG= <>
##$CPDPRG1= <>
##$CPDPRG2= <>
##$CPDPRG3= <>
##$CPDPRG4= <mlev>
##$CPDPRG5= <mlev>
##$CPDPRG6= <mlev>
##$CPDPRG7= <mlev>
##$CPDPRG8= <mlev>
##$CPDPRGB= <>
##$CPDPRGT= <>
##$D= (0..31)
0 1.2 0 0 0 0 0 0 0 0.06 0 0.03 0 0 0 0 0.0002 0 0 0 0 0 0 0 0 0 0 0 0 
0 0 0 
##$DATE= 1712656747
##$DBL= (0..7)
120 120 120 120 120 120 120 120 
##$DBP= (0..7)
150 150 150 150 150 150 150 150 
##$DBP07= 0
##$DBPNAM0= <>
##$DBPNAM1= <>
##$DBPNAM2= <>
##$DBPNAM3= <>
##$DBPNAM4= <>
$$ [...]
##$SUBNAM3= <"">
##$SUBNAM4= <"">
##$SUBNAM5= <"">
##$SUBNAM6= <"">
##$SUBNAM7= <"">
##$SUBNAM8= <"">
##$SUBNAM9= <"">
##$SW= 18.0517689322627
##$SWIBOX= (0..15)
0 0 2 0 0 0 0 0 0 0 0 0 0 0 0 0 
##$SW_h= 3612.71676300578
##$TD= 16384
##$TD0= 1
##$TE= 0
##$TE2= 300
##$TE3= 300
##$TEG= 300
##$TL= (0..7)
0 120 120 120 120 120 120 120 
##$TP= (0..7)
150 150 150 150 150 150 150 150 
##$TP07= 0
##$TPNAME0= <>
##$TPNAME1= <>
##$TPNAME2= <>
##$TPNAME3= <>
##$TPNAME4= <>
##$TPNAME5= <>
##$TPNAME6= <>
##$TPNAME7= <>
##$TPOAL= (0..7)
0.5 0.5 0.5 0.5 0.5 0.5 0.5 0.5 
##$TPOFFS= (0..7)
0 0 0 0 0 0 0 0 
##$TUNHIN= 0
##$TUNHOUT= 0
##$TUNXOUT= 0
##$USERA1= <user>
##$USERA2= <user>
##$USERA3= <user>
##$USERA4= <user>
##$USERA5= <user>
##$V9= 5
##$VALIST= <valist>
##$VCLIST= <CCCCCCCCCCCCCCC>
##$VD= 0
##$VDLIST= <DDDDDDDDDDDDDDD>
##$VPLIST= <PPPPPPPPPPPPPPP>
##$VTLIST= <TTTTTTTTTTTTTTT>
##$WBST= 1024
##$WBSW= 4
##$XGAIN= (0..3)
0 0 0 0 
##$XL= 0
##$YL= 0
##$YMAX_a= 768349
##$YMIN_a= -921166
##$ZGOPTNS= <>
##$ZL1= 120
##$ZL2= 120
##$ZL3= 120
##$ZL4= 120
##$ABSF1= 15.63013
##$ABSF2= -2.421758
##$ABSG= 5
##$ABSL= 3
##$ALPHA= 0
##$AQORDER= 0
##$ASSFAC= 0
##$ASSFACI= 0
##$ASSFACX= 0
##$ASSWID= 0
##$AUNMP= <proc_1d>
##$AZFE= 0.1
##$AZFW= 0.1
##$BCFW= 0
##$BC_mod= 2
##$BYTORDP= 0
##$COROFFS= 0
##$CY= -3
##$DATMOD= 1
##$DC= 0
##$DFILT= <>
##$DTYPP= 0
##$F1P= 0
##$F2P= 0
##$FCOR= 1
##$FTSIZE= 16384
##$FT_mod= 6
##$GAMMA= 0
##$GB= 0
##$INTBC= 1
##$INTSCL= 3.70164e-10
##$ISEN= 128
##$LB= 0.24
##$LEV0= 0
##$LPBIN= 0
##$MAXI= 10000
##$MC2= 0
##$MEAN= 0
##$ME_mod= 0
##$MI= 1.114404
##$NCOEF= 0
##$NC_proc= -6
##$NLEV= 6
##$NOISF1= 3.799351
##$NOISF2= 2.8
##$NSP= 0
##$NTH_PI= 0
##$NZP= 0
##$OFFSET= 15.66429
##$PC= 1
##$PHC0= -25301.59
##$PHC1= 12.58731
##$PH_mod= 1
##$PKNL= yes
##$PPARMOD= 0
##$PSCAL= 0
##$PSIGN= 0
##$REVERSE= no
##$SF= 200.129571471583
##$SI= 16384
##$SIGF1= 3
##$SIGF2= 2
##$SINO= 5.538805
##$SIOLD= 16384
##$SREGLST= <1H.CDCl3>
##$SSB= 0
##$STSI= 16384
##$STSR= 0
##$SW_p= 3612.71676300577
##$SYMM= 0
##$S_DEV= 0
##$TDeff= 16384
##$TDoff= 0
##$TI= <>
##$TILT= no
##$TM1= 0
##$TM2= 0
##$TOPLEV= 0
##$USERP1= <user>
##$USERP2= <user>
##$USERP3= <user>
##$USERP4= <user>
##$USERP5= <user>
##$WDW= 1
##$XDIM= 16384
##$YMAX_p= 428057718
##$YMIN_p= -1144639
$$ End of Bruker specific parameters
$$ ---------------------------------
##NTUPLES= NMR SPECTRUM
##VAR_NAME=  FREQUENCY,     SPECTRUM/REAL,   SPECTRUM/IMAG
##SYMBOL=    X,             R,               I
##VAR_TYPE=  INDEPENDENT,   DEPENDENT,       DEPENDENT
##VAR_FORM=  AFFN,          ASDF,            ASDF
##VAR_DIM=   16384,         16384,           16384
##UNITS=     HZ,            ARBITRARY UNITS, ARBITRARY UNITS
##FACTOR=    0.220516191357247, 1,           1
##FIRST=     3134.8877307944, 0,             0
##LAST=      -477.829032211365, 0,           0
##MIN=       -477.829032211365, -1144639,    0
##MAX=       3134.8877307944, 428057718,     0
$$ Real data points
##PAGE= N=1
##DATA TABLE= (X++(R..R)), XYDATA
$$ [...]
$$ plain form
6323 1492340 1365968 1413969 1367346 1299405 1450245 1439069 1479678 1444820 1433039 1363831 1432809
6312 1432809 1472117 1344087 1416107 1348423 1206433 1239971 1350614 1379992 1468215 1334853 1335333
6301 1335333 1388685 1502992 1494567 1386486 1290169 1375629 1231607 1204602 1273238 1251214 1284756
6290 1284756 1343630 1375545 1526701 1426362 1407939 1500169 1309938 1440149 1528322 1489441 1465949
6279 1465949 1411133 1470887 1644852 1580692 1665378 1784910 1612006 1564033 1621463 1592641 1558708
6268 1558708 1505382 1599366 1714498 1565499 1446526 1606099 1854246 1852740 1894406 1953226 2006718
6257 2006718 2135807 1970659 2053191 2139960 2079809 2207831 2175331 2138891 2342300 2318205 2377954
6246 2377954 2346571 2365750 2322524 2459707 2544251 2514364 2486219 2692746 2795181 2769187 2847411
$$ packed form
6323A492340j26372M8001m6623o7941J50840j1176M0609l4858j1781o9208O8978
6312A432809L9308j28030P2020o7684j41990L3538J10643K9378Q8223j33362M80
6301A335333N3352J14307q425j08081r6317Q5460j44022k7005O8636k2024L3542
6290A284756N8874L1915J51156j00339j8423R2230j90231J30211Q8173l8881k3492
6279A465949n4816N9754J73965o4160Q4686J19532j72904m7973N7430k8822l3933
6268A558708n3326R3984J15132j48999j18973J59573K48147j506M1666N8820N3492
6257B006718J29089j65148Q2532Q6769o0151J28022l2500l6440K03409k4095N9749
6246B377954l1383J9179m3226J37183Q4544k9887k8145K06527J02435k5994P8224
$$ plain form
6235 2847411 2861784 2934496 3088595 3091636 3110076 3028267 3064447 3203768 3197799 3105020 3150133
6224 3150133 3384958 3507426 3500025 3654310 3652586 3596661 3891017 4000062 4041803 4252752 4309025
6213 4309025 4305019 4482599 4607977 4728218 4878743 5035412 5094191 5216695 5454048 5589334
6203 5589334 5808587 5908320 6119972 6351591 6467575 6742501 6989017 7133898 7267376 7279007
6193 7279007 7412937 7464984 7675288 7888639 8052615 8425648 8758127 9063480 9272486 9493388
6183 9493388 9766966 10038825 10284279 10666870 10993558 11495553 11894343 12392005 13005898 13401231
6173 13401231 14008244 14558846 14891345 15406340 15834316 16363533 17058614 17708323 18351410
6164 18351410 19226839 20226540 21361792 22811743 24366785 25827548 27624938 29695082
$$ packed form
6235B847411J4373P2712J54099L041J8440q1809L6180J39321n969r2779M5113
6224C150133K34825J22468p401J54285j724n5925K94356J09045M1741K10949N6273
6213D309025m006J77580J25378J20241J50525J56669N8779J22504K37353J35286
6203E589334K19253R9733K11652K31619J15984K74926K46516J44881J33478J1631
6193G279007J33930N2047K10304K13351J63976L73033L32479L05353K09006K20902
6183I493388K73578K71859K45454L82591L26688N01995L98790M97662O13893L95333
6173A3401231O07013N50602L32499N14995M27976N29217O95081O49709O43087
6164A8351410Q75429R99701J135252J449951J555042J460763J797390K070144
$$ plain form
6156 29695082 31957538 34288970 36786442 39514726 42179312 44665035 46867808 48466954
6148 48466954 49287780 49179825 48504539 47447803 46441236 45411421 44409343 43629382 43296714
6139 43296714 43439802 43615991 44171722 45177544 46646037 48639829 50789371 53622012 56876312
6130 56876312 60418656 64454279 68913935 73808228 78717276 83459393 87197663 89299725
6122 89299725 89128285 86833569 82992843 78627189 73952164 69529370 65523844 61656472
6114 61656472 58166752 55251173 52748873 50624386 48892126 47725905 47215304 47054668
6106 47054668 47059546 47524305 48493375 49678421 51149333 52739247 54379590 55785266 56683533
6097 56683533 56637347 55485355 53592109 51006416 48064042 45202571 42446946 39676697
$$ packed form
6156B9695082K262456K331432K497472K728284K664586K485723K202773J599146
6148D8466954Q20826j07955o75286j056736j006567j029815j002078p79961l32668
6139D3296714J43088J76189N55731J005822J468493J993792K149542K832641L254300
6130E6876312L542344M035623M459656M894293M909048M742117L738270K102062
6122H9299725j71440k294716l840726m365654m675025m422794m005526l867372
6114F1656472l489720k915579k502300k124487j732260j166221n10601j60636
6106D7054668M878M64759R69070J185046J470912J589914J640343J405676Q98267
6097E6683533m6186j151992j893246k585693k942374k861471k755625k770249
$$ plain form
6089 39676697 36978544 34452164 32171176 29886877 27867308 26050357 24394191 22839951
6081 22839951 21431047 20309886 19169829 18184529 17309444 16575680 15934098 15399414 14920910
6072 14920910 14411544 13960900 13537786 13232044 13015135 12794422 12588024 12237529 11914053
6063 11914053 11647128 11394901 11058457 10663963 10251965 9912043 9503848 9109206 8760640
6054 8760640 8451850 8244069 8000914 7745151 7468834 7392288 7285046 6937253 6764506 6576079
6044 6576079 6482298 6298583 6293194 6115835 6034997 5795932 5561513 5444821 5246049 5064196
6034 5064196 4984423 4732404 4572743 4610333 4465792 4333085 4340099 4225023 4099307 4092426 4084060
6023 4084060 4031197 3824750 3905661 3864226 3797694 3796989 3759273 3606307 3671095 3728134 3522740
$$ packed form
6089C9676697k698153k526380k280988k284299k019569j816951j656166j554240
6081B2839951j408904j121161j140057r85300q75085p33764o41582n34684m78504
6072A4920910n09366m50644m23114l05742k16909k20713k06398l50495l23476
6063A1914053k66925k52227l36444l94494m11998l39922m08195l94642l48566
6054H760640l08790k07781k43155k55763k76317p6546j07242l47793j72747j88427
6044F576079r3781j83715n389j77359q0838k39065k34419j16692j98772j81853
6034E064196p9773k52019j59661L7590j44541j32707P014j15076j25716o881q366
6023D084060n2863k06447Q0911m1435o6532p05l7716j52966O4788N7039k05394
$$ plain form
6012 3522740 3354946 3467685 3576123 3548985 3356038 3556809 3433175 3412802 3512961 3415480
6002 3415480 3436505 3443952 3532733 3555266 3477748 3541210 3605500 3512480 3501139 3465523 3390161 3484672
5990 3484672 3318572 3230795 3193987 3235331 3105770 3134921 3263359 3398584 3600795 3503820
5980 3503820 3399883 3357622 3477212 3343391 3369333 3297550 3313898 3269973 3151432 3105822 2981119
5969 2981119 3103256 3136381 3104831 3148549 3047631 3018615 3166711 3107087 3175044 3183455 3215328
5958 3215328 3137340 3270153 3511042 3633819 3670922 3667098 3781185 3874193 3832300 3799485 3756763
5947 3756763 3856981 4143432 4238329 4172132 4298150 4614452 4689031 4746153 4790667 4928014
5937 4928014 4880020 5022995 5013741 4811670 4764790 4897397 4896289 4837552 4736621 4860947 4903110
$$ packed form
6012C522740j67794J12739J08438k7138j92947K00771j23634k0373J00159r7481
6002C415480K1025P447Q8781K2533p7518O3462O4290r3020j1341l5616p5362R4511
5990C484672j66100q7777l6808M1344j29561K9151J28438J35225K02211r6975
5980C503820j03937m2261J19590j33821K5942p1783J6348m3925j18541m5610j24703
5969B981119J22137L3125l1550M3718j00918k9016J48096n9624O7957Q411L1873
5958C215328p7988J32813K40889J22777L7103l824J14087R3008m1893l2815m2722
5947C756763J00218K86451R4897o6197J26018L16302P4579N7122M4514J37347
5937D928014m7994J42975r254k02071m6880J32607j108n8737j00931J24326M2163
$$ plain form
5926 4903110 4978333 5087463 5142674 5355811 5716273 5962995 6275162 6504168 6774139 7087795
5916 7087795 7295186 7417156 7334334 7056856 6861867 6749374 6556393 6180472 5750306 5546412
5906 5546412 5220956 5200177 4960226 4814117 4684938 4575159 4586900 4538798 4480714 4573498
5896 4573498 4576131 4523381 4756274 5090347 5083433 5093533 5203519 5138887 4989667 4912656 4558236
5885 4558236 4231892 4206230 3931278 3649396 3581818 3554545 3417870 3115796 2889175 2900091
5875 2900091 2739199 2739856 2575675 2583456 2632196 2631140 2540183 2550927 2522089 2567771 2663131 2717741
5863 2717741 2747450 2745727 2657530 2603986 2867544 2918385 2937630 2857808 2754087 2632326 2615538
5852 2615538 2561199 2523207 2316461 2418651 2487583 2214579 2147066 2409674 2253468 2057030
$$ packed form
5926D903110P5223J09130N5211K13137L60462K46722L12167K29006K69971L13656
5916G087795K07391J21970q2822k77478j94989j12493j92981l75921m30166k03894
5906E546412l25456k0779k39951j46109j29179j09779J1741m8102n8084R2784
5896D573498K633n2750K32893L34073o914J0100J09986o4632j49220p7011l54420
5885D558236l26344k5662k74952k81882o7578k7273j36675l02074k26621J0916
5875B900091j60892O57j64181P781M8740j056r0957J0744k8838M5682R5360N4610
5863B717741K9709j723q8197n3544K63558N0841J9245p9822j03721j21761j6788
5852B615538n4339l7992k06746J02190O8932k73004o7513K62608j56206j96438
$$ plain form
5842 2057030 2140044 2241543 2352951 2246729 2216447 2249715 2299141 2249310 2472510 2604197
5832 2604197 2574853 2517512 2387188 2225578 2288754 2277699 2284732 2280547 2357744 2181931 2255723
5821 2255723 2330209 2294619 2393975 2322773 2391656 2439521 2633702 2639672 2669837 2607518 2641880
5810 2641880 2887650 2903533 2916843 3000140 3126180 3367813 3174771 2998908 2955904 2863576
5800 2863576 2930994 2867653 2817109 2749051 2723940 2742997 2576164 2626895 2683945 2555581 2535969
5789 2535969 2612341 2580437 2710660 2747505 2820530 2922672 2967151 2969452 2927408 2913244 3098536
5778 3098536 3082792 3064283 3084428 2965968 3040182 2821396 2859373 2868624 2621152 2644397 2805887
5767 2805887 2751127 2666600 2707325 2785407 2848269 2855766 2875343 2838636 2835481 2898821 2834573 2884506
$$ packed form
5842B057030Q3014J01499J11408j06222l0282L3268M9426m9831K23200J31687
5832B604197k9344n7341j30324j61610O3176j1055P033m185P7197j75813P3792
5821B255723P4486l5590R9356p1202O8883M7865J94181N970L0165o2319L4362
5810B641880K45770J5883J3310Q3297J26040K41633j93042j75863m3004r2328
5800B863576O7418o3341n0544o8058k5111J9057j66833N0731N7050j28364j9612
5789B535969P6372l1904J30223L6845P3025J02142M4479K301m2044j4164J85292
5778C098536j5744j8509K0145j18460P4214k18786L7977R251k47472K3245J61490
5767B805887n4760q4527M0725P8082O2862P497J9577l6707l155O3340o4248M9933
$$ plain form
5755 2884506 3037171 2902649 3119223 3216945 3240927 3391813 3554066 3496028 3586962 3688711
5745 3688711 3731201 3730012 3802628 3960173 3801210 3799662 3763037 3882949 3827000 4003008 4072770
5734 4072770 3963568 4089332 4134543 4244411 4391879 4437672 4591804 4657554 4806721 4934614
5724 4934614 5302185 5434245 5629375 5873613 6195994 6375233 6522111 6986033 7236460 7547976
5714 7547976 7727415 8065660 8252443 8427825 8741090 8958290 8754289 8791540 8891026 8721249
5704 8721249 8686410 8711026 8937040 8928818 8816885 8924858 9058133 9137445 9281134 9523750
5694 9523750 9839604 10243853 10433672 10907690 11339572 11824908 12393086 12959148 13401950 13920796
5684 13920796 14438571 14774962 14777796 14630757 14627588 14575426 14398260 14244235 14148654 13999647
$$ packed form
5755B884506J52665j34522K16574R7722K3982J50886J62253n8038R0934J01749
5745C688711M2490j189P2616J57545j58963j548l6625J19912n5949J76008O9762
5734D072770j09202J25764M5211J09868J47468M5793J54132O5750J49167J27893
5724D934614L67571J32060J95130K44238L22381J79239J46878M63922K50427L11516
5714G547976J79439L38245J86783J75382L13265K17200k04001L7251R9486j69777
5704H721249l4839K4616K26014q222j11933J07973J33275P9312J43689K42616
5694I523750L15854M04249J89819M74018M31882M85336N68178N66062M42802N18846
5684A3920796N17775L36391K834j47039l169n2162j77166j54025r5581j49007
$$ plain form
5674 13999647 13995741 13975691 13996495 14003373 14064658 14261280 14472311 14941228 15359234 15720527 15973482
5663 15973482 16261524 16858995 17263448 17876983 18533758 19106804 19569388 20212761 20788764
5654 20788764 21187062 21496605 22124013 22637194 23418388 24102351 24936957 25989885 27300406
5645 27300406 28856742 30482033 32380876 34667527 37025503 39447272 42156959 45077656
5637 45077656 48479923 51859216 55271637 58315585 60342970 61075706 60709607 59520642
5629 59520642 57854260 56025021 54402902 52953954 51575806 50627566 50180661 50225290 50569220
5620 50569220 51318053 52824165 54756284 57119360 59851987 63088919 66976180 71389083
5612 71389083 76448625 82048215 88218107 94454022 99288079 101233956 100199899 96790679
$$ packed form
5674A3999647l906k0050K0804O878O1285J96622K11031M68917M18006L61293K52955
5663A5973482K88042N97471M04453O13535O56775N73046M62584O43373N76003
5654B0788764L98298L09543O27408N13181P81194O83963Q34606J052928J310521
5645B7300406J556336J625291J898843K286651K357976K421769K709687K920697
5637D5077656L402267L379293L412421L043948K027385P32736l66099j188965
5629E9520642j666382j829239j622119j448948j378148r48240m46905M4629L43930
5620E0569220P48833J506112J932119K363076K732627L236932L887261M412903
5612G1389083N059542N599590O169892O235915M834057J945877j034057l409220
$$ plain form
5604 96790679 92041209 86908708 81470932 76132300 71188533 66746486 62893955 59233138
5596 59233138 56238246 53970744 52155132 50801641 50115456 49925160 49972520 50253388 50982000
5587 50982000 52102198 53281255 54963362 56766109 58598138 59851943 60224615 59674874
5579 59674874 58459957 56683860 54580026 52318754 50082756 47856358 45298721 42501108
5571 42501108 39893713 37345287 34917940 32875703 31163201 29601299 28237948 26948340
5563 26948340 25793030 25011807 24393266 23884878 23710418 23406141 23128791 22799506 22631985
5554 22631985 22388496 22110315 21593248 21136661 20602731 20275975 19888855 19662559 19459067
5545 19459067 19183530 18822351 18129090 17799602 17150667 16604094 16278324 15823197 15295880
$$ packed form
5604I6790679m749470n132501n437776n338632m943767m442047l852531l660817
5596E9233138k994892k267502j815612j353491o86185j90296M7360K80868P28612
5587E0982000J120198J179057J682107J802747J832029J253805L72672n49741
5579E9674874j214917j776097k103834k261272k235998k226398k557637k797613
5571D2501108k607395k548426k427347k042237j712502j561902j363351j289608
5563B6948340j155310p81223o18541n08388j74460l04277k77350l29285j67521
5554B2631985k43489k78181n17067m56587n33930l26756l87120k26296k03492
5545A9459067k75537l61179o93261l29488o48935n46573l25770m55127n27317
$$ plain form
5536 15295880 15050421 14819654 14451723 14187100 14124028 13971065 13662368 13253618 13077852 12906017
5526 12906017 12544565 12315412 12008301 11729918 11332263 10998444 10931834 10769775 10733804 10483592
5516 10483592 10553042 10453420 10353663 10424931 10309458 10436354 10481952 10462106 10597629 10769112
5506 10769112 10755009 10737260 10609987 10301173 10151036 10002840 9819752 9744850 9804929 9827278
5496 9827278 9846257 9849147 10031807 9974962 9895698 9969503 10124000 10177285 10233257 10174641 10248087
5485 10248087 10259738 10248413 10214042 10168110 9988282 10003394 9999590 10034319 9868218 9620715 9493320
5474 9493320 9521746 9636677 9631129 9625271 9813090 9927922 9945175 9949608 9862419 10015712 10084266
5463 10084266 10095417 10110814 10296302 10180931 10173337 10237728 10437131 10345553 10328615 10316404 10327328
$$ packed form
5536A5295880k45459k30767l67931k64623o3072j52963l08697m08750j75766j71835
5526A2906017l61452k29153l07111k78383l97655l33819o6610j62059l5971k50212
5516A0483592O9450r9622r9757P1268j15473J26896M5598j9846J35523J71483
5506A0769112j4103j7749j27273l08814j50137j48196j83088p4902O0079K2349
5496I827278J8979K890J82660n6845p9264P3805J54497N3285N5972n8616P3446
5485A0248087J1651j1325l4371m5932j79828J5112l804L4729j66101k47503j27395
5474I493320K8426J14931n548n858J87819J14832J7253M433q7189J53293O8554
5463A0084266J1151J5397J85488j15371p594O4391J99403r1578j6938j2211J0924
$$ plain form
5452 10327328 10430012 10446653 10420990 10213830 9986957 10042463 10129128 10104962 10105589 10046701 10351822
5441 10351822 10547014 10543769 10631177 10824042 10911193 10960432 11188503 11315618 11457460 11648527
5431 11648527 11850243 12126587 12315954 12494850 12445967 12340874 12243012 12233445 12340964 12445172
5421 12445172 12545282 12638954 12709499 12801578 12786720 12885820 13023287 13257068 13559148 13770100
5411 13770100 13976799 14238887 14681268 15037546 15415223 15778336 16218143 16415426 16562865
5402 16562865 16753221 17108821 17041827 17141159 17288942 17469962 17660865 17944169 18185951 18398286
5392 18398286 18807086 19051695 19447719 19962120 20535990 20981428 21226713 21713094 22031011
5383 22031011 22440466 22923866 23564815 24045531 24672849 25621307 26272164 26828978 27376124
$$ packed form
5452A0327328J02684J6641k5663k07160k26873N5506Q6665k4166O27n8888L05121
5441A0351822J95192l245Q7408J92865Q7151M9239K28071J27115J41842J91067
5431A1648527K01716K76344J89367J78896m8883j05093r7862r567J07519J04208
5421A2445172J00110R3672P0545R2079j4858R9100J37467K33781L02080K10952
5411A3770100K06699K62088M42381L56278L77677L63113M39807J97283J47439
5402A6562865J90356L55600o6994R9332J47783J81020J90903K83304K41782K12335
5392A8398286M08800K44609L96024N14401N73870M45438K45285M86381L17917
5383B2031011M09455M83400O40949M80716O27318R48458O50857N56814N47146
$$ plain form
5374 27376124 27959824 28614949 29105477 29698826 30420966 31126446 31989494 33057615 34084201
5365 34084201 34797102 35321267 35778272 36352600 37067223 37607119 38252862 38958508 39558912
5356 39558912 40443899 41541625 42925035 44436598 46079632 47738143 49498607 51064707
5348 51064707 52344089 53256927 54071413 54791692 55329704 55985131 57048232 58000325 59285131
5339 59285131 60818193 62527908 64301144 66134882 68060031 69877253 71386001 72789382
5331 72789382 74458878 76023667 77350875 78471008 79692145 81378550 83295863 85316159
5323 85316159 87713573 90423518 93307198 96716611 100574524 105305495 110553474 116093545
5315 116093545 121513431 125962115 128938835 131474522 134093593 136893610 140660669 145428662
$$ packed form
5374B7376124N83700O55125M90528N93349P22140P05480Q63048J068121J026586
5365C4084201P12901N24165M57005N74328P14623N39896O45743P05646O00404
5356C9558912Q84987J097726J383410J511563J643034J658511J760464J566100
5348E1064707J279382R12838Q14486P20279N38012O55427J063101R52093J284806
5339E9285131J533062J709715J773236J833738J925149J817222J508748J403381
5331G2789382J669496J564789J327208J120133J221137J686405J917313K020296
5323H5316159K397414K709945K883680L409413L857913M730971N247979N540071
5315A16093545N419886M448684K976720K535687K619071K800017L767059M767993
$$ plain form
5307 145428662 150930312 156322397 160597299 164498780 169441570 175668709 183083376 191769003
5299 191769003 201373741 211473926 221404596 231773835 242861776 253148275 261263554
5292 261263554 266269812 268239788 267594489 263867958 257559800 249702731 241571244 234062808
5284 234062808 226622463 219279589 212353110 204838689 196636355 189352137 183092271 177471366
5276 177471366 171683764 165766239 159553057 154171226 149244382 144492164 140099406 135980441
5268 135980441 132090643 128594806 125426805 122759240 120628293 119128956 118029685 117307553
5260 117307553 117274521 117759895 119213024 121145801 123866892 127305104 131237136 134551295
5252 134551295 136345221 136061738 134016449 130378348 125164817 119563153 113598785 107668666
$$ packed form
5307A45428662N501650N392085M274902L901481M942790O227139P414667Q685627
5299A91769003R604738J0100185R930670J0369239J1087941J0286499Q115279
5292B61263554N006258J969976o45299l726531o308158p857069q131487p508436
5284B34062808p440345p342874o926479p514421q202334p284218o259866n620905
5276A77471366n787602n917525o213182n381831m926844m752218m392758m118965
5268A35980441l889798l495837l168001k667565k130947j499337j099271p22132
5260A17307553l3032M85374J453129J932777K721091L438212L932032L314159
5252A34551295J793926k83483k045289l638101n213531n601664n964368n930119
$$ plain form
5244 107668666 102199896 96910831 92153097 87990663 84487310 81389975 78463847 75864161
5236 75864161 73868148 72487037 71584081 71323786 71415641 72249238 73488141 74953731 76291592
5227 76291592 76678000 75819265 73344225 69817403 65757978 61531184 57445431 53653156
5219 53653156 50191191 46781355 43423950 40552490 38087987 35601015 33810869 32085520
5211 32085520 30335565 28818339 27390698 26142841 25161383 24162962 23041864 22194465 21391878
5202 21391878 20654925 20088037 19466046 18835200 18308844 17748687 17222444 16781499 16442130
5193 16442130 16354285 15960005 15566098 15322728 15085555 15030315 14859738 14923558 14835649 14739158
5183 14739158 14732049 14858528 14867487 14891629 15262868 15315485 15564120 15574040 15316218 14969240 14519365
$$ packed form
5244A07668666n468770n289065m757734m162434l503353l097335k926128k599686
5236G5864161j996013j381111r02956k60295R1855Q33597J238903J465590J337861
5227G6291592L86408q58735k475040l526822m059425m226794m085753l792275
5219E3653156l461965l409836l357405k871460k464503k486972j790146j725349
5211C2085520j749955j517226j427641j247857r81458r98421j121098q47399q02587
5202B1391878p36953n66888o21991o30846n26356n60157n26243m40945l39369
5193A6442130q7845l94280l93907k43370k37173n5240j70577O3820q7909r6491
5183A4739158p109J26479Q959K4142L71239N2617K48635R920k57822l46978m49875
$$ plain form
5172 14519365 14195623 13915921 13649562 13301436 13107431 13014991 12982693 12936667 12771194 12726274
5162 12726274 12767494 12925446 13102746 13136925 13475106 13757888 14075119 14353752 14670543 14920648
5152 14920648 15244576 15838490 16596272 17370254 18462382 19776367 20896703 21860214 22143997
5143 22143997 22075423 21785119 21550454 20877140 20250431 19396619 18689276 18066501 17515827 17218224
5133 17218224 16700450 16507011 16252560 15864561 15548955 15475306 15194250 15191963 15245110 15322528
5123 15322528 15318077 15480664 15499446 15718658 15889841 16417775 17066896 17997551 18839024 19689992
5113 19689992 20680728 21339407 21356074 21121353 20666096 19763058 19099133 18318849 17518503 16800799
5103 16800799 16324240 15944842 15462458 15195503 15058806 15049884 15370775 15756656 16400892 17009531
$$ packed form
5172A4519365l23742k79702k66359l48126j94005r2440l2298m6026j65473m4920
5162A2726274M1220J57952J77300L4179L38181K82782L17231K78633L16791K50105
5152A4920648L23928N93914P57782P73982J092128J313985J120336R63511K83783
5143B2143997o8574k90304k34665o73314o26709q53812p07343o22775n50674k97603
5133A7218224n17774j93439k54451l87999l15606p3649k81056k287N3147P7418
5123A5322528m451J62587J8782K19212J71183N27934O49121R30655Q41473Q50968
5113A9689992R90736O58679J6667k34721m55257r03038o63925p80284q00346p17704
5103A6800799m76559l79398m82384k66955j36697q922L20891L85881O44236O08639
$$ plain form
5093 17009531 17819370 18608940 18919767 18744796 18239170 17485997 16625444 15977635 15354897
5084 15354897 14830993 14377453 14081174 13979204 13535667 13033247 12550083 11996017 11356515
5075 11356515 10924422 10252078 9882179 9803083 9621727 9577880 9416166 9185998 8951542 8926574
5065 8926574 8702817 8260691 8071121 7750253 7372623 6983558 6690749 6568980 6299971 6248784
5055 6248784 5995336 5681447 5552308 5538713 5628413 5546348 5535066 5494934 5576034 5604236 5558657
5044 5558657 5683637 5880439 5992535 6364772 6606137 6948047 7305332 7619852 7670989 7970388
5034 7970388 8138481 8225077 8250429 8195976 7969419 7600793 7433828 7195371 7081377 6719444
5024 6719444 6377099 6108533 5921837 5851504 5704712 5607071 5480679 5335408 5140548 5119939
$$ packed form
5093A7009531Q09839P89570L10827j74971n05626p53173q60553o47809o22738
5084A5354897n23904m53540k96279j01970m43537n02420m83164n54066o39502
5075A1356515m32093o72344l69899p9096j81356m3847j61714k30168k34456k4968
5065H926574k23757m42126j89570l20868l77630l89065k92809j21769k69009n1187
5055F248784k53448l13889j29139j3595Q9700q2065j1282m0132Q1100K8202m5579
5044E558657J24980J96802J12096L72237K41365L41910L57285L14520N1137K99399
5034G970388J68093Q6596K5352n4453k26557l68626j66965k38457j13994l61933
5024F719444l42345k68566j86696p0333j46792r7641j26392j45271j94860k0609
$$ plain form
5014 5119939 5134546 5017392 5001811 4937751 4914729 4952950 5020560 5214825 5407185 5411805 5502435
5003 5502435 5779752 6078258 6301843 6355323 6627187 6764908 6672817 6615900 6463824 6210270
4993 6210270 6046174 5932338 5599926 5359220 5137138 5072067 4878606 4727376 4699520 4563837
4983 4563837 4511074 4517814 4262566 4078290 4033229 3971919 3881053 3777274 3711028 3548657 3487346
4972 3487346 3501425 3561074 3751729 3837733 4134575 4240812 4468774 4351902 4366885 4315237
4962 4315237 4266367 4345839 4325130 4249509 4208190 4268654 4314928 4256800 4148508 4232610 4125643
4951 4125643 3991100 3854334 3784971 3728426 3547741 3287159 3148421 3071458 2994525 2974243
4941 2974243 2849571 2806370 2765162 2688083 2743936 2738161 2835346 2971593 2958805 2892721 2794334
$$ packed form
5014E119939J4607j17154j5581o4060k3022L8221O7610J94265J92360M620R0630
5003E502435K77317K98506K23585N3480K71864J37721r2091n6917j52076k53554
4993F210270j64096j13836l32412k40706k22082o5071j93461j51230k7856j35683
4983D563837n2763O740k55248j84276m5061o1310r0866j03779o6246j62371o1311
4972C487346J4079N9649J90655Q6004K96842J06237K27962j16872J4983n1648
4962D315237m8870P9472k0709p5621m1319O0464M6274n8128j08292Q4102j06967
4951D125643j34543j36766o9363n6545j80685k60582j38738p6963p6933k0282
4941B974243j24672m3201m1208p7079N5853n775R7185J36247j2788o6084r8387
$$ plain form
4930 2794334 2808137 2823181 2889384 2781343 2829431 2839265 2856443 2879859 2952186 2928746 2945977
4919 2945977 3131022 3060933 2990164 2950059 3052960 3065912 3151204 3000149 3030351 3021235 2886643
4908 2886643 2795645 2726246 2781037 2839182 2791283 2717013 2630974 2363545 2342779 2456399 2455168
4897 2455168 2532107 2426480 2438631 2406426 2324203 2413536 2526598 2363903 2438737 2451357 2278568
4886 2278568 2217534 2346010 2457589 2463901 2536160 2633395 2638013 2443593 2669748 2864148 2929446
4875 2929446 3009068 2754320 2565217 2576834 2810000 2703467 2638182 2800995 2742944 2647604
4865 2647604 2599470 2596762 2681565 2702540 2609248 2760392 3044147 2948508 3022777 3011892 3010936 3094422
4853 3094422 3279987 3318021 3213889 3321762 3291000 3253541 3441751 3609674 3582792 3528378
$$ packed form
4930B794334J3803J5044O6203j08041M8088R834J7178K3416P2327k3440J7231
4919B945977J85045p0089p0769m0105J02901J2952Q5292j51055L0202r116j34592
4908B886643r0998o9399N4791N8145m7899p4270q6039k67429k0766J13620j231
4897B455168P6939j05627J2151l2205q2223Q9333J13062j62695P4834J2620j72789
4886B278568o1034J28476J11579O312P2259R7235M618j94420K26155J94400O5298
4875B929446P9622k54748j89103J1617K33166j06533o5285J62813n8051r5340
4865B647604m8134k708Q4803K0975r3292J51144K83755r5639P4269j0885r56Q3486
4853C094422J85565L8034j04132J07873l0762l7459J88210J67923k6882n4414
$$ plain form
4843 3528378 3409100 3480693 3581702 3445868 3461926 3293628 3248058 3487270 3506802 3549094
4833 3549094 3465574 3536351 3479390 3689000 3851041 3972347 4037921 3907415 4059630 3995747
4823 3995747 3948256 3950830 3845495 3741350 3679525 3765664 3646327 3576778 3633745 3615246 3464905
4812 3464905 3617025 3534692 3533396 3551054 3489550 3349334 3208398 3283716 3346373 3424725 3483308
4801 3483308 3511361 3447044 3519991 3578673 3438572 3342360 3363266 3584478 3642654 3484233 3567307
4790 3567307 3503865 3342077 3437347 3638273 3657969 3632789 3653926 3763787 3856295 3819738 3743387
4779 3743387 3895832 4066654 4231748 4335893 4288235 4489181 4598955 4545033 4707019 4764063
4769 4764063 4841000 4998944 5142357 5201981 5138364 5145058 5174714 5201819 5366547 5414973 5489005
$$ packed form
4843C528378j19278P1593J01009j35834J6058j68298m5570K39212J9532M2292
4833C549094q3520P0777n6961K09610J62041J21306O5574j30506J52215o3883
4823C995747m7491K574j05335j04145o1825Q6139j19337o9549N6967j8499j50341
4812C464905J52120q2333j296J7658o1504j40216j40936P5318O2657P8352N8583
4801C483308K8053o4317P2947N8682j40101r6212K0906K21212N8176j58421Q3074
4790C567307o3442j61788R5270K00926J9696k5180K1137J09861R2508l6557p6351
4779C743387J52445J70822J65094J04145m7658K00946J09774n3922J61986N7044
4769D764063P6937J57944J43413N9624o3617O694K9656K7105J64728M8426P4032
$$ plain form
4758 5489005 5630754 5629324 5709757 5755564 5927935 6067035 6144783 6366365 6705251 6789747 7085881
4747 7085881 7424505 7732498 7996862 8106920 8314066 8732534 9208665 9450433 9613893 9741234
4737 9741234 9776945 10010025 10393697 10727037 11178611 11972658 12780496 13712780 14615154 15220517
4727 15220517 15899410 16611800 17657612 19036378 20982945 23451733 26370710 29920249
4719 29920249 34186046 37899261 39025368 38311632 35999852 32578782 29298853 26183400
4711 26183400 23557811 21092219 19032031 17433464 15785602 14608030 13763311 12760793
4703 12760793 12043516 11380479 10766689 10302533 10215155 9919009 9673740 9410607 9282109 9239495
4693 9239495 9178488 9006105 8941620 8772058 8686545 8619960 8338236 8231648 8222975 8196420 8082764
$$ packed form
4758E489005J41749j430Q0433M5807J72371J39100P7748K21582L38886Q4496K96134
4747G085881L38624L07993K64364J10058K07146M18468M76131K41768J63460J27341
4737I741234L5711K33080L83672L33340M51574P94047Q07838R32284R02374O05363
4727A5220517O78893P12390J045812J378766J946567K468788K918977L549539
4719B9920249M265797L713215J126107p13736k311780l421070l279929l115453
4711B6183400k625589k465592k060188j598567j647862j177572q44719j002518
4703A2760793p17277o63037o13790m64156q7378k96146k45269k63133j28498m2614
4693I239495o1007j72383o4485j69562q5513o6585k81724j06588q673k6555j13656
$$ plain form
4682 8082764 8050818 8081429 8145877 8108228 8088301 8192725 8110769 7947465 8089584 8148795 7994246
4671 7994246 7731322 7808732 7995598 7911930 7783010 8102335 8168991 8067737 8107478 8249091
4661 8249091 8327001 8268966 8393827 8546236 8575088 8576169 8631977 8817762 8820729 9060433 9324426
4650 9324426 9279671 9481652 9498086 9767189 9996355 10017543 9978720 10183240 10285755 10452879
4640 10452879 10839353 11009016 11276440 11313300 11272747 11710089 11970307 12008064 12370162 12579519
4630 12579519 12850193 13156993 13627612 14009108 14337898 14912097 15457951 15826894 16489135
4621 16489135 17170407 17762702 18398600 18895242 19594456 20136553 20722819 21500094 22003029
4612 22003029 22656056 23381661 24082002 24659538 25486454 26389902 27188323 28268946 29401706
$$ packed form
4682H082764l1946L0611O4448l7649j9927J04424q1956j63304J42119N9211j54549
4671G994246k62924P7410J86866q3668j28920L19325O6656j01254L9741J41613
4661H249091P7910n8035J24861J52409K8852J081N5808J85785K967K39704K63993
4650I324426m4755K01981J6434K69103K29166K1188l8823K04520J02515J67124
4640A0452879L86474J69663K67424L6860m0553M37342K60218L7757L62098K09357
4630A2579519K70674L06800M70619L81496L28790N74199N45854L68943O62241
4621A6489135O81272N92295O35898M96642O99214N42097N86266P77275N02935
4612B2003029O53027P25605P00341N77536Q26916R03448P98421J080623J132760
$$ plain form
4603 29401706 30459973 31802760 33289738 34416484 35771270 37103893 38220548 38990680
4595 38990680 39695438 40716041 41583689 42307358 43070078 43989443 45039131 45961769 47222482
4586 47222482 48554065 49874456 51712501 53902517 56344376 59338598 62689873 66370955
4578 66370955 70285333 74263973 78121263 81014150 82299824 82065179 80819337 78934006
4570 78934006 77064734 74965249 73176497 71666128 70562995 69533151 68580322 67940198
4562 67940198 67611496 67558468 67839140 68822985 70543050 72803299 75718097 79337553 83642697
4553 83642697 88202761 92262101 95378864 96804900 96116399 93408729 88974831 83733947
4545 83733947 78592625 73508057 69015633 64961125 61162871 57998905 55171006 52914586
$$ packed form
4603B9401706J058267J342787J486978J126746J354786J332623J116655P70132
4595C8990680P04758J020603Q67648P23669P62720R19365J049688R22638J260713
4586D7222482J331583J320391J838045K190016K441859K994222L351275L681082
4578F6370955L914378L978640L857290K892887J285674k34645j245842j885331
4570G8934006j869272k099485j788752j510369j103133j029844r52829o40124
4562F7940198l28702n3028K80672R83845J720065K260249K914798L619456M305144
4553H3642697M560064M059340L116763J426036o88501k707670m433898n240884
4545H3733947n141322n084568m492424m054508l798254l163966k827899k256420
$$ plain form
4537 52914586 50755045 48885848 47537819 46796997 46555852 46551302 46832683 47672171 49047218
4528 49047218 50460643 51610432 52166420 52000052 50663169 48211832 45124156 42221470
4520 42221470 39200020 36542595 34050549 31692014 29375072 27280323 25542259 24017771
4512 24017771 22556394 21164609 20008952 19016154 18099486 17410048 16639300 15940855 15398373
4503 15398373 15076456 14429703 13887592 13573071 13233130 12970839 12633265 12332578 12071976
4494 12071976 11877020 11706987 11542130 11174753 10929522 10674008 10494045 10329823 10044176
4485 10044176 9976391 9872614 9857298 9771978 9699831 9641858 9546110 9653326 9454718 9300156
4475 9300156 9156211 9275129 9342435 9233059 9312310 9404495 9305914 9186920 9311038 9172219
$$ packed form
4537E2914586k159541j869197j348029p40822k41145m550K81381Q39488J375047
4528D9047218J413425J149789N55988j66368j336883k451337l087676k902686
4520D2221470l021450k657425k492046k358535k316942k094749j738064j524488
4512B4017771j461377j391785j155657r92798r16668o89438p70748o98445n42482
4503A5398373l21917o46753n42111l14521l39941k62291l37574l00687k60602
4494A2071976j94956j70033j64857l67377k45231k55514j79963j64222k85647
4485A0044176o7785j03777j5316q5320p2147n7973r5748J07216j98608j54562
4475I300156j43945J18918O7306j09376P9251R2185r8581j18994J24118j38819
$$ plain form
4465 9172219 9205546 9438578 9553053 9679307 9746908 9882168 10031775 10413779 10705700 10997780
4455 10997780 11325034 11718769 12112943 12360913 12636776 12943153 13558623 14209216 14966791
4446 14966791 15917635 16890839 17785387 18338642 18692184 18677112 18261867 17953056 17462464 16764860
4436 16764860 16120670 15621567 15349780 15019934 14625973 14195210 13824667 13611442 13351240
4427 13351240 13174573 12895279 12488391 12229715 11935476 11841767 11803755 11591197 11370430 11380412
4417 11380412 11353511 11351971 11331444 11475590 11645729 11840883 12009136 12253698 12468193 12562441
4407 12562441 12551698 12696354 12714828 12622330 12445516 12317405 12258148 12205197 12270779 12517158
4397 12517158 12523556 12604034 12763237 12823100 13082479 13290344 13648492 13847519 14276839 14870889
$$ packed form
4465I172219L3327K33032J14475J26254O7601J35260J49607L82004K91921K92080
4455A0997780L27254L93735L94174K47970K75863L06377O15470O50593P57575
4446A4966791R50844R73204Q94548N53255L53542j5072m15245l08811m90592o97604
4436A6764860o44190m99103k71787l29846l93961m30763l70543k13225k60202
4427A3351240j76667k79294m06888k58676k94239r3709l8012k12558k20767R982
4417A1380412k6901j540k0527J44146J70139J95154J68253K44562K14495R4248
4407A2562441j0743J44656J8474r2498j76814j28111n9257n2951O5582K46379
4397A2517158O398Q0478J59203N9863K59379K07865L58148J99027M29320N94050
$$ plain form
4387 14870889 15279797 15623403 15976679 16215467 16575288 17035704 17447293 18008091 18675397
4378 18675397 19249027 19843504 20794654 21818623 23262096 24894358 26777660 29131444 31762800
4369 31762800 34991456 38110832 40855280 43109555 44205411 44300091 43265369 41555636
4361 41555636 39068961 36129112 33265714 30332732 27905073 25834591 23909390 22422294
4353 22422294 21124121 19834084 18928906 17951945 17070633 16403535 15911349 15268097 14645691
4344 14645691 14086264 13666820 13283289 13034019 12601628 12398836 12231903 12059182 11945903
4335 11945903 11842914 11614843 11497293 11438646 11522205 11625938 11463417 11251838 11148191 11194233
4325 11194233 11106734 11045188 10895549 10802009 10668846 10556578 10677150 10608557 10464780 10472129
$$ packed form
4387A4870889M08908L43606L53276K38788L59821M60416M11589N60798O67306
4378A8675397N73630N94477R51150J023969J443473J632262J883302K353784K631356
4369C1762800L228656L119376K744448K254275J095856R4680j034722j709733
4361D1555636k486675k939849k863398k932982k427659k070482j925201j487096
4353B2422294j298173j290037r05178r76961q81312o67098m92186o43252o22406
4344A4645691n59427m19444l83531k49270m32391k02792j66933j72721j13279
4335A1945903j02989k28071j17550n8647Q3559J03733j62521k11579j03647M6042
4325A1194233q7499o1546j49639r3540j33163j12268J20572o8593j43777P349
$$ plain form
4315 10472129 10693018 10713604 10698800 10627800 10579219 10585899 10649029 10601164 10457911 10444703 10475545
4304 10475545 10509158 10677490 10769381 10794610 10972534 10854032 10919217 10995487 11202700 11349386
4294 11349386 11614543 11697809 11598563 11673020 11855176 11872641 11995892 12219784 12490892 12716733
4284 12716733 12888429 12970080 13222205 13485876 13621780 13933217 14217792 14665047 15107838 15455279
4274 15455279 15578520 15836524 16245510 16630918 16894527 17237427 17631846 17873906 18113303
4265 18113303 18535675 18880795 19198674 19548775 19795174 20182996 20458070 20759881 21093672
4256 21093672 21473937 21893074 22619342 23384062 24026300 25110561 26452448 27593134 28994627
4247 28994627 30639812 32640691 34939556 37479626 40304219 43441486 47332356 51954565
$$ packed form
4315A0472129K20889K0586j4804p1000m8581O680O3130m7865j43253j3208L0842
4304A0475545L3613J68332R1891K5229J77924j18502O5185P6270K07213J46686
4294A1349386K65157Q3266r9246P4457J82156J7465J23251K23892K71108K25841
4284A2716733J71696Q1651K52125K63671J35904L11437K84575M47255M42791L47441
4274A5455279J23241K58004M08986L85408K63609L42900L94419K42060K39397
4265A8113303M22372L45120L17879L50101K46399L87822K75074L01811L33791
4256B1093672L80265M19137P26268P64720O42238J084261J341887J140686J401493
4247B8994627J645185K000879K298865K540070K824593L137267L890870M622209
$$ plain form
4239 51954565 57373071 64083056 71991606 81707536 93086300 104634765 114936304 123003169
4231 123003169 128024890 129566958 127162458 121418125 112760184 102203506 91457562 81509245
4223 81509245 72608855 65212867 58596119 52720484 47737003 43384793 39872354 36718719
4215 36718719 34139036 31884872 29943021 28359908 26857436 25445360 24415714 23426789
4207 23426789 22431355 21373801 20496901 19784535 19175192 18593694 18142460 17579870 17112865
4198 17112865 16665090 16502436 16284430 15943252 15632324 15451607 15343840 15306676 15212299 14902509
4188 14902509 14617159 14622247 14361037 14212965 14022852 13989405 13969782 13904701 13912345 13891559 13959771
4177 13959771 13768571 13827387 13936517 13756163 13808327 13884140 14004575 13900597 13842893 14011840
$$ packed form
4239E1954565N418506O709985P908550R715930J1378764J1548465J0301539Q066865
4231A23003169N021721J542068k404500n744333q657941j0556678j0745944r948317
4223H1509245q900390p395988o616748n875635m983481m352210l512439l153635
4215C6718719k579683k254164j941851j583113j502472j412076j029646r88925
4207B3426789r95434j057554q76900p12366o09343n81498m51234n62590m67005
4198A7112865m47775j62654k18006l41178l10928j80717j07767l7164r4377l09790
4188A4902509k85350N088k61210j48072j90113l3447j9623o5081P644k0786O8212
4177A3959771j91200N8816J09130j80354N2164P5813J20435j03978n7704J68947
$$ plain form
4167 14011840 14001340 14081469 14002096 14102748 14110408 14088430 14160150 14184564 14224788 14252336 14167178
4156 14167178 14089944 14086199 14177009 13982667 13946337 13926491 13970997 13900304 13819737 13899937 13960932
4145 13960932 14034944 14198022 14285663 14538715 14649459 14871720 15083093 15271737 15406288 15662861
4135 15662861 16035303 16379159 16762414 16940408 17167428 17345990 17522834 17650113 17859468
4126 17859468 17913100 17920973 18054379 18086713 18200249 18565354 18773126 19020874 19393376 19641180
4116 19641180 19747920 20209807 20680698 21028874 21314605 21698742 22074999 22258837 22701495
4107 22701495 23247449 23758529 24283504 24854378 25423272 25872450 26250811 26627408 27102246
4098 27102246 27422676 27731015 28106835 28558404 28999785 29521959 29997339 30557348 31316671
$$ packed form
4167A4011840j0500Q0129p9373J00652P660k1978P1720K4414M0224K7548q5158
4156A4167178p7234l745R0810j94342l6330j9846M4506p0693q0567Q0200O0995
4145A3960932P4012J63078Q7641K53052J10744K22261K11373J88644J34551K56573
4135A5662861L72442L43856L83255J77994K27020J78562J76844J27279K09355
4126A7859468N3632P873J33406L2334J13536L65105K07772K47748L72502K47804
4116A9641180J06740M61887M70891L48176K85731L84137L76257J83838M42658
4107B2701495N45954N11080N24975N70874N68894M49178L78361L76597M74838
4098B7102246L20430L08339L75820M51569M41381N22174M75380N60009P59323
$$ plain form
4089 31316671 31809091 32248524 32784968 33497810 34092196 34579473 35320302 36091845 36748165
4080 36748165 37479301 38242856 38976207 39968832 41269369 42327007 43103340 44133060 45317173
4071 45317173 46637180 48172800 49644122 51327922 52888000 54566135 56100392 57482155
4063 57482155 59020826 60521170 62209976 64053852 65915370 67880201 69910784 71940958
4055 71940958 74163696 76417508 78777239 81444728 84329563 87328833 90051337 93034102
4047 93034102 96051287 99416048 102800081 105960685 109413684 112858741 116385037 119580957
4039 119580957 122629233 125570042 128375037 130871397 133034945 135104032 136988796 138821988
4031 138821988 140277446 141432709 142540470 143523465 144180047 144469397 144602772 144082519 143351641
$$ packed form
4089C1316671M92420M39433N36444P12842N94386M87277P40829P71543O56320
4080C6748165P31136P63555P33351R92625J300537J057638P76333J029720J184113
4071D5317173J320007J535620J471322J683800J560078J678135J534257J381763
4063E7482155J538671J500344J688806J843876J861518J964831K030583K030174
4055G1940958K222738K253812K359731K667489K884835K999270K722504K982765
4047I3034102L017185L364761L384033L160604L452999L445057L526296L195920
4039A19580957L048276K940809K804995K496360K163548K069087J884764J833192
4031A38821988J455458J155263J107761R82995O56582K89350J33375n20253p30878
$$ plain form
4022 143351641 142353604 141353782 140101015 139017938 137649071 135973366 134322901 132698491
4014 132698491 130866497 128617881 126432150 124092291 121517007 118765310 116051238 113241457
4006 113241457 110668203 108050289 105230771 102750406 100222294 97805183 95476444 93151810
3998 93151810 90693229 88371654 86145912 84072251 82092906 79889718 77928790 76154636
3990 76154636 74299185 72367518 70797928 69332586 67835991 66668090 65537111 64106010
3982 64106010 62947471 61790859 60717583 59633632 58816326 57873992 56829351 56154007 55476063
3973 55476063 54835866 54080838 53495378 52800069 51986941 51399279 50531420 49495757 48328904
3964 48328904 47205583 46228198 45295268 44467344 43645155 43030840 42199760 41555051 41047835
$$ packed form
4022A43351641r98037r99822j252767j083077j368867j675705j650465j624410
4014A32698491j831994k248616k185731k339859k575284k751697k714072k809781
4006A13241457k573254k617914k819518k480365k528112k417111k328739k324634
3998I3151810k458581k321575k225742k073661j979345k203188j960928j774154
3990G6154636j855451j931667j569590j465342j496595j167901j130979j431101
3982F4106010j158539j156612j073276j083951q17306r42334j044641o75344o77944
3973E5476063o40197p55028n85460o95309q13128n87662q67859j035663j166853
3964D8328904j123321r77385r32930q27924q22189o14315q31080o44709n07216
$$ plain form
3955 41047835 40567321 40365318 40207089 40236599 40245576 40198131 40101235 40234932 40236397 40264827 40481072
3944 40481072 40666742 41082824 41513193 41752747 41859924 41951629 42219702 42330435 42402119 42306434
3934 42306434 42065602 41553483 41101559 40932371 40651484 40194880 40065338 39866547 39715607
3925 39715607 39722275 39681666 39533513 39400293 39370656 39356179 39448442 39624139 40085975 40272876
3915 40272876 40238432 40196639 40275294 40004987 39728554 39485769 39340690 39193656 39215008 39271221
3905 39271221 39285522 39352140 39131124 39055948 39123130 39006442 39175970 39259449 39440703 39752236
3895 39752236 40007220 40117356 40289944 40576788 40482196 40627276 40790875 41094966 40916968 40752222
3885 40752222 40574016 40187883 39896934 39601218 39593480 39588948 39701435 39811533 39913810 40127785
$$ packed form
3955D1047835m80514k02003j58229K9510Q977m7445r6896J33697J465K8430K16245
3944D0481072J85670M16082M30369K39554J07177R1705K68073J10733P1684r5685
3934D2306434k40832n12119m51924j69188k80887m56604j29542j98791j50940
3925C9715607O668m0609j48153j33220k9637j4477R2263J75697M61836J86901
3915D0272876l4444m1793P8655k70307k76433k42785j45079j47034K1352N6213
3905C9271221J4301O6618k21016p5176O7182j16688J69528Q3479J81254L11533
3895C9752236K54984J10136J72588K86844r4592J45080J63599L04091j77998j64746
3885D0752222j78206l86133k90949k95716p738m532J12487J10098J02277K13975
$$ plain form
3875 40127785 40409249 40506036 40822232 41189130 41445493 41760604 42211979 42685924 43060294 43325946
3865 43325946 43244995 43170816 43252973 43251211 43342960 43322286 43560747 43849300 44068974 44437566 45046106
3854 45046106 45431402 45817054 46403629 46678292 46976886 47336214 47806359 48098828 48448419
3845 48448419 48775194 49101565 49152493 49420833 49872610 50236836 50789358 51348341 51661413 51868781
3835 51868781 51971202 51886474 51368347 50912631 50368670 49902242 49050051 48404572 48297524 48204827
3825 48204827 48148002 47863118 47721643 47662136 47721691 47886938 47942820 47801742 47300525 46897649
3815 46897649 46593765 46137305 45861545 45530405 45610821 45517550 45441456 45361264 45458100 45663211
3805 45663211 45811991 45861679 45871511 45918787 45908298 45753823 45458551 45365567 45239839 45269605 45265901
$$ packed form
3875D0127785K81464R6787L16196L66898K56363L15111M51375M73945L74370K65652
3865D3325946q0951p4179Q2157j762R1749k0674K38461K88553K19674L68592O08540
3854D5046106L85296L85652N86575K74663K98594L59328M70145K92469L49591
3845D8448419L26775L26371N0928K68340M51777L64226N52522N58983L13072K07368
3835E1868781J02421q4728n18127m55716n43961m66428q52191o45479j07048r2697
3825D8204827n6825k84884j41475n9507N9555J65247N5882j41078n01217m02876
3815D6897649l03884m56460k75760l31140Q0416r3271p6094q0192R6836K05111
3805D5663211J48780M9688R832M7276j0489j54475k95272r2984j25728K9766l704
$$ plain form
3794 45265901 45186128 44928855 44541042 44387569 44265260 44216536 43953818 43989620 44003326 43914590
3784 43914590 43817904 43874290 43786815 43670656 43431666 43216616 42951940 43172023 43310960 43545822
3774 43545822 43814990 44135726 44576688 45046765 45503209 45712872 45683163 46037045 46447319 46493604
3764 46493604 46734739 46964274 47319442 47390589 48011559 48372016 48669004 49143080 49650283 50274142
3754 50274142 50838401 51394732 52027020 52586118 52961987 53361058 54023721 54428514 54912834
3745 54912834 55439781 56038545 56445791 57116124 58067541 58931656 59952451 61055590 62280630
3736 62280630 63605180 64883185 66340822 67831489 69212093 70534072 72009235 73671945
3728 73671945 75365168 76787132 78163288 79835109 81293779 82893189 84627458 86160008
$$ packed form
3794D5265901p9773k57273l87813j53473j22309m8724k62718L5802J3706q8736
3784D3914590r6686N6386q7475j16159k38990k15050k64676K20083J38937K34862
3774D3545822K69168L20736M40962M70077M56444K09663k9709L53882M10274M6285
3764D6493604K41135K29535L55168P1147O20970L60457K96988M74076N07203O23859
3754E0274142N64259N56331O32288N59098L75869L99071O62663M04793M84320
3745E4912834N26947N98764M07246O70333R51417Q64115J020795J103139J225040
3736F2280630J324550J278005J457637J490667J380604J321979J475163J662710
3728G3671945J693223J421964J376156J671821J458670J599410J734269J532550
$$ plain form
3720 86160008 87691085 88698488 89504274 89908783 90271317 90560227 90778294 91119309 91547007
3711 91547007 91999049 92524618 93306962 94091269 94730654 95406435 95885211 96248524 96282469 96127062
3701 96127062 95994328 95765046 95528505 95111249 95165918 95327772 95339126 95452593 95756166 95872826
3691 95872826 96038890 96518623 96983900 97520843 98445396 99409137 100702318 102204393 103398061
3682 103398061 104717172 105815006 107074429 108460019 109867775 111630840 113340915 115201306
3674 115201306 117691538 120591132 123600437 127084472 130745535 134785034 138894938 143345775
3666 143345775 148113455 152763158 157653362 162717269 167604751 172430226 177258320 182313879
3658 182313879 187200040 192014188 196770854 201500135 206022154 210208288 214242143 217985117
$$ packed form
3720H6160008J531077J007403Q05786M04509L62534K88910K18067L41015M27698
3711I1547007M52042N25569P82344P84307O39385O75781M78776L63313L3945j55407
3701I6127062j32734k29282k36541m17256N4669J61854J1354J13467L03573J16660
3691I5872826J66064M79733M65277N36943R24553R63741J293181J502075J193668
3682A03398061J319111J097834J259423J385590J407756J763065J710075J860391
3674A15201306K490232K899594L009305L484035L661063M039499M109904M450837
3666A43345775M767680M649703M890204N063907M887482M825475M828094N055559
3658A82313879M886161M814148M756666M729281M522019M186134M033855L742974
$$ plain form
3650 217985117 221548730 224782639 227740680 230487001 232908465 235025768 237070894 239020982
3642 239020982 241167090 243389536 245670020 248135443 250379967 252673917 254596991 256285576
3634 256285576 257973242 259382112 260840680 262305356 263769689 265482613 267249429 269242382
3626 269242382 271701960 274456478 277350424 280608789 284189879 287887766 292004604 296743769
3618 296743769 301822223 307353970 313634583 320516384 327915589 336227856 345449673 355415650
3610 355415650 365951920 377070901 388653511 399645024 409326063 417612231 423665473
3603 423665473 427097588 428057718 426823456 423833834 419517415 414417515 408878423 403141894
3595 403141894 397434642 391536534 385216096 378087539 369748851 359742334 347943668 334446604
$$ packed form
3650B17985117L563613L233909K958041K746321K421464K117303K045126J950088
3642B39020982K146108K222446K280484K465423K244524K293950J923074J688585
3634B56285576J687666J408870J458568J464676J464333J712924J766816J992953
3626B69242382K459578K754518K893946L258365L581090L697887M116838M739165
3618B96743769N078454N531747O280613O881801P399205Q312267R221817R965977
3610C55415650J0536270J1118981J1582610J0991513R681039Q286168O053242
3603D23665473L432115R60130j234262k989622m316419n099900n539092n736529
3595D03141894n707252n898108o320438p128557q338688j0006517j1798666j3497064
$$ plain form
3587 334446604 319293763 302884945 285637719 268158479 251226657 235251689 219926923
3580 219926923 205879828 192956434 181015946 170477874 161063317 152572838 144994869
3573 144994869 138039527 131983764 126820161 122140273 117696203 113664298 110080459 106785573
3565 106785573 103516565 100195706 97174629 94379500 91484660 88671798 85861950 83362473
3557 83362473 81034162 78584922 76213508 73963289 71602814 69420517 67590933 65649974
3549 65649974 63621326 61725574 59598153 57857534 56188476 54447318 52844173 51184614
3541 51184614 49612172 48121614 46650363 45326864 44166349 43009232 42087822 40911983
3533 40911983 39918657 38800233 37986521 37321473 36448191 35649595 34978843 34231409 33565411
$$ packed form
3587C34446604j5152841j6408818j7247226j7479240j6931822j5974968j5324766
3580B19926923j4047095j2923394j1940488j0538072r414557q490479p577969
3573A44994869o955342o055763n163603m679888m444070m031905l583839l294886
3565A06785573l269008l320859l021077k795129k894840k812862k809848k499477
3557H3362473k328311k449240k371414k250219k360475k182297j829584j940959
3549F5649974k028648j895752k127421j740619j669058j741158j603145j659559
3541E1184614j572442j490558j471251j323499j160515j157117r21410j175839
3533D0911983r93326j118424q13712o65048q73282p98596o70752p47434o65998
$$ plain form
3524 33565411 33075636 32521162 31821755 31140309 30538014 29909803 29260597 28524268 28081342
3515 28081342 27595942 26868721 26384493 25940475 25295316 25072410 24626928 24246620 24051129
3506 24051129 23628506 23154737 22824474 22617530 22340004 22009953 21589743 21379913 21203904
3497 21203904 21052003 20838863 20547556 20307113 20192188 20219717 20029027 19771662 19649155 19578192
3487 19578192 19459247 19529458 19406952 19357653 19351035 19045835 18784870 18673539 18648904 18642429 18567759
3476 18567759 18425732 18127008 18014037 17963133 17889803 17997354 18091471 18139554 18205603 18071219
3466 18071219 18175005 18295396 18337852 18372515 18654224 18768240 18725379 18915681 19017910 19028056
3456 19028056 18825593 18885049 18796624 18879685 18857116 18729231 18769964 18904382 18934641 18972535 18962718
$$ packed form
3524C3565411m89775n54474o99407o81446o02295o28211o49206p36329m42926
3515B8081342m85400p27221m84228m44018o45159k22906m45482l80308j95491
3506B4051129m22623m73769l30263k06944k77526l30051m20210k09830j76009
3497B1203904j51901k13140k91307k40443j14925K7529j90690k57365j22507p0963
3487A9578192j18945P0211j22506m9299o618l05200k60965j11331k4635o475p4670
3476A8567759j42027k98724j12971n0904p3330J07551R4117M8083O6049j34384
3466A8071219J03786J20391M2456L4663K81709J14016m2861J90302J02229J0146
3456A9028056k02463N9456q8425Q3061k2569j27885M0733J34418L0259L7894r817
$$ plain form
3445 18962718 19019003 19004001 19034171 19173483 19192280 19243948 19370204 19341163 19432543 19295575 19363298
3434 19363298 19561748 19603383 19689055 19808921 19864662 20004189 20207812 20160019 20287427 20334590
3424 20334590 20307926 20412113 20569895 20553025 20625723 20617752 20710792 20895460 20941142 21041298 21169451
3413 21169451 21443520 21658751 21728125 22058259 22173688 22409871 22626563 22925217 23214527 23464824
3403 23464824 23693451 23978214 24439195 24858235 25310633 25691987 26107022 26358594 26659044
3394 26659044 26779045 26994449 27171574 27421881 27677273 27854899 28015582 28127988 28515765
3385 28515765 28776847 28904126 29265765 29686351 29822708 30043775 30633809 31116973 31479767
3376 31479767 31924810 32609746 32970072 33385123 33800737 34299430 34969760 35759322 36353807
$$ packed form
3445A8962718N6285j5002L0170J39312J8797N1668J26256k9041R1380j36968O7723
3434A9363298J98450M1635Q5672J19866N5741J39527K03623m7793J27408M7163
3424B0334590k6664J04187J57782j6870P2698p971R3040J84668M5682J00156J28153
3413B1169451K74069K15231O9374L30134J15429K36183K16692K98654K89310K50297
3403B3464824K28627K84763M60981M19040M52398L81354M15035K51572L00450
3394B6659044J20001K15404J77125K50307K55392J77626J60683J12406L87777
3385B8515765K61082J27279L61639M20586J36357K21067N90034M83164L62794
3376C1479767M45043O84936L60326M15051M15614M98693O70330P89562N94485
$$ plain form
3367 36353807 37032519 37752180 38367246 39417173 40219469 40732583 41394761 42397209 43150310
3358 43150310 43964200 44890123 45686374 46718711 47773547 48797097 49811011 50908934 52201254
3349 52201254 53244297 54356770 55639240 56738856 57887357 58919370 59878228 60882325
3341 60882325 61629842 62533377 63497320 64511626 65337452 66249201 67120217 68222421 69282924
3332 69282924 70124256 71275760 72379582 73268258 74084805 74970870 75763946 76689018 77859217
3323 77859217 79075505 80378579 81978794 83983883 86259450 88639945 91509180 94576305
3315 94576305 98026902 101869514 105953447 110135721 114631283 119333113 124422348 129674416
3307 129674416 134773915 139939202 144708592 148797872 152208399 154618299 155619894 155035024
$$ packed form
3367C6353807O78712P19661O15066J049927Q02296N13114O62178J002448P53101
3358D3150310Q13890R25923P96251J032337J054836J023550J013914J097923J292320
3349E2201254J043043J112473J282470J099616J148501J032013R58858J004097
3341F0882325P47517R03535R63943J014306Q25826R11749Q71016J102204J060503
3332F9282924Q41332J151504J103822Q88676Q16547Q86065P93076R25072J170199
3323G7859217J216288J303074J600215K005089K275567K380495K869235L067125
3315I4576305L450597L842612M083933M182274M495562M701830N089235N252068
3307A29674416N099499N165287M769390M089280L410527K409900J001595n84870
$$ plain form
3299 155035024 152912809 149587416 145398229 140586315 135617453 130801064 126324424 122211717
3291 122211717 118571474 115395985 112802292 110695532 108571113 106149550 103533065 101186379
3283 101186379 98463651 95730295 92964043 90199108 87778022 85361160 83174991 81499924
3275 81499924 79909337 78476369 77325982 76134741 74917537 74187878 73701199 73520653 73213831
3266 73213831 73517175 74108709 73469298 72054701 70695687 69957242 69710840 69616129 69861627
3257 69861627 70703782 72076027 73094205 73191470 72181187 70974073 69266616 66694682 63604510
3248 63604510 60687822 58191197 56078610 54297818 52604827 51118393 50119173 49448939
3240 49448939 49104246 48958451 48927476 49070436 48067838 46337538 44916329 43834503 42986057
$$ packed form
3299A55035024k122215l325393m189187m811914m968862m816389m476640m112707
3291A22211717l640243l175489k593693k106760k124419k421563k616485k346686
3283A01186379k722728k733356k766252k764935k421086k416862k186169j675067
3275H1499924j590587j432968j150387j191241j217204p29659m86679j80546l06822
3266G3213831L03344N91534o39411j414597j359014p38445k46402r4711K45498
3257F9861627Q42155J372245J018178R7265j010283j207114j707457k571934l090172
3248F3604510k916688k496625k112587j780792j692991j486434r99220o70234
3240D9448939l44693j45795l0975J42960j002598j730300j421209j081826q48446
$$ plain form
3231 42986057 42532780 42067005 41693776 41323941 41327871 41571868 41968022 42640247 43432166 43690150
3221 43690150 43254025 42632027 42127743 41275842 40235774 39205620 38235763 37623771 37425901
3212 37425901 37353975 37307299 37549391 38137002 38803927 39646530 40895128 42178959 41597552
3203 41597552 39455740 37608721 35875605 34306988 32888310 31752332 30527543 29626051
3195 29626051 28904275 28129380 27658817 27325095 26928325 26767752 26600723 26508822 26596763 26649649
3185 26649649 27115395 27784853 28489173 29077909 29925003 30998179 32075020 33431946 34618397
3176 34618397 33847911 31855427 29808844 28149121 27029138 25657604 24396434 23661758
3168 23661758 22731539 22014462 21448039 20844957 20285007 19776566 19505209 19212941 18752988
$$ packed form
3231D2986057m53277m65775l73229l69835L930K43997L96154O72225P91919K57984
3221D3690150m36125o21998n04284q51901j040068j030154r69857o11992j97870
3212C7425901p1926m6676K42092N87611O66925Q42603J248598J283831n81407
3203D1597552k141812j847019j733116j568617j418678j135978j224789r01492
3195B9626051p21776p74895m70563l33722l96770j60573j67029r1901Q7941N2886
3185B6649649M65746O69458P04320N88736Q47094J073176J076841J356926J186451
3176C4618397p70486j992484k046583j659723j119983j371534j261170p34676
3168B3661758r30219p17077n66423o03082n59950n08441k71357k92268m59953
$$ plain form
3159 18752988 18615119 18426655 18210001 18013917 17869348 17591130 17282842 17136659 16982666
3150 16982666 16896232 16792672 16619060 16493840 16432689 16369012 16308829 16181928 15958314 15765382
3140 15765382 15740152 15557679 15476672 15328065 15296424 15116931 14884328 14702462 14632184 14537707
3130 14537707 14395806 14311277 14317216 14161235 13865827 13655411 13651205 13781235 13674799 13442291
3120 13442291 13217074 13138002 13086427 13040033 13128294 13122792 12941724 12796532 12753020 12769498 12764321
3109 12764321 12666552 12705497 12569516 12519649 12422021 12365753 12271028 12111184 12095625 12039725 11882974
3098 11882974 11920628 12012756 11979485 11937635 11721809 11488150 11479188 11387981 11505326 11528978 11407287
3087 11407287 11392805 11343257 11292490 11333397 11426284 11457277 11504878 11546171 11500698 11424922 11528907
$$ packed form
3159A8752988j37869j88464k16654j96084j44569k78218l08288j46183j53993
3150A6982666q6434j03560j73612j25220o1151o3677o0183j26901k23614j92932
3140A5765382k5230j82473q1007j48607l1641j79493k32603j81866p0278r4477
3130A4537707j41901q4529N939j55981k95408k10416m206J30030j06436k32508
3120A3442291k25217p9072n1575m6394Q8261n502j81068j45192m3512J6478n177
3109A2764321r7769L8945j35981m9867r7628n6268r4725j59844j5559n5900j56751
3098A1882974L7654R2128l3271m1850k15826k33659q962r1207J17345K3652j21691
3087A1407287j4482m9548n0767M0907R2887L0993M7601M1293m5473p5776J03985
$$ plain form
3076 11528907 11706811 11740089 11788661 11825377 11836025 11711308 11752170 11833883 11696995 11833538
3066 11833538 11884406 11953541 12119054 12207631 12347520 12439759 12630907 12815844 13086133 13485261
3056 13485261 13648543 13781639 13953665 14293604 14355454 14733732 15349735 15700811 16123838 16663365
3046 16663365 17009916 17480746 17886631 17934002 17751440 17748902 17691114 17504259 17502883 17691300
3036 17691300 17819933 17977241 18065632 18102385 18182235 18099034 17994240 18026254 18120915 18207300 18310157
3025 18310157 18475041 18854079 19219081 19382655 19819529 20287907 20776717 21423259 21961727
3016 21961727 22956209 23823667 24864048 25765845 26384160 26527387 26719636 26934642 26782133
3007 26782133 26708246 26983889 27240500 27725410 28175584 28456399 29023409 29312217 29570547 29900970
$$ packed form
3076A1528907J77904L3278M8572L6716J0648j24717M0862Q1713j36888J36543
3066A1833538N0868O9135J65513Q8577J39889R2239J91148J84937K70289L99128
3056A3485261J63282J33096J72026L39939O1850L78278O16003L51076M23027N39527
3046A6663365L46551M70830M05885M7371j82562k538n7788j86855j376J88417
3036A7691300J28633J57308Q8391L6753P9850q3201j04794L2014R4661Q6385J02857
3025A8310157J64884L79038L65002J63574M36874M68378M88810O46542N38468
3016B1961727R94482Q67458J040381R01797O18315J43227J92249K15006j52509
3007B6782133p3887K75643K56611M84910M50174K80815N67010K88808K58330L30423
$$ plain form
2997 29900970 30217713 30495197 30804354 31110066 31605122 32076761 32410341 32818921 33151370
2988 33151370 33572325 34000556 34363191 34934727 35374000 35942545 36531880 37145736 37627973
2979 37627973 38208155 38873220 39454766 40368965 41258578 42280536 43277916 44155491 45451821
2970 45451821 46813500 48091971 49587091 51016607 52450156 53507623 54297712 54584668
2962 54584668 54570031 54059084 53091212 51868481 50648019 49535853 48423641 47697613 47087916
2953 47087916 46651013 46406281 46480999 46407091 46815666 47436546 47975907 48584684 49356814 50296523
2943 50296523 51136198 51950318 52858584 53730153 54508440 55000344 55443785 55419082 54831384 54212815
2933 54212815 53337790 52320631 51053421 49600672 48036884 46566929 45137105 43808250
$$ packed form
2997B9900970L16743K77484L09157L05712M95056M71639L33580M08580L32449
2988C3151370M20955M28231L62635N71536M39273N68545N89335O13856M82237
2979C7627973N80182O65065N81546R14199Q89613J021958R97380Q77575J296330
2970D5451821J361679J278471J495120J429516J433549J057467P90089K86956
2962E4584668j4637n10947r67872j222731j220462j112166j112212p26028o09697
2953D7087916m36903k44732P4718p3908M08575O20880N39361O08777P72130R39709
2943E0296523Q39675Q14120R08266Q71569P78287M91904M43441k4703n87698o18569
2933E4212815q75025j017159j267210j452749j563788j469955j429824j328855
$$ plain form
2925 43808250 42690145 41685446 41036347 40341954 39900972 39530317 39205152 39081343 38904275
2916 38904275 38712329 38385352 37990461 37664167 37304582 36859991 36168481 35316186 34429756
2907 34429756 33367831 32101033 30854982 29730343 28512652 27219902 26135282 25057837
2899 25057837 24160979 23258873 22454109 21597613 20669464 20144029 19697524 19173741 18638821
2890 18638821 18176210 17833586 17295787 16765810 16518995 16158532 15670708 15143012 14879450
2881 14879450 14461259 14035138 13691032 13299988 12835498 12440517 12111424 11871291 11656404
2872 11656404 11349496 11298797 10952020 10562989 10233167 9946929 9830991 9625243 9374051 9093066
2862 9093066 9003216 8748440 8467680 8240400 8211505 8188941 7963632 7804015 7750264 7635998
$$ packed form
2925D3808250j118105j004699o49099o94393m40982l70655l25165j23809j77068
2916C8904275j91946l26977l94891l26294l59585m44591o91510q52295q86430
2907C4429756j061925j266798j246051j124639j217691j292750j084620j077445
2899B5057837q96858r02106q04764q56496r28149n25435m46505n23783n34920
2890A8638821m62611l42624n37799n29977k46815l60463m87824n27696k63562
2881A4879450m18191m26121l44106l91044m64490l94981l29093k40133k14887
2872A1656404l06908n0699l46777l89031l29822k86238j15938k05748k51192k80985
2862I093066q9850k54776k80760k27280k8895k2564k25309j59617n3751j14266
$$ plain form
2852 7635998 7350242 7374764 7372653 7307170 7185089 6930094 6975547 6758930 6674343 6665536 6470570
2841 6470570 6432774 6172002 6009122 5838500 5690547 5641731 5306728 5209958 5066981 4901764
2831 4901764 4856997 4797331 4666525 4742542 4728303 4598801 4353664 4480203 4323698 4316924 4337939
2820 4337939 4277049 4196624 4230316 4263036 4100116 4021999 3945197 3838554 3721310 3694731 3679802
2809 3679802 3710853 3366888 3351720 3574040 3385582 3130964 3029299 2891909 2935084 2923521
2799 2923521 3018550 2871633 2676987 2656622 2605111 2691551 2601792 2408462 2469671 2390636 2397955
2788 2397955 2319199 2281525 2335126 2327463 2435362 2354448 2137042 2147192 2180070 2390585 2351619
2777 2351619 2196777 2184230 2087017 1994316 1875184 1723442 1767687 1914136 1666706 1830622
$$ packed form
2852G635998k85756K4522k111o5483j22081k54995M5453k16617q4587q807j94966
2841F470570l7796k60772j62880j70622j47953m8816l35003r6770j42977j65217
2831D901764m4767n9666j30806P6017j4239j29502k45137J26539j56505o774K1015
2820D337939o0890q0425L3692L2720j62920p8117p6802j06643j17244k6579j4929
2809C679802L1051l43965j5168K22320j88458k54618j01665j37390M3175j1563
2799B923521R5029j46917j94646k0365n1511Q6440q9759j93330O1209p9035P319
2788B397955p8756l7674N3601p663J07899q0914k17406J0150L2878K10515l8966
2777B351619j54842j2547r7213r2701j19132j51742M4245J46449k47430J63916
$$ plain form
2767 1830622 1979323 1914116 1860326 1838746 1838047 1624820 1616071 1462480 1408473 1791394 1690002
2756 1690002 1687881 1757824 1764656 1728604 1686826 1683410 1570962 1535586 1606233 1685888 1775783 1731456
2744 1731456 1774055 1628687 1522658 1407401 1396212 1630964 1600459 1587894 1462928 1514037
2734 1514037 1473991 1405632 1291834 1305014 1346907 1574327 1492202 1499004 1461243 1454677 1272157
2723 1272157 1322678 1308371 1220702 1312454 1442033 1466820 1305535 1337669 1426240 1339593 1297322
2712 1297322 1408517 1373409 1139373 1186277 1284629 1307251 1266789 1321545 1314787 1151054 1187716
2701 1187716 1236977 1329781 1288551 1112368 1062952 1132718 1020619 1011995 1045069 1185655 1343853
2690 1343853 1270322 1305157 1206724 1124478 1151011 1129060 1145908 976689 1163543 1175171 1034387
$$ packed form
2767A830622J48701o5207n3790k1580o99k13227q749j53591n4007L82921j01392
2756A690002k121O9943O832l6052m1778l416j12448l5376P0647P9655Q9895m4327
2744A731456M2599j45368j06029j15257j1189K34752l0505j2565j24966N1109
2734A514037m0046o8359j13798J3180M1893K27420q2125O802l7761o566j82520
2723A272157N0521j4307q7669R1752J29579K4787j61285L2134Q8571q6647m2271
2712A297322J11195l5108k34036M6904R8352K2622m0462N4756o758j63733L6662
2701A187716M9261R2804m1230j76183m9416O9766j12099q624L3074J40586J58198
2690A343853p3531L4835r8433q2246K6533k1951J6848j69219J86854J1628j40784
$$ plain form
2679 1034387 1047904 1196363 1139348 1254311 1259256 1124228 1147121 1123633 1144296 1062355 993063
2668 993063 969882 887069 991426 1081515 1073005 1060453 1134614 1120590 1011336 1077945 1143964
2657 1143964 1077571 907104 933502 942238 959853 964479 1062646 942463 873354 896676 765960
2646 765960 708885 841260 866476 1019373 1084083 915940 832061 809484 871106 788342 923767
2635 923767 888647 762805 714375 680786 710135 713898 729966 710020 717046 723913 611827 613312
2623 613312 543335 611547 547244 516721 579614 713179 665927 738354 566136 567967 518731
2612 518731 485059 644452 501993 521383 579734 531675 623447 581455 412102 410597 641030
2601 641030 718786 537261 492805 498295 524458 464263 557676 560693 633493 613530 614385 594294
$$ packed form
2679A034387J3517J48459n7015J14963M945j35028K2893k3488K0663q1941o9292
2668I93063k3181q2813J04357R0089q510j2552P4161j4024j09254O6609O6019
2657A143964o6393j70467K6398Q736J7615M626R8167j20183o9109K3322j30716
2646G65960n7075J32375K5216J52897O4710j68143q3879k2577O1622q2764J35425
2635I23767l5120j25842m8430l3589K9349L763J6068j9946P026O867j12086J485
2623F13312o9977O8212o4303l0523O2893J33565m7252P2427j72218J831m9236
2612E18731l3672J59393j42459J9390N8351m8059R1772m1992j69353j505K30433
2601F41030P7756j81525m4456N490K6163o0195R3413L017P2800j9963Q55k0091
$$ plain form
2589 594294 571700 484458 290132 381772 363658 457538 485015 552698 557949 420553 351767
2578 351767 340115 394635 502832 472045 379668 318318 420111 424880 398276 450883 385028
2567 385028 264296 234231 253106 222668 83184 17873 125045 73248 81199 268643 365490
2556 365490 424949 263222 163813 270067 207651 226219 88705 214907 242179 381514 367915
2545 367915 256283 207366 286906 289985 330318 366893 266993 362573 370051 250776 232289 216287
2533 216287 281627 212584 75229 18691 271579 217150 171010 364319 234582 101548 66052
2522 66052 56345 195648 269383 178247 200172 209326 25964 9312 30335 97063 124430 70592
2510 70592 11252 182406 119166 8963 53027 204540 157651 -86437 10126 244488 380436
$$ packed form
2589E94294k2594q7242j94326R1640j8114R3880K7477O7683N251j37396o8786
2578C51767j1652N4520J08197l0787r2377o1350J01793M769k6604N2607o5855
2567C85028j20732l0065J8875l0438j39484o5311J07172n1797P951J87444R6847
2556C65490N9459j61727r9409J06254o2416J8568j37514J26202K7272J39335j3599
2545C67915j11632m8917P9540L079M0333L6575r9900R5580P478j19275j8487j6002
2533B16287O5340o9043j37355n6538K52888n4429m6140J93309j29737j33034l5496
2522F6052r707J39303P3735r1136K1925R154j83362j6652K1023O6728K7367n3838
2510G0592n9340J71154o3240j10203M4064J51513m6889k44088R6563K34362J35948
$$ plain form
2499 380436 257128 255237 156541 111578 138442 88630 72439 -3491 -79387 92368 237845
2488 237845 66414 -7115 1440 20029 47673 -161266 -133996 -142558 -167773 -67045 32672
2477 32672 78085 -9247 9917 64479 78388 56309 35537 -35622 79547 138579 7275
2466 7275 -103825 -137573 -60180 -108694 7093 -29238 -86123 16123 5492 70 11024 -28118
2454 -28118 -6011 157934 66925 -84908 -62560 -104313 19495 -26021 -3263 8678 19269
2443 19269 -41501 -59439 -25486 -122988 -1941 -22623 -95879 2866 57383 174891 186151
2432 186151 92513 -38668 -26212 -15138 -17642 -24459 55206 43558 -19442 -41780 -142855 -24627
2420 -24627 121475 78208 -36289 -114774 -111666 -41659 -163760 -175660 -80156 28952 -48219
$$ packed form
2499C80436j23308j891r8696m4963K6864m9812j6191p5930p5896J71755J45477
2488B37845j71431p3529Q555J8589K7644k08939K7270q562k5215J00728R9717
2477C2672M5413q7332J9164N4562J3909k2079k0772p1159J15169N9032j31304
2466G275j11100l3748P7393m8514J15787l6331n6885J02246j0631n422J0954l9142
2454b8118K2107J63945r1009j51833K2348m1753J23808m5516K2758J1941J0591
2443A9269o0770j7938L3953r7502J21047k0682p3256R8745N4517J17508J1260
2432A86151r3638j31181J2456J1074k504o817P9665j1648o3000k2338j01075J18228
2420b4627J46102m3267j14497p8485L108P0007j22101j1900R5504J09108p7171
$$ plain form
2409 -48219 -113483 -58855 -77064 36357 36330 -142473 -206889 -190440 -239574 -173995 -21520 57226
2397 57226 -23040 -110594 -157119 -23776 -2088 126384 71555 -136260 -11280 -18730 -31862
2386 -31862 45421 -66317 -238928 -258464 -66918 78364 53730 8623 38343 56840 69559
2375 69559 -43940 -224823 -158688 -50900 -17689 -101043 -261635 -191317 -206086 -360692 -310646
2364 -310646 -348510 -375538 -227225 -207017 -154615 -235716 -218270 -354617 -195396 -109344 -311237
2353 -311237 -200924 -46754 97939 143349 15479 -77642 -153166 -322415 -301203 -179712
2343 -179712 6867 -173428 -36726 -63380 -171376 -159872 -26591 40349 23720 -95042
2333 -95042 -228854 -206332 -81765 59298 39897 44002 -9590 -29547 -123281 -378972 -316360
$$ packed form
2409d8219o5264N4628j8209J13421k7j78803o4416J6449m9134O5579J52475P8746
2397E7226q0266q7554m6525J33343K1688J28472n4829k07815J24980p450j3132
2386c1862P7283j11738j72611j9536J91546J45282k4634m5107K9720J8497J2719
2375F9559j13499j80883O6135J07788L3211q3354j60592P0318j4769j54606N0046
2364c10646l7864k7028J48313K0208N2402q1101J7446j36347J59221Q6052k01893
2353c11237J10313J54170J44693M5410j27870r3121p5524j69249K1212J21491
2343a79712J86579j80295J36702k6654j07996J1504J33281O6940j6629j18762
2333i5042j33812K2522J24567J41063j9401M105n3592j9957r3734k55691O2612
$$ plain form
2322 -316360 -291256 -226303 9784 -150238 -198316 -86047 -57129 -115076 -96328 -155364 -65729
2311 -65729 -127506 -175802 -119982 -155848 -96560 -69738 24788 154445 31591 -106311 -154921
2300 -154921 9187 -36046 -91709 -64861 -136324 -84217 -154785 81769 153568 175923 34351
2289 34351 75725 136616 90585 44943 -17982 -207044 24216 121081 152897 113574 -3328
2278 -3328 17215 82147 77400 109123 148045 63866 22264 64421 118637 -191923 -203378 -60741
2266 -60741 -176715 -209602 -101221 11168 193352 233737 169384 106195 -13446 -42608 138403
2255 138403 93360 117387 164364 82465 163599 254216 241251 384378 238698 211514 115504
2244 115504 165146 268005 435379 490059 539227 508987 634265 659933 490779 550724 598746
$$ packed form
2322c16360K5104O4953K36087j60022m8078J12269K8918n7947J8748n9036Q9635
2311f5729o1777m8296N5820l5866N9288K6822R4526J29657j22854j37902m8610
2300a54921J64108m5233n5663K6848p1463N2107p0568K36554P1799K2355j41572
2289C4351M1374O0891m6031m5642o2925j89062K31260R6865L1816l9323j16902
2278c328K0543O4932m747L1723L8922q4179m1602M2157N4216l10560j1455J42637
2266f0741j15974l2887J08381J12389J82184M0385o4353o3189j19641k9162J81011
2255A38403m5043K4027M6977q1899Q1134R0617j2965J43127j45680k7184r6010
2244A15504M9642J02859J67374N4680M9168l0240J25278K5668j69154N9945M8022
$$ plain form
2233 598746 752242 622760 604350 610315 557417 508470 552455 580824 560749 515424 599061
2222 599061 713173 830997 891600 868872 707807 745744 894518 1029871 1134087 1100926
2212 1100926 994641 1139365 1255193 1323375 1462355 1421365 1302267 1358938 1467793 1539792
2202 1539792 1508155 1465424 1489258 1485613 1655963 1864688 1927474 1874419 2038625 2151046 2117008
2191 2117008 2323576 2488518 2543088 2777470 2864996 3133391 3533551 3799615 4044891 4469691
2181 4469691 4781643 5099682 5552147 6068905 6718495 7532731 8450941 9643924 11036664
2172 11036664 13172833 15523260 18267398 21502905 25774702 28098282 25236309 21430776
2164 21430776 18600873 16576823 14674247 12861466 11006944 9600802 8509805 7293036
$$ packed form
2233E98746J53496j29482j8410N965n2898m8947M3985K8369k0075m5325Q3637
2222E99061J14112J17824O0603k2728j61065L7937J48774J35353J04216l3161
2212A100926j06285J44724J15828O8182J38980m0990j19098N6671J08855P1999
2202A539792l1637m2731K3834l645J70350K08725O2786n3055J64206J12421l4038
2191B117008K06568J64942N4570K34382Q7526K68395M00160K66064K45276M24800
2181D469691L11952L18039M52465N16758O49590Q14236R18210J192983J392740
2172A1036664K136169K350427K744138L235507M271797K323580k861973l805533
2164B1430776k829903k024050j902576j812781j854522j406142j090997j216769
$$ plain form
2156 7293036 6563185 5902491 5237973 4860527 4628204 4215557 3838373 3639422 3204025 2797195
2146 2797195 2738701 2440119 2079029 1999902 2059712 1870748 1776845 1683026 1593408 1487127 1483283
2135 1483283 1301713 965634 846065 799130 838181 858071 664871 742448 722051 831710
2125 831710 762306 650776 792554 715375 589433 475271 489367 462559 384712 380979 289674
2114 289674 299612 361793 396708 430616 419602 360031 264432 283547 355364 400192 478689 350137
2102 350137 361027 236851 355866 371262 242818 238421 255224 175235 97555 122589 155302
2091 155302 172706 95180 250532 261217 283515 178201 133921 -122031 -202050 -98177 43291
2080 43291 -151875 -218259 -166234 -111402 -167028 -205365 -146739 -111085 -59340 -4772 -21925 79757
$$ packed form
2156G293036p29851o60694o64518l77446k32323m12647l77184j98951m35397m06830
2146B797195n8494k98582l61090p9127N9810j88964r3903r3819q9618j06281l844
2135A483283j81570l36079j19569m6935L9051J9890j93200P7577k0397J09659
2125H31710o9404j11530J41778p7179j25942j14162J4096k6808p7847l733r1305
2114B89674R938O2181L4915L3908j1014n9571r5599J9115P1817M4828P8497j28552
2102C50137J0890j24176J19015J5396j28444m397J6803p9989p7680K5034L2713
2091A55302J7404p7526J55352J0685K2298j05314m4280k55952q0019J03873J41468
2080D3291j95166o6384N2025N4832n5626l8337N8626L5654N1745N4568j7153J01682
$$ plain form
2068 79757 -60463 -159037 -157011 -98140 -161689 -95899 -148710 -128844 -184707 -59756 -94610 -176908
2056 -176908 -108653 -90148 -122132 -38893 -86697 -77784 98739 -101007 -224082 -353476 -312495
2045 -312495 -194799 -288348 -182415 -103276 -65571 -99750 -66392 -50017 -142685 -134049 -241208
2034 -241208 -78884 -130531 -208441 -221944 -182845 -162315 -217802 -280670 -180266 -120631 -60503
2023 -60503 -24716 -88302 -240279 -203450 -231085 -111953 8691 -91431 -281259 -58907 137344
2012 137344 -73443 -200992 -190443 -116283 -82418 -29903 -170549 -171162 -108084 -220709 -208462
2001 -208462 -91824 19478 92516 -104169 -264635 -497748 -532179 -509735 -426129 -204976
1991 -204976 -435141 -322366 -172866 -145062 -78603 -164333 -235719 -107783 -183048 -195045 -290861
$$ packed form
2068G9757j40220r8574K026N8871o3549O5790n2811J9866n5863J24951l4854q2298
2056a76908O8255J8505l1984Q3239m7804Q913J76523j99746j23075j29394M0981
2045c12495J17696r3549J05933P9139L7705l4179L3358J6375r2668Q636j07159
2034b41208J62324n1647p7910j3503L9099K0530n5487o2868J00404N9635O0128
2023f0503L5787o3586j51977L6829k7635J19132J20644j00122j89828K22352J96251
2012A37344k10787j27549J0549P4160L3865N2515j40646o13O3078j12625J2247
2001b08462J16638J11302P3038j96685j60466k33113l4431K2444Q3606K21153
1991b04976k30165J12775J49500K7804O6459q5730p1386J27936p5265j1997r5816
$$ plain form
1980 -290861 -83163 25322 -160349 -242932 -178023 -96154 -15266 -41512 -30945 -23694 -30112
1969 -30112 -28310 30219 -75552 -20913 -83953 -207455 -257896 -185389 -119159 -162193 -172721 -177951
1957 -177951 -141847 -116113 -157321 -345251 -168821 37141 80312 -66357 -106177 -213021 -139846
1946 -139846 -179808 -196855 -318957 -229010 -202817 -196348 -304668 -61500 20726 -54108 -100751
1935 -100751 -99918 -281502 -239056 -165121 -107679 -130464 40239 56115 -82744 -129294 -221653
1924 -221653 -193151 -153677 -87753 -113325 -71761 -291019 -96926 -124037 9039 38059 67691
1913 67691 -209340 -156016 -78397 9348 -79162 -87159 -7159 -106898 -151086 -12078 -55607 -51513
1901 -51513 47314 -34054 -38130 127299 54618 -33151 46521 -109 -161947 -175994 -158245 -187674
$$ packed form
1980b90861K07698J08485j85671q2583O4909Q1869Q0888k6246J0567P251o418
1969c0112J802N8529j05771N4639o3040j23502n0441P2507O6230m3034j0528n230
1957a77951L6104K5734m1208j87930J76430K05962M3171j46669l9820j06844P3175
1946a39846l9962j7047j22102Q9947K6193O469j08320K43168Q2226p4834m6643
1935a00751Q33j81584M2446P3935N7442k2785J70703J5876j38859m6550r2359
1924b21653K8502L9474O5924k5572M1564k19258J94093k7111J33076K9020K9632
1913F7691k77031N3324P7619Q7745q8510p997Q0000r9739m4188J39008m3529M094
1901e1513R8827q1368m076J65429p2681q7769P9672m6630j61838j4047J7749k9429
$$ plain form
1889 -187674 -160995 -264070 -199595 -108454 -158243 -119286 -158136 -78675 -116930 -149863 -52436
1878 -52436 -70993 12861 45982 52744 -112913 -138864 -138191 -176655 -77067 -57061 -190293 -14730
1866 -14730 -138502 -142096 -49124 -79668 -128628 -252494 -45110 -146946 -189200 -133777 -225953
1855 -225953 -150181 -172846 -24889 -222147 -98301 -221034 -130816 -271675 -352046 -319312 -248595
1844 -248595 -31616 -82443 -62391 -60821 -168478 -164307 10154 7365 -31258 -99858 -58120 -6842
1832 -6842 -90603 -195912 -171421 -178005 -222693 -43628 57764 -74708 -193292 -215961 -51571
1821 -51571 -17835 -94313 -25696 -94360 -75150 -175157 -129321 -94355 -146119 -217964 -224003 -247838
1809 -247838 -117451 -95629 -174874 -292445 -221776 -77251 -121803 -156028 -55957 -181893 -213377
$$ packed form
1889a87674K6679j03075O4475R1141m9789L8957l8850P9461l8255l2933R7427
1878e2436j8557Q3854L3121O762j65657k5951O73l8464R9588K0006j33232J75563
1866a4730j23772l594R2972l0544m8960j23866K07384j01836m2254N5423r2176
1855b25953P5772k2665J47957j97258J23846j22733R0218j40859q0371L2734P0717
1844b48595K16979n0827K0052J570j07657M171J74461k789l8623o8600M1738N1278
1832f842q3761j05309K4491o584m4688J79065J01392j32472j18584k2669J64390
1821e1571L3736p6478O8617o8664J9210j00007M5836L4966n1764p1845o039k3835
1809b47838J30387K1822p9245j17571P0669J44525m4552l4225J00071j25936l1484
$$ plain form
1798 -213377 -195735 -229228 -164255 -372572 -187585 -59416 -34641 -93497 -47060 -82788 -53232
1787 -53232 82349 27039 -185847 -30768 -15928 -86184 -82026 -191873 -290687 -262561 -304908
1776 -304908 -230174 -197195 -253357 -178224 -15826 -85882 -248477 -203610 -65948 -114141 -117207
1765 -117207 -235155 -316638 -344430 -335372 -255437 -193702 -62773 -178205 -182818 -122032 -63946
1754 -63946 -99541 -107489 15673 -1155 -138488 -139519 -122164 -243010 -126853 -234129 -184394
1743 -184394 -143658 -9223 32067 -136184 -59203 -19926 -177194 -210990 -177633 -63474 -76550
1732 -76550 -117261 -173907 -117760 -95649 -199582 -179544 -195189 -289317 -204592 -187632 -71880
1721 -71880 -105763 -104067 -77926 -13721 -144897 -240845 -115464 -16509 29409 -174378 -197976
$$ packed form
1798b13377J7642l3493O4973k08317J84987J28169K4775n8856M6437l5728K9556
1787e3232J35581n5310k12886J55079J4840p0256M158j09847r8814K8126m2347
1776c04908P4734L2979n6162P5133J62398p0056j62595M4867J37662m8193l066
1765a17207j17948q1483k7792R058P9935O1735J30929j15432m613O0786N8086
1754f3946l5595p948J23162j6828j37333j031J7355j20846J16157j07276M9735
1743a84394M0736J34435M1290j68251P6981L9277j57268l3796L3357J14159j3076
1732g6550m0711n6646N6147K2111j03933K0038j5645r4128Q4725J6960J15752
1721g1880l3883J696K6141O4205j31176r5948J25381R8955M5918k03787k3598
$$ plain form
1710 -197976 -295382 -125712 -111944 -126385 -190683 -239723 -173584 -217005 -70042 -39540 30782
1699 30782 25573 -86685 -191039 -290321 -361385 -303072 -212024 -310437 -190373 -85377 -127123
1688 -127123 -110395 -277802 -355509 -322580 -229514 -101530 -169211 -125261 -236416 -100183 -91316
1677 -91316 -112965 -297868 -185757 -179305 -122046 -141604 -125878 -104364 -58654 -154457 -130221 -6252
1665 -6252 -75827 -168930 -161109 -183533 -292854 -272421 -139740 -233084 -257416 -225925 -176202 -232922
1653 -232922 -217367 -149124 -162885 -223550 -117921 14346 -51941 -91337 -119866 24468 -37394
1642 -37394 -204115 -163437 -136336 -246228 -167192 -164919 -63536 -158579 -178647 -218281 -128026
1631 -128026 -183059 -2411 -30818 -133001 -112129 -191990 -156400 -101507 -33388 -184724 -315864
$$ packed form
1710a97976r7406J69670J3768j4441o4298m9040O6139m3421J46963L0502P0322
1699C0782n209j12258j04354r9282p1064N8313R1048r8413J20064J04996m1746
1688a27123J6728j67407p7707L2929R3066J27984o7681M3950j11155J36233Q867
1677i1316k1649j84903J12111O452N7259j9558J5726K1514M5710r5803K4236J23969
1665f252o9575r3103P821k2424j09321K0433J32681r3344k4332L1491M9723n6720
1653b32922J5555O8243j3761o0665J05629J32267o6287l9396k8529J44334o1862
1642c7394j66721M0678K7101j09892P9036K273J01383r5043k0068l9634R0255
1631a28026n5033J80648k8407j02183K0872p9861L5590N4893O8119j51336j31140
$$ plain form
1620 -315864 -167774 -53432 -61632 4603 -134581 -221549 -131021 -284389 -300782 -274194 -190591
1609 -190591 71747 57007 2942 30083 -132935 -161697 -186372 -150757 -134159 -253380 -200132
1598 -200132 -69386 -15607 -73525 -47186 -85757 -90823 -180336 -154313 -137356 -157753 -246307 -244528
1586 -244528 -83850 -103917 2856 -33829 -153010 -149280 -300053 -145791 -4951 -73654 96802
1575 96802 -6276 -216864 -220202 -110569 3339 36377 -9057 -151806 -182721 -127737 -105862
1564 -105862 -144231 -51361 -106236 -145468 -119547 -117509 -152712 -182922 -112344 -173590 -205782 -61925
1552 -61925 11240 -23197 88653 -63892 -44579 -38621 -2464 -105836 -214432 -19464 -86233
1541 -86233 -164094 -151604 -67675 -16387 -52142 6318 53789 -82473 -130452 -173656 -157370 -58362
$$ packed form
1620c15864J48090J14342q200O6235j39184q6968R0528j53368j6393K6588Q3603
1609a90591K62338j4740n4065K7141j63018k8762k4675L5615J6598j19221N3248
1598b00132J30746N3779n7918K6339l8571n066q9513K6023J6957k0397q8554J779
1586b44528J60678k0067J06773l6685j19181L730j50773J54262J40840o8703J70456
1575I6802j03078k10588l338J09633J13908L3038m5434j42749l0915N4984K1875
1564a05862l8369R2870n4875l9232K5921K038l5203l0210P0578o1246l2192J43857
1552f1925P3165l4437J11850j52545J9313N958L6157j03372j08596J94968o6769
1541h6233p7861J2490Q3929N1288l5755N8460M7471j36262m7979m3204J6286R9008
$$ plain form
1529 -58362 -138863 -154156 -252013 -105939 -200857 -134567 -73936 -235064 -185746 -170013 -93967
1518 -93967 -186889 -117243 -170117 -195832 -187016 -182362 -223897 -108029 -14260 -118036 -92160 -88909
1506 -88909 -178513 -116333 -24365 -967 -5034 77770 108434 -3733 27768 -47813 -131453 -14581
1494 -14581 -33339 -159348 -163653 -117046 -23151 -66622 95820 12790 -124439 -75704 -9570
1483 -9570 13077 -79331 -13822 -110888 -91311 -44827 -36392 -137749 -56786 -26859 -31521 -66274
1471 -66274 -140185 -163999 -149356 24436 43879 -73591 -76873 -221211 -57942 135523 112475
1460 112475 133954 -2702 -27038 -119082 -217051 -149205 -163602 -64207 20266 -87424 -144625
1449 -144625 -235782 -132997 27104 -42077 -49426 -61199 -33895 -192221 -151787 -47409 -88731
$$ packed form
1529e8362q0501j5293r7857J46074r4918O6290O0631j61128M9318J5733P6046
1518i3967r2922O9646n2874k5715Q816M654m1535J15868R3769j03776K5876L251
1506h8909q9604O2180R1968K3398m067Q2804L0664j12167L1501p5581q3640J16872
1494a4581j8758j26009m305M6607R3895m3471J62442q3030j37229M8735O6134
1483i570K2647r2408O5509r7066J9577M6484Q435j01357Q0963K9927m662l4753
1471f6274p3911k3814J4643J73792J9443j17470l282j44338J63269J93465k3048
1460A12475K1479j36656k4336r2044r7969O7846j4397R9395Q4473j07690n7201
1449a44625r1157J02785J60101o9181p349j1773K7304j58326M0434J04378m1322
$$ plain form
1438 -88731 -33825 -126093 -296053 -308522 -98599 -48570 -26412 -204106 -230955 -257509 -41183
1427 -41183 -177405 -210914 -285219 -177965 -19290 -64277 -59202 -128397 -180936 -237987 -153971
1416 -153971 -142729 -150861 -160500 -126753 -142874 -168886 -89047 -23860 85306 125049 226690 162220
1404 162220 -70691 -286432 -307354 -167312 -226102 -258739 -196424 -61914 11490 1418 -172048
1393 -172048 -162703 21785 41696 -20112 -69242 -209818 27692 47355 -86744 -130238 -235929
1382 -235929 -167812 85162 18209 -58996 -130617 -230358 -106002 24045 -158460 -41588 31530
1371 31530 -114098 9498 -148752 -30768 -67674 -170056 -85846 136222 344591 221221
1361 221221 -19492 26251 13282 -46861 -7794 -103754 -67259 -252039 -23159 54382 -15673
$$ packed form
1438h8731N4906r2268j69960j2469K09923N0029K2158j77694k6849k6554K16326
1427d1183j36222l3509p4305J07254J58675m4987N075o9195n2539n7051Q4016
1416a53971J1242q132r639L3747j6121k6012P9839O5187J09166L9743J01641o4470
1404A62220k32911k15741k0922J40042n8790l2637O2315J34510P3404j0072j73466
1393a72048R345J84488J9911o1808m9130j40576K37510J9663j34099m3494j05691
1382b35929O8117K52974o6953p7205p1621r9741J24356J30047j82505J16872P3118
1371C1530j45628J23596j58250J17984l6906j02382Q4210K22068K08369j23370
1361B21221k40713M5743j2969o0143L9067r5960L6495j84780K28880P7541p0055
$$ plain form
1350 -15673 -75139 -10841 52468 119190 68852 -129588 -119701 -38260 -78618 57397 25003 8972
1338 8972 55577 -68478 -93588 -269377 -123296 126688 43254 120404 150330 54977 -164149
1327 -164149 -150880 -22346 -201257 -186725 22458 -136060 -180861 4859 -5520 -174546
1317 -174546 -166589 -173732 -113955 -30951 -241516 -149674 -32817 19959 -59153 -67945 33565 139747
1305 139747 64401 117983 30259 -109132 -24460 56895 -159831 -138243 -128919 -2654 -44278
1294 -44278 -215 76159 65883 -4959 -93093 -42265 69130 77109 3301 -48657 -141903 -1328
1282 -1328 173788 80112 64817 191728 237296 128946 139390 74367 56686 64584 51671 136656
1270 136656 95127 156569 24142 -252146 -75590 -30846 -255730 -200324 -10607 159397
$$ packed form
1350a5673n9466O4298O3309O6722n0338j98440R887Q1441m0358J36015l2394j6031
1338H972M6605j24055k5110j75789J46081K49984q3434P7150K9926r5353k19126
1327a64149J3269J28534j78911J4532K09183j58518m4801J85720j0379j69026
1317a74546P957p143N9777Q3004k10565R1842J16857N2776p9112q792J01510J06182
1305A39747p5346N3582q7724j39391Q4672Q1355k16726K1588R324J26265m1624
1294d4278M4063P6374j0276p0842q8134N0828J11395P979p3808n1958r3246J40575
1282a328J75116r3676j5295J26911M5568j08350J0444o5023j7681P898j2913Q4985
1270A36656m1529O1442j32427k76288J76556M4744k24884N5406J89717J70004
$$ plain form
1260 159397 84734 38632 -42630 -34157 -195395 -113616 -16311 107451 31914 -147857 89512
1249 89512 189809 13118 -166017 -247555 -82851 -51321 45242 171677 122655 26537 39576
1238 39576 22319 -10333 -52283 -19551 -51199 -39571 -37326 -15236 162755 -184048 -147463 -122175
1226 -122175 -112276 -69358 -185304 -208584 -33060 73715 99436 237632 117534 -140796 -181815
1215 -181815 -198981 -87459 -18289 -108559 -49210 -182835 -138342 81634 65165 -101181 -317096
1204 -317096 -157887 52804 145968 209971 39037 -65378 -23489 48262 -36551 -68186 9396
1193 9396 31746 201551 170470 71758 -57650 9424 89642 75885 49444 -56065 -60704 -10711
1181 -10711 52891 49373 -1305 -55332 -57166 -200704 -179799 -37766 44413 62986 -56506 -199104
$$ packed form
1260A59397p4663m6102q1262Q473j61238Q1779R7305J23762p5537j79771K37369
1249H9512J00297j76691j79135q1538J64704L1530R6563J26435m9022r6118J3039
1238C9576j7257l2652m1950L2732l1648J1628K245K2090J77991l46803L6585K5288
1226a22175R899M2918j15946k3280J75524J06775K5721J38196j20098k58330m1019
1215a81815j7166J11522O9170r0270N9349j33625M4493K19976j6469j66346k15915
1204c17096J59209K10691R3164O4003j70934j04415M1889P1751q4813l1635P7582
1193I396K2350J69805l1081r8712j29408O7074Q0218j3757k6441j05509m639M9993
1181a0711O3602l518n0678n4027j834j43538K0905J42033Q2179J8573j19492j42598
$$ plain form
1169 -199104 -271223 -141425 -156665 -157760 -126187 -211965 -171038 -96345 46443 263147 187604
1158 187604 106466 41666 -38191 85937 91937 33714 69178 70620 -106762 -136327 -28921
1147 -28921 104044 108427 123402 45079 -12318 -44598 -12103 -66850 -88716 -97707 -24598 81921
1135 81921 -35333 -127087 130849 104781 -60979 -58876 100350 188232 350049 202658 236260
1124 236260 202430 69095 117697 66914 -33830 185962 126636 249293 334238 300232 93276
1113 93276 89549 189947 24294 92832 22776 112743 -2963 -42783 72628 32566 -6766
1102 -6766 53946 78854 131456 33594 39324 -22679 46310 -77310 -1941 74770 261808 194535
1090 194535 163553 -35327 -9873 182804 82309 -82840 -163742 -31161 286565 39735
$$ packed form
1169a99104p2119J29798j5240j095L1573q5778M0927P4693J42788K16704p5543
1158A87604q1138o4800p9857J24128O000n8223L5464J442j77382k9565J07406
1147b8921J32965M383J4975p8323n7397l2280L2495n4747k1866q991P3109J06519
1135H1921j17254r1754K57936k6068j65760K103J59226Q7882J61817j47391L3602
1124B36260l3830j33335M8602n0783j00744K19792n9326J22657Q4945l4006k06956
1113I3276l727J00398j65653O8538p0056Q9967j15706l9820J15411m0062l9332
1102f766O0712K4908N2602r7862N730o2003O8989j23620P5369P6711J87038o7273
1090A94535l0982j98880K5454J92677j00495j65149q0902J32581L17726k46830
$$ plain form
1080 39735 -30103 32336 -191479 -65411 -56990 -13352 -81994 -58270 -34252 -107099 81643
1069 81643 22773 -83587 69019 32301 53944 -16960 -17451 33254 -78521 -116100 -122044 20371
1057 20371 -10466 74308 61318 178215 68840 -76541 33662 -99084 -68015 -66614 -78995
1046 -78995 -136334 -63437 7473 -15671 31756 -88078 -25020 135433 82117 37774 98388
1035 98388 42419 185355 103935 -207987 -306392 -193664 92351 30401 18100 78756 69363
1024 69363 129609 141208 72485 51015 -79576 26824 55305 -912 -76644 -110937 5415
1013 5415 150350 299530 259205 326487 186459 135734 131431 -65488 -61832 -74263 446 -138446
1001 -138446 16662 -115474 -139386 -62525 -166575 -82055 101386 124375 167758 212651 143218
$$ packed form
1080C9735o9838O2439k23815J26068Q421M3638o8642K3724K4018p2847J88742
1069H1643n8870j06360J52606l6718K1643p0904m91N0705j11775l7579n944J42415
1057B0371l0837Q4774j2990J16897j09375j45381J10203j32746L1069J401j2381
1046g8995n7339P2897P0910k3144M7427j19834O3058J60453n3316m4343O0614
1035I8388n5969J42936q1420l11922r8405J12728K86015o1950j2301O0656r393
1024F9363O0246J1599o8723k1470j30591J06400K8481n6217p5732l4293J16352
1013E415J44935J49180m0325O7282j40028n0725m303j96919L656j2431P4709j38892
1001a38446J55108j32136k3912P6861j04050Q4520J83441K2989M3383M4893o9433
$$ plain form
990 143218 71314 -20050 -11967 -32106 -62003 -141351 -263559 -140748 43673 129441 78485
979 78485 -128854 93676 178023 32230 -32661 -29555 -94841 -75370 68956 -36194 73623
968 73623 175546 119504 214728 -57585 -5825 59496 55447 2661 95064 -43965 -148623
957 -148623 14710 -11983 54129 -19462 21485 55077 -9915 -7960 20020 89423 151292 -6714
945 -6714 -867 30789 -3053 89126 87222 221549 192303 67974 95148 121382 88584 7115
933 7115 44287 1850 91144 120542 19888 41242 91542 -84309 -14974 -72392 -52013 69600
921 69600 -32472 -208140 -115598 -53403 -98664 136243 121553 17842 313 26667 -42531
910 -42531 -83127 -128167 82809 106003 22589 120333 109998 67139 67935 -71575 2398 161054
$$ packed form
990A43218p1904r1364Q083k0139k9897p9348j22208J22811J84421Q5768n0956
979G8485k07339K22530Q4347j45793o4891L106o5286J9471J44326j05150J09817
968G3623J01923n6042R5224k72313N1760O5321m049n2786R2403j39029j04658
957a48623J63333k6693O6112p3591M0947L3592o4992J955K7980O9403O1869j58006
945f714N847L1656l3842R2179j904J34327k9246j24329K7174K6234l2798q1469
933G115L7172m2437Q9294K9398j00654K1354N0300j75851O9335n7418K0379J21613
921F9600j02072j75668R2542O2195m5261K34907j4690j03711j7529K6354o9198
910d2531m0596m5040K10976K3194q3414R7744j0335m2859P96j39510P3973J58656
$$ plain form
898 161054 55021 167043 208118 154944 255577 330175 239374 232433 50114 -25869 40843
887 40843 7801 -44293 -80811 106417 44565 -32139 74119 207587 18624 -44602 81789
876 81789 -29487 -13271 -29331 -69521 37456 57676 10114 61743 149530 126334 -138103
865 -138103 -42255 -72219 -82678 37828 1338 154571 160448 148623 88 98252 261072
854 261072 174271 83684 -60120 -202674 -63692 38348 -48314 -56735 -32416 -65498 -106025
843 -106025 38167 206558 185713 40977 -47894 -73219 -52201 -44022 82394 35018 25853
832 25853 -82094 -125074 -1439 218987 199926 149500 154850 58804 93105 195280 59308
821 59308 63721 134031 204012 15577 -95815 17150 50861 195686 81332 131856 -23715
$$ packed form
898A61054j06033J12022M1075n3174J00633P4598r0801o941j82319p5983O6712
887D0843l3042n2094l6518J87228o1852p6704J06258J33468j88963o3226J26391
876H1789j11276J6216j6060m0190J06977K0220m7562N1629Q7787k3196k64437
865a38103R5848k9964j0459J20506l6490J53233N877j1825j48535R8164J62820
854B61072q6801r0587j43804j42554J38982J02040q6662q421K4319l3082m0527
843a06025J44192J68391k0845j44736q8871k5325K1018Q179J26416m7376r165
832B5853j07947m2980J23635K20426j9061n0426N350r6046L4301J02175j35972
821E9308M413P0310O9981j88435j11392J12965L3711J44825j14354N0524j55571
$$ plain form
810 -23715 -31804 -27455 -77596 -25969 8536 97947 117603 22743 17633 -129344 -71402 -105648
798 -105648 -204317 -4019 102696 15036 58518 -39790 -2641 133262 233963 154956 172364
787 172364 61078 49731 201364 103943 36572 -57120 36433 22474 123713 -60241 -59430
776 -59430 42881 19847 -17409 -153887 22954 64123 35543 100262 87741 73235 121598
765 121598 53691 38285 23076 43730 42458 122732 168095 80757 178242 84929 -67476 77689
753 77689 17006 -34073 21799 185706 127983 30238 104711 27638 83958 94965 161569 11065
741 11065 -149804 -183048 -64438 -155999 -197189 -89657 2964 -43872 102784 194229 250974
730 250974 169770 122946 14482 -176669 -127527 -112318 -39529 5892 179246 171000 169750 116915
$$ packed form
810b3715q089M349n0141N1627L4505Q9411J9656r4860n110j46977N7942l4246
798a05648r8669K00298J06715q7660M3482r8308L7149J35903J00701p9007J7408
787A72364j11286j1347J51633r7421o7371r3692R3553j3959J01239j83954Q11
776e9430J02311k3034l7256j36478J76841M1169k8580O4719j2521j4506M8363
765A21598o7907j5406j5209K0654j272Q0274M5363q7338R7485r3313j52405J45165
753G7689o0683n1079N5872J63907n7723r7745P4473p7073N6320J1007O6604j50504
741A1065j60869l3244J18610r1561m1190J07532R2621m6836J46656R1445N6745
730B50974q1204m6824j08464j91151M9142J5209P2789M5421J73354q246j250n2835
$$ plain form
718 116915 15695 60407 46542 63898 -37783 5288 145059 78997 48004 -40373 -167460
707 -167460 -196213 -56751 -23820 -41929 -37476 136557 92167 67247 62207 164220 124800 25714
695 25714 68716 49078 159672 28552 -54331 -11891 90247 -47700 -2714 96475 213493
684 213493 115592 71109 42264 153448 191533 151518 75313 -15651 18425 8256 -15676 98256
672 98256 28624 -2915 151988 4979 34537 88846 135023 84916 49322 89489 83160 24281
660 24281 -78717 -104154 -34849 33081 142033 132809 53917 26197 238058 166995 97381 188023
648 188023 135173 -70731 30172 109577 -90027 -71023 -8896 -96242 -83854 -154753 -98514
637 -98514 161276 316885 218301 66983 39356 -52419 -26121 19760 -57165 25210 48105
$$ packed form
718A16915j01220M4712j3865J7356j01681M3071J39771o6062l0993q8377j27087
707a67460k8753J39462L2931j8109M453J74033m4390k4920n040J02013l9420r9086
695B5714M3002j9638J10594j31120q2883M2440J02138j37947M4986R9189J17018
684B13493r7901m4483k8845J11184L8085m0015p6205r0964L4076j0169k3932J13932
672I8256o9632l1539J54903j47009K9558N4309M6177n0107l5594M0167o329n8879
660B4281j02998k5437O9305O7930J08952r224p8892k7720K11861p1063o9614R0642
648A88023n2850k05904J00903P9405j99604J9004O2127q7346J2388p0899N6239
637i8514K59790J55609r8584j51318k7627r1775K6298M5881p6925Q2375K2895
$$ plain form
626 48105 52410 61754 127447 81326 52743 122573 -50337 11633 33551 51872 14962 151714
614 151714 156874 52901 -24152 -105609 46533 39584 158409 241164 109212 17897 -95273
603 -95273 -33733 93450 93195 -79819 137257 101517 -59740 164689 133218 134026 65881 20871
591 20871 89598 205411 294980 269758 227705 153094 98140 135369 104596 222469 175529 87514
579 87514 184699 57531 27003 21580 64421 194463 28452 -9718 120055 84512 129347
$$ packed form
626D8105M305R344O5693m6121k8583O9830j72910O1970K1918J8321l6910J36752
614A51714N160j03973p7053q1457J52142o949J18825Q2755j31952r1315j13170
603i5273O1540J27183k55j73014K17076l5740j61257K24429l1471Q08o8145m5010
591B0871O8727J15813Q9569k5222m2053p4611n4954L7229l0773J17873m6940q8015
579H7514R7185j27168l0528n423M2841J30042j66011l8170J29773l5543M4835
$$ [...]
##END NTUPLES=NMR SPECTRUM
##END=
