##TITLE=1H_EC-3322(23)
 CDCl3
 8 sc, 
 4.4.2024
##JCAMPDX= 6.0         $$ Bruker NMR JCAMP-DX V2.0
##DATA TYPE= NMR SPECTRUM
##DATA CLASS= NTUPLES
##ORIGIN= UXNMR, Bruker Analytische Messtechnik GmbH
##OWNER= root
$$ XWIN-NMR		Version 3.5
$$ Thu Apr  4 14:12:48 2024 Russian Standard Time (UT+4h)  she@DPX200
##.OBSERVE FREQUENCY= 200.1309
##.OBSERVE NUCLEUS= ^1H
##.ACQUISITION MODE= SIMULTANEOUS
##.ACQUISITION SCHEME= undefined
##.AVERAGES= 8
##.DIGITISER RES= 18
##SPECTROMETER/DATA SYSTEM= spect
##.PULSE SEQUENCE= zg30
##.SOLVENT NAME= MeOD
##.SHIFT REFERENCE= (INTERNAL, MeOD, 0, 15.6566)
##AUDIT TRAIL= $$ (NUMBER, WHEN, WHO, WHERE, WHAT)
$$ ##TITLE= Audit trail, XWIN-NMR		Version 3.5
$$ ##JCAMPDX= 5.01
$$ ##ORIGIN= Bruker BioSpin GmbH
$$ ##OWNER= she
$$ F:/spectra/data/she/nmr/H-F/1/pdata/1/auditp.txt
$$ ##AUDIT TRAIL=  $$ (NUMBER, WHEN, WHO, WHERE, WHAT)
(   1,<2024-04-04 14:11:19.03 +0400>,<she>,<DPX200>,
      <created by zg, POWCHK disabled, PULCHK disabled
       configuration hash MD5:
       00 E9 B6 7A A2 85 ED C7 34 08 36 98 17 FE 4E 26
       data hash MD5: 16K
       6A A5 99 B0 E9 EA 51 59 B6 13 F2 9B DF 71 84 BB>)
(   2,<2024-04-04 14:11:23.62 +0400>,<she>,<DPX200>,
      <Start of raw data processing
       efp BC_mod = 2 LB = 0.24 FT_mod = 6 PKNL = 1 PHC0 = -25300.09 PHC1 = 11.58731 SI = 16K 
       data hash MD5: 16K
       FD 6E 48 27 F0 50 41 A8 31 6D D6 4D CA E2 1F D8>)
(   3,<2024-04-04 14:11:40.37 +0400>,<she>,<DPX200>,
      <pk PHC0 = -3.915849 PHC1 = 5.4 
       data hash MD5: 16K
       80 78 10 90 21 D1 68 47 4A F2 FB 65 7A FC 57 7C>)
(   4,<2024-04-04 14:11:49.68 +0400>,<she>,<DPX200>,
      <abs ABSG = 5 
       data hash MD5: 16K
       3A 4C 33 7C 33 02 81 98 46 26 34 22 FA B1 B5 A9>)
$$ ##END=
$$ 
$$ hash MD5
$$ 1B 83 2D DD E3 FE D6 A9 59 05 D3 DC 5F C7 71 6B
##$RELAX= 
##$RELAX= 
##$RELAX= 
##$RELAX= 
##$RELAX= 
##$RELAX= 
$$ Bruker specific parameters
$$ --------------------------
##$DU= <F:/spectra>
##$EXPNO= 1
##$NAME= <H-F>
##$PROCNO= 1
##$TYPE= <nmr>
##$USER= <she>
##$AMP= (0..31)
100 100 100 100 100 100 100 100 100 100 100 100 100 100 100 100 100 100 
100 100 100 100 100 100 100 100 100 100 100 100 100 100 
##$AQSEQ= 0
##$AQ_mod= 1
##$AUNM= <au_zg>
##$AUTOPOS= <>
##$BF1= 200.13
##$BF2= 200.13
##$BF3= 200.13
##$BF4= 200.13
##$BF5= 200.13
##$BF6= 200.13
##$BF7= 200.13
##$BF8= 200.13
##$BYTORDA= 1
##$CFDGTYP= 0
##$CFRGTYP= 5
##$CHEMSTR= <none>
##$CNST= (0..31)
1 1 145 1 1 1 1 1 1 1 1 1 1 1 1 1 1 1 1 1 1 1 1 1 1 1 1 1 1 1 1 1 
##$CPDPRG= <>
##$CPDPRG1= <>
##$CPDPRG2= <>
##$CPDPRG3= <>
##$CPDPRG4= <mlev>
##$CPDPRG5= <mlev>
##$CPDPRG6= <mlev>
##$CPDPRG7= <mlev>
##$CPDPRG8= <mlev>
##$CPDPRGB= <>
##$CPDPRGT= <>
##$D= (0..31)
0 1.2 0 0 0 0 0 0 0 0.06 0 0.03 0 0 0 0 0.0002 0 0 0 0 0 0 0 0 0 0 0 0 
0 0 0 
##$DATE= 1712225478
##$DBL= (0..7)
120 120 120 120 120 120 120 120 
##$DBP= (0..7)
150 150 150 150 150 150 150 150 
##$DBP07= 0
##$DBPNAM0= <>
##$DBPNAM1= <>
##$DBPNAM2= <>
##$DBPNAM3= <>
##$DBPNAM4= <>
$$ [...]
##$SUBNAM3= <"">
##$SUBNAM4= <"">
##$SUBNAM5= <"">
##$SUBNAM6= <"">
##$SUBNAM7= <"">
##$SUBNAM8= <"">
##$SUBNAM9= <"">
##$SW= 18.0517689322627
##$SWIBOX= (0..15)
0 0 2 0 0 0 0 0 0 0 0 0 0 0 0 0 
##$SW_h= 3612.71676300578
##$TD= 16384
##$TD0= 1
##$TE= 0
##$TE2= 300
##$TE3= 300
##$TEG= 300
##$TL= (0..7)
0 120 120 120 120 120 120 120 
##$TP= (0..7)
150 150 150 150 150 150 150 150 
##$TP07= 0
##$TPNAME0= <>
##$TPNAME1= <>
##$TPNAME2= <>
##$TPNAME3= <>
##$TPNAME4= <>
##$TPNAME5= <>
##$TPNAME6= <>
##$TPNAME7= <>
##$TPOAL= (0..7)
0.5 0.5 0.5 0.5 0.5 0.5 0.5 0.5 
##$TPOFFS= (0..7)
0 0 0 0 0 0 0 0 
##$TUNHIN= 0
##$TUNHOUT= 0
##$TUNXOUT= 0
##$USERA1= <user>
##$USERA2= <user>
##$USERA3= <user>
##$USERA4= <user>
##$USERA5= <user>
##$V9= 5
##$VALIST= <valist>
##$VCLIST= <CCCCCCCCCCCCCCC>
##$VD= 0
##$VDLIST= <DDDDDDDDDDDDDDD>
##$VPLIST= <PPPPPPPPPPPPPPP>
##$VTLIST= <TTTTTTTTTTTTTTT>
##$WBST= 1024
##$WBSW= 4
##$XGAIN= (0..3)
0 0 0 0 
##$XL= 0
##$YL= 0
##$YMAX_a= 102834
##$YMIN_a= -134737
##$ZGOPTNS= <>
##$ZL1= 120
##$ZL2= 120
##$ZL3= 120
##$ZL4= 120
##$ABSF1= 15.70065
##$ABSF2= -2.351239
##$ABSG= 5
##$ABSL= 3
##$ALPHA= 0
##$AQORDER= 0
##$ASSFAC= 0
##$ASSFACI= 0
##$ASSFACX= 0
##$ASSWID= 0
##$AUNMP= <proc_1d>
##$AZFE= 0.1
##$AZFW= 0.1
##$BCFW= 0
##$BC_mod= 2
##$BYTORDP= 0
##$COROFFS= 0
##$CY= -3
##$DATMOD= 1
##$DC= 0
##$DFILT= <>
##$DTYPP= 0
##$F1P= 0
##$F2P= 0
##$FCOR= 1
##$FTSIZE= 16384
##$FT_mod= 6
##$GAMMA= 0
##$GB= 0
##$INTBC= 1
##$INTSCL= 3.70164e-10
##$ISEN= 128
##$LB= 0.24
##$LEV0= 0
##$LPBIN= 0
##$MAXI= 10000
##$MC2= 0
##$MEAN= 0
##$ME_mod= 0
##$MI= 1.114404
##$NCOEF= 0
##$NC_proc= -7
##$NLEV= 6
##$NOISF1= 3.799351
##$NOISF2= 2.8
##$NSP= 0
##$NTH_PI= 0
##$NZP= 0
##$OFFSET= 15.65658
##$PC= 1
##$PHC0= -25304.01
##$PHC1= 16.98731
##$PH_mod= 1
##$PKNL= yes
##$PPARMOD= 0
##$PSCAL= 0
##$PSIGN= 0
##$REVERSE= no
##$SF= 200.129573014514
##$SI= 16384
##$SIGF1= 3
##$SIGF2= 2
##$SINO= 5.538805
##$SIOLD= 16384
##$SREGLST= <1H.CDCl3>
##$SSB= 0
##$STSI= 16384
##$STSR= 0
##$SW_p= 3612.71676300577
##$SYMM= 0
##$S_DEV= 0
##$TDeff= 16384
##$TDoff= 0
##$TI= <>
##$TILT= no
##$TM1= 0
##$TM2= 0
##$TOPLEV= 0
##$USERP1= <user>
##$USERP2= <user>
##$USERP3= <user>
##$USERP4= <user>
##$USERP5= <user>
##$WDW= 1
##$XDIM= 16384
##$YMAX_p= 319591735
##$YMIN_p= -689601
$$ End of Bruker specific parameters
$$ ---------------------------------
##NTUPLES= NMR SPECTRUM
##VAR_NAME=  FREQUENCY,     SPECTRUM/REAL,   SPECTRUM/IMAG
##SYMBOL=    X,             R,               I
##VAR_TYPE=  INDEPENDENT,   DEPENDENT,       DEPENDENT
##VAR_FORM=  AFFN,          ASDF,            ASDF
##VAR_DIM=   16384,         16384,           16384
##UNITS=     HZ,            ARBITRARY UNITS, ARBITRARY UNITS
##FACTOR=    0.220516191357247, 1,           1
##FIRST=     3133.34466452656, 0,            0
##LAST=      -479.372098479213, 0,           0
##MIN=       -479.372098479213, -689601,     0
##MAX=       3133.34466452656, 319591735,    0
$$ Real data points
##PAGE= N=1
##DATA TABLE= (X++(R..R)), XYDATA
$$ [...]
7081B118634o9429K1216N9185q0735J01430j55499j2027q6244K4623p5641j59867
7070A685646q8390M7331J3845J7585j65696J36526K67314K06550J00291O5932
7060B286934p8057Q9107K15115K4178K22908K55112J46112P6912K64303K89345
7050C791969r917m0714k71688l09365j10835k86374j02360p4706r4379l22528
7040B169103j13627N7937J04093j01949k03006O5816j34127j56418J39463O6219
7030A893504j1838O3334L3623m1563k33008R4775J47907J08376Q9591k25468R3418
7019B012651P8493q8156p4865J4603J8703j69288l36590o8462j42797J86355P1017
7008A501664k35054k3641k38431l3323O1489j98284q884O851j94609J89488J0649
$$ plain form
7081 2118634 2049205 2070421 2129606 2048871 2150301 1994802 1982775 1896531 1921154 1845513 1685646
7070 1685646 1597256 1644587 1658432 1676017 1510321 1646847 1914161 2120711 2221002 2286934
7060 2286934 2208877 2297984 2513099 2537277 2760185 3015297 3161409 3238321 3502624 3791969
7050 3791969 3782052 3741338 3469650 3160285 3049450 2763076 2660716 2586010 2491631 2169103
7040 2169103 2055476 2113413 2217506 2115557 1912551 1978367 1844240 1687822 1827285 1893504
7030 1893504 1881666 1945000 1978623 1937060 1704052 1798827 1946734 2055110 2144701 1919233 2012651
7019 2012651 2091144 2002988 1928123 1942726 1961429 1792141 1455551 1387089 1244292 1430647 1501664
7008 1501664 1266610 1242969 1004538 971215 1032704 834420 825536 832387 637778 827266 837915
6997H37915p8680P1699m644j48704j58791n041J28531m9629j48235J06603K06589
6986G57613m586k24238O2206j13235J20517R2960O8064k35389n3808j28681Q0658
6975D22081J14233J17747K7101o8051m1073j49600j26947j00858J06796j6447
6965B84982N5150K3528j6417J05277p5925k662J08779q7430J72908Q043n8909
6954E17324k01005o3505J67378O9728m3932P1198l937j6515O748P906l4595N0853
6942E27646J75307r3819j05872qK0364N9628j45124j63098J80441m0184o2734
6931C52547J27501j29140j77236J57002J15160J5095K22191k34833k01187j53351
6921I3749J70958J1974J23379J77535P5421o7010q6508J5614L9728J45497k16093
$$ plain form
6997 837915 759235 830934 826290 677586 518795 513754 642285 592656 444421 551024 757613
6986 757613 753027 528789 590995 477760 598277 691237 759301 523912 470104 341423 422081
6975 422081 536314 654061 681162 613111 572038 422438 295491 194633 301429 284982
6965 284982 340132 363660 347243 452520 376595 373933 482712 395282 568190 576233 517324
6954 517324 316319 252814 420192 489920 445988 517186 513249 496734 503482 511388 476793 527646
6942 527646 702953 609134 503262 503254 523618 583246 438122 275024 455465 415281 352547
6931 352547 480048 350908 173672 330674 445834 460929 683120 448287 247100 93749
6921 93749 264707 276681 400060 577595 653016 586006 499498 515112 554840 700337 484244
6910D84244J0482l9819j12694l5632o8212K04385K86773J77984j98309j33729
6900E75473Q2035O0819q7936n5831p6068K04812p7213j30335m7009K45918m8809
6889F45856k09758J79610L1565n5055J9750k02422R9870K88117M4767M7016k17968
6878F71348j09497J93470M7888n1910k8884k1625P0730k32723K14149J4513L9943
6867H07402Q917q4086n5126J77428J42364o928L3348M5760l7138m1127J75880
6856A166694M9594m8491j14447O068q3944Q2298Q885j84737j53849J84973k5743
6845H87301j36783R0535J23390K25060p8668k06192j75327K90994o9390n6800
6835H94120J0984J09677o4579J08487j5912k71568K83769J08944j36620Q7829
$$ plain form
6910 484244 494726 454907 342213 306581 238369 442754 729527 907511 709202 575473
6900 575473 657508 718327 630391 574560 498492 703304 626091 495756 448747 694665 645856
6889 645856 436098 615708 647273 592218 611968 409546 509416 797533 842300 889316 671348
6878 671348 561851 755321 803209 751299 722415 700790 771520 538797 752946 767459 807402
6867 807402 816319 732233 677107 854535 996899 989971 1023319 1069079 1031941 990814 1166694
6856 1166694 1216288 1167797 1053350 1059418 975474 1057772 1066657 881920 728071 913044 887301
6845 887301 750518 841053 964443 1189503 1110835 904643 729316 1020310 950920 894120
6835 894120 905104 1014781 950202 1058689 1042777 771209 1054978 1163922 1027302 1115131
6825A115131j58203J10104K4028j34383K7459Q1773J8885Q6366k58808j51148
6815G61204R7876N3225k5632k0030J48446P0195J15101p2195O4860L5406K5953
6804A254409j14553J65664k60188K61584n3698k0726L0754K6082q306j43525J52093
6793A289590o7481o6973q3538J04812K60038P4N5900M4394r7721J09989M5940
6782A595024K77074j49583j13055J45202J12323N5361K84588k5702p5792k86404
6772A819036j36268K704j9153j23426r4722n1001K8197K23326k14965R4225J16575
6761A644528j19101j34163M9818j22929j2256J35859k8133O7352k6144J04345
6751A559176K1297k5159l1244j98756j6986L0421q2146M8957q1301k2670j3319
$$ plain form
6825 1115131 956928 1067032 1091060 956677 984136 1065909 1084794 1171160 912352 761204
6815 761204 859080 912305 886673 866643 1015089 1085284 1200385 1128190 1193050 1228456 1254409
6804 1254409 1139856 1305520 1045332 1306916 1253218 1232492 1263246 1289328 1281022 1137497 1289590
6793 1289590 1222109 1155136 1071598 1176410 1436448 1436522 1492422 1536816 1439095 1549084 1595024
6782 1595024 1872098 1722515 1609460 1754662 1866985 1922346 2206934 2181232 2105440 1819036
6772 1819036 1682768 1685472 1666319 1542893 1448171 1397170 1425367 1648693 1433728 1527953 1644528
6761 1644528 1525427 1391264 1441082 1318153 1305897 1441756 1413623 1480975 1454831 1559176
6751 1559176 1580473 1555314 1524070 1325314 1308328 1338749 1256603 1305560 1224259 1201589 1188270
6740A188270K11752K21170n6642j09957J27037r8005j60434J5661j937J02325
6730A439240O7385J44703j2061J49188j12966k50754j28133J09319n2670K19220
6720A572471J73465L5828j70141r9267K38518J18130J41731p1940j73622L7591
6710A802764J7438O3612J72696r659j68591j73677k3107J22550j724j5003Q1814
6699A869113n016m3143J92247K36920o8178j29554O9272j04760K19497o9263p6617
6688B090518j93390j19608J00442P2560L9790L6206J0684j05597J47790J13647
6678B193042J15279M7132R0860j34159L887n8442Q0304j4744K955k43679Q4898
6667B167333K21537O21j28584j22901J48277K33572R988K038p3104R4734J34721
$$ plain form
6740 1188270 1400022 1621192 1564550 1454593 1581630 1483625 1323191 1338852 1336915 1439240
6730 1439240 1506625 1651328 1639267 1788455 1675489 1424735 1296602 1405921 1353251 1572471
6720 1572471 1745936 1781764 1611623 1512356 1750874 1869004 2010735 1938795 1765173 1802764
6710 1802764 1820202 1883814 2056510 2046851 1878260 1704583 1681476 1804026 1802302 1787299 1869113
6699 1869113 1864097 1820954 2013201 2250121 2181943 2052389 2121661 2016901 2236398 2167135 2090518
6688 2090518 1897128 1777520 1877962 1950522 1990312 2026518 2037202 1931605 2079395 2193042
6678 2193042 2308321 2355453 2446313 2312154 2316041 2257599 2337903 2323159 2326114 2082435 2167333
6667 2167333 2388870 2389491 2260907 2138006 2286283 2519855 2529843 2531881 2458777 2553511 2688232
6656B688232j69939J05051J14016R3641o6939R314K06377m4324q3504N4978k13823
6645B693080P4710Q4352q6522k9712j05659L92955K75271j19937R2135j85407
6635C085266j51157J11671J1291o3172J06412L7270J39646M2419o8231p3138l010
6624C175267L5481J1210m2159J08867O0089K03457J08178O7580o4936r2313J546
6613C572267O7303k4063o5439N5378r5755J45143r698J84212r0018J08166K09177
6602D056673o6563O6735Q499p6312J72726K53276J44779M7406R4885q7637l6902
6591D577565m00R9271j38401j04241R1023J8068M8428K7780j5559p7347k21645
6580D304542J24650J78091p0339O0472M1760J32484K71908J4028K49598N8711
$$ plain form
6656 2688232 2518293 2623344 2737360 2831001 2764062 2773376 2979753 2935429 2851925 2906903 2693080
6645 2693080 2767790 2852142 2765620 2735908 2630249 3023204 3298475 3178538 3270673 3085266
6635 3085266 2934109 3045780 3057071 2993899 3100311 3137581 3277227 3319646 3251415 3178277 3175267
6624 3175267 3210748 3221958 3179799 3288666 3348755 3552212 3660390 3727970 3663034 3570721 3572267
6613 3572267 3639570 3615507 3550068 3605446 3509691 3654834 3645136 3829348 3739330 3847496 4056673
6602 4056673 3990110 4056845 4065344 3989032 4161758 4415034 4559813 4607219 4702104 4614467 4577565
6591 4577565 4577165 4676436 4538035 4433794 4524817 4542885 4591313 4619093 4603534 4526187 4304542
6580 4304542 4429192 4607283 4536944 4597416 4639176 4771660 5043568 5057596 5307194 5365905
6570E365905P6432J89730J61191O245J84069p2510j65808j17634k47066k2508
6560E358046j50150m9756k78450j65203p7192J28373M0549m7570N340o8785p4418
6549D620784j74217K9526K63745r9682r6195p4467K69527Q5343p4002K54590N4779
6538E059731j34559j23881k07983j03133m3688P117j3561L2346j40621k86421
6528D045347q0153m208l6824n5194j9830n5366j03986P5033j26630j70979j00627
6517C366583J13537J13503r7589j9257J19858r1381m8936L6073M4482n9855r4804
6506C382214R783J3607j3326m361k8953j4454j15885L8575j57153J77428k1204
6495C266271n5191n8189m1244J08459J55583K1611l1507J00257l687q6218k55537
$$ plain form
6570 5365905 5442337 5632067 5793258 5799503 5983572 5911062 5745254 5627620 5380554 5358046
6560 5358046 5207896 5158140 4879690 4714487 4637295 4765668 4806217 4758647 4763987 4695202 4620784
6549 4620784 4446567 4476093 4739838 4640156 4543961 4469494 4739021 4824364 4750362 5004952 5059731
6538 5059731 4925172 4801291 4593308 4490175 4446487 4453604 4440043 4472389 4331768 4045347
6528 4045347 3965194 3960986 3924162 3868968 3849138 3793772 3689786 3764819 3638189 3467210 3366583
6517 3366583 3480120 3593623 3496034 3476777 3596635 3505254 3456318 3492391 3536873 3477018 3382214
6506 3382214 3391997 3405604 3392278 3387917 3358964 3344510 3228625 3267200 3110047 3287475 3266271
6495 3266271 3211080 3152891 3111647 3220106 3375689 3397300 3365793 3466050 3462363 3376145 3120608
6484C120608J32453j02804P8204j36809j9218r5936J2970K2239J5848J79936j63464
6473C044027l06832J57179m0164J59140j65240k24726J75152o5435J12455L0396
6463B875952N8700J3662k0841m8013P8011n2479j11311o145k52631J67163M9489
6452B751557j06428k64912j098J81970j57574M3518J0817m1451J77217k0628j52829
6441B420159R8461M2160j66532J51928J21577j38891K92371l92574j76893K89109
6431B540875j93621L5036K8288K8923J16070j50686j11147J7817O6812Q1537Q3516
6420B543420m2771j16758j8047j19313j1020M9780n7618K3907K4158j37582L9722
6409B177878m3688O9186O7458N2723j41561L3603r1776m9609j3360q1092l5825
$$ plain form
6484 3120608 3253061 3150257 3228461 3091652 3072434 2976498 2989468 3011707 3027555 3207491 3044027
6473 3044027 2737195 2894374 2854210 3013350 2848110 2623384 2798536 2733101 2845556 2875952
6463 2875952 2934652 2948314 2927473 2879460 2957471 2904992 2793681 2787536 2534905 2702068 2751557
6452 2751557 2645129 2380217 2379119 2561089 2403515 2447033 2457850 2416399 2593616 2572988 2420159
6441 2420159 2518620 2560780 2394248 2546176 2667753 2528862 2821233 2428659 2251766 2540875
6431 2540875 2347254 2382290 2410578 2439501 2555571 2404885 2293738 2311555 2378367 2459904 2543420
6420 2543420 2500649 2383891 2365844 2246531 2235511 2285291 2227673 2251580 2275738 2138156 2177878
6409 2177878 2134190 2203376 2270834 2323557 2181996 2215599 2123823 2074214 2060854 1979762 1943937
6398A943937m6799K47782J67896j24046m7796K00785m5993l02672j65886J02292
6388A929500K06595M9007j51139J16537j19845k4586r7850j32080K70863r8977
6378A948025M8375J97429j37480o508m8810l4582l4307J55733M9553o2523j04334
6367A970571k7998J28424l4244k39130J40734l1087l4133J86415J90213l04043
6357A945722L0487j66568r5663K46662R0668J28597K5155q0108r3733j59206L746
6346A875759j14133K32867j2614K39311Q7416j65805J5512k29847Q9365J12888
6336B130719J36177j29415j44443M9455L2912j517J73065K3918N6262M026j46643
6325B184516k33885K171K19165k8004J2888K01199k48278P4901M1478o9608O6766
$$ plain form
6398 1943937 1897138 2144920 2312816 2188770 2140974 2341759 2295766 1993094 1827208 1929500
6388 1929500 2136095 2185102 2033963 2150500 2030655 2006069 1908219 1776139 2047002 1948025
6378 1948025 1996400 2193829 2056349 2049841 2001031 1966449 1932142 2087875 2137428 2074905 1970571
6367 1970571 1942573 2070997 2036753 1797623 1938357 1907270 1873137 2059552 2249765 1945722
6357 1945722 1976209 1809641 1713978 1960640 2051308 2179905 2205060 2124952 2031219 1872013 1875759
6346 1875759 1761626 1994493 1981879 2221190 2308606 2142801 2158313 1928466 2017831 2130719
6336 2130719 2266896 2137481 1993038 2042493 2075405 2073888 2246953 2270871 2327133 2331159 2184516
6325 2184516 1950631 1952802 2171967 2143963 2156851 2358050 2109772 2184673 2226151 2156543 2223309
6314B223309J30771O7031J05595j13283j57361k4679k647J27885r8979m7241J40924
6303B351325j5489O2595n9610J60423j5770q7652J29270R2786l1311J09271M5424
6292B741262k9860k5514P7068P6047K60137K027n6407l4430R0085K4359j16070
6281C008704K04696l6851P8421K21443K8928J69260q5334J04676R4954J02992
6271C891889j09832L46301k0624N3220J9419J52603J40526p2490Q6444j2128L28274
6260D803602Q0116L1606M203j2352K02928K33637j63009K16683M5234J49290J91876
6249E783814J97274K15130J03541m7116k8048J53574K17647N9775M27868K54239
6239G337698K6723O757L22210O7522J31216k441R0512K11220J69914J52372L97564
$$ plain form
6314 2223309 2354080 2421111 2526706 2413423 2256062 2231383 2228736 2356621 2257642 2210401 2351325
6303 2351325 2335836 2398431 2338821 2499244 2483474 2395822 2525092 2617878 2586567 2695838 2741262
6292 2741262 2711402 2685888 2762956 2839003 3099140 3101167 3044760 3010330 3100415 3124774 3008704
6281 3008704 3213400 3176549 3254970 3476413 3505341 3674601 3589267 3693943 3788897 3891889
6271 3891889 3782057 4128358 4107734 4160954 4180373 4332976 4473502 4401012 4487456 4475328 4803602
6260 4803602 4883718 4915324 4919527 4907175 5110103 5343740 5180731 5397414 5442648 5591938 5783814
6249 5783814 5981088 6196218 6299759 6252643 6224595 6378169 6595816 6655591 7083459 7337698
6239 7337698 7364421 7371178 7693388 7760910 7892126 7889685 7980197 8191417 8361331 8513703 8911267
6228H911267J92376L45077K37079j113K50918N37432O2971K84607N86328M69855
6218A1876797N81128K16321L92373N99989Q45577O84907O31294Q99710Q55817
6209A7583913J014706J136383J124156J364806J421282J594336J634477J717192
6201B8591251J613496R32729L24992j93940q08605j048573j155446q27092o09549
6192B6819263o19139l37928j328L45989M56517Q84139J016274J037737J243597
6183C0845121J307915J767713K214522K402908K980129L005741L213929K944901
6175E0682879K058661J130725n30760k170295l290936l533100l728234l254991
6167C7363949k733486k233843j677390j414888j018634p56415r65479m85567l91568
$$ plain form
6228 8911267 9103643 9448720 9685799 9684686 9935604 10473036 10536007 10820614 11406942 11876797
6218 11876797 12457925 12674246 13066619 13666608 14512185 15197092 15828386 16728096 17583913
6209 17583913 18598619 19735002 20859158 22223964 23645246 25239582 26874059 28591251
6201 28591251 30204747 31137476 31462468 31268528 30459923 29411350 28255904 27428812 26819263
6192 26819263 26200124 25862196 25860868 26206857 26663374 27547513 28563787 29601524 30845121
6183 30845121 32153036 33920749 36135271 38538179 41518308 44524049 47737978 50682879
6175 50682879 52741540 53872265 53341505 51171210 47880274 44347174 40618940 37363949
6167 37363949 34630463 32396620 30719230 29304342 28285708 27529293 26563814 26078247 25686679
6158B5686679j80384K73268L96872N31430Q66548J070168J288412J163453Q29213
6149C1925659M94691l56954j218545j835024k122253k107852j957466j607234
6141B1215022j667128j254641j140952j261022j288737j079500j056067j191252
6133A1275723o23184n12470l54673m79676o26934k94892j80327j96904k75629
6124G731034k12357k81161j50367j61538j25869k04426j13182k55384k44603r484
6114E972663L3590j6815j22275m15283j79072J37537O064j73724j34082J91745
6104E300348J13895k46365j46334J20178j20775j04534k38190l60180j71266O2877
6094D209654j82933m5716j13122P7166J50301j37234j27911k44468J02599M6900
$$ plain form
6158 25686679 25506295 25779563 26176435 26707865 27574413 28644581 29932993 31096446 31925659
6149 31925659 32420350 32063396 30844851 29009827 26887574 24779722 22822256 21215022
6141 21215022 19547894 18293253 17152301 15891279 14602542 13523042 12466975 11275723
6133 11275723 10652539 10140069 9785396 9305720 8678786 8383894 8203567 8006663 7731034
6124 7731034 7518677 7237516 7087149 6925611 6799742 6595316 6482134 6226750 5982147 5972663
6114 5972663 6006253 5989438 5867163 5451880 5272808 5410345 5416409 5242685 5108603 5300348
6104 5300348 5414243 5167878 5021544 5141722 5020947 4916413 4678223 4318043 4146777 4209654
6094 4209654 4026721 3981005 3867883 3945049 4095350 3958116 3830205 3585737 3688336 3735236
6084C735236k47675j52056j200k8833J14299J11969R2168n5649p9535j51907p7060
6073C259757M4131j16302j01511m0936J93528m2061J52596N6141j99507J9463
6063C225299o0978p8769M0002k65933J77040R0239j47105q5757J95487J96515
6053C286040j83882M3266n3875j46830J71919L4370J25417n3472m8597O96Q652
6042C183704j95244l1508n8541j10593k96156P8452N1098j75964r5440J18200
6032B468008K8769j96406J70388K1784J89747M795P0990K490j80133k90704J62910
6021B452638N2543l25550l20054j90406J17495p8567k02220j36497J98273J37710
6011A705365j77838j30616N3355K36778k79049J6242J9559P4444L04892k20141
$$ plain form
6084 3735236 3487561 3335505 3334305 3305472 3419771 3531740 3623908 3568259 3488724 3336817 3259757
6073 3259757 3303888 3187586 3086075 3045139 3238667 3196606 3349202 3405343 3205836 3225299
6063 3225299 3164321 3085552 3125554 2859621 3036661 3126900 2979795 2894038 3089525 3286040
6053 3286040 3102158 3145424 3091549 2944719 3116638 3151008 3276425 3222953 3174356 3175052 3183704
6042 3183704 2988460 2956952 2898411 2787818 2491662 2570114 2621212 2445248 2349808 2468008
6032 2468008 2496777 2300371 2470759 2492543 2682290 2687085 2758075 2760565 2580432 2289728 2452638
6021 2452638 2505181 2179631 1859577 1669171 1786666 1708099 1505879 1369382 1567655 1705365
6011 1705365 1527527 1396911 1450266 1687044 1407995 1424237 1443796 1518240 1823132 1602991
6001A602991k23437K11465J11772L6471k0793k94084m9917J00107M3762Q8447
5991A606784j39049r6646k92111Q8226K93837J28509j73617n0892K14575j66431
5981A413185K12051m8487J5539K05637k28492J29603n7005Q2752l9266k19308
5971A466209P4404k1251J40927p861r830k11492R9917K25871n8810k23696m1305
5960A433083K09501l0238K4648K8395p6760n1675J4442R2870Q0230J5238j8655
5949A721079J85827k5130j77394n9223k1986j14445p0249K49034k00217o7076
5939A420220R3738J93272l4837J35062k40100j53780r158j73489J41313m1741
5929A330500K0424N487r921J31178m0746l7511J55976K4025O4389k36412J34866
$$ plain form
6001 1602991 1379554 1591019 1702791 1739262 1718469 1424385 1374468 1474575 1518337 1606784
5991 1606784 1467735 1371089 1078978 1167204 1461041 1589550 1415933 1365041 1579616 1413185
5981 1413185 1625236 1576749 1592288 1797925 1569433 1699036 1642031 1724783 1685517 1466209
5971 1466209 1540613 1519362 1660289 1652428 1642598 1431106 1531023 1756894 1698084 1474388 1433083
5960 1433083 1642584 1612346 1636994 1665389 1588629 1536954 1551396 1644266 1724496 1739734 1721079
5949 1721079 1906906 1881776 1704382 1645159 1623173 1508728 1438479 1687513 1487296 1420220
5939 1420220 1513958 1707230 1672393 1807455 1567355 1413575 1404417 1230928 1372241 1330500
5929 1330500 1350924 1356411 1346490 1477668 1436922 1399411 1555387 1579412 1643801 1407389 1542255
5918A542255j14029M6905j51228k9391J19241J0501M4135n0644J61243j59744
5908A419244p6932J78877J21291l8612K739o6532j11622Q7411q5451O9879J20734
5897A621026N7152N2644j50822O726M0662p0478Q3349p160j32223J79687O7601
5886A748164N1290n7519J92471K9269j29324l9650j96396K46484J86453j18110
5876A913132M5557Q7037m5643j2416j51023p5783J41198O7977m9746Q1836o2857
5865A939269L6801J79992k092k1816P7531M0111L0650j55341m3940K5515j99205
5854A907475J49437N3065o3769J42641J4250m2856j5314J9450L2378N2080p9802
5843B169035K57374J3531p4927P3223k5766R0893n0432O6123j64114J62550J26631
$$ plain form
5918 1542255 1428226 1475131 1323903 1294512 1413753 1424254 1468389 1417745 1578988 1419244
5908 1419244 1342312 1521189 1642480 1603868 1606607 1540075 1428453 1515864 1430413 1500292 1621026
5897 1621026 1678178 1730822 1580000 1586726 1627388 1556910 1640259 1633099 1500876 1680563 1748164
5886 1748164 1799454 1741935 1934406 1963675 1834351 1794701 1598305 1844789 2031242 1913132
5876 1913132 1958689 2045726 2000083 1987667 1836644 1760861 1902059 1970036 1920290 2002126 1939269
5865 1939269 1976070 2156062 2153970 2132154 2209685 2249796 2280446 2125105 2081165 2106680 1907475
5854 1907475 2056912 2109977 2046208 2188849 2203099 2160243 2144929 2164379 2196757 2248837 2169035
5843 2169035 2426409 2439940 2365013 2438236 2412470 2503363 2452931 2519054 2354940 2517490 2644121
5832B644121M3040j07983j59790M2130J38297p7769j18145J40204J81410O4158
5822B789673J12029j34256K61489N9918l07284J18331J16576L5767L8940m1414
5812C049769j0160N648J60897j76229k55754M5230j22328N179J18699L23566j12576
5801C031941j63292l1169J2703j87642J73695q0332j58059L1730k2803K24746
5791B831518J96494K94740j27013K2952m953k29394K8577l6450j327r6997L3477
5780B911624J25710j55301n2316k966j25754L8840q5703j50204N8122J91293K86989
5769C040334j629O5971n7074K6787O1822K0698N6152J7714Q2551j4408L20241
5758C619159j5996j92346j27935m8195N3567K39637R5157j20203K61698O7922
$$ plain form
5832 2644121 2687161 2579178 2419388 2461518 2599815 2522046 2403901 2544105 2725515 2789673
5822 2789673 2901702 2767446 3028935 3088853 2781569 2899900 3016476 3052243 3091183 3049769
5812 3049769 3039609 3045257 3206154 3029925 2774171 2819401 2697073 2702252 2820951 3144517 3031941
5801 3031941 2868649 2837480 2850183 2662541 2836236 2755904 2597845 2629575 2606772 2831518
5791 2831518 3028012 3322752 3195739 3218691 3213738 2984344 3012921 2976471 2975144 2878147 2911624
5780 2911624 3037334 2882033 2829717 2826751 2700997 2739837 2654134 2503930 2562052 2753345 3040334
5769 3040334 3038705 3104676 3047602 3074389 3136211 3156909 3213061 3230775 3313326 3298918 3619159
5758 3619159 3603163 3410817 3282882 3234687 3288254 3527891 3623048 3502845 3764543 3832465
5748C832465O3401m0919K5300K09101J05391K77704N4196J48298P1585K12291
5738D958813K90204q5190J56139K63906K36421J49800o1892J52507j49129j28210
5728E783369J46450R8756Q3881l688j53180M3754K64082j16149J83002o0645R5548
5717F365180K25817J44264K56035q451J63512K89100L25483J83936K24016N13698
5707H682590K93667K19209J48635l933j01974J04757Q6653n6989k04312k9490
5697I138813N8412m1054Q5534L65400L03717k21740K57467J39959K63677L74268
5687A0724453L45077L59886J70365L49226M48605L32477L21457L68599M34754
5678A3854899J80596N38777L09421K76842M40272N31112O25943P11018Q19703
$$ plain form
5748 3832465 3895866 3854947 3880247 4089348 4194739 4472443 4526639 4674937 4746522 4958813
5738 4958813 5249017 5163827 5319966 5583872 5820293 5970093 5908201 6060708 5911579 5783369
5728 5783369 5929819 6028575 6112456 6108768 5955588 5999342 6263424 6147275 6330277 6269632 6365180
5717 6365180 6590997 6735261 6991296 6982845 7146357 7435457 7760940 7944876 8168892 8682590
5707 8682590 8976257 9195466 9344101 9340168 9238194 9342951 9429604 9372615 9168303 9138813
5697 9138813 9197225 9156171 9241705 9607105 9910822 9689082 9946549 10086508 10350185 10724453
5687 10724453 11069530 11429416 11599781 11949007 12397612 12730089 13051546 13420145 13854899
5678 13854899 14035495 14574272 14883693 15160535 15600807 16131919 16757862 17468880 18288583
5669A8288583R88953Q81489J243472J453984J306982J366209J602159K094644
5661B9226475J917215K346830K238554J585263R53588o2579r93537j317303j418321
5652C4476185j239681j143913j019595q88365n93711r9666O6179L25748P89169
5643C0672350P83556J250448J392229J695320J909198K438625K804760L308872
5635D6255358L671552M123620L344287J696761l17394k277318l406943l884445
5627D9205478m108670l427950k992765k879581k577715k100455j717326j285515
5619B8115501j102993o21379l10340k3646K31489K70964N94415N56783R85706
5610B8696500J256479J262269R79435Q12516k409p31213j513252j616604j735837
$$ plain form
5669 18288583 19277536 20159025 21402497 22856481 24163463 25529672 27131831 29226475
5661 29226475 31143690 33490520 35729074 37314337 38267925 38205346 37211809 35894506 34476185
5652 34476185 33236504 32092591 31072996 30184631 29590920 29491254 29557433 29883181 30672350
5643 30672350 31455906 32706354 34098583 35793903 37703101 40141726 42946486 46255358
5635 46255358 49926910 54050530 57394817 59091578 58774184 56496866 53089923 49205478
5627 49205478 45096808 41668858 38676093 35796512 33218797 31118342 29401016 28115501
5619 28115501 27012508 26391129 26080789 26057143 26288632 26559596 27154011 27710794 28696500
5610 28696500 29952979 31215248 32194683 33007199 33004790 32273577 30760325 29143721 27407884
5601B7407884j726666j942968j480409j603199j467269j064879j242672j095686
5593A5784136p91481o49993l52382m78703m82222j26658O7490Q0331k9927J72334
5583A3192925J01246K83871J68372j7253r2491k23341k30961l31644l13384m62055
5573A2075285m61457p2053k1386k35662k09671j89364j69483r0855J01757n3380
5563A0673731L6369K5638R5459q2780j8070K9376j40849j83240j42401J9551o9789
5552A0242995n4053j1386r2795k13501j00713j23973k12477k9681N2607j54324
5542I302699R5473j04163o5144m0934j08024p229k30058m23260k50792k83232
5532G885336j92054k48070k02521l03370j62968l44376k75306p794J69362M9453
$$ plain form
5601 27407884 25681218 23738250 22257841 20654642 19187373 18122494 16879822 15784136
5593 15784136 14992655 14342662 13990280 13511577 13029355 12902697 12970187 13050518 13020591 13192925
5583 13192925 13294171 13578042 13746414 13729161 13636670 13413329 13182368 12850724 12537340 12075285
5573 12075285 11613828 11541775 11520389 11284727 11075056 10885692 10716209 10625354 10727111 10673731
5563 10673731 10710100 10735738 10831197 10748417 10730347 10759723 10618874 10435634 10293233 10312784 10242995
5552 10242995 10188942 10177556 10084761 9871260 9770547 9646574 9434097 9404416 9457023 9302699
5542 9302699 9398172 9294009 9228865 9187931 9079907 9072678 8842620 8419360 8168568 7885336
5532 7885336 7693282 7445212 7242691 6939321 6776353 6431977 6156671 6148877 6318239 6367692
5522F367692l05545o9736p9707j56973k1672K21340J899L2548Q6413j97373k20305
5511E658581J57468k602P4720q0304J227p7737p8667L3356J31704J67648P9075
5500F064469j9216J46048N8981N047J35043j32491j34816j02650j44174l446q7965
5489E784830n1785J13257J87219j12222M4690J63631o3903P0313p4258n33K68877
5478F330116J98293M9868j2968q6133Q0240J25562j77872q0496K06416r8031M5431
5467F580426r4785m4554k38753r3760j90492M0748N3270J41908J34710K51268
5457F539986j6885l51876K13419p3313k6643K31394L72550r474k29747n3733r2773
5446F502905L757l9069R1881k1109j02449K4544R3227K48496M8679r1083J06951
$$ plain form
5522 6367692 6062147 5992411 5912704 5755731 5734059 5955399 5957298 5989846 6076259 5878886 5658581
5511 5658581 5816049 5813447 5888167 5807863 5809090 5731353 5652686 5686042 5817746 5985394 6064469
5500 6064469 6045253 6191301 6250282 6255329 6390372 6257881 6123065 6020415 5876241 5872795 5784830
5489 5784830 5733045 5846302 6033521 5921299 5965989 6129620 6065717 6136030 6061772 6061239 6330116
5478 6330116 6528409 6578277 6565309 6479176 6559416 6684978 6507106 6426610 6633026 6534995 6580426
5467 6580426 6485641 6441087 6202334 6108574 5918082 5958830 6012100 6154008 6288718 6539986
5457 6539986 6523101 6171225 6384644 6311331 6284688 6516082 6888632 6879158 6649411 6595678 6502905
5446 6502905 6506662 6467593 6559474 6538365 6435916 6460460 6553687 6802183 6850862 6759779 6866730
5435F866730K75441Q081j05290p9653J05337Q0610j9239J52995J81699L14693
5425G781404J72628J13242J67223R3783l047J83672K1152L10188K14312R8317
5415I152874K07467J93494q5594l2169L56668J62577m185K84470L69492K54414
5405A0859508Q5055K61995K43555J86437J79832K48236K68917L99239K23570J98674
5395A3155018K23803L97786K18968K07168M36813N1719L81041J48636K32241L53101
5385A5806294N64444L37444M01061J69964J95427L06469K15679K34133L77007
5376A8607922L40239L82437L13098M84122M38229O27751M25332R2475P7081L68544
5366B2157230N44863L23666M51699M63741L91065O17763N21972N41213O39911
$$ plain form
5435 6866730 7142171 7150252 7044962 6965309 7070646 7151256 7132017 7285012 7466711 7781404
5425 7781404 7954032 8067274 8234497 8328280 8325233 8508905 8530057 8840245 9054557 9152874
5415 9152874 9360341 9553835 9468241 9436072 9792740 9955317 9951132 10235602 10605094 10859508
5405 10859508 10944563 11206558 11450113 11636550 11816382 12064618 12333535 12732774 12956344 13155018
5395 13155018 13378821 13776607 13995575 14202743 14639556 14691275 15072316 15220952 15453193 15806294
5385 15806294 16370738 16708182 17109243 17279207 17474634 17781103 17996782 18230915 18607922
5376 18607922 18948161 19330598 19643696 20127818 20566047 21193798 21619130 21711605 21788686 22157230
5366 22157230 22702093 23025759 23477458 23941199 24332264 24950027 25471999 26013212 26653123
5357B6653123Q46397P95631P17103P02196Q28193O95357Q70224Q21022N96592
5348C3525838J033074J242337J319285J334118J025315J037056M89269L84718
5340D1391010J93763J79319R58256J041625J138980J574116J806492J727792J758948
5331E1770301J131697R34304J227574J844174K053525K297036K657476K532083
5323F6448170K654097K927773L215334L417411L198649L160938K592705K770194
5315I0385271K739587L005247L402427K798954J767653N86205p47134j480937
5307A02457273j249359p07199N3138Q35758J011806Q4882j211465k625843l776817
5298I4872174m017764l284017k882560k727196k736301k876125k985591k909483
$$ plain form
5357 26653123 27499520 28295151 29012254 29714450 30542643 31238000 32108224 32929246 33525838
5348 33525838 34558912 35801249 37120534 38454652 39479967 40517023 41006292 41391010
5340 41391010 41584773 41764092 42722348 43763973 44902953 46477069 48283561 50011353 51770301
5331 51770301 52901998 53836302 55063876 56908050 58961575 61258611 63916087 66448170
5323 66448170 69102267 72030040 75245374 78662785 81861434 85022372 87615077 90385271
5315 90385271 93124858 96130105 99532532 102331486 104099139 104685344 103938210 102457273
5307 102457273 101207914 100500715 100553853 101389611 102401417 102486299 101274834 98648991 94872174
5298 94872174 90854410 87570393 84687833 81960637 79224336 76348211 73362620 70453137
5290G0453137k359498k244355j986909j449577j144542o71989P4597N98660J678592
5281F2948116K027191K047467K177003J543583N62363m94773j470811j056803
5273F8283336o21484n36129n66867j040589k007807k390707k354243k549586k236791
5264E3979133j876624j404619q77854n62480P8620P60720J316000J871593K230587
5255E5515076L291571M095633L844543K723959J72078l046083m833125n389310
5247E6374342n100756m064836l519045l284367k777661k425155k063273j659882
5239C1479367j611621j124147o58790n25664j61493m7154J97227N75078J097805
5230B9220608J352356J596352K155770J924763J228054k88193j830168k958893
$$ plain form
5290 70453137 68093639 65849284 63862375 62412798 61268256 60596267 60670864 61269524 62948116
5281 62948116 64975307 67022774 69199777 70743360 71305723 70810950 69340139 68283336
5273 68283336 67661852 67125723 66558856 65518267 63510460 61119753 58765510 56215924 53979133
5264 53979133 52102509 50697890 49820036 49257556 49336176 50096896 51412896 53284489 55515076
5255 55515076 58806647 62902280 66746823 69470782 69642860 66596777 61763652 56374342
5247 56374342 51273586 47208750 43689705 40405338 37627677 35202522 33139249 31479367
5239 31479367 29867746 28743599 28084809 27559145 27397652 27350498 27547725 28122803 29220608
5230 29220608 30572964 32169316 34325086 36249849 37477903 37189710 35359542 32400649
5222C2400649l069136k770322k494794k194627k030428j638589j561375j188518
5214A5452860j082569r16667q72974n79608m11877o19318l59889k73262j70126
5205A0166570l42280k96209j45474l54713k01187k9814j82671j88614J33494k9517
5195H529585k41309j21151j49482j36818J12667P5537P9907R8874R7653m6657
5185H298806N1024j70027J25446K8389N4530J39334n7510k37095N6960J29270
5175H419127J80763p0182k79096J73148K20441N9895q6737R1988L1756l8048K7639
5164H730694o3577j43280j85478k64466j16503j84674j8613j90979j80422q5444
5154G297258j82486j58152j67421M484K6979J1091J7538r3129N3548m8695k29440
$$ plain form
5222 32400649 29331513 26561191 24066397 21871770 19841342 18202753 16641378 15452860
5214 15452860 14370291 13453624 12580650 12001042 11589165 10969847 10609958 10336696 10166570
5205 10166570 9824290 9528081 9382607 9027894 8826707 8796893 8614222 8425608 8559102 8529585
5195 8529585 8288276 8167125 8017643 7880825 7993492 8069029 8148936 8247810 8345463 8298806
5185 8298806 8349830 8179803 8305249 8333638 8388168 8527502 8469992 8232897 8289857 8419127
5175 8419127 8599890 8529708 8250612 8423760 8644201 8704096 8617359 8709347 8741103 8703055 8730694
5164 8730694 8667117 8523837 8338359 8073893 7957390 7772716 7754103 7563124 7382702 7297258
5154 7297258 7114772 6956620 6789199 6793683 6820662 6831753 6849291 6756162 6809710 6761015 6531575
5143F531575j29984k2607P9467k64113j20019J81911j87097j18270j41117k17850
5133E591896j86455K4737Q2192l45711K39125K7880j25861o404J2823J00094k93797
5122E120519l38335J05928j79512p8595q4980o0653k43579k21276M8339o2031
5112D005825l4779o2138K2544J45666M7049l34052J69980K04222J15836l14562
5102C965591q5727J435j20617q9349M1798j65262M5833o6833l61446j43778r5578
5091B926067k0013P4429j25864J81407J22913q7730J79903n0333j89102J73643
5081C185320L1506j82303K11058K47258q3148q3583l9500R2719L08713J27138
5071C815178k14966p0738Q3336J12744k0738j77467J7848j74869j34248J52321
$$ plain form
5143 6531575 6401591 6378984 6458451 6194338 6074319 6256230 6069133 5950863 5809746 5591896
5133 5591896 5405441 5430178 5512370 5166659 5405784 5433664 5307803 5301399 5314222 5414316 5120519
5122 5120519 4782184 4888112 4708600 4630005 4545025 4484372 4240793 4019517 4067856 4005825
5112 4005825 3971046 3908908 3931452 4077118 4124167 3790115 3960095 4164317 4280153 3965591
5102 3965591 3879864 3881299 3760682 3671333 3713131 3547869 3593702 3526869 3165423 3021645 2926067
5091 2926067 2906054 2980483 2854619 3036026 3158939 3071209 3251112 3200779 3011677 3185320
5081 3185320 3216826 3034523 3245581 3492839 3409691 3326108 3286608 3379327 3688040 3815178
5071 3815178 3600212 3529474 3612810 3725554 3704816 3527349 3545197 3370328 3236080 3388401
5061C388401J67058p4547J46091r8130k135n0742O5411J86405k51m8272K5572
5050C704861L47326J25861j09620M9037K95061R7518J63903K83270J30320J16966
5040E204503M08438J80093q9946O8993J80046K7726k05827j46038k2080j08742
5030E497166r6796j08330J6293J81515j23044k81462M7932J15210R2887J02792
5020E444163J95014J8848R1476J10496j03580N7018J44923R3234R1152L9632K57658
5009F440034R9101K20076j08249j05265L74256M6130P3934L28299R0052P8695
4999G537063K91158J56188L55415Q70M24948N06928N47681N42408M99300N24843
4989A1386802N85981J002814R69246J041886R78708J348479J325962J287179J730268
$$ plain form
5061 3388401 3555459 3480912 3627003 3528873 3526738 3475996 3541407 3727812 3727561 3679289 3704861
5050 3704861 4052187 4178048 4068428 4117465 4412526 4510044 4673947 4957217 5087537 5204503
5040 5204503 5612941 5793034 5703088 5772081 5952127 5979853 5774026 5627988 5605908 5497166
5030 5497166 5400370 5292040 5308333 5489848 5366804 5085342 5133274 5248484 5341371 5444163
5020 5444163 5639177 5658025 5749501 5859997 5756417 5813435 5958358 6051592 6142744 6182376 6440034
5009 6440034 6539135 6759211 6650962 6545697 6919953 6966083 7040017 7368316 7458368 7537063
4999 7537063 7828221 7984409 8339824 8340694 8765642 9272570 9820251 10362659 10861959 11386802
4989 11386802 11972783 12975597 13944843 14986729 15965437 17313916 18639878 19927057 21657325
4980B1657325J554111J303559Q41001L28909o46404j312805j583418j872399k178119
4971A8091760j735355j665551j425757j211577j137292q27528p39580o01250o16392
4962H131478l44038m28863m17405k75984l01183j68181j75533j05953K3716j09094
4952E828960n4298J36200j61071k74739j64301r2119j04238p0505j78787j50358
4942D714744k13213k6820J85809r2622J00547j72550p2891o6955L131K4363J4206
4931D397749N1160l55947j1488R4970K7723j68067k0587l931L5525K5913K6008
4920D099028l2691N0286q592Q6540j40762j19284K75592P6617p2039p0169J20780
4909D265306K43830j62144J0470l7310j85150M04029J25396L9347r5962M1002
$$ plain form
4980 21657325 23211436 24514995 25355996 25684905 25038501 23725696 22142278 20269879 18091760
4971 18091760 16356405 14690854 13265097 12053520 10916228 10088700 9349120 8747870 8131478
4962 8131478 7787440 7358577 6941172 6665188 6364005 6195824 6020291 5914338 5938054 5828960
4952 5828960 5774662 5910862 5749791 5475052 5310751 5218632 5114394 5043889 4865102 4714744
4942 4714744 4501531 4474711 4660520 4567898 4668445 4495895 4423004 4356049 4359180 4383543 4397749
4931 4397749 4448909 4092962 4081474 4176444 4204167 4036100 4015513 4011582 4047107 4073020 4099028
4920 4099028 4066337 4116623 4108031 4194571 4053809 3934525 4210117 4286734 4214695 4144526 4265306
4909 4265306 4509136 4346992 4357462 4320152 4135002 4539031 4664427 4703774 4607812 4648814
4899D648814J57516J63911j61869J18395K37367P6933J21452K1879J35202J42745
4889E662345J19542R7806O4604L43746K94683M28345L50636L28770L13653J13275
4879H117405K7704J52127J15896j42922J55232J51698J21147J17646j704J48948
4869H963177K62384J59493K93945M43692J36012M27371L82593M92726P86496R08585
4859A3256474R61592J434970J647806J450979J053022N48181k34599j164240j382942
4850A7571243r87972q28703p36834p88447n34487k08481l58659j94216k03005
4841A2730439q4177P8427j16718j07861M2528O967N8453n14610m41268j66137
4831A1486043k79581l55058m55477j86527L7587l59589l34760j66002p534j17397
$$ plain form
4899 4648814 4806330 4970241 4808372 4926767 5164134 5241067 5362519 5384398 5519600 5662345
4889 5662345 5781887 5879693 5944297 6288043 6582726 7011071 7361707 7690477 8004130 8117405
4879 8117405 8145109 8297236 8413132 8270210 8425442 8577140 8698287 8815933 8814229 8963177
4869 8963177 9225561 9385054 9678999 10122691 10258703 10686074 11068667 11561393 12347889 13256474
4859 13256474 14218066 15653036 17300842 18751821 19804843 20353024 20118425 18954185 17571243
4850 17571243 16583271 15754568 15017734 14229287 13694800 13486319 13127660 12933444 12730439
4841 12730439 12646262 12724689 12607971 12500110 12542638 12549605 12608058 12093448 11652180 11486043
4831 11486043 11206462 10851404 10395927 10209400 10246987 9887398 9552638 9386636 9379102 9261705
4821I261705J67702k9745O205K35306j01980R8141O8605J97285K8089L76772M10930
4810A0719015K36808K80069L48494K08986M9797J85117L89790P0888K90483R3634
4800A2873081J09906L00052K97533j4246M0388L26970O16444P75230J156751J042651
4790A7524760M76991J84030n18555j199408j592807j555162j763756j087856j060324
4781I407913p21713m29151n29573m64444k67606k87200j83428k26382j15219j4792
4771F168405j80633k85465K61703m0013j50025j99664m16923k73572p4972k51891
4761D556950l05033k5938l06023l46290k31073k15898K6305j60515j293Q4443
4751C075635P8831p2316q4636j68505k04697j49200K1025Q9032N9972L769j449
$$ plain form
4821 9261705 9429407 9399662 9405867 9641173 9539193 9637334 9705939 9903224 9931313 10308085 10719015
4810 10719015 10955823 11235892 11584386 11793372 11843169 12028286 12418076 12488964 12779447 12873081
4800 12873081 12982987 13283039 13580572 13566326 13606714 13933684 14550128 15325358 16482109 17524760
4790 17524760 18001751 18185781 17667226 16467818 14875011 13319849 11556093 10468237 9407913
4781 9407913 8686200 8257049 7727476 7263032 6995426 6708226 6524798 6298416 6183197 6168405
4771 6168405 5987772 5702307 5964010 5923997 5773972 5574308 5157385 4883813 4808841 4556950
4761 4556950 4251917 4225979 3919956 3573666 3342593 3126695 3153000 2992485 2991192 3075635
4751 3075635 3154466 3082150 2997514 2829009 2624312 2475112 2496137 2585169 2645141 2648910 2647461
4740B647461O7962k11108k38574j17488J40460R0233j21641K6324N7055J29329
4730B470013q1841n9733j54740J93051m5439n9429J10010q9357n6554P1726j32471
4719B165236J675J22344j70280N3563J78808p4941k7123O4123k97199k1390j74541
4708A820275M5244J19502J92020J5456k09883k7934N4436j18164J02080j20503
4698A872529J71215m9038k0722o366r5330L8903P1612m7112N440m7482Q1740J47223
4686B122612r794r3300j03901q9898M3416K0607K2291J40664J09332N6499L9981
4675B258509k11696J65906o9754m3485J09811L8421m6355k2387n3799K2568o0275
4664B087464j43373J16824J59705j45597k17087J69000J31159J27641j26380j8550
$$ plain form
4740 2647461 2715423 2504315 2265741 2148253 2288713 2378946 2257305 2283629 2340684 2470013
4730 2470013 2388172 2328439 2173699 2366750 2321311 2261882 2371892 2282535 2225981 2297707 2165236
4719 2165236 2166911 2289255 2118975 2172538 2351346 2276405 2249282 2313405 2016206 1994816 1820275
4708 1820275 1865519 1985021 2177041 2192497 1982614 1954680 2009116 1890952 1993032 1872529
4698 1872529 2043744 1994706 1973984 1967618 1872288 1911191 1982803 1935691 1941131 1893649 1975389 2122612
4686 2122612 2112818 2019518 1915617 1825719 1869135 1889742 1912033 2052697 2162029 2218528 2258509
4675 2258509 2046813 2212719 2142965 2099480 2209291 2247712 2201357 2178970 2125171 2147739 2087464
4664 2087464 1944091 2060915 2220620 2075023 1857936 2026936 2158095 2285736 2159356 2140806
4654B140806M3868r2528Q7686J83458r9005P1545M1897j15441j15355j8810j5772
4643B112349J10343O2405j99093N5895J38509Q5034N044j1064K5003N6283j31561
4632B309147o2495P7928j08888j25945J00020M4966j36885O8844k9410J37258
4622B274540J35226m8644o4037n0852o6j6413n4804J29447m1695j3433j7056n4734
4610B177479Q1371R0424l9912J15059N2275L5832j39057L7195l10414N4944K64827
4599B420023K8023j3728j00762L4736J96098K1707o8445J71667r0353j85796K635
4588B415805J99057j556R4581M3329P9040P4846j26421N282l7496J39169J07158
4577B992794J16620J40104q5036J46973P6035J17055l4126J36793L7275K40108
$$ plain form
4654 2140806 2184674 2092146 2179832 2363290 2264285 2335830 2377727 2262286 2146931 2128121 2112349
4643 2112349 2222692 2285097 2086004 2141899 2280408 2365442 2370486 2359422 2384425 2440708 2309147
4632 2309147 2246652 2324580 2215692 2089747 2189767 2234733 2097848 2166692 2137282 2274540
4622 2274540 2409766 2361122 2297085 2246233 2246167 2229754 2174950 2304397 2262702 2249269 2232213 2177479
4610 2177479 2258850 2349274 2309362 2424421 2476696 2512528 2373471 2410666 2100252 2155196 2420023
4599 2420023 2448046 2434318 2333556 2368292 2564390 2586097 2517652 2689319 2598966 2413170 2415805
4588 2415805 2614862 2613306 2707887 2751216 2830256 2905102 2778681 2783963 2746467 2885636 2992794
4577 2992794 3109414 3249518 3164482 3311455 3387490 3504545 3470419 3607212 3644487 3884595
4567C884595M65069J63537M3263n5663j9254k1121K21J09349O2201r0700o5583
4556D475914j48096K41208R4356m227M11299L46436K98339N63778O38863M38263
4546G356133J26086k39685n91978p20893l64813k28819m08325l47721k09227l41158
4536D029600k84983j88083l8238K25750j33374p1246o7181o3044R961J13090J85262
4525C717514M7245j51093J33136p9404p9063k8586q3299n9001J79572J02675K23909
4514C923605K3913M3061J16827j39510M0863n8392J02153P7466K06992K21219
4504D558197K8139K15346m4062o3905K50197M4484K33119j60386J3117L2002j89674
4493D916574n7824j05565q2078Q0078k1217J25184M7441n5715j66957m4810N3790
$$ plain form
4567 3884595 4349664 4513201 4556464 4500801 4481547 4460426 4460647 4569996 4632197 4541497 4475914
4556 4475914 4327818 4569026 4663382 4659155 5070454 5416890 5715229 6279007 6917870 7356133
4546 7356133 7482219 7242534 6650556 5929663 5564850 5336031 4927706 4579985 4370758 4029600
4536 4029600 3744617 3556534 3518296 3744046 3610672 3539426 3472245 3409201 3419162 3532252 3717514
4525 3717514 3764759 3613666 3746802 3667398 3588335 3559749 3476450 3417449 3597021 3699696 3923605
4514 3923605 3947518 3990579 4107406 3967896 4008759 3950367 4052520 4129986 4336978 4558197
4504 4558197 4586336 4801682 4757620 4693715 4943912 4988396 5221515 5061129 5074246 5106248 4916574
4493 4916574 4858750 4753185 4671107 4751185 4729968 4855152 4902593 4846878 4679921 4635111 4688901
4482D688901J85110l6761Q5379R4321J18359O1727P037N2265K0813J20792L05157
4471E703100R2059p351K4214L5426j68134L40970R9348j46956R4597L59113K52550
4460F678936j78593J93177J15051K4852J30096K13553J41744J05344J38469Q5571
4450G648200J02130J85831J56786K03064O9315J29044J41361J04622p4124O7075
4440H733304K60523L4478J05088L35681N8348J54228J63830J40979J00960K83783
4430A0371202K21404K51366J36080J28035N11271N4519P4203J37443L67540K70361
4420A2523424M35923L69831J68131L34094L33361L82078L01007M61317O00803
4411A5909969P62565N22429P07259P48455O59103P22909Q67052J039919J058067
$$ plain form
4482 4688901 4874011 4837250 4922629 5016950 5135309 5197036 5204073 5256338 5277151 5397943 5703100
4471 5703100 5795159 5787808 5812022 5847448 5679314 6020284 6119632 5972676 6067273 6426386 6678936
4460 6678936 6500343 6693520 6808571 6833423 6963519 7177072 7318816 7424160 7562629 7648200
4450 7648200 7750330 7936161 8092947 8296011 8365326 8494370 8635731 8740353 8666229 8733304
4440 8733304 8993827 9028305 9133393 9469074 9527422 9681650 9845480 9986459 10087419 10371202
4430 10371202 10592606 10843972 10980052 11108087 11619358 11673877 11748080 11885523 12253063 12523424
4420 12523424 12959347 13329178 13497309 13831403 14164764 14546842 14847849 15309166 15909969
4411 15909969 16672534 17194963 17902222 18650677 19309780 20032689 20899741 21939660 22997727
4402B2997727Q47420Q44044Q69972J029901R16350R64516J147169R33161P14074
4393C1264334N20943K92936L60311M08212N58489N77146Q47483J191288J446726
4384C7467868J933735K482773K823821L417197L763641L573026L283088J685340
4376F0430489k92528j450199k443058k766447k922268k937265k654671k549647
4368D2414406k233778j804195j189224r82641l58045L7210L36650Q49103J115236
4359C8184722J261357J993132K650959L369280L926509M269912L919251K515294
4351F2090416K50255k369007m208040n045558m956286m497896l492684k771327
4343C4999873k344239k107154j630450j448998q63366m91513l48992O4513J98123
$$ plain form
4402 22997727 23845147 24689191 25559163 26589064 27505414 28469930 29617099 30550260 31264334
4393 31264334 31785277 32078213 32438524 32846736 33405225 33982371 34829854 36021142 37467868
4384 37467868 39401603 41884376 44708197 48125394 51889035 55462061 58745149 60430489
4376 60430489 60137961 58687762 56244704 53478257 50555989 47618724 44964053 42414406
4368 42414406 40180628 38376433 37187209 36204568 35846523 35883733 36220383 37069486 38184722
4359 38184722 39446079 41439211 44090170 47459450 51385959 55655871 59575122 62090416
4351 62090416 62340671 59971664 55763624 50718066 45761780 41263884 37771200 34999873
4343 34999873 32655634 30548480 28918030 27469032 26605666 26114153 25765161 25829674 26027797
4334B6027797L04746L12996P13232J251418J327838K202841J749756J553661J013416
4325C6457701k67680j479227k438650k784508k499448k045623j898093j830335
4317B1214137j456728r92441q79193o44842r13526m52480m14061k42142j73708
4308A5045016P4544l03609l5071p704k1083J09385J3338J25176R0495j43865k93588
4297A4653034J10581k1408j8160j32914j01095R801L12691L66353p5471q078m1185
4286A5054149R4851j14098J7327K64164K88595M09786J83100J07017K16053K36098
4276A6757042L15706k045L76198N83318K82017j3326K67448P4706K74541M84920
4266A9400525N08617M75169K79768K77122L03299N46367K76921K87789M46684
$$ plain form
4334 26027797 26332543 26645539 27358771 28610189 29938027 32140868 33890624 35444285 36457701
4325 36457701 36190021 34710794 32272144 29487636 26988188 24942565 23044472 21214137
4317 21214137 19757409 18764968 17885775 17240933 16327407 15874927 15460866 15218724 15045016
4308 15045016 15119560 14815951 14780880 14773176 14752093 14861478 14874816 14999992 15090487 14946622 14653034
4297 14653034 14763615 14742207 14724047 14591133 14490038 14499839 14812530 15178883 15103412 15095334 15054149
4286 15054149 15149000 15034902 15052229 15316393 15604988 16014774 16197874 16304891 16520944 16757042
4276 16757042 17072748 17070703 17446901 18030219 18312236 18298910 18566358 18641064 18915605 19400525
4266 19400525 19909142 20384311 20664079 20941201 21244500 21790867 22067788 22355577 22802261
4257B2802261M35752K59783L05559K34828N38673M78634M57076M35134N00751
4248B6448451K44322M07747M70153O42798P57231P07417Q30066O66438N82286
4239C1756909M57272P06011R23460R71784J270934J105625Q04432J029310J541010
4230D0566747J422209J456789J753779J570056J508801J503270J730213K068629
4222E3580493K409486K801396L126348L322137L981832M505789M894107M847064
4214H3468652L927945K975201K912638L706188M780747O580469Q234999Q967884
4206A25554723R177811R727914J1266326J3823958J7692307K1804024K7069919
4199B36116982L1829537L1464781K0180435j418471k2524204l4764573l7895556
$$ plain form
4257 22802261 23238013 23497796 23803355 24038183 24576856 25055490 25512566 25947700 26448451
4248 26448451 26692773 27100520 27570673 28213471 28970702 29678119 30508185 31174623 31756909
4239 31756909 32214181 32920192 33843652 34815436 36086370 37191995 37996427 39025737 40566747
4230 40566747 41988956 43445745 45199524 46769580 48278381 49781651 51511864 53580493
4222 53580493 55989979 58791375 61917723 65239860 69221692 73727481 78621588 83468652
4214 83468652 87396597 90371798 93284436 96990624 101771371 108351840 116586839 125554723
4206 125554723 134732534 144460448 155726774 169550732 187243039 209047063 236116982
4199 236116982 267946519 299411300 319591735 318173264 295649060 260884487 222988931
4192B22988931l4597487k8666516k3299521j8859997j5116925j2574821j0291250
4185G9582414q108515o628897n552857m969886m296561l649020l091296k450356
4177D0835026k111772j875564j631142j665515j151730j015958r56424q77838
4169B9549083m10140m67082m90744l35198l07191j04733j62813R6788J9823J52633
4159B7540426K38994L32050O33404M80979O92403Q61776J010488J629080K278518
4150C5698118K282154K864094M031722N075423M990224L029932n68542l444729
4142E3958396n161758n931938n330849m720566l998889l092838k458282k175388
4134B1087888j651833j297468j008635r48652p40633q15602n36014m24738p08772
$$ plain form
4192 222988931 188391444 159724928 136425407 117565410 102448485 89873664 79582414
4185 79582414 71473899 64845002 59292145 54322259 50025698 46376678 43285382 40835026
4177 40835026 38723254 36847690 35216548 33551033 32399303 31383345 30426921 29549083
4169 29549083 29138943 28671861 28181117 27845919 27538728 27433995 27271182 27367970 27387793 27540426
4159 27540426 27779420 28111470 28744874 29225853 29918256 30780032 31790520 33419600 35698118
4150 35698118 37980272 40844366 44876088 49951511 54941735 57971667 57403125 53958396
4142 53958396 48796638 42864700 37533851 32813285 28814396 25721558 23263276 21087888
4134 21087888 19436055 18138587 17129952 16181300 15440667 14625065 14089051 13664313 12955541
4125A2955541o49925m38567m16187m43338m49584j02995j95451l27712k74033
4116I657749l12295l23236l59346j38529j31458k3754r3614J0525R4047k77918
4106H102171l4272k04801n9550J33934j78143n4371o5405j66020m2707K41035
4096G671871k7711J23743R0869j3608K5945J50071R0331Q3330K3862q8394k55338
4085G874971j49270k00296j87472j05982J08412j43803j03263j17792r3618j19659
4075F762228p491Q6361k94660j35125J26428j65019o3034R3070N8079L0975R1204
4064F583016J50336J36676J52576N0558K0492j55429L25556n8388M9214l8871
4054G215736M8500P5670K02956J1210l15829j08750J9842j29840K9525l24794
$$ plain form
4125 12955541 12305616 11867049 11450862 11007524 10557940 10454945 10259494 9931782 9657749
4116 9657749 9345454 9022218 8662872 8524343 8392885 8369131 8275517 8286042 8380089 8102171
4106 8102171 8067899 7863098 7803548 7937482 7759339 7704968 7639563 7473543 7430836 7671871
4096 7671871 7644160 7767903 7858772 7845164 7871109 8021180 8111511 8194841 8218703 8130309 7874971
4085 7874971 7725701 7525405 7337933 7231951 7340363 7196560 7093297 6975505 6881887 6762228
4075 6762228 6754737 6841098 6546438 6411313 6537741 6372722 6309688 6402758 6460837 6491812 6583016
4064 6583016 6733352 6870028 7022604 7073162 7093654 6938225 7263781 7205393 7254607 7215736
4054 7215736 7264236 7339906 7542862 7554072 7238243 7129493 7149335 7019495 7049020 6724226
4044F724226n36667L4530k33821k73148Q385j99044J53642k26888k15380l8186
4034E197649l9481J13184l5569L6362j42393L7011L24309m9814k1519l2887n3849
4023E333003n3553l3820o4751l00318k2238N28045n5488m16933K5589j21767l4518
4012D783251j51590j26831k19308j31952k22110n8035L6854l0536J46008M3497
4002D069248J8758k08690K1266Q6909l37316Q9081O8068O0694Q8498q97p5630
3991C879989n0180L11410M7983p9410n9409k73231J78025J47556k06730q7976
3981C808027q4420j49839k25080L30056k32023q6863J43231j85739J38129k52340
3971C203139J5657k8406j66857N6815P8321j36100k9541L3638j27156k26378K56485
$$ plain form
4044 6724226 6187559 6222089 5988268 5715120 5723505 5524461 5678103 5451215 5235835 5197649
4034 5197649 5158168 5271352 5235783 5272145 5129752 5166763 5491072 5441258 5419739 5386852 5333003
4023 5333003 5279450 5245630 5180879 4880561 4858323 5386368 5330880 4913947 4939536 4817769 4783251
4012 4783251 4631661 4504830 4285522 4153570 3931460 3873425 3910279 3879743 4025751 4069248
4002 4069248 4088006 3879316 3900582 3987491 3650175 3739256 3807324 3868018 3956516 3955619 3879989
3991 3879989 3829809 4141219 4189202 4109792 4050383 3777152 3955177 4102733 3896003 3808027
3981 3808027 3723607 3573768 3348688 3678744 3446721 3359858 3503089 3317350 3455479 3203139
3971 3203139 3218796 3190390 3023533 3080348 3158669 3022569 2993028 3026666 2899510 2673132 2929617
3960B929617M9575p8826q2536J08597J42761k20948j2354o8057K43268m7952j49115
3949B814030l5032r5073k6386M3037J63126j85602j36001j31816k7611J09970
3939B492642P5504j33654L9265k24379L2476P4886l9233j13219J5864q1656K459
3928B140955N8914l263r0966o9972J1785J38795K56888j40832j09142k9106J41884
3917B305940l1251m7994Q7459j6620o0838p2712o5271o4303J70732j85549j62972
3906A856621L01646j8988L6140J6412J88340p4741L498K26915N6889o6388L3871
3895B560215J52638J63085J46375J2359K2919j51924r7842l9249k61193o0630
3885B446753k42020q7271M5517L3746j65429j84048j93799Q8888r9984J39993
$$ plain form
3960 2929617 2979192 2900366 2817830 2926427 3069188 2848240 2835886 2767829 3011097 2963145 2814030
3949 2814030 2778998 2683925 2657539 2700576 2863702 2678100 2542099 2410283 2382672 2492642
3939 2492642 2568146 2434492 2473757 2249378 2281854 2356740 2317507 2204288 2220152 2138496 2140955
3928 2140955 2199869 2196606 2105640 2035668 2047453 2186248 2443136 2302304 2193162 2164056 2305940
3917 2305940 2274689 2226695 2314154 2297534 2236696 2163984 2098713 2034410 2205142 2019593 1856621
3906 1856621 2158267 2139279 2175419 2191831 2380171 2305430 2308928 2535843 2592732 2526344 2560215
3895 2560215 2712853 2875938 3022313 3034672 3057591 2905667 2807825 2768576 2507383 2446753
3885 2446753 2204733 2117462 2162979 2196725 2031296 1847248 1653449 1742337 1642353 1782346
3875A782346J72226J2630k24180J52267j6882j10190J41172l1590J25942J38045
3865B141786r2830j75833j28635R279L7764J08688R7533j83863p2606M2782q3045
3854A701020j2946R6429J33373l2175j48251M6641n3012j28098j3854M8705k62750
3843A375082L3851K12615q809j12981l0938Q8510j20585J09742q1046O7698N4511
3832A587650k51214L5454N3470J6695j01139O2411k20630q69k073k2772K8984
3821A185967L3892K31509J05116k85628o2244o2336m6144K80535M8645j96926
3811A232386n0928J659K7869m7737J12193J665N3693O3210p2291j00168O2141
3800A283692J07403q6677l20227J22155K81539L4940j65950n661l7556J36241
$$ plain form
3875 1782346 1954572 1967202 1743022 1895289 1878407 1768217 1909389 1877799 2003741 2141786
3865 2141786 2048956 1873123 1744488 1753767 1791531 1900219 1997752 1813889 1741283 1784065 1701020
3854 1701020 1688074 1784503 1917876 1885701 1737450 1784091 1731079 1602981 1589127 1637832 1375082
3843 1375082 1408933 1621548 1612739 1499758 1468820 1557330 1436745 1546487 1465441 1533139 1587650
3832 1587650 1336436 1371890 1425360 1442055 1340916 1403327 1182697 1181828 1179755 1156983 1185967
3821 1185967 1219859 1451368 1556484 1270856 1208612 1146276 1100132 1380667 1429312 1232386
3811 1232386 1181458 1183117 1210986 1163249 1275442 1277107 1330800 1394010 1321719 1221551 1283692
3800 1283692 1391095 1304418 984191 1106346 1387885 1422825 1256875 1251214 1213658 1349899
3790A349899m5072l066m5812p3713K00090N0809k68451k11046J06444j629l7008
3779A021445J35993J66154J8800n1820k37539J25528q1061N8104j6923O3147J87605
3768A389433l1920m8531Q5181k4331j02498Q6370j65652J12814j1288q7880o6133
3757A135565K9728q3886k8545L12556K7707n8736L9667K43124j06006p3502K2671
3746A460343j08544R6295p4544k44721J77190P0286M0007L6345J08140M5282k553
3735A603526j80957l8130j7734J13738m0476j60738j22686L08859N6150k48747
3725A272805P073o1851n6135P7333K35275k59668M7974M8254Q9216P7220r7304
3714A380192m3232r8K32302J14791M6083j66763j03000Q7034P3386J61945J15859
$$ plain form
3790 1349899 1304827 1301761 1255949 1182236 1382326 1433135 1164684 953638 1060082 1058453 1021445
3779 1021445 1157438 1323592 1342392 1290572 1053033 1178561 1097500 1155604 1138681 1201828 1389433
3768 1389433 1357513 1308982 1394163 1369832 1267334 1353704 1188052 1300866 1289578 1201698 1135565
3757 1135565 1165293 1081407 1052862 1365418 1393125 1334389 1374056 1617180 1511174 1437672 1460343
3746 1460343 1351799 1448094 1373550 1128829 1306019 1376305 1416312 1452657 1560797 1606079 1603526
3735 1603526 1422569 1384439 1366705 1480443 1439967 1279229 1156543 1465402 1521552 1272805
3725 1272805 1279878 1218027 1161892 1239225 1474500 1214832 1262806 1311060 1400276 1477496 1380192
3714 1380192 1336960 1336862 1569164 1683955 1730038 1563275 1460275 1547309 1620695 1782640 1898499
3703A898499j7726k7220j16431j03773l4484J46836J72372K8857K68712P953k11530
3692B012065K63122Q5005j16005J04132P2895J01363K7290K64871j48286J83381
3682B849833J82246p9592K35057r5778o3085N4038j20677Q8417P2342k15783J53172
3671C060190P0709q841k3505o8192K43211J52860n2230j92501m6367J04148q5407
3660C154075L240r1408o7990P0261K8202P7003k3179K28156o0833j41789k7338
3649C148400j6740J65213j33390J61456j06465M4960J65016k6879j76779n7099
3639C167693J549l5527R5551J51926k0651j63179L9817J68530O1905j42911p072
3628C317631M060Q7239J50850O4060q6700k9424J64320j4535J7130J37327k1834
$$ plain form
3703 1898499 1880773 1853553 1737122 1633349 1598865 1745701 1918073 1946930 2215642 2223595 2012065
3692 2012065 2275187 2360192 2244187 2348319 2421214 2522577 2549867 2814738 2666452 2849833
3682 2849833 3032079 2952487 3187544 3091766 3028681 3082719 2962042 3050459 3122801 2907018 3060190
3671 3060190 3130899 3122058 3098553 3030361 3273572 3426432 3374202 3181701 3135334 3239482 3154075
3660 3154075 3157315 3065907 2997917 3068178 3096380 3173383 3150204 3378360 3317527 3175738 3148400
3649 3148400 3131660 3296873 3163483 3324939 3218474 3263434 3428450 3401571 3224792 3167693
3639 3167693 3169242 3133715 3229266 3381192 3360541 3197362 3237179 3405709 3467614 3324703 3317631
3628 3317631 3321691 3408930 3559780 3623840 3537140 3507716 3672036 3657501 3674631 3811958 3790124
3617C790124r1225N2206o6191M5548k94134p7992L5065j70749K75211j49682j31110
3606C217071k48794j09196l3516l9392j48832N5269J3846J20970K52606N5007
3596C135039l3672k09859j93935j05138m1645p3426L21103J66337k53792j0921
3586B700091p9205K64235n5446q1736j19768J63470n4117l9726n4044Q9002j50877
3575B581879k61027J05185r0993j23093j58819o3031l1600p7904P823L18759R271
3564B216450L796l3944j04785M3422k29228k28985J01550j769N4927O038r425
3553A818047k05207L7523J65755J02798k19711J01442j81651K2759n9395j57653
3543A424707J10801P0846j24540N9745M0014j67506O7733o8030m698N1750l7803
$$ plain form
3617 3790124 3698899 3751105 3684914 3730462 3436328 3358336 3393401 3222652 3497863 3348181 3217071
3606 3217071 2968277 2859081 2825565 2786173 2637341 2692610 2706456 2827426 3080032 3135039
3596 3135039 3101367 2891508 2697573 2592435 2550790 2477364 2798467 2964804 2711012 2700091
3586 2700091 2620886 2885121 2829675 2747939 2628171 2791641 2737524 2697798 2643754 2732756 2581879
3575 2581879 2320852 2426037 2335044 2211951 2053132 1990101 1958501 1880597 1888420 2207179 2216450
3564 2216450 2220246 2186302 2081517 2124939 1895711 1666726 1768276 1766507 1821434 1827472 1818047
3553 1818047 1612840 1650363 1816118 1918916 1699205 1800647 1618996 1641755 1582360 1424707
3543 1424707 1535508 1606354 1481814 1541559 1581573 1414067 1481800 1413770 1409072 1460822 1423019
3532A423019K4436j57647j08565R4936O178p7077R8717J26285J20245j13369k23815
3521A213343O4377J3738M0672J5534J30894Q8376m3080J25753j7250k90586j29049
3510A212722K48519p4124j13206J95208J32891L685j20642P0233k799M3997L3896
3499A630380j07288j80374p3106K2002O6653K10418J83941j4756k50889O4842
3489A551823o3727m7096Q6343O7050Q5595j10127K02028j43966L3295j32106L4090
3478A563202J33126j7270n5245Q4850P4912m1332K22902O5848p4837r377j12039
3467A834740J23258P7911j18902k9183J33705R4558k87491k16152J97912J4492
3457A824848q648K16437J7861n765L2208L11314o6110J00764j21963j0689K62866
$$ plain form
3532 1423019 1447455 1289808 1181243 1276179 1282357 1205280 1303997 1430282 1550527 1437158 1213343
3521 1213343 1277720 1291458 1332130 1347664 1478558 1566934 1523854 1649607 1632357 1341771 1212722
3510 1212722 1461241 1387117 1273911 1469119 1602010 1605695 1485053 1555286 1552487 1596484 1630380
3499 1630380 1523092 1342718 1269612 1291614 1358267 1568685 1752626 1737870 1486981 1551823
3489 1551823 1488096 1441000 1527343 1594393 1679988 1569861 1771889 1627923 1661218 1529112 1563202
3478 1563202 1696328 1679058 1623813 1708663 1783575 1742243 1965145 2030993 1956156 1946779 1834740
3467 1834740 1957998 2035909 1917007 1887824 2021529 2116087 1828596 1612444 1810356 1824848
3457 1824848 1816200 2032637 2050498 2044733 2076941 2388255 2322145 2422909 2300946 2290257 2553123
3446B553123j2629m6526O4456J58167M4904j40423R3888L87467j01871M390J39184
3435C144130m2857r7502p2064j69827J90464K95325O3856n78j09065J74739L9600
3424C416221Q6723j28140J47225K72593J65191n4391J51857M7233Q5126K60074
3414D449712M4267Q1572J31188j8922J24100J99619j943o8115K32644K63327j12319
3403E325130K33793J15188K4015R9454L72579K46390L4805J55774K62972O7993
3393F938093R4278R323L05490O6604L20157K54943M4767K7241K78911k1019K81210
3382H599998L78214k6137K10716K78714N4823L1961K63038K30147J08553L76385
3372A0506412J36763p2748L26960K94798K57586J09184M16564K06476K56691K69344
$$ plain form
3446 2553123 2540494 2493968 2558424 2716591 2761495 2621072 2714960 3102427 3000556 3004946 3144130
3435 3144130 3101273 3003771 2931707 2761880 2952344 3247669 3311525 3310947 3201882 3376621 3416221
3424 3416221 3502944 3374804 3522029 3794622 3959813 3905422 4057279 4104512 4189638 4449712
3414 4449712 4493979 4575551 4706739 4687817 4811917 5011536 5009593 4941478 5174122 5437449 5325130
3403 5325130 5558923 5674111 5698126 5797580 6170159 6416549 6451354 6607128 6870100 6938093
3393 6938093 7032371 7041694 7347184 7413788 7733945 7988888 8033655 8060896 8339807 8318788 8599998
3382 8599998 8978212 8952075 9162791 9441505 9496328 9528289 9791327 10021474 10130027 10506412
3372 10506412 10643175 10570427 10897387 11192185 11449771 11558955 11975519 12181995 12438686 12708030
3362A2708030N1592L48334N55149M19663K31695P3655L55180L62917L98918L34262
3352A5839395M2580L08128L61993K91934M46141M00039M45274L12275O24696M77941
3342A9550396N85699M24414K40219O57842L73398O40594N59305K92229O79507
3333B4003603N49940M80494Q50793O82102P66743R18998J096277R49552R16749
3324C1215251J290203J404399J319269J315729J476282J658875K047451J933474
3316D3660933K062869K470295K509108K185375J721906J326886R88411P05147
3308E7630930J018005N26248J07294J20028j76254m09428l69512n35774o99149
3299E7212388r59176q47089j180063j360311j737483k052770k508792k859857
$$ plain form
3362 12708030 12759622 13107956 13663105 14082768 14314463 14388118 14743298 15106215 15505133 15839395
3352 15839395 15881975 16190103 16552096 16844030 17290171 17690210 18135484 18447759 19072455 19550396
3342 19550396 20136095 20560509 20800728 21458570 21831968 22472562 23031867 23324096 24003603
3333 24003603 24553543 25034037 25884830 26566932 27333675 28252673 29348950 30298502 31215251
3324 31215251 32505454 33909853 35229122 36544851 38021133 39680008 41727459 43660933
3316 43660933 45723802 48194097 50703205 52888580 54610486 55937372 56925783 57630930
3308 57630930 58648935 59175183 59282477 59402505 59226251 58816823 58447311 57911537 57212388
3299 57212388 56253212 55406123 54226060 52865749 51128266 49075496 46566704 43706847
3291D3706847k975189k984851l068226k947001k475547k694017k412178j815680
3283B2334158j718647j801727j447643j367287r01017r32292q04865p88466q68245
3274A1703969n57516l51225n65526o32942o38860m35004k21958k64269k71571
3265G765098k95127j24784r6682l54788l46793k44518k04561m43488r4816q381
3255E551160l27141m10736j13295k27479k25784m7716j52052O9386l1184o828
3245D078331j31431m9150k11681j03821P3017k41805N299j46710n8624j5086j60314
3234C038025j82225N2699O704k01954k09904l0687j71243P2964O7330j78299J8188
3223B281598m0099m3098o7441j30902j26986O1382Q3383j76476k05616J05367
$$ plain form
3291 43706847 40731658 37746807 34678581 31731580 29256033 26562016 24149838 22334158
3283 22334158 20615511 18813784 17366141 15998854 15097837 14165545 13360680 12572214 11703969
3274 11703969 11146453 10795228 10229702 9596760 8957900 8522896 8300938 8036669 7765098
3265 7765098 7469971 7345187 7248505 6893717 6546924 6302406 6097845 5654357 5559541 5551160
3255 5551160 5224019 4813283 4699988 4472509 4246725 4199009 4046957 4116343 4085159 4078331
3245 4078331 3946900 3897750 3686069 3582248 3655265 3413460 3418759 3272049 3213425 3198339 3038025
3234 3038025 2855800 2908499 2915203 2713249 2503345 2472658 2301415 2374379 2441709 2263410 2281598
3223 2281598 2241499 2198401 2130960 2000058 1873072 1934454 2017837 1841361 1635745 1741112
3213A741112j24865J90778L2959j97800q3194J27782q4631j63556l4301J81720
3203A586004K5807l62174K18788R6187k58049j95154J46723O4822j42741j58749
3193A021464M6073K46332j64587J81453j3434M6469j92059l23881L725J74633
3183A026188J58756m8979j45496L3177k5240L8426J03819j10936q7938K47518
3173A189295j04634k24939J01595J52851N2685j43752r2318j96018J97893O5651
3163I98309m3841n1885j4327P1117p4438j04663P9551j13233O5955J13717Q9140
3152A015402j39153j12711K109J29181k7782o9815n1071K79300J49847l25427
3142H49880j26888q5474m9890j8546j23136j6022L45176j57060k8246J6435j18051
$$ plain form
3213 1741112 1616247 1807025 1839984 1642184 1558990 1686772 1602141 1438585 1404284 1586004
3203 1586004 1611811 1249637 1468425 1564612 1306563 1111409 1258132 1322954 1180213 1021464
3193 1021464 1067537 1313869 1149282 1330735 1317301 1363770 1171711 847830 851555 1026188
3183 1026188 1184944 1135965 990469 1023646 998406 1036832 1140651 1029715 941777 1189295
3173 1189295 1084661 859722 961317 1114168 1166853 1023101 930783 734765 932658 998309
3163 998309 954468 902583 888256 959373 884935 780272 859823 746590 812545 926262 1015402
3152 1015402 876249 763538 765647 894828 867046 797231 746160 1025460 1175307 849880
3142 849880 722992 637518 587628 569082 445946 429924 775100 618040 589794 606229 488178
3131D88178K59303k5775j52212o9098j01949K91408M0933K0093r842j49799o9471
3120E21769n0488J9831j65426K1948Q748j6568J47222K20955P4830j05434p8727
3109E98660K54373l4177j16338j12479K52442Q8324j25260j80450r3090R5487
3099F27492Q5326J8814n7156K6873N8669J38364q4109j70901K91570n7474k11870
3088F65598p3572J18846J23948M5971O0873q4840M4651m8799K0341l9959J4237
3077H47295k9023J97092J0556j5618m545k5142j58049k2372K05753K8579j6026
3066A018500Q0364m9456n2262j22401R5895J80593k36732j00698J21610J80105
3056A115518K01663O1864l3007j66160J67750Q0863m1093j11096J73908q5560
$$ plain form
3131 488178 747481 721706 569494 500396 398447 689855 730788 750881 741039 591240 521769
3120 521769 471281 491112 325686 347634 356382 339814 487036 707991 782821 677387 598660
3109 598660 853033 818856 702518 590039 842481 930805 805545 625095 532005 627492
3099 627492 712818 731632 674476 701349 760018 898382 814273 643372 934942 877468 665598
3088 665598 592026 710872 834820 880791 941664 856824 901475 852676 873017 833058 847295
3077 847295 818272 1015364 1025920 1010302 1005757 980615 822566 800194 1005947 1034526 1018500
3066 1018500 1098864 1049408 997146 874745 970640 1151233 914501 813803 935413 1115518
3056 1115518 1317181 1379045 1346038 1179878 1347628 1428491 1387398 1276302 1450210 1364650
3046A364650k9395r7181n931J27681l8889p2053K41025j11768N160K85687J5413
3035A684399P9205L1394r541k27685J05951m5941j1159Q3850J00012R6433j11065
3024A775853K7532o2644J44724K21345J48599j69165N8782K46960j41114R3871
3014B344743K55045M2013L1090J42448o1183L7531l6919K28646J55860Q1217J75340
3003C395831J95106K43183K52329P5464K46290R4788J3624J3329j16108K06687
2993D620523L5785m8360J87979J50744q3106k06612r0556J35306J27171j6738
2983D812136j13933p1258L32495J21478K07438j8284J74878M49889L67034J31736
2973F393609J80698M44372L46454M90554J61424l05468n07065n54948l98646l99192
$$ plain form
3046 1364650 1335255 1238074 1232143 1359824 1320935 1248882 1489907 1378139 1383299 1668986 1684399
3035 1684399 1763604 1794998 1785457 1557772 1663723 1617782 1606623 1690473 1790485 1886918 1775853
3024 1775853 1803385 1740741 1885465 2106810 2255409 2086244 2145026 2391986 2250872 2344743
3014 2344743 2599788 2641801 2672891 2815339 2754156 2791687 2754768 2983414 3139274 3220491 3395831
3003 3395831 3590937 3834120 4086449 4161913 4408203 4502991 4516615 4529944 4413836 4620523
2993 4620523 4656308 4607948 4795927 4946671 4863565 4656953 4566397 4701703 4828874 4812136
2983 4812136 4698203 4626945 4959440 5080918 5288356 5270072 5444950 5894839 6261873 6393609
2973 6393609 6574307 7018679 7365133 7855687 8017111 7711643 7204578 6649630 6250984 5851792
2963E851792m99118m18610k46044k86617j50655m4647q4356j45748j25896k96054
2953C554047O6146J62145l4613j38037K32572l7568q6670o2181j34018M14291
2943C936114p5848j37665O8430J59748k47695j64996O0135q6617j41711l20505
2933C049390l93692j03238K453K2307j23699l96989n7099j97201K0073J14951
2923A937256j41935L3853k66496l49150n1630l496J75315k71293j52675l2289
2913H77460j36588j0609J44050o4048j86222K69614J71054p0286l00370J86002
2903H80057k02307L8807j2112k55167R1320j8004j42072r995J11502J4973r9204
2892C97798r2093o6060l4130J33437J21609j07694N5112j39077K9198j13333n6452
$$ plain form
2963 5851792 5352674 4934064 4688020 4401403 4250748 4206101 4121745 3975997 3850101 3554047
2953 3554047 3620193 3782338 3747725 3609688 3842260 3804692 3718022 3655841 3521823 3936114
2943 3936114 3860266 3722601 3791031 3950779 3703084 3538088 3598223 3511606 3369895 3049390
2933 3049390 2655698 2552460 2554913 2577220 2453521 2056532 1999433 1802232 1822305 1937256
2923 1937256 1795321 1829174 1562678 1213528 1161898 1158402 1333717 1062424 909749 877460
2913 877460 740872 730263 874313 810265 624043 893657 1064711 994425 694055 880057
2903 880057 677750 716557 704445 449278 540598 522594 380522 370527 482029 497002 397798
2892 397798 305705 239645 205515 338952 460561 352867 407979 268902 298100 184767 128315
2881A28315J06016l062Q0070j68888j2883Q104r3174K7326R5081K33547N0642
2870D51094k75035p447L24579j49693j30647J18916j24745N4125K787m19419j9527
2859a75012L38882K27099r139N250j59123j05464J11008o8425O6906J2370j59528
2848H4824R677j22654J44082R1249J48584P3211l48341k5890j28405K11592K92238
2837D30167n9431m35966o1528K0459J47973j80662M52766J9104j02777N0549k25869
2826E4785l7938r3892j05275Q3673K55390p3799m4708K3632l1130j38452J9833
2815h7881L55458n4062j23260J69457j15338J9801l8488q4221K4659j87935j81724
2804c03534J36182J36473J01701j66143N4843k42930Q9677J1466Q5328L56011
$$ plain form
2881 128315 234331 231269 311339 142451 129568 137672 44498 71824 166905 400452 451094
2870 451094 176059 168612 493191 343498 212851 331767 207022 261147 263934 -155485 -175012
2859 -175012 163870 390969 381830 387080 227957 122493 233501 165076 231982 244352 84824
2848 84824 94501 -28153 115929 207178 355762 428973 80632 54742 -73663 137929 430167
2837 430167 370736 -65230 -126758 -106299 41674 -138988 313778 332882 230105 280654 54785
2826 54785 16847 -77045 -182320 -98647 156743 82944 38236 61868 30738 -107714 -87881
2815 -87881 267577 213515 90255 259712 144374 164175 125687 41466 66125 -121810 -303534
2804 -303534 -167352 -30879 70822 -95321 -40478 -283408 -193731 -182265 -96937 259074
2794B59074J9595j91993L310j00540o6095p9543R1877j23077K4437N1027K37534
2783A25606n1917m4346n7914l134J76732k52940j44472K34900J58672j16460J93493
2772B18220L6235O259j86195J0952J39291L3485j71906L7269k15155K8969N212
2761e7364K7793j52464j39676J76927J59881k54317N5428J55411o9798L2914q3027
2750a48292q0126j5376J86527J23965j31448l2458N3711J04684j18449N9885N5236
2739E7859o0335m0383o2729k2266J07141o7924P207P2136k9819j18946K36644
2728G8585J15880r0623K5166j13975j92752P3909N7920n6229K22558o4815K1943
2717G7567l008O039O35K3256J57803k37655j17491J0399l5890j41317K1402J65531
$$ plain form
2794 259074 278669 86676 89986 -10554 -76649 -156192 -64315 -187392 -162955 -111928 125606
2783 125606 73689 29343 -28571 -31705 145027 -107913 -252385 -17485 141187 24727 218220
2772 218220 254455 260714 74519 85471 224762 258247 86341 123610 -91545 -62576 -57364
2761 -57364 -29571 -182035 -321711 -144784 15097 -239220 -183792 -28381 -98179 -65265 -148292
2750 -148292 -228418 -243794 -57267 66698 -64750 -97208 -43497 61187 -57262 2623 57859
2739 57859 -2476 -42859 -105588 -127854 -20713 -88637 -81430 -9294 -39113 -158059 78585
2728 78585 194465 103842 129008 15033 -177719 -103810 -45890 -102119 120439 55624 77567
2717 77567 74559 80598 81233 104489 262292 24637 -92854 -82455 -118345 -259662 -238260 -72729
2705g2729K75084o0342m4906J37041k97838j3248j59170Q1161N416p9506q1230
2694c10267J71601N9321q861J13488k0934N74P6211r5894k0696J46041J3679j82626
2682e8363o4132L0548P2060l7568r523j20265n3179K03838R2237J9883o6631j08541
2670i9636J41266K0483j43406k13672n1171J49375K04073J32157J47506k83042
2660C933L8578k7022j35105O3511q0931K2829k7257o9907K88667j5177q9070J9435
2648g516L4450K9752k14934M2114K7331j9265p3208j05381J28466R1600J2721
2637e3870o9807J13981k205m4936m6474j17388J23648P5639J30622n3931L0627
2626H5906j05568J13979K3190k6519j25559j85903J71114J33088K166r8909o6931
$$ plain form
2705 -72729 202355 142013 97107 234148 -63690 -76938 -236108 -154947 -149531 -229037 -310267
2694 -310267 -138666 -79345 -88206 25282 4348 4922 81133 -14761 -35457 110584 124263 -58363
2682 -58363 -122495 -91947 -19887 -57455 -66978 -187243 -240422 -36584 55653 75536 8905 -99636
2670 -99636 41630 62113 -81293 -294965 -346136 -196761 7312 139469 286975 3933
2660 3933 42511 15489 -119616 -56105 -137036 -114207 -141464 -211371 77296 62119 -26951 -7516
2648 -7516 26934 56686 -158248 -116134 -88803 -108068 -181276 -286657 -158191 -66591 -53870
2637 -53870 -123677 -9696 -11901 -56837 -103311 -220699 -97051 -21412 109210 55279 85906
2626 85906 -19662 94317 117507 90988 -34571 -220474 -49360 83728 85894 -13015 -79946
2615g9946P0058l21530P4233J29849k3861k71425J43987l7408R8399L1874j07205
2604b92975N2084P5834J80931o8020j43252J50226k44741P3494J06115k09807
2594c20111q574K97616J27015j09303q148J1787N6408J39286j36369l7956j22382
2583a10731q4402L76269k52859j12593L1747M9946n7078L6218r4805j32185J02257
2572b48216L70429m5315Q4012j55229j69240Q6052Q4928o6551N4134O4927p1175
2561a1244j69295J5517Q8594l2410J2752J72090p0060R2169L5324j26650k70587
2550b63800K799J49006j824Q2953M9463j52254o8324n95Q9175R6815j63559J34793
2538d5352K8844L465J832j13587m6751k12922Q6982K06468j789P9502p4156J72134
$$ plain form
2615 -79946 -9888 -331418 -257185 -127336 -151197 -422622 -278635 -316043 -217644 -185770 -292975
2604 -292975 -240891 -165057 15874 -52146 -195398 -45172 -289913 -216419 -110304 -320111
2594 -320111 -328685 -31069 95946 -13357 -21505 -9718 46690 185976 49607 11651 -110731
2583 -110731 -195133 181136 -71723 -184316 -152569 -102623 -159701 -123483 -218288 -350473 -248216
2572 -248216 122213 76898 160910 5681 -163559 -77507 7421 -59130 -4996 59931 -11244
2561 -11244 -180539 -165022 -76428 -108838 -96086 76004 5944 98113 133437 6787 -263800
2550 -263800 -261001 -111995 -113819 -30866 18597 -133657 -201981 -202576 -113401 -16586 -180145 -45352
2538 -45352 -16508 -13043 -11211 -124798 -171549 -384471 -297489 -91021 -92810 -13308 -87464 84670
2526H4670k21472k33840m3379L327O6300J46835N4876Q7009m6195j22100L6982
2515a86987l689Q4638k00664J2782M0115K0541K8996j67436Q9574j81251N6261
2504d07120J64708n9118k00156n0874K63926K47343L0872j49016j39770j14976
2494d14181K6379l95J26803L7150p7582J60341L1514L8063l8975J45139M7030
2483H1286o6115R863k13145Q3182R8440j97072J5840J64581j14275N820O5171
2472f6424j89628J12909P750o402K5706n7044k19630J15297M2854O6636J91925
2461B3949p9514j11464K7346p2582J66121J79996m7839j58797O9934J23269n1650
2450F8769J48230k18654k56973j46682J39482O4031R1939O1901J39777k1668L2313
$$ plain form
2526 84670 -136802 -370642 -414021 -410694 -344394 -197559 -142683 -55674 -101869 -223969 -186987
2515 -186987 -190676 -106038 -306702 -293920 -253805 -233264 -204268 -371704 -282130 -463381 -407120
2504 -407120 -242412 -301530 -501686 -552560 -288634 -41291 -10419 -159435 -299205 -414181
2494 -414181 -387802 -388197 -261394 -224244 -301826 -141485 -109971 -71908 -110883 34256 81286
2483 81286 15171 25034 -188111 -104929 -6489 -203561 -187721 -23140 -137415 -131595 -66424
2472 -66424 -256052 -143143 -135393 -141795 -116089 -173133 -392763 -277466 -234612 -167976 23949
2461 23949 -55565 -167029 -139683 -212265 -46144 133852 86013 -72784 -2850 120419 68769
2450 68769 216999 -1655 -258628 -405310 -265828 -201797 -109858 -47957 91820 70152 102465
2439A02465n2695N6075n1820J77312j39412j96570J74910j31630j24921Q3459
2429a02827J36359L7468l5640J82578L5505j31842j45010J8142J35706j24391
2419F048J8020k3226n22r5667K76534q6666n0515k5000j59329J4713j64752k2723
2407c13085K03806J56833j6569k4775j43373J8286K81547L6466j30965l9793j01844
2396g3466R3446p3869n8083l2672j9477J50746j9224r4825L7845P6946k3159K02160
2384A66368n336j24944K7252j15030R6899q3887j20969J41832Q4979R2793o5192
2373I4765k74460M919Q3289q7949m9979J21444r0891m287K36857J46324j25494
2362E4538j07065j08693L6220O0063l7054N370J16374L2655l0805l7862O0128
$$ plain form
2439 102465 49770 105845 54025 231337 91925 -104645 70265 -61365 -186286 -102827
2429 -102827 33532 71000 35360 217938 253443 121601 -23409 -5267 130439 6048
2419 6048 24068 842 320 -95347 181187 94521 44006 19006 -140323 -125610 -290362 -313085
2407 -313085 -109279 47554 30985 6210 -137163 -118877 162670 199136 68171 28378 -73466
2396 -73466 19980 -53889 -111972 -144644 -164121 -13375 -32599 -127424 -89579 -12633 -35792 166368
2384 166368 161032 36088 63340 -51690 45209 -38678 -159647 -17815 67164 159957 94765
2373 94765 -179695 -174776 -91487 -179436 -229415 -107971 -198862 -203149 33708 180032 54538
2362 54538 -52527 -161220 -125000 -64937 -101991 -96621 19753 52408 21603 -16259 43869
2351D3869J40781j15784J09145o0770K2660p1945j09890j2263M3445J25450J16477
2340B31175j53192r2851R7624J23218j72061j13035R9132K10810k1219o7037k8564
2329A14000k37861R2199j4235P0675J58786K2089k10985R1714J49852J26614J28926
2318D91774j86264j07753j84020Q3900k50223k3785J44777r1481J7355R4426J93880
2307A82586k87177O6900J21771J01484r0612p6811J08018N8189L7517J2833k1591
2296B13107J5576j46305J4156q0469Q5733L008k0135L6952p1613J34318j78763
2285E565K43536J62488L938o9367J8233M1090L7132j4368j80699k27614J93269
2274B13203J87411R2145j256N7444J04330k81419k15426J68443K423P2180L5147
$$ plain form
2351 43869 184650 68866 178011 117241 139901 67956 -41934 -54197 -10752 114698 231175
2340 231175 77983 -14868 82756 205974 33913 -79122 20010 230820 209601 142564 114000
2329 114000 -123861 -31662 -45897 24778 183564 205653 -5332 86382 236234 362848 491774
2318 491774 305510 197757 13737 97637 -152586 -176371 -31594 -123075 -105720 -11294 182586
2307 182586 -104591 -37691 84080 185564 94952 18141 126159 184348 221865 234698 213107
2296 213107 228683 82378 96534 16065 101798 104806 84671 121623 50010 184328 5565
2285 5565 249101 411589 415527 346160 364393 405483 442615 428247 247548 19934 213203
2274 213203 400614 492759 491503 548947 653277 371858 156432 324875 327298 399478 434625
2263D34625O3639k0889O3986K35986k38200n6985M2924Q685k6097L5004L4732
2252E77410K9745j6494P3032J9417j48461J75805j22464J81116n127j28306K13960
2241H49633j71569K18179P9766o6949L04797r6291j19318J28924k2486J02717
2231A207403k0409o6710K49972P1754k12395J71997r7989r0115k01799J47714
2221A159423L42895j35227J05635Q774R1544K88646j97009M8003R4461l46j19278
2210A687521j15444P0374J47967K74936J2319Q4150K57746J13815L9508K4094
2200B596986J96786M12031R9508J31544n8777K13507J14477J42853L54252M05765
2190D608932J03206M57386M98011L01565K96789O16034R07418O97612Q59378J155853
$$ plain form
2263 434625 498264 477375 541361 777347 539147 482162 525086 533771 507674 542678 577410
2252 577410 607155 590661 663693 683110 534649 710454 587990 769106 763979 635673 849633
2241 849633 678064 896243 976009 909060 1213857 1117566 998248 1127172 1104686 1207403
2231 1207403 1186994 1120284 1370256 1442010 1229615 1401612 1303623 1213508 1011709 1159423
2221 1159423 1502318 1367091 1472726 1481500 1573044 1861690 1664681 1712684 1807145 1806799 1687521
2210 1687521 1572077 1642451 1790418 2065354 2077673 2161823 2419569 2533384 2572892 2596986
2200 2596986 2793772 3205803 3305311 3436855 3378078 3591585 3706062 3848915 4203167 4608932
2190 4608932 4712138 5169524 5667535 5969100 6265889 6881923 7789341 8486953 9346331 10502184
2180A0502184J579525J747903K305115L035355L580906L864060J734890j870473
2172B6479465l550848m145976l550498k691122j978874j458044j460913j268377
2164F374813p61433p55792m17368k91866l42016m28318l52226k85427j13333J11897
2154B738931k74219r1037k17771k33618l69993j17914n927k35700K4465q9660
2144A127557q4587l2999N0801j11174k1823j27667o6657j28536P2843K4539n1484
2133F50813J29153k4752k38954o1880K092j01878l0131J89553j51098m269L2426
2122C91075j07072R0365k5404k53763J49852O7377J6400N0976M1229p6896k84764
2111E9375J83653L1303j4494L4492N6816j49482p2170J66921o9801j09151L0303
$$ plain form
2180 10502184 12081709 13829612 16134727 19170082 22750988 26615048 28349938 26479465
2172 26479465 22928617 18782641 15232143 12541021 10562147 9104103 7643190 6374813
2164 6374813 5613380 4857588 4440220 4148354 3806338 3378020 3025794 2740367 2627034 2738931
2154 2738931 2464712 2373675 2155904 1922286 1552293 1434379 1428452 1192752 1217217 1127557
2144 1127557 1042970 1009971 1060772 949598 927775 800108 733451 604915 677758 702297 650813
2133 650813 779966 755214 516260 454380 456472 354594 324463 514016 362918 358649 391075
2122 391075 284003 374368 348964 95201 245053 312430 328830 379806 421035 344139 59375
2111 59375 243028 274331 259837 294329 351145 201663 129493 296414 226613 117462 147765
2100A47765m3917k5301r4481K44314Q371j24201P945q8342O0580R4267j38056
2089D8944n2160j17708l9505m8714J94749K13436j22179m8610r0178K7201J05961
2078G1237j50390k429Q6621O0496L5613j39237J5829J15795r7838n0615Q3657
2067B8739q2904J1325K4772O8314Q9628j38468k3554K7486Q6315j61502R7558
2056B7709l0216R8373m9519r7753J31835j9662J8439K04017j06090l04197j1990
2045a39054j2310R3250J89033m9283J8565J31059O3070N2608j06943p6776j36040
2034B7179O2368R5306l23948J5631J84602j31227Q6252J76094j46611k6912J27984
2023A46718p4926j35848J40573j52423M4449L3361m4329l9586o2521k1371L425
$$ plain form
2100 147765 103848 78547 -15934 228380 236751 112550 120495 32153 92733 187000 48944
2089 48944 -3216 -120924 -160429 -209143 -14394 199042 76863 28253 -61925 -34724 71237
2078 71237 -79153 -81582 5039 65535 101148 -38089 -22260 93535 -4303 -54918 28739
2067 28739 -54165 -42840 -18068 50246 139874 1406 -22148 5338 91653 -69849 27709
2056 27709 -2507 95866 46347 -51406 80429 60767 79206 283223 177133 -127064 -139054
2045 -139054 -151364 -58114 130919 81636 100201 231260 294330 346938 239995 163219 27179
2034 27179 89547 184853 -139095 -123464 61138 -70089 16163 192257 45646 18734 146718
2023 146718 71792 -64056 76517 -75906 -31457 1904 -42425 -82011 -144532 -165903 -162478
2012a62478M962o4695K81992J69376j55972j38734K0428k1005m312P5969J16616
2001A22147o1972R7240k17695J67345r4799k1727O2632p0785r296k61j57269k1764
1989b06204k00806J76655L94582j86571R1607o3691l17730l265K82374L948p4955
1978a04056J04726j44225m9136J09215L78m3059O0732j34915R0973n9530j37555
1967c06452R8843K1704J11759j47209j4992J18561K7640P5414K6904j22270K8128
1956h1970o7176k7231J58893J91854o4733p6393O1098j37257m712N0967M4072
1945D7412n2197O079j04945N651J26515o9643l4675j0298N8648N6958l5723k1533
1933b7751M0358M5122n2235o5982j28713R2845O7820p0552J660M5042o7576J56811
$$ plain form
2012 -162478 -157516 -222211 59781 229157 73185 -65549 -45121 -66126 -70438 5531 122147
2001 122147 60175 157415 -60280 107065 12266 -9461 53171 -17614 -26910 -27171 -184440 -206204
1989 -206204 -407010 -230355 164227 -22344 69263 5572 -312158 -315423 -33049 -29101 -104056
1978 -104056 670 -143555 -192691 -83476 -83098 -126157 -65425 -200340 -109367 -168897 -306452
1967 -306452 -207609 -185905 -74146 -221355 -236347 -117786 -90146 -14732 12172 -110098 -81970
1956 -81970 -149146 -176377 -17484 174370 109637 33244 94342 -42915 -47627 3340 47412
1945 47412 -4785 1294 -103651 -98000 28515 -41128 -75803 -86101 -27453 29505 -6218 -27751
1933 -27751 12607 57729 5494 -60488 -189201 -96356 -28536 -99088 -97428 -52386 -119962 36849
1921C6849p7397J8932K2565l07536K04727l5284p208j40406j00400N8924J24548
1910b01686J45857J78569o9414k7336l516j57623K43740K61237r8746j69658o39
1899A00785j05398k4082o6819j19568O0147J86700N2890p5259j7181J31557m5190
1888G8582n3686l3044k6471j98027J7013J67040P538j36583k2735J75845J47604
1877A23076j8765l17196Q5676M7874N7090N318r6614O9233m4376n1321J30034
1866i971O0969j4318n8007K16307k05730J40972l2288k0192n0701q020K19785
1855B38806o1344j32496j44114R938L6616j03288K32870k2222J8897r4058r0565
1844a10960j08403J21950L1030k51359K06588P9938P8806j83063M8642J35781
$$ plain form
1921 36849 -40548 -21616 949 -306587 -101860 -137144 -144352 -284758 -385158 -326234 -201686
1910 -201686 -55829 122740 53326 25990 22474 -135149 108591 369828 271082 101424 100785
1899 100785 -4613 -28695 -95514 -215082 -154935 31765 84655 9396 -7785 123772 78582
1888 78582 24896 -8148 -34619 -232646 -215633 -48593 -41055 -177638 -200373 -24528 123076
1877 123076 104311 -212885 -127209 -79335 -22245 -16927 -113541 -44308 -88684 -140005 -9971
1866 -9971 50998 36680 -21327 194980 -10750 130222 97934 77742 27041 19021 238806
1855 238806 177462 44966 -99148 -89210 -52594 -155882 76988 54766 73663 -20395 -110960
1844 -110960 -219363 -97413 -66383 -317742 -111154 -31216 47590 -135473 -86831 48950
1834D8950l43075k45941L25130P1778k1770j48753K07429K52847k5867J83916
1824C04644N991k9802j34837n8429P3665j52777J32723q173J52880j89967r2009
1813C909j12069j9607R7789J33296j02025j06626O1097o0962K8971K3853Q5604
1802C3230j43074R4285k41632j13365K19495J24000J94089l8882j65181j94693
1792b31728l4774K14307o7424j63747K06122Q10n4097R7467k18470M4511J10170
1781i6853l0408K2400J6710l7951J40074J49548M6919m3006k17114j11666p5537
1770b36884L2549J26847j35629J16847p7559R2517q0419L4925L840r3103J43051
1759g3018m8606O0692o8306Q0450J52143L14283k35949k87106m1622J04941j1181
$$ plain form
1834 48950 -294125 -540066 -214936 -143158 -164928 -313681 -106252 146595 120728 304644
1824 304644 310635 280833 145996 87567 161232 8455 141178 133005 285885 95918 3909
1813 3909 -108160 -127767 -29978 103318 1293 -105333 -44236 -105198 -76227 -52374 33230
1802 33230 -109844 -15559 -257191 -370556 -151061 -27061 167028 128146 -37035 -231728
1792 -231728 -266502 -52195 -119619 -283366 -77244 -76434 -130531 -33064 -251534 -207023 -96853
1781 -96853 -127261 -104861 -88151 -126102 13972 163520 210439 167433 -49681 -161347 -236884
1770 -236884 -204335 -77488 -213117 -96270 -173829 -81312 -161731 -126806 -122966 -216069 -73018
1759 -73018 -121624 -60932 -129238 -48788 103355 417638 181689 -105417 -147039 -42098 -53279
1748e3279M0600k22641m9651J59341l9757j01902L6198J17031P3304j20912M1080
1737a20588O2214k0242R9272P155j13076J17035j48659k12216n6241J15745N4041
1726b15560J72479J43806k3061p1649k15973J27538O947M0139m24696J06497K45674
1715a07859J02764q8468j44343r0862P65J82331M4142p8801J35189M2261j58197
1704a61078q485K4543M7379J30020k418r0641k23111P2292P3964k5390Q0579l7958
1692a20304o1495n1236J93239j39036J11202m2916N3255n6897j27290J04767J32184
1681d527j7218Q137J08131j56630j87683K14007J0317M7862K34669k53283q4965
1670h1183j78281J20612j0039o0766j3011O9152K79428j01521j86772L2734k2820
$$ plain form
1748 -53279 -12679 -235320 -284971 -125630 -165387 -267289 -231091 -114060 -40756 -161668 -120588
1737 -120588 -58374 -78616 20656 27811 -85265 31770 -116889 -329105 -385346 -269601 -215560
1726 -215560 -43081 100725 77664 6015 -209958 -82420 -75473 -35334 -460030 -353533 -107859
1715 -107859 -5095 -93563 -237906 -328768 -328003 -145672 -101530 -180331 -45142 -2881 -161078
1704 -161078 -169563 -145020 -97641 32379 29961 -60680 -283791 -211499 -137535 -162925 -82346 -120304
1692 -120304 -181799 -233035 -39796 -178832 -67630 -110546 -57291 -114188 -241478 -136711 -4527
1681 -4527 -21745 -13608 94523 -62107 -249790 -35783 -25466 22396 257065 3782 -81183
1670 -81183 -259464 -138852 -148891 -209657 -222668 -153516 125912 24391 -162381 -129647 -152467
1659a52467j39254K40181j43798N101J27917j90517K12756J14388j21462r7188
1649a44343q0384L1967J88519k0944j38380R3549J45258J03403k52024j83429
1639b56808K46794J18008J03688j84314M4604j57867k0270J19439l5341q1979
1629a04046K0108j19755J39833O7805j90707l0419K31053L3640j80678R9450p5768
1618a09484J75319p6553o17K6235K864P8799j27222n6274k58217J67130J90267
1607A2247r2941j13730M7604J89516L2420m9828j47546L0633O909P1151n8864
1596g2429l2131J8272m9009M3074M0395j86326Q6516J41146j22693K8571m7108
1585a51722j08124j06738N9463J62084J73678m8146J59485p9259m1291R8905k66165
$$ plain form
1659 -152467 -291721 -51540 -195338 -190237 -62320 -252837 -40081 74307 -47155 -144343
1649 -144343 -224727 -192760 -4241 -25185 -163565 -70016 75242 178645 -73379 -256808
1639 -256808 -10014 107994 211682 27368 71972 -85895 -106165 13274 -22067 -104046
1629 -104046 -83938 -203693 -63860 3945 -186762 -217181 13872 47512 -133166 -33716 -109484
1618 -109484 65835 -10718 -11335 14900 17764 96563 -30659 -86933 -345150 -178020 12247
1607 12247 -80694 -194424 -146820 42696 75116 25288 -122258 -91625 -84716 -13565 -72429
1596 -72429 -104560 -86288 -135297 -92223 -51828 -238154 -151638 -10492 -133185 -104614 -151722
1585 -151722 -259846 -366584 -307121 -145037 28641 -19505 139980 60721 19430 118335 -147830
1574a47830L1041J17121r783l41216J07249J01102J92306O2064j43981m0610l6086
1563a08623P5502j48721o8599Q9222Q6638j42747J16389P6126k03925K66209q7783
1552e0312J8967J16297j6932r4029k131R1852J3708l0193o3159K4121J10410Q8348
1540B06947o8542m5074j64468J14659J46628k17727j22842L57J09111l5455l5154
1529a11560m1466N7558J53786Q5615L2855Q514m2530L5578K26698j20871l38568
1518e4391k2549r0790J37045L2918j14946J10477M5413j2499j5935P4188l0377
1507E8554K35625k33225r0304R4634j04202j26693p1060p3075K47433j42104J4031
1496a90386M1424O091k4663P4227J09586M0661J06363r3118k9672j99934K41445
$$ plain form
1574 -147830 -116789 332 -9451 -350667 -243418 -142316 49990 112054 -31927 -72537 -108623
1563 -108623 -33121 -181842 -250441 -161219 -74581 -217328 -100939 -24813 -228738 37471 -50312
1552 -50312 -31345 84952 68020 -26009 -28140 63712 77420 47227 -15932 8189 118599 206947
1540 206947 138405 93331 -71137 43522 190150 -27577 -150419 -150062 -40951 -76406 -111560
1529 -111560 -153026 -95468 58318 143933 176788 185302 142772 178350 405048 284177 -54391
1518 -54391 -76940 -167730 -30685 2233 -112713 -2236 43177 30678 14743 88931 58554
1507 58554 294179 60954 -29350 65284 -38918 -165611 -236671 -309746 -62313 -204417 -190386
1496 -190386 -148962 -142871 -167534 -93307 16279 56940 163303 70185 40513 -159421 82024
1485H2024O2081o4189j69205l6578m4872J45790j63664n8262J62669q3847J26037
1474d2016K97891l0187k63278j71978K6035J88940L3625l9281j22004J8461J234
1463a02558J81398j00742k30161J09695J22382P255J39823Q3726k3223k20230
1453c2635j53621K9672j4036p1028j15723k4982M1702J91113o2896n1001J49833
1442a13602o4228n2133R6818j56190m8610J81256Q1119J22488j7857k00012J49014
1431b1937J39664p9893n1018R8206L1051p8256M4525M2166L6591k19520Q8345
1420B9924O8490R2767r4084r2526k833N083r3319m3985J07815j90694P0488P2522
1408g0352M4469q8838K0266M514o3458K13275J0750l4316L1838P4848J44019J7338
$$ plain form
1485 82024 144105 79916 -89289 -125867 -170739 -24949 -188613 -246875 -84206 -168053 -42016
1474 -42016 255875 225688 -37590 -209568 -183533 5407 39032 -249 -122253 -103792 -102558
1463 -102558 78840 -21902 -252063 -142368 -19986 -12731 127092 210818 187595 -32635
1453 -32635 -186256 -156584 -170620 -241648 -357371 -382353 -340651 -149538 -212434 -263435 -113602
1442 -113602 -177830 -229963 -133145 -289335 -337945 -156689 -75570 46918 29061 -170951 -21937
1431 -21937 117727 37834 -13184 85022 116073 37817 82342 124508 161099 -58421 29924
1420 29924 98414 191181 97097 4571 1738 6821 -86498 -130483 -22668 -213362 -142874 -70352
1408 -70352 -25883 -114721 -94455 -89941 -153399 59876 70626 36310 68148 142996 287015 304353
1396C04353p5638k28753j35378K71435R0027j12084N9993K2309j16045j04692
1386b4473R4466q9657l7250N3810J1894j56549L2252n7812o4457J8739J97683
1375b1354K49790j33476j32240r6612J31577J11468l3126Q1416J0525j89470r4411
1364a15913m5182J76125k54607j42620N1640M1156J68253M4063j441Q7979O2285
1353G1738q3742j21982q7474O4515J6172M4422m302J12928j36805J06978Q3994
1342F6442q945P7976q679j75101j36381K57347k494k03622j8820J0321p7441P0749
1330a48648J92011m8911j50550j9777J24041J90664m4924j684k08180j21729J15743
1319a21944J16147o1733O489K5450q3618k17113J95824J70070P8743j10006k973
$$ plain form
1396 304353 228715 -38 -135416 136019 226046 113962 173955 196264 80219 -24473
1386 -24473 69993 -19664 -56914 -3104 8790 -147759 -115507 -173319 -237776 -219037 -21354
1375 -21354 228436 94960 -37280 -133892 -2315 109153 76027 157443 167968 -21502 -115913
1364 -115913 -161095 15030 -239577 -382197 -330557 -289401 -121148 -77085 -78526 9453 71738
1353 71738 -12004 -133986 -221460 -156945 -140773 -96351 -100653 12275 -124530 -17552 66442
1342 66442 57497 135473 126794 -48307 -184688 72659 70165 -133457 -152277 -141956 -219397 -148648
1330 -148648 43363 -5548 -156098 -175875 -51834 138830 93906 92222 -115958 -237687 -121944
1319 -121944 -5797 -67530 -61041 -35591 -119209 -336322 -140498 29572 108315 -1691 -4664
1308d664J72109j30221L617j23034K43614K881k84244l1101j48185K9926j6943
1297b86245j51883M02859O0097J97131j94618m5687K53176R082j39013r9846l9355
1286c4302j26171n7708J67184L2676L2672J25390J16574p1898k16564j47194j8558
1275a97899J91730Q083N4306o118J48312r263k0611K7601n2759k86247J8938K67031
1263A43104P887k14635j02755O3874l6314Q8299P2099l5454k9557j29632k9415
1252b02499K43726j14j85114P145O548L2507Q8423J2072L8435j00195P782P1915
1240B0631j00837p4227k8899J32452J25860q0613j48228O4357K6596K37216j95327
1229b1019j13457k0534J08378J49797j62884p6107J94094J06919p1692k30294
$$ plain form
1308 -4664 167445 37224 40841 -82193 161421 164302 -119942 -151043 -299228 -269302 -286245
1297 -286245 -438128 -35269 24828 221959 27341 -18346 234830 243912 104899 5053 -34302
1286 -34302 -160473 -218181 -50997 -18321 14351 139741 256315 184417 -32147 -179341 -197899
1275 -197899 -6169 1914 56220 50102 198414 189151 168540 196141 143382 -142865 -123927 143104
1263 143104 150991 -63644 -166399 -102525 -138839 -50540 21559 -13895 -43452 -173084 -202499
1252 -202499 41227 41113 -144001 -136856 -130308 -97801 -9378 2694 41129 -59066 -51284 20631
1240 20631 -80206 -154433 -183332 -50880 74980 -5633 -153861 -89504 -62908 174308 -21019
1229 -21019 -134476 -155010 -46632 103165 -59719 -135826 58268 165187 93495 -136799
1219a36799K66970O1106j11733n038l0501j0906J5620m1072k90697J14122K09368
1208D0440K32108j58599R7803j11962j8201j7380k48203J23685j23712M1380K17747
1197G5106m5044j21773J17730P1963m9563K157P9249j6331k01014J28145m9509
1186h884K3249l53n0589K33509o9145j75122R6135p6872R1551j26625j22773j0739
1174a96658J83627o7158r3648K29494p2605k44701L13962M6947j13402J16491
1164A02349p3756k35487N8340Q6709n6045Q6590R6790K03187k02115l32859J20581
1153a45716K6947R2429Q4949J16628J5617k65800j3321j41877R8715r3657J23046
1142a02040L7260J4243p7555o1206J6460P7939J41125j0269n4936m0554j85525
$$ plain form
1219 -136799 130171 191277 79544 74506 44005 33099 48719 7647 -283050 -168928 40440
1208 40440 272548 113949 211752 99790 81589 64209 -183994 -60309 -184021 -142641 75106
1197 75106 30062 -91711 26019 97982 48419 50576 129825 113494 -87520 40625 -8884
1186 -8884 14365 14012 -36577 196932 127787 -47335 48800 -28072 63479 -63146 -185919 -196658
1174 -196658 -13031 -80189 -173837 55657 -16948 -261649 52313 99260 -14142 102349
1164 102349 28593 -206894 -148554 -61845 -117890 -31300 65490 268677 66562 -266297 -145716
1153 -145716 -118769 -26340 58609 175237 190854 -74946 -88267 -230144 -131429 -225086 -102040
1142 -102040 -64780 -50537 -128092 -189298 -172838 -94899 46226 35957 -18979 -59533 -245058
$$ [...]
##END NTUPLES=NMR SPECTRUM
##END=
