##TITLE=1H_EC-3322(22)
 CDCl3
 8 sc, 
 4.4.2024
##JCAMPDX= 6.0         $$ Bruker NMR JCAMP-DX V2.0
##DATA TYPE= NMR SPECTRUM
##DATA CLASS= NTUPLES
##ORIGIN= UXNMR, Bruker Analytische Messtechnik GmbH
##OWNER= root
$$ XWIN-NMR		Version 3.5
$$ Thu Apr  4 14:17:36 2024 Russian Standard Time (UT+4h)  she@DPX200
##.OBSERVE FREQUENCY= 200.1309
##.OBSERVE NUCLEUS= ^1H
##.ACQUISITION MODE= SIMULTANEOUS
##.ACQUISITION SCHEME= undefined
##.AVERAGES= 8
##.DIGITISER RES= 18
##SPECTROMETER/DATA SYSTEM= spect
##.PULSE SEQUENCE= zg30
##.SOLVENT NAME= MeOD
##.SHIFT REFERENCE= (INTERNAL, MeOD, 0, 15.7337)
##AUDIT TRAIL= $$ (NUMBER, WHEN, WHO, WHERE, WHAT)
$$ ##TITLE= Audit trail, XWIN-NMR		Version 3.5
$$ ##JCAMPDX= 5.01
$$ ##ORIGIN= Bruker BioSpin GmbH
$$ ##OWNER= she
$$ F:/spectra/data/she/nmr/H-F/1/pdata/1/auditp.txt
$$ ##AUDIT TRAIL=  $$ (NUMBER, WHEN, WHO, WHERE, WHAT)
(   1,<2024-04-04 14:16:34.75 +0400>,<she>,<DPX200>,
      <created by zg, POWCHK disabled, PULCHK disabled
       configuration hash MD5:
       00 E9 B6 7A A2 85 ED C7 34 08 36 98 17 FE 4E 26
       data hash MD5: 16K
       20 61 3A D4 68 D0 BF 03 D1 29 6F 2F FF F2 60 80>)
(   2,<2024-04-04 14:16:37.31 +0400>,<she>,<DPX200>,
      <Start of raw data processing
       efp BC_mod = 2 LB = 0.24 FT_mod = 6 PKNL = 1 PHC0 = -25304.01 PHC1 = 16.98731 SI = 16K 
       data hash MD5: 16K
       D2 5E 57 88 A5 C4 65 5C 28 8B 7D E1 9E B2 A6 8B>)
(   3,<2024-04-04 14:16:49.87 +0400>,<she>,<DPX200>,
      <pk PHC0 = 2.496434 PHC1 = -3.4 
       data hash MD5: 16K
       CD 03 E2 3C 79 36 BB C4 0B 43 06 5E 29 7B E3 A7>)
(   4,<2024-04-04 14:16:53.32 +0400>,<she>,<DPX200>,
      <abs ABSG = 5 
       data hash MD5: 16K
       7C 35 12 96 11 11 81 71 FB D4 81 E0 EF 26 9A 82>)
$$ ##END=
$$ 
$$ hash MD5
$$ E3 99 D9 6D 9F 9C 26 6E B0 3F 7F 61 42 43 60 AC
##$RELAX= 
##$RELAX= 
##$RELAX= 
##$RELAX= 
##$RELAX= 
##$RELAX= 
$$ Bruker specific parameters
$$ --------------------------
##$DU= <F:/spectra>
##$EXPNO= 1
##$NAME= <H-F>
##$PROCNO= 1
##$TYPE= <nmr>
##$USER= <she>
##$AMP= (0..31)
100 100 100 100 100 100 100 100 100 100 100 100 100 100 100 100 100 100 
100 100 100 100 100 100 100 100 100 100 100 100 100 100 
##$AQSEQ= 0
##$AQ_mod= 1
##$AUNM= <au_zg>
##$AUTOPOS= <>
##$BF1= 200.13
##$BF2= 200.13
##$BF3= 200.13
##$BF4= 200.13
##$BF5= 200.13
##$BF6= 200.13
##$BF7= 200.13
##$BF8= 200.13
##$BYTORDA= 1
##$CFDGTYP= 0
##$CFRGTYP= 5
##$CHEMSTR= <none>
##$CNST= (0..31)
1 1 145 1 1 1 1 1 1 1 1 1 1 1 1 1 1 1 1 1 1 1 1 1 1 1 1 1 1 1 1 1 
##$CPDPRG= <>
##$CPDPRG1= <>
##$CPDPRG2= <>
##$CPDPRG3= <>
##$CPDPRG4= <mlev>
##$CPDPRG5= <mlev>
##$CPDPRG6= <mlev>
##$CPDPRG7= <mlev>
##$CPDPRG8= <mlev>
##$CPDPRGB= <>
##$CPDPRGT= <>
##$D= (0..31)
0 1.2 0 0 0 0 0 0 0 0.06 0 0.03 0 0 0 0 0.0002 0 0 0 0 0 0 0 0 0 0 0 0 
0 0 0 
##$DATE= 1712225794
##$DBL= (0..7)
120 120 120 120 120 120 120 120 
##$DBP= (0..7)
150 150 150 150 150 150 150 150 
##$DBP07= 0
##$DBPNAM0= <>
##$DBPNAM1= <>
##$DBPNAM2= <>
##$DBPNAM3= <>
##$DBPNAM4= <>
$$ [...]
##$SUBNAM3= <"">
##$SUBNAM4= <"">
##$SUBNAM5= <"">
##$SUBNAM6= <"">
##$SUBNAM7= <"">
##$SUBNAM8= <"">
##$SUBNAM9= <"">
##$SW= 18.0517689322627
##$SWIBOX= (0..15)
0 0 2 0 0 0 0 0 0 0 0 0 0 0 0 0 
##$SW_h= 3612.71676300578
##$TD= 16384
##$TD0= 1
##$TE= 0
##$TE2= 300
##$TE3= 300
##$TEG= 300
##$TL= (0..7)
0 120 120 120 120 120 120 120 
##$TP= (0..7)
150 150 150 150 150 150 150 150 
##$TP07= 0
##$TPNAME0= <>
##$TPNAME1= <>
##$TPNAME2= <>
##$TPNAME3= <>
##$TPNAME4= <>
##$TPNAME5= <>
##$TPNAME6= <>
##$TPNAME7= <>
##$TPOAL= (0..7)
0.5 0.5 0.5 0.5 0.5 0.5 0.5 0.5 
##$TPOFFS= (0..7)
0 0 0 0 0 0 0 0 
##$TUNHIN= 0
##$TUNHOUT= 0
##$TUNXOUT= 0
##$USERA1= <user>
##$USERA2= <user>
##$USERA3= <user>
##$USERA4= <user>
##$USERA5= <user>
##$V9= 5
##$VALIST= <valist>
##$VCLIST= <CCCCCCCCCCCCCCC>
##$VD= 0
##$VDLIST= <DDDDDDDDDDDDDDD>
##$VPLIST= <PPPPPPPPPPPPPPP>
##$VTLIST= <TTTTTTTTTTTTTTT>
##$WBST= 1024
##$WBSW= 4
##$XGAIN= (0..3)
0 0 0 0 
##$XL= 0
##$YL= 0
##$YMAX_a= 649743
##$YMIN_a= -612468
##$ZGOPTNS= <>
##$ZL1= 120
##$ZL2= 120
##$ZL3= 120
##$ZL4= 120
##$ABSF1= 15.65658
##$ABSF2= -2.395309
##$ABSG= 5
##$ABSL= 3
##$ALPHA= 0
##$AQORDER= 0
##$ASSFAC= 0
##$ASSFACI= 0
##$ASSFACX= 0
##$ASSWID= 0
##$AUNMP= <proc_1d>
##$AZFE= 0.1
##$AZFW= 0.1
##$BCFW= 0
##$BC_mod= 2
##$BYTORDP= 0
##$COROFFS= 0
##$CY= -3
##$DATMOD= 1
##$DC= 0
##$DFILT= <>
##$DTYPP= 0
##$F1P= 0
##$F2P= 0
##$FCOR= 1
##$FTSIZE= 16384
##$FT_mod= 6
##$GAMMA= 0
##$GB= 0
##$INTBC= 1
##$INTSCL= 3.70164e-10
##$ISEN= 128
##$LB= 0.24
##$LEV0= 0
##$LPBIN= 0
##$MAXI= 10000
##$MC2= 0
##$MEAN= 0
##$ME_mod= 0
##$MI= 1.114404
##$NCOEF= 0
##$NC_proc= -6
##$NLEV= 6
##$NOISF1= 3.799351
##$NOISF2= 2.8
##$NSP= 0
##$NTH_PI= 0
##$NZP= 0
##$OFFSET= 15.7337
##$PC= 1
##$PHC0= -25301.51
##$PHC1= 13.58731
##$PH_mod= 1
##$PKNL= yes
##$PPARMOD= 0
##$PSCAL= 0
##$PSIGN= 0
##$REVERSE= no
##$SF= 200.129557580164
##$SI= 16384
##$SIGF1= 3
##$SIGF2= 2
##$SINO= 5.538805
##$SIOLD= 16384
##$SREGLST= <1H.CDCl3>
##$SSB= 0
##$STSI= 16384
##$STSR= 0
##$SW_p= 3612.71676300577
##$SYMM= 0
##$S_DEV= 0
##$TDeff= 16384
##$TDoff= 0
##$TI= <>
##$TILT= no
##$TM1= 0
##$TM2= 0
##$TOPLEV= 0
##$USERP1= <user>
##$USERP2= <user>
##$USERP3= <user>
##$USERP4= <user>
##$USERP5= <user>
##$WDW= 1
##$XDIM= 16384
##$YMAX_p= 528156073
##$YMIN_p= -1335382
$$ End of Bruker specific parameters
$$ ---------------------------------
##NTUPLES= NMR SPECTRUM
##VAR_NAME=  FREQUENCY,     SPECTRUM/REAL,   SPECTRUM/IMAG
##SYMBOL=    X,             R,               I
##VAR_TYPE=  INDEPENDENT,   DEPENDENT,       DEPENDENT
##VAR_FORM=  AFFN,          ASDF,            ASDF
##VAR_DIM=   16384,         16384,           16384
##UNITS=     HZ,            ARBITRARY UNITS, ARBITRARY UNITS
##FACTOR=    0.220516191357247, 1,           1
##FIRST=     3148.77837978973, 0,            0
##LAST=      -463.938383216042, 0,           0
##MIN=       -463.938383216042, -1335382,    0
##MAX=       3148.77837978973, 528156073,    0
$$ Real data points
##PAGE= N=1
##DATA TABLE= (X++(R..R)), XYDATA
$$ [...]
10497 45485 160841 191738 121364 157110 219421 166957 146712 175158 189651 126722 140060
10486 140060 217648 159193 171562 119804 55500 100740 119388 89501 88358 145395 163424 167881
10474 167881 100601 66276 137608 134935 121123 141052 225864 131288 135504 138675 119744 114662
10462 114662 161035 117998 145460 176889 113499 157809 61920 47605 89571 118302 83715
10451 83715 126298 116631 76872 72717 37174 164222 99537 105841 89232 128526 133280 202893
10439 202893 148347 160099 247247 264451 131633 130604 172068 130060 168938 188059 183498 88645
10427 88645 188689 246385 216706 142677 83422 104562 114373 110705 28483 -29953 131974 111434
10415 111434 77866 139327 263030 390381 165273 178160 289919 237822 72491 154099
10405 154099 185146 151808 214987 187867 213245 151306 123558 194329 203464 200257 279817 278157
10393 278157 192888 126427 167514 130165 146524 141304 163164 164862 194860 190699 123395 276564
10381 276564 285718 169304 149319 103537 131173 98807 190521 186985 147452 215301 174256 276679
10369 276679 227885 207320 197115 113450 107304 78389 118201 149611 154762 220750 187891 152535
10357 152535 187360 185344 95351 107257 233951 221932 219895 227227 195732 83020 191193
10346 191193 184874 133085 124287 167406 159434 193772 136342 174702 212041 184046 177168 68276
10334 68276 99374 144223 159712 181511 198596 309093 240363 277775 326691 292280 291592 235062
10322 235062 288718 233304 203300 293153 260698 294223 256406 199634 234779 242048 243708 303575
10310 303575 447867 411075 331916 355133 327745 250189 297310 290224 264786 254982 210481 233434
10298 233434 190625 226213 282697 274206 262301 237934 231913 231062 279109 132909 63982 113666
10286 113666 144672 184715 123460 166111 163004 260420 258577 158833 265712 307202 284516 221610
10274 221610 247967 237849 122150 181045 209750 140413 200461 191584 161896 202197 246529
10263 246529 115831 195546 170652 198305 208988 168396 202471 222170 186464 82150 157010
10252 157010 244538 163077 192975 233443 172816 168072 223343 201554 293783 284319 198302 239410
10240 239410 214629 209593 241812 196234 161856 287602 217707 275320 327994 255616 196461
10229 196461 148627 216283 268515 253571 263043 234753 205579 251807 224889 172617 121852 184070
10217 184070 273860 341498 309592 296767 194702 128502 84127 161063 293817 259752 219624
10206 219624 213576 191652 172131 219363 255708 266196 181124 186913 224329 316508 254837 177807
10194 177807 255518 312436 327290 299020 331743 339445 256084 263003 329240 392590 315118 268068
10182 268068 336116 371867 405882 449851 324508 314276 298071 286448 327255 300497 320707
10171 320707 396946 353982 409387 466796 474175 387780 333286 309533 339065 379412 256549
10160 256549 260797 320069 346800 267787 322983 254182 274178 325446 289167 236103 209298 175445
10148 175445 235966 312261 318777 366151 333694 287221 329232 261287 250910 316097 311059 369947
10136 369947 414575 385316 438854 389459 459149 394494 337906 334966 273244 238138 314348 394947
10124 394947 270914 374299 362066 287156 334791 251033 298752 295080 320913 290637 264213
10113 264213 380533 426295 511193 471345 315741 277183 347588 291782 239161 232117 346298
10102 346298 378399 418679 316899 380226 378317 323828 389252 390559 377905 375269 340493 386141
10090 386141 241672 287289 323537 325943 368114 353650 316876 394345 421738 340414 245292
10079 245292 234856 341388 318666 318139 329305 286008 343232 366196 286306 274617 268496 379198
10067 379198 354586 387029 295369 273541 323127 292145 294709 242724 305023 251116 252138 284047
10055 284047 274042 373578 327173 237646 295383 325907 388724 440340 308434 266611 346792
10044 346792 316055 239718 212621 153597 236022 313639 333339 331651 271618 259541 271595 283266
10032 283266 363127 399146 358432 261073 254225 307501 253355 369576 381763 304664 335870
10021 335870 313221 255298 263286 440068 462933 370995 280827 367425 296660 339779 312255
10010 312255 293276 276408 289677 413894 343490 422542 429116 358603 408393 411372 400650 420871
9998 420871 380844 390017 377933 383565 407201 347926 339916 269302 242123 355704 351644 281538
9986 281538 427041 453277 395025 328934 191179 253086 378887 355434 306560 236264 196744
9975 196744 242842 248503 215594 225158 348834 344530 314537 351028 314869 236413 293069 389063
9963 389063 435669 428325 505090 475093 426159 476350 509919 476579 502698 458119 460209 509635
9951 509635 373938 392665 438206 484339 349967 301258 347716 405098 385637 423916 481880
9940 481880 452754 480810 567645 576490 633687 659598 587897 705993 591929 536063 545346 525761
9928 525761 625045 609663 651830 565520 475416 391627 540687 671682 622498 522689 493241
9917 493241 437936 394698 429553 506358 566636 574733 572421 427122 456175 558084 566663 589762
9905 589762 557558 499902 317286 320649 394787 482452 553621 548034 572665 532183 574998 526533
9893 526533 577981 559100 608584 559006 574978 666855 659182 530035 634583 606950 647479
9882 647479 593060 626211 699248 632716 532312 487758 522716 529966 445956 448593 530397 675398
9870 675398 659929 685964 705785 725673 725638 667751 496708 512756 586901 623828 650465 647722
9858 647722 640595 690166 687506 637111 681655 738013 785859 772764 752128 687065 675813 653617
9846 653617 657255 678884 747637 730413 681343 644117 654581 670248 698227 623522 612932 689007
9834 689007 727429 737254 761442 585944 651293 617211 512236 627864 718330 727863 702462
9823 702462 681147 643553 693661 717212 656170 719816 620911 656612 664399 761239 752708 717023
9811 717023 696639 733000 692829 659666 599631 652735 639234 655535 739153 808544 861304 807850
9799 807850 848000 805500 747847 790533 796904 831986 822984 761026 796758 851630 871100 853276
9787 853276 853186 807241 747892 883528 870855 870117 877328 902912 898888 831606 856988 908152 1020434
9774 1020434 966146 979802 973621 959350 1044181 1100620 1132444 1083170 1052266 1182874 1120217
9763 1120217 1082007 983399 961912 1038985 1071347 1155982 1197205 1036371 1123894 1226678 1204525
9752 1204525 1194567 1244971 1332030 1305809 1309517 1276795 1267789 1176048 1023485 1053961 1155623 1248320
9740 1248320 1232824 1241265 1251448 1185771 1217449 1232203 1256250 1197974 1209671 1175825 1265860 1322400
9728 1322400 1231695 1232414 1204951 1241527 1186831 1154941 1192666 1240122 1229419 1208647 1265439 1225049
9716 1225049 1217113 1232702 1225225 1219500 1235068 1348164 1372589 1352051 1405635 1471354 1556613 1552033
9704 1552033 1492782 1485928 1477708 1539163 1552631 1683761 1572938 1568590 1601916 1697683 1665066 1671166
9692 1671166 1619329 1673777 1735851 1664741 1635944 1763264 1904577 1833254 1642584 1613614 1680883
9681 1680883 1718347 1682468 1721540 1746240 1688210 1695184 1711089 1694632 1641286 1763258 1821977
9670 1821977 1888724 1889594 1852712 1876363 1953522 1897782 1934826 1907660 1922174 2023578 2132999
9659 2132999 2074888 2032066 2068277 2147947 2073732 2072906 2228442 2282665 2269393 2243947 2312262 2318441
9647 2318441 2298543 2245337 2285057 2338735 2408567 2500886 2569316 2679931 2604295 2604001 2658523 2754395
9635 2754395 2680066 2785907 2882256 2924669 2925769 2952261 3026914 3119446 3194303 3202860 3237923 3275179
9623 3275179 3373020 3352145 3412935 3511774 3564989 3721636 3654577 3695439 3819520 3869710 4118587
9612 4118587 4079914 3983789 4083000 4347543 4473041 4526923 4601626 4599995 4681842 4782407 4894195
9601 4894195 5106723 5287832 5337222 5419811 5613987 5965678 6142319 6360574 6551817 6895712
9591 6895712 7278343 7494986 7715164 8061082 8364561 8629441 9047333 9555381 10060219 10537300
9581 10537300 11201666 11781235 12482993 13401964 14419602 15558185 16770826 17913632 19132807
9572 19132807 20104991 21039445 21705542 22325427 22791100 23056112 23259517 23271003 23163836 23023029
9562 23023029 22871292 22385069 21758288 21042478 20072831 18961517 17708687 16398929 15048277
9553 15048277 13830197 12768060 11711612 10865570 10185156 9494430 8993211 8503762 8044578
9544 8044578 7774061 7502365 7204447 6930778 6690719 6520249 6359428 6099902 6033717 6004705
9534 6004705 5874843 5698007 5478553 5310067 5290672 5258159 5158410 5109544 5138637 5125317 5100739
9523 5100739 5015173 4930680 4811555 4751942 4927273 5118189 5061396 4986380 5001228 5046783 5166975
9512 5166975 5134196 5200536 5426798 5632263 5755295 5710761 5812791 6062846 6342498 6496660
9502 6496660 6770266 7051251 7377991 7832226 8345753 8905102 9245792 9775188 10278652 10699622
9492 10699622 11044540 11325158 11575530 11652656 11742905 11820515 11818772 11815612 11597754 11411909 11145939
9481 11145939 10794109 10467515 10002245 9537883 9112405 8626588 8133152 7759552 7479436
9472 7479436 7264801 7054243 6852637 6690488 6634783 6512233 6465898 6444236 6480191 6489299 6609998
9461 6609998 6610938 6675433 6752148 6715431 6774779 6808401 6987935 7062914 7048768 7061786 7141365 7314291
9449 7314291 7465020 7601222 7676446 7757340 7920303 8088520 8277213 8382323 8503439 8671760
9439 8671760 8788018 8960202 9115617 9326663 9412696 9631298 9746393 9805584 10082508 10312898
9429 10312898 10574842 10796673 11033677 11323936 11566109 11685692 11900932 12255177 12734194
9420 12734194 12992733 13289771 13590370 13843973 14212153 14439943 14829018 15324339 15711102
9411 15711102 16055531 16520785 16949205 17485381 18056483 18495581 19191774 19823308 20578138
9402 20578138 21413828 22421073 23518701 24798268 26190003 27849348 29831927 32023719
9394 32023719 34483740 37193473 39757545 42246917 44559590 46431658 48256639 50053910
9386 50053910 51787037 53296669 54523753 55244733 55481158 55679063 55870674 56148201 56561652
9377 56561652 56791158 56324306 55404173 54689060 54314835 54774144 55928676 58025509 60883139
9368 60883139 64278490 67884260 70808841 72202067 72062403 70632960 68836328 67496009
9360 67496009 67280394 68196008 69258778 69508550 68172539 65325592 61366752 56853327 52917625
9351 52917625 49831339 47576905 45962477 44835121 43987964 43495415 43156634 42923307 42882733
9342 42882733 42624055 42388247 42069920 41828435 41381512 41175056 41136527 41406593 41979194 43017006
9332 43017006 44403337 46251046 48551236 51603217 55534876 60220054 66005548 72275858
9324 72275858 77862937 81501477 82417660 80864046 78091207 75615117 74688759 75409844 76923950
9315 76923950 77703461 76137228 71771875 65325997 57593559 50246027 44102082 39054457
9307 39054457 34891859 31680920 28996045 26757776 25033735 23545450 22317553 21262694
9299 21262694 20369822 19705882 19084107 18613455 18324114 18112594 18000493 18014373 18128300 17985683
9289 17985683 17925792 17742264 17391988 16999009 16681340 16448083 16273828 16173089 16162721 16008221
9279 16008221 15578233 15181202 14730814 14326734 13859716 13519974 13293974 13150973 13082818 12987378
9269 12987378 12976281 13104761 13282699 13547556 13794940 14081683 14250635 14335144 14422315 14745314
9259 14745314 15140000 15425756 15978934 16310414 16435271 16293257 15982790 15803770 15750141 15692357
9249 15692357 15630340 15641723 15580157 15368044 15141234 14822258 14463260 14334236 14116417 13889447
9239 13889447 13640428 13598273 13626718 13725220 13792449 13914635 14055460 14352644 14813295 15159323
9229 15159323 15620624 15985429 16516055 17083076 17688489 18430410 19183142 19881844 20634049
9220 20634049 21472324 22588834 23947635 25488007 27169000 29016842 31003956 33243907
9212 33243907 35518872 37826563 40215758 42376257 43917388 44857832 45102145 44736897 44262519
9203 44262519 43734782 43430821 43418034 43624381 43867819 44245033 44526039 44916717 45266450 45430522
9193 45430522 45616268 45418205 45064561 44517282 43779198 43000051 41941694 40711294 39468110
9184 39468110 38189079 36817501 35426719 34174354 33395867 32993413 33071092 33607038 34495272
9175 34495272 35631789 36956744 38231666 39270323 40101044 40286181 39427374 37453497 34773474
9166 34773474 31615004 28420123 25312290 22576297 20373488 18490260 16829607 15483571
9158 15483571 14416607 13657524 12999257 12334085 11845884 11436222 10990190 10600368 10160855
9149 10160855 9708419 9231264 9002179 8744533 8422925 8148010 8010517 7675294 7376506
9140 7376506 7154520 6880849 6669357 6436658 6277282 6061791 5963502 5779348 5716051 5605738
9130 5605738 5404643 5360399 5244720 5144711 5102530 4878096 4817994 4756904 4744624 4797991 4777790
9119 4777790 4787516 4754185 4736886 4687561 4590466 4688815 4648514 4614375 4701957 4705114 4612088 4628559
9107 4628559 4611648 4599470 4680527 4786334 4804904 4806534 5051035 5175270 5313535 5481625 5649328
9096 5649328 5922596 6148778 6333285 6586366 6770516 6720317 6669547 6746122 6780591 6948178
9086 6948178 7150528 7299646 7437009 7333859 7273312 7209072 7119813 7158330 7312459 7442096
9076 7442096 7641385 7918479 8147502 8275800 8359768 8259281 8047555 8008921 8047540 8190954
9066 8190954 8293859 8368894 8241922 7916905 7555217 7314706 7165039 7085572 7119950 7127669
9056 7127669 7144282 7259855 7575525 7866760 8222845 8718467 9200307 9443112 9341548 9196138
9046 9196138 9157828 9029562 9068782 9097303 9095425 9012781 8688269 8335557 7797859 7356021 6911040
9035 6911040 6564083 6324795 6097351 5976323 5771089 5640918 5479518 5436384 5249627 5113613
9025 5113613 5133784 5138907 5105171 5064525 4978282 5055587 5124131 5155070 5274303 5196926 5263230
9014 5263230 5461032 5520593 5695568 5913076 6063229 6221429 6365740 6277398 6166669 6180695
9004 6180695 6058831 6072002 6212420 6283568 6333318 6289916 6125008 5927234 5831865 5796107 5755571
8993 5755571 5757570 5731639 5735369 5631704 5662237 5630919 5753594 5960329 5997806 5931614 6022231
8982 6022231 6054676 6174737 6092450 6063067 6143156 6163243 6174866 6172538 6196089 6425208 6495029
8971 6495029 6501877 6711738 6881101 6963147 7082335 7287692 7417553 7434256 7464400 7512186 7619537
8960 7619537 7761081 7967304 8041366 8157440 8266712 8483460 8776780 8984530 9209852 9359560
8950 9359560 9627793 9855033 10119504 10235806 10387479 10532985 10741090 11057984 11227182 11505952
8940 11505952 11717432 11917078 12327622 12603847 12933678 13139262 13516189 13906298 14337172
8931 14337172 14798172 15291866 15783919 16327292 16962715 17791630 18655134 19699408 21073242
8922 21073242 22385669 23472807 24358928 25190355 26010167 27009284 28113109 29078579 29867150
8913 29867150 30364352 30496838 30431211 30126801 29911876 30071019 30199855 30386353 30329646 30135854
8903 30135854 30086946 29798207 29619807 29442260 29241149 29087191 29302210 29725454 30263758 30925547
8893 30925547 31606232 32470809 33421691 34383942 35700247 37346154 39400989 41847424 44678361
8884 44678361 47973588 51485265 54659999 56616952 57390757 57570115 58090133 59288720 60970312
8875 60970312 62662700 64224871 64896061 64495134 63068435 61191866 59679772 58963092 58839325
8866 58839325 58688052 58696079 59008868 59919511 61184900 62908662 64783500 66027387 65945818
8857 65945818 64583656 63138571 62350901 62612225 63556273 64828842 66030050 66506453 65587351
8848 65587351 63815743 61998359 61116598 61312491 62080038 63080286 63517675 62954087 61672592
8839 61672592 60404704 59715682 59881750 60837289 62179122 63530114 64460883 64308597 63480158
8830 63480158 62753700 62779788 63685025 65196170 67144541 69259289 71613502 74305202 77301460
8821 77301460 80823305 83917954 85522677 84908450 82621550 80281935 78384147 77113754
8813 77113754 76441534 75916772 74797522 72113238 67267670 61203800 55510378 50960507
8805 50960507 47517200 44575809 42334193 40433770 38920416 37812472 36971103 36254554
8797 36254554 35751998 35351447 35086330 35036911 35171625 35600707 36238130 37014118 37982512 39069076
8787 39069076 39985571 40623237 40917141 41016734 40831380 40524446 40402005 40601734 40951863 41251649
8777 41251649 41218060 40860401 40130243 39008014 37810468 36554645 35271516 34144881 33329944
8768 33329944 32599590 31949710 31501686 31118856 30978650 31002873 31115255 31391345 32032215 32667245
8758 32667245 33421130 34199711 34832974 35519093 36100917 36658961 36983912 37146588 37302129
8749 37302129 37395861 37529371 37660553 37658193 37742628 37589685 37479139 37372287 37217172 37270497
8739 37270497 37389359 37801717 38460769 38988308 39595343 40278127 41270894 42391295 43754704
8730 43754704 45178634 46819681 49212411 52372188 56350264 60994310 66352453 72788349
8722 72788349 80400105 89469094 100171044 112992736 128614590 147308889 169158289
8715 169158289 189663452 198254693 186075477 160281257 136068080 118540798 105869213
8708 105869213 96342423 88303836 81697172 77158418 73894301 71196692 68847604 66206299
8700 66206299 63728556 61605799 60052182 59166202 58804135 58522113 58054763 57069461 55544173
8691 55544173 53450813 51215870 49078374 47206900 45576869 44457510 43637123 42720264
8683 42720264 42036251 41397890 40790022 40150905 39493868 39213264 39048129 38991448 39190604 39497192
8673 39497192 40076368 40754844 41655345 42551465 43754430 45481360 47388503 49782021 52515997
8664 52515997 55421347 58541781 61683954 65066837 68877545 73265529 78467138 84421323
8656 84421323 90482928 95463246 97616764 96485928 92008944 85151741 77475411 70468127
8648 70468127 64730146 60027085 56306977 53590659 51635940 50358471 49781575 49724191 50233844
8639 50233844 51395475 53219657 55614847 57958108 59931987 60637209 59681513 57237330
8631 57237330 53899296 50176688 46695876 43910701 41598011 39940499 38914714 38506588
8623 38506588 38689137 39526121 41045899 43062890 45780079 49118836 52706008 56102217
8615 56102217 58354028 58723755 56805527 53273313 48662454 43956096 39916132 36521359
8607 36521359 33977754 31983856 30725852 30088578 29756906 29955853 30811765 32105140 33576459
8598 33576459 35458069 37307251 38880738 39760647 39555590 37903063 35148747 31956338
8590 31956338 28687185 25815669 23294701 21165823 19496468 18233112 17179954 16407376
8582 16407376 15717684 15154918 14678864 14224827 14001177 13699989 13507819 13211168 13051304
8573 13051304 12949325 12879306 12818650 12831391 13053547 13228174 13564633 13899739 14326923 14862310
8563 14862310 15524354 16195209 16928608 17766507 18631148 19555004 20456162 21311537 22083253
8554 22083253 22537318 22733743 22417835 21588989 20454226 19126629 17803095 16197995 14950154
8545 14950154 13817529 12834772 12095267 11349443 10621897 10093019 9665165 9371721 9138205
8536 9138205 8767668 8713911 8725540 8660652 8483037 8522098 8561220 8533724 8635054 8661393 8780350
8525 8780350 8973618 9141730 9475082 9943341 10428255 10827893 11406216 11985364 12555299 13214542
8515 13214542 13895226 14258719 14358356 14162503 13638927 12777329 11645688 10520989 9552336
8506 9552336 8720225 8033841 7404286 6903266 6467736 6073578 5805778 5547496 5434295 5233664
8496 5233664 5035109 4859296 4748998 4600449 4466610 4275862 4169778 4140364 3966075 3804468
8486 3804468 3667221 3712764 3631585 3586920 3627873 3503266 3386963 3380782 3388319 3357927 3346344
8475 3346344 3238547 3214442 3275798 3279501 3246674 3231159 3246189 3368985 3398517 3360074 3460963
8464 3460963 3571199 3512409 3409491 3510450 3436351 3296202 3253666 3037801 2988227 2982998 2863657
8453 2863657 2749829 2665570 2625348 2451423 2450178 2509518 2500144 2457812 2338265 2372687 2346943
8442 2346943 2238150 2132455 2108412 2152293 2168620 2111021 2173143 2072594 2166267 2338312 2303236
8431 2303236 2168335 2014505 2035485 2003729 2033899 2018936 1893568 1970953 2047051 2065110 2132517
8420 2132517 2146584 2126301 2118822 2048410 1987831 1945818 1970247 1838137 1685580 1589415 1587209
8409 1587209 1487274 1434989 1493830 1472058 1417196 1387596 1398520 1341061 1392770 1435651 1547610
8398 1547610 1461985 1422982 1385181 1505262 1528082 1436910 1439116 1505063 1356451 1384578 1432641
8387 1432641 1371808 1379337 1419633 1495482 1449176 1508964 1423964 1292103 1305530 1264353 1150060
8376 1150060 1223180 1153206 1057816 1102748 1076775 1131604 1204885 1268128 1240956 1134774 1169057
8365 1169057 1280317 1296334 1178904 1179073 1205811 1177840 1152375 1055369 983287 1058130 1055110 1036783
8353 1036783 1041309 1070588 1064819 1014271 1056342 1003628 1026250 887962 897944 1031322 996485 925130
8341 925130 901480 857828 921017 963555 880798 929207 886505 896033 1014015 1046006 1027187 962265
8329 962265 900204 880895 849862 856882 774174 739783 792653 815784 738525 835592 824042 773094
8317 773094 801046 803727 849285 844333 794238 759732 750834 693192 643332 659261 615144 670283
8305 670283 820874 810206 821852 751529 704933 774022 795854 796718 821885 707104 675533 829289
8293 829289 770020 704637 704772 764717 831183 871108 995424 1006347 933196 951917 946496 979192
8281 979192 879346 792074 853804 826463 774116 755491 690816 666672 655790 748487 835940 751429
8269 751429 788232 809514 819445 785779 711732 734786 772596 694527 673068 679965 567289 638305
8257 638305 739870 632882 784873 682374 701468 717949 706987 760852 781918 899466 899038
8246 899038 948462 928632 970626 1023449 1054575 1050246 1159195 1106578 1210128 1362290 1389490
8235 1389490 1408019 1259394 1167927 1064822 1065702 965600 973194 935898 744284 626885 608461
8224 608461 650974 555926 560905 614209 634688 597296 580184 530697 519474 492789 408982 334500
8212 334500 320471 312268 379574 342379 457496 313080 304781 377896 407205 355587 329021 366054
8200 366054 497401 303649 314153 325584 288472 99459 123049 -523264 -1335382 168437
8190 168437 587372 503667 473269 559143 534896 538992 486924 420535 444057 337024 344006 453577
8178 453577 383955 320723 301743 341012 404466 433064 428946 353476 428824 469645 501234 539590
8166 539590 451406 389247 414526 338785 461061 373621 434543 444881 420513 475999 391932
8155 391932 354809 494742 478844 467169 511240 558174 535733 540324 434992 375971 378444 389204
8143 389204 419508 283591 232141 228838 208989 323932 399038 433949 399983 356764 425336
8132 425336 445658 345794 244388 239913 332549 323824 305130 367231 293233 192284 302218
8121 302218 347133 300231 258554 300909 233028 219896 240216 349721 328447 225297 209555
8110 209555 256855 301154 238670 271227 321810 211551 292429 378231 292031 391255 403342
8099 403342 351272 216943 271215 201399 267362 263234 226370 275255 293963 382533 319920 349029
8087 349029 338767 237897 296164 311832 331876 250500 175701 135919 82358 141459 90120
8076 90120 60604 126377 52884 157899 220843 135775 143983 151980 271701 294216 185860 168098
8064 168098 166713 132648 80668 41921 81689 20707 86490 138042 140761 126094 76211 138269
8052 138269 218724 155691 83898 3647 -25161 -99620 -88539 14031 32734 98860 196215
8041 196215 78798 98378 85219 122107 67515 103097 123825 -20482 -50674 -14597 11249
8030 11249 -36691 -64576 -81383 -18272 26767 67340 -52910 -18327 -109802 -84898 36777
8019 36777 25604 -14047 31725 -22433 61338 37827 -29995 -16530 72345 44653 -37911 12009
8007 12009 72654 26236 -17658 -141607 -64212 36708 83626 65218 47975 26942 51106
7996 51106 24073 -178137 -114000 -100289 -50258 3003 -24181 -28409 -34132 92510 112495 20137
7984 20137 67559 84021 -65843 -96864 -149306 -64260 -88985 -41399 41892 -5027 6936 98999
7972 98999 58696 123042 128135 11882 93479 5485 -59464 -80841 -1418 47989 -18459 -22345
7960 -22345 47044 60197 47503 -56029 -22845 -16730 29749 32305 14412 -71398 39257 20166
7948 20166 41717 29196 -79834 -138778 -84070 -109819 -74110 -20278 126743 59223 -12416
7937 -12416 29135 89900 61342 -38134 -72306 -31203 -81551 -19493 -47051 -80834 -69816 -58315
7925 -58315 -1609 18027 3901 -9906 2555 71166 34132 -86738 -114533 -169484 -21168
7914 -21168 -7454 -48735 -70651 -47134 -2844 -42042 -101623 -123050 -116748 -55208 14082 -64687
7902 -64687 -95075 -78947 -169760 -139438 -173054 -173313 -161595 -124976 -125897 -124538 -127652 -114232 -91492
7889 -91492 -135575 -237451 -207017 -144352 -93300 -39468 -80718 -129665 -198256 -279517 -180201 -54092
7877 -54092 -36110 -80895 -132184 -76011 -81283 -189187 -57094 -117726 -112155 6673 20642 -133936
7865 -133936 -221758 -193212 -143876 -119625 -113236 -128910 -168165 -252168 -153426 -95056 -96804 -55517
7853 -55517 -61082 -142706 -151929 -115714 -63017 -81502 -152546 -198921 -241914 -176858 -94998 6525
7841 6525 -126484 -133221 -236513 -154741 -78114 -137063 -189809 -123883 -69186 -84360 -86009 -95264
7829 -95264 -35108 -46336 -49732 -60426 -59734 -108239 -110970 -160287 -150557 -169295 -262718 -262080 -185632
7816 -185632 -208672 -248630 -322457 -319856 -285776 -123028 -100875 -119878 -35431 -29980 -134946 -73371
7804 -73371 -142761 -233574 -176153 -141390 -182038 -211337 -224590 -197929 -227379 -310375 -284702 -216351
7792 -216351 -94484 -188290 -128920 -149229 -289722 -260176 -108305 -157943 -84232 -120734 -139046
7781 -139046 -132995 -211684 -153304 -157484 -154695 -141750 -55523 -46530 -62375 -81071 -103790 -120798
7769 -120798 -157045 -92697 -74921 -187894 -177304 -63965 -160682 -195652 -139003 -80269 -104896
7758 -104896 -158237 -232860 -199231 -159974 -95333 -125903 -88892 -47815 -97393 -175651 -177850 -214836
7746 -214836 -153311 -140904 -146092 -150286 34410 -32383 -37806 -109610 -161575 -52765 -208092 -270118
7734 -270118 -231084 -88404 -155570 -122707 -92950 -123916 -178825 -131143 -130536 -107779 -99398 -90781
7722 -90781 -11552 -25488 36468 -58618 -190036 -173503 -221239 -94903 -203843 -341275 -246885
7711 -246885 -162732 -129422 -99438 -85000 -123663 -133789 -161498 -128275 -108375 -118965 -138778 -166597
7699 -166597 -228856 -296335 -311213 -180243 -147511 -233140 -191041 -77293 -41993 -69666 -35967
7688 -35967 -190745 -177914 -54846 -109313 -131514 -139521 -132770 -59066 -88398 -134409 -68825 -89999
7676 -89999 -128871 -114271 -165965 -175079 -207550 -274920 -203263 -117829 -235690 -223219 -177138 -157307
7664 -157307 -76746 -118026 -173707 -148652 -180449 -97259 -13449 -32399 -91159 -64490 -134319 -165043
7652 -165043 -178610 -121468 -174845 -108465 -128626 -225064 -113781 -94182 -104712 -150962 -88256
7641 -88256 -132241 -126770 -101210 -126214 -45405 10184 3976 3394 33394 10915 -62878 -54686 -53949
7628 -53949 -73051 4298 46183 -2236 -25537 -77840 -80936 -86330 -79899 -104242 -78067 -33833
7616 -33833 -100714 -107847 -104861 -109826 -92625 -67822 -19755 41965 -107810 -212481 -174335 -49945
7604 -49945 -125766 -133853 -184372 -119417 -114840 -188034 -83045 -64687 98906 56661 6756 -119709
7592 -119709 -96479 -115286 -130435 -179531 -201565 -201575 -144250 -170379 -169891 -135868 -153171 -176503 -134116
7579 -134116 -48827 -39572 -142088 -120404 -19538 -47307 -16863 -38880 -142395 -81396 -27171
7568 -27171 -91487 -70363 -57277 -163824 -140294 -55383 -40110 939 -68496 26041 49943 -628
7556 -628 34514 -12383 -34809 -25787 -173603 -149274 17341 -1230 -115393 -173942 -95077 10210
7544 10210 58431 91698 55141 -20390 -33129 -101018 -27140 -46538 -71146 45535 950 1203
7532 1203 -9847 -29293 -54225 -17403 -2117 -98704 -112580 -94703 -49069 -114676 -48752 -66068
7520 -66068 -162352 -109832 -161331 -198164 -88341 -110524 -166737 -148469 -35480 -40329 -8808 38269
7508 38269 -23480 34818 -25431 -76584 -136995 -96840 -128638 -118490 -46292 -2271 -62905 26246
7496 26246 118529 -2020 44551 86284 -69321 -111661 -26621 -3132 -7109 -63914 -118798 -80892
7484 -80892 -14125 -34645 -17206 23693 -13116 33116 23132 -87470 -67489 -67891 -23333 60412
7472 60412 -47843 -176469 -120445 -90280 -132186 -108425 -148061 -93635 -72628 -65030 -45510 -107737
7460 -107737 -104134 -55941 -52479 -117536 -114365 -71490 4379 -21395 -93266 2787 27957 15675
7448 15675 -39046 -79690 16903 69109 104556 87482 45312 -47078 -52397 -52413 -96981 -98566 -193407
7435 -193407 -104987 -31649 19110 -6716 6815 15993 6154 -50908 -129371 -136681 -153328 -87851
7423 -87851 11414 -78795 -98799 -99183 -89972 35101 94703 90491 -37547 -29895 18834 -5306
7411 -5306 -38281 96205 98323 41203 30955 -26605 16818 13011 6394 80568 34118 -82560
7399 -82560 -89805 -48272 10885 -129200 -211921 -584 -44057 -8415 27426 -49225 -77439 -106754
7387 -106754 -70497 -132645 -152521 -65726 -74894 -17736 64203 42179 -56329 -63558 20376 -61996
7375 -61996 -96651 -102757 -39786 -75898 13007 -42955 -41099 140546 150875 45311 -29205 26566
7363 26566 33500 78796 23175 32580 68166 -2020 -81316 22379 79921 109341 87536 28731
7351 28731 41008 -11993 -21024 25249 -11850 -4652 84571 184774 96355 81164 49549 -53090
7339 -53090 -28680 28148 85518 96949 85613 62239 -7395 138484 205484 124700 100153 140670
7327 140670 30929 56342 38427 63112 95427 -25554 -29827 -7713 -29272 -14333 75564
7316 75564 97456 113343 8830 -66702 -45479 -12006 -68314 2755 -28680 -67609 -16314 20866
7304 20866 -40394 -7504 -2413 84444 43296 -47675 -83765 -122797 9837 17053 23583 8685
7292 8685 -18994 -50491 -68980 -49178 26066 79368 48408 72393 -1325 101512 163173 44922
7280 44922 95670 50085 -15315 -56532 -166071 -70078 45668 195 15152 49512 96153
7269 96153 61416 72069 28870 22528 107470 57133 91864 138093 109044 4801 56958 97655
7257 97655 164147 141583 181454 126587 127823 10135 81837 126736 78692 155471 52113 93255
7245 93255 119367 132200 61822 -13344 -43492 -4538 6846 9451 97777 190669 126374 133740
7233 133740 176473 121939 85113 77599 41080 68282 -3893 48861 -65282 -66641 127023 110610
7221 110610 117295 114164 134377 163715 145856 163695 168048 163241 128259 132476 83391 74083 166451
7208 166451 143004 162520 220143 206393 212915 164530 76154 132304 142187 150301 118185 58897
7196 58897 45678 74513 55152 65499 37711 -16698 125493 135574 123120 116900 144243 217281
7184 217281 210045 137001 146036 130555 208468 219263 154568 68700 69292 140060 18607 -11592
7172 -11592 28412 -9270 36746 61820 177204 231041 158749 204109 225425 157623 124698 170688
7160 170688 133585 144201 166423 158694 175627 157739 249216 214195 110788 281603 233353
7149 233353 130781 138004 71959 36537 179525 180174 120013 198970 144293 154402 194153 172778
7137 172778 67147 67184 229023 220673 238052 215953 115208 103250 164876 121474 131411 158969
7125 158969 201333 175760 173127 149960 275059 282040 138004 94759 144311 184528 189344 177544
7113 177544 165915 130975 35918 121304 202210 233058 250959 264364 288582 187256 168450
7102 168450 232937 266189 414853 389400 323003 348169 233638 176020 161538 217149 184843
7091 184843 207793 250181 119438 213628 248462 202159 307597 368186 398537 259538 218399
7080 218399 193817 91307 90232 82797 194102 152819 160559 139039 76978 73478 201199 164984
7068 164984 171587 169357 126460 147034 207514 187170 189117 94498 192360 194919 241692 307959
7056 307959 255654 275992 353245 317030 236994 234099 331671 394963 300736 213583 135768 227378
7044 227378 144555 204212 208744 238585 173603 189090 178946 166742 184543 236357 305150 262909
7032 262909 302125 298039 255607 230536 295871 281484 237516 246491 274196 292878 335982 303764
7020 303764 369013 344594 367030 336138 256698 408500 415723 361616 302194 280253 276047 227145
7008 227145 248495 252312 220319 275963 369208 534193 539534 498441 463463 438865 466300 397496
6996 397496 426881 414242 382143 413646 375853 282466 283790 322684 410870 340553 321142 420795
6984 420795 380025 456047 355175 363720 390245 464164 469594 388761 434398 578473 644989 534798
6972 534798 503019 517371 681901 684545 474758 584493 658010 738217 738524 674331 580714 637009
6960 637009 648247 692182 700924 711666 709316 756386 783665 828653 828186 849512 800242 842357
6948 842357 788836 690494 695914 776640 848558 833613 881618 919056 940221 821919 878014 874564
6936 874564 1097117 1004654 1051535 1087035 1090705 1127148 1144289 1257674 1244127 1336000 1423123
6925 1423123 1405484 1455977 1498945 1626666 1604383 1659034 1764683 1857668 1971917 2042085 1934788
6914 1934788 1961432 2084800 2189505 2219212 2284127 2369002 2442897 2433963 2435091 2527911 2551178
6903 2551178 2502763 2546565 2552019 2492258 2387422 2367998 2476180 2457394 2479409 2536709 2570502
6892 2570502 2797914 2842756 2881985 3091338 3175194 3329925 3430495 3636523 3766793 3888425
6882 3888425 3948135 4045281 4170019 4218844 4300330 4365153 4279001 4245560 4133397 4039490 3893284
6871 3893284 3668370 3472697 3297245 3101192 2933091 2963184 3010276 3022228 3000311 2890703
6861 2890703 2854160 2880113 2865150 2885523 3060716 3217029 3223282 3370926 3530289 3522394 3504502
6850 3504502 3469418 3411383 3459228 3416926 3315751 3208775 2978029 2855561 2786074 2712237 2546943
6839 2546943 2361886 2158458 2007609 2002791 2019333 1891554 1806020 1741712 1675374 1573359 1575246
6828 1575246 1494058 1556987 1569308 1512317 1611334 1588827 1624519 1632706 1613695 1595788 1516426 1414941
6816 1414941 1409307 1342268 1261612 1220171 1159662 1131191 1134353 1078198 1001466 1019604 1029055 912530
6804 912530 943346 843049 909229 902302 882290 902264 918916 878379 820327 834643 798728 871161
6792 871161 817004 789124 750918 837400 821622 921688 1011127 986274 1061053 1030009 907187
6781 907187 903738 871422 815622 861285 851046 817758 745532 807673 778116 695697 632783 734309
6769 734309 668561 622384 821199 829557 864988 838615 879492 901439 837177 687765 651864
6758 651864 690187 775731 750488 724439 716556 669766 670371 557411 564479 530243 575448 656514
6746 656514 608999 625062 653952 679815 663836 631529 589034 651570 580647 506401 540926 399166
6734 399166 316334 392295 361608 297112 388406 451294 467188 452872 483794 492806 415412 413597
6722 413597 491930 486897 355396 329143 417224 444552 527076 570778 501250 477992 448826 482349
6710 482349 509537 477902 386977 360980 514203 578093 604218 481942 379095 418327 491692
6699 491692 403376 367430 434651 359929 371902 491634 428891 397401 390916 467670 585738
6688 585738 589329 428175 470425 549603 562951 507137 531397 453111 424390 550788 621935
6677 621935 555796 526671 516658 554627 510766 463382 461261 447935 447528 330646 328343 356860
6665 356860 440958 397848 478380 376547 361692 473957 615400 639026 509082 470706 483979
6654 483979 560398 618451 554334 526471 535214 491803 511085 425399 458739 585330 547711 451808
6642 451808 486694 636468 576866 659528 665436 651343 615277 563920 549646 525939 453793 402699
6630 402699 523384 557697 483302 516440 543745 627617 458600 447118 529787 527619 453286
6619 453286 421650 455991 539978 592247 578979 600018 600602 681200 633258 583898 542116 602731
6607 602731 675459 570251 494337 514488 498779 506801 531173 654337 625581 583122 512303
6596 512303 493413 563956 596664 591082 492102 444848 535599 565280 608656 592572 512858 507169
6584 507169 494648 452630 524566 516874 486140 468080 538933 564718 556526 608624 624795 605989
6572 605989 576974 636012 671816 617660 523647 568305 683280 642221 532633 525859 558706
6561 558706 630331 626404 503366 477477 472396 470466 577960 597366 582393 654923 665357 608450
6549 608450 581404 669832 691341 702340 721281 692492 629634 591565 707920 677486 696538
6538 696538 675020 694336 666129 590528 695465 668893 652414 737593 852307 731161 753200
6527 753200 858783 839607 756034 830025 842706 820177 800797 778450 685126 758083 841468
6516 841468 847936 856680 803903 829268 759504 828447 944585 926410 875906 877182 916057 1020710
6504 1020710 1022027 985012 863570 874673 844465 903192 1067102 1168490 989068 925524 994065
6493 994065 989178 1088826 1098066 1106586 1278262 1206469 1037771 1068665 1104620 1094658 1102985 1070186
6481 1070186 1169184 1314481 1287990 1294913 1323756 1385203 1414127 1463953 1458006 1394708 1403502 1280045
6469 1280045 1316146 1226086 1317209 1391652 1409105 1473412 1371253 1378487 1454190 1512200 1540000
6458 1540000 1614236 1574738 1606633 1702367 1599470 1604242 1773274 1742577 1856146 1995690 2159539
6447 2159539 2225055 2322073 2374373 2481435 2563600 2760389 2940850 3209580 3391999 3450918
6437 3450918 3442326 3299025 3136942 2985747 2925911 2930155 2895934 2689857 2505408 2465929 2526172
6426 2526172 2531202 2513465 2523950 2628472 2572484 2560616 2687676 2648910 2576339 2749982 2853478
6415 2853478 2886230 3016074 3088888 3237225 3414612 3449145 3499066 3476793 3488490 3509530 3505729
6404 3505729 3431623 3409086 3304553 3193359 3197787 3194147 3221441 3180442 3156249 3191388 3191352 3263778
6392 3263778 3315257 3252286 3291890 3465082 3681980 3836573 3884049 3979946 4098341 4139405 4119009
6381 4119009 4040089 4019694 3933377 3847461 3783111 3697833 3499815 3434771 3486493 3453222 3357352
6370 3357352 3298186 3340402 3409611 3313090 3228543 3299723 3392696 3474849 3382103 3305860 3337135
6359 3337135 3391410 3523868 3574860 3555101 3533525 3413685 3327127 3336294 3302123 3314195 3341132
6348 3341132 3344188 3461302 3453771 3410670 3356588 3209349 2989374 2882943 2897251 2786975 2692609
6337 2692609 2651216 2568794 2684541 2663456 2517174 2516382 2622409 2587412 2704026 2708093 2637461
6326 2637461 2754173 2736008 2682209 2681459 2791872 2781581 2751465 2701193 2652630 2713305 2622144
6315 2622144 2496535 2526437 2511586 2512835 2529399 2578175 2386109 2395025 2373096 2312170 2233087
6304 2233087 2252921 2226279 2149417 2130548 2146542 2132109 2190687 2228882 2260764 2326553 2218737
6293 2218737 2206387 2185752 2235077 2245326 2277922 2265824 2337692 2403203 2373805 2366476 2458842 2449727
6281 2449727 2416607 2482517 2543222 2467687 2480009 2453004 2359856 2376587 2333030 2318588 2320203 2303334
6269 2303334 2292628 2215081 2209876 2253333 2151340 2162755 2193345 2214206 2220386 2200607 2169051 2157319
6257 2157319 2164080 2074918 2085141 2116594 2123707 2108571 2088043 2128920 2197934 2245158 2178667 2181528
6245 2181528 2144122 2128631 2254048 2270944 2254198 2206409 2309571 2290532 2273979 2238535 2268322
6234 2268322 2267556 2140483 2156105 2193869 2265489 2291223 2252717 2255521 2270598 2394531 2334603 2336936
6222 2336936 2330726 2382413 2346655 2344783 2417424 2374942 2327749 2405208 2491386 2438304 2506205 2577149
6210 2577149 2533431 2529342 2633001 2557408 2510800 2435048 2398144 2425575 2501119 2517845 2561410
6199 2561410 2678378 2669436 2747892 2797350 2751331 2777580 2742568 2812873 2683300 2744896 2822115
6188 2822115 2799333 2893437 3034595 3028530 3071224 3083984 3145374 3231182 3225611 3200799 3241098 3336905
6176 3336905 3317019 3498590 3534752 3636008 3918630 3954776 3968185 4167611 4262041 4126422
6166 4126422 4125143 4173391 4240153 4217541 4103011 4157162 4258998 4307612 4398732 4558505 4569288
6155 4569288 4750858 4801536 4838707 4949645 5172117 5253699 5350402 5504935 5502239 5546401 5505731
6144 5505731 5502745 5395955 5364214 5304994 5423148 5417697 5410682 5492776 5463166 5388980 5433788 5430029
6132 5430029 5550069 5652993 5798745 5957835 6088491 6195732 6172247 6192683 6042718 6021531
6122 6021531 6004761 6018756 6082813 5992793 5963235 6055428 6056526 6281022 6304048 6199696 6268337
6111 6268337 6305031 6390815 6400574 6614836 6737532 6739981 6805794 6917377 7100104 7289669 7340131
6100 7340131 7506381 7561917 7651618 7795290 7886287 8043118 8110899 8208954 8336072 8510681
6090 8510681 8666790 8818423 9012201 9308211 9554762 9813568 9985789 10338886 10638266 10873466
6080 10873466 11078526 11359074 11515326 11706063 11951406 12217325 12341739 12615624 12837863
6071 12837863 13120152 13498342 13999875 14610496 14965860 15284623 15738928 16214038 16696193
6062 16696193 17425946 18007429 18569851 19376540 20195084 21051140 21819533 22609403 23477275
6053 23477275 24380071 25205187 25823031 26434207 26842620 27098015 27233827 27371824 27450862 27505588
6043 27505588 27846293 28177344 28639889 29118727 29744208 30522116 31360709 32361152 33538432
6034 33538432 34888006 36417639 38160280 39971899 41821684 44016362 46163268 48118614
6026 48118614 49970169 51605033 53073274 54034025 54786944 55237833 55449101 55444173 55076927
6017 55076927 54491045 53686514 52702159 51763324 50838800 50115884 49662507 49493384 49612837
6008 49612837 50014660 50770349 51845264 53242281 55182305 57177664 59343622 61667336
6000 61667336 64020189 66427833 68552501 70547520 72414472 73726306 74463996 74287216
5992 74287216 73047024 70904388 68169724 65258712 62424140 59766450 57455964 55578123
5984 55578123 54150975 53185159 52570342 52393920 52642151 53158398 54252207 55503352 57092887
5975 57092887 58834649 60507631 62410495 63947122 65468448 66650231 67201976 67483993
5967 67483993 67355035 66981097 66404451 66095193 65810675 66065618 66588001 66868893 66618658
5958 66618658 65893000 64866565 63874465 63134479 62777227 62914257 63350310 63904797 64770314
5949 64770314 65758435 66607305 67447507 68129730 68602975 68547895 68229931 67733618 67284527 66642823
5939 66642823 65875300 64801412 63259726 61558384 59821762 58274242 57435720 56511999 55463698
5930 55463698 54080711 52609611 51122317 49757019 48684966 47867008 47189894 46643986 46361066
5921 46361066 46172275 46203832 46256444 45988607 45290855 43745694 41346976 38316875 35132288
5912 35132288 32354104 29746333 27464892 25478560 23651815 22131595 20871523 19796823
5904 19796823 18935128 18009833 17211804 16722352 16133669 15632178 15139498 14703142 14362612
5895 14362612 14076595 13866077 13634288 13436004 13131400 12896628 12727418 12468196 12328757
5886 12328757 12362567 12381713 12225495 12219651 12346981 12359449 12447140 12665066 12998082 13292530
5876 13292530 13595986 13948472 14003255 13776657 13334996 12927731 12523325 12273981 12133148 11971142
5866 11971142 11951798 12006883 12135579 12157423 12318640 12507188 12507895 12409509 12386037 12580160 12848125
5855 12848125 13073713 13062613 12708449 12263717 11842799 11495362 11213300 11145681 11207862 11120415
5845 11120415 11141481 10821131 10455023 10192742 10126350 10210268 10241046 10415973 10651315 10953524
5835 10953524 11194993 11393072 11219461 10824018 10054565 9450534 8910646 8363493 7998197
5826 7998197 7623655 7431585 7265448 7093762 6937370 6781041 6647639 6577933 6490011 6501084
5816 6501084 6430938 6361177 6441949 6492698 6409847 6293140 6317452 6403033 6466162 6562623 6619077
5805 6619077 6684508 6684309 6578649 6481613 6412489 6507559 6455782 6494330 6535083 6615067 6763931
5794 6763931 6838119 7036987 7324240 7585819 7928485 8254199 8320490 8051840 7804044 7403815
5784 7403815 6958791 6811758 6668829 6421598 6262558 6166136 6118321 6097432 6044210 6008694
5774 6008694 5964938 5996714 5988085 5950296 6058812 6090231 6165669 6137542 6192163 6159262 6146704
5763 6146704 6178876 6100198 6028190 6017861 6036075 6076852 6238342 6253514 6252223 6279102 6457661
5752 6457661 6549075 6552450 6676784 6733245 6791613 6826885 6822639 6929446 7009920 7049117 7219892
5741 7219892 7276018 7441065 7512763 7506134 7633542 7754549 7870491 7850746 7974883 8168281
5731 8168281 8296733 8414878 8573876 8686358 8890210 9087878 9257728 9471863 9697394 9778751
5721 9778751 9980674 10143234 10333231 10332291 10405705 10430372 10587582 10811700 10838774 10962005 11169758
5710 11169758 11457644 11779752 12131841 12423776 12718353 13082009 13600453 14081332 14512860
5701 14512860 15019913 15533556 16155010 16676174 17227896 17852721 18479915 19014605 19377659
5692 19377659 19724247 20064857 20205136 20291755 20208796 20002809 19741503 19505519 19422199 19453306
5682 19453306 19548644 19572714 19786931 20173678 20640734 21229585 21932690 22730142 23626715 24564291
5672 24564291 25557110 26612868 27572391 28458853 29187892 29602113 29721362 29520161 28993200
5663 28993200 28184104 27299215 26281151 25325719 24258596 23386544 22763378 22313895 22001711
5654 22001711 21705781 21645935 21634928 21684962 21756995 21835806 22121388 22563752 22908480 23229187
5644 23229187 23631757 23853528 24038598 24111720 23920135 23510393 22914034 22177295 21482739 20777441
5634 20777441 20096689 19507291 18996324 18537135 18166298 17792452 17517560 17186203 17007136
5625 17007136 16922685 16846318 16759741 16749140 16742088 16818978 16989392 17204955 17438610 17551450 17639019
5614 17639019 17684254 17601214 17502949 17490523 17505108 17449028 17197702 17000449 16844918 16665685
5604 16665685 16536483 16599126 16590543 16559910 16737964 16878798 16986620 17104645 17378937 17793664
5594 17793664 17991491 18220190 18563575 18911885 19228503 19379237 19379512 19632878 19743265 19843272
5584 19843272 20032502 20323377 20388787 20582838 20782590 21060171 21360946 21786863 22293355 22745786
5574 22745786 23275902 23769472 24301555 24848521 25704040 26530444 27413371 28539282 29640787
5565 29640787 30898891 32283971 33793794 35631669 37474083 39441745 41677895 43962214
5557 43962214 46003356 47910949 49455824 50832376 51699385 52021154 51915394 51666745 51512621
5548 51512621 51367139 51492735 51784153 52300351 52926028 53624479 54228187 54816744 55443330
5539 55443330 56207123 57371086 58749917 60589044 62750565 65466072 68529084 72007342
5531 72007342 75460491 78186144 79730265 79850608 78548412 76507060 74402971 72384238
5523 72384238 70761171 69638048 68982309 68606742 68457643 68112332 67517070 66382273 64966855
5514 64966855 63598754 62447799 61706287 61014781 60151981 59300578 58450084 57649863 57028818
5505 57028818 56580072 56078602 55062999 53975573 52914789 51718148 50614825 49670641 49048916
5496 49048916 48516167 48038581 47715327 47380766 46804790 46089124 45218149 44470719 43932219
5487 43932219 43451283 43155190 43170537 43455014 43820015 44472801 45329204 46331345 46734566
5478 46734566 45849081 43754118 41280467 39293613 37665480 36381617 35421099 34487333 33880516
5469 33880516 33501946 33121144 32976792 33104103 33267712 33495990 33669871 33728649 33908763 34121929
5459 34121929 34422767 34802789 35117251 35564878 36292221 37018322 37958920 39188973 40704940
5450 40704940 42517679 44408256 46395259 47662994 47667414 46714660 45423615 44542035 44204642
5441 44204642 44199155 44257076 44569589 44888487 45285679 45622651 45816300 45916380 45922403 45972951
5431 45972951 46206999 46271990 46613048 46817260 46935469 47175009 47596572 48318460 49112457 50116072
5421 50116072 51490038 53130073 54799803 56741550 58744111 60799540 62513139 63708240
5413 63708240 64198448 64148187 63811894 63124964 62201539 61121866 60035098 59126629 58398574
5404 58398574 57989583 57917648 58167694 58824261 59815088 61165255 63003492 65077619 67258847
5395 67258847 69339695 70933690 71658128 71495927 70753290 69623199 68583941 67529957 66512520
5386 66512520 65771498 65116403 64569444 64610793 64995493 65603819 66485255 67173921 67468744 67543091
5376 67543091 67625596 67942268 68498795 68860544 68683988 67988586 66925247 65651873 64524978
5367 64524978 63428336 62116991 60517476 58823439 57390298 56304493 55278757 54617983
5359 54617983 54291785 54389802 54823083 55340299 55993298 56827867 57510969 57908738 57763481 57017941
5349 57017941 55766030 54209153 52596460 51314533 50340933 49467958 48887955 48472731 48302030
5340 48302030 48347315 48567071 49050843 49708495 50547410 51434749 52395927 53421662 54436218
5331 54436218 55560653 56581788 57581906 58496554 59470184 60493714 61383454 62032206 62508519
5322 62508519 62803493 63202001 63550599 64078345 64825232 65939115 67401667 68893376 70461400
5313 70461400 71694278 72930816 74074568 75547188 77136658 78991706 81061591 83515539
5305 83515539 86050642 88742200 91639979 94859991 98620150 102656170 106550868 110016680
5297 110016680 112791618 115273728 117619942 119840156 121820388 123103702 123532393 122868136
5289 122868136 121435613 119563955 117863305 116682926 116316251 116930012 118175597 120103324
5281 120103324 122553234 124976042 127102133 128219001 128465023 127875259 126664122 125131617
5273 125131617 123885074 122850535 121789841 120777558 119898593 119023905 118610688 118942092 120047966
5264 120047966 121622036 123555733 125470454 127734091 130396851 133830916 137777923 142431653
5256 142431653 147916381 154442587 162322137 171807335 182871495 196025173 211750647 231014707
5248 231014707 254331114 281593206 314175099 353289375 399677904 451990798 501818528
5241 501818528 528156073 510786794 455337074 390961078 337016623 295301211 262108031
5234 262108031 233310936 207875040 186900312 170176208 157232196 147055633 139087784
5227 139087784 133095001 128952158 126240541 124534500 123408858 122693863 122531405 122852007
5219 122852007 123180374 123467516 124060648 124954320 126640080 128732269 130984889 132916599 133759946
5210 133759946 132885553 130609906 127547334 124416326 121441917 118441776 114686840 110371046
5202 110371046 105902833 101753223 98400220 95321664 92589896 90049871 87693163 85544104
5194 85544104 83635961 81503260 79061361 76271949 73511255 71077020 68741985 66462390
5186 66462390 64366443 62195129 60054592 57825400 55682876 53702505 51950205 50759274
5178 50759274 49884929 49156076 48578485 48199424 48060301 48057199 47934239 47557215 47200202 46707866
5168 46707866 46045801 45123166 44092000 43227213 42480602 42096816 41847531 41887424 41893321 41574603
5158 41574603 40779414 39562481 38008849 36427429 35027879 33659545 32512309 31465123
5150 31465123 30392868 29524843 28967663 28610491 28262161 28019738 27962412 28010867 28140454 28257570
5140 28257570 28341236 28450378 28512033 28698307 28966046 29109457 29203749 29164136 28996267 28444561
5130 28444561 27737272 27323843 27010692 26852300 26715588 26608329 26495237 26509861 26567050 26569613
5120 26569613 26513874 26458478 26403015 26462398 26584479 26772294 26982080 27196657 27711107 28127661
5110 28127661 28602117 29145342 29798887 30414103 31050654 31569587 32047657 32512176 32866584
5101 32866584 33329876 33708912 33975894 34364474 34826295 35324306 35772092 36164527 36477385
5092 36477385 36815559 37285533 37804252 38541043 39452811 40393279 41516587 42717254 44172026
5083 44172026 45689832 47394303 49395030 51437057 53513085 55438928 57159028 58823568
5075 58823568 60367527 61544624 62361107 62847819 62851272 62521089 62158230 61788282 61357378
5066 61357378 61141009 61085463 60950953 60733223 60039095 59097414 57852370 56356764 54782840
5057 54782840 52961609 51026062 48994813 46863520 44995523 43163652 41418090 40042094
5049 40042094 38786136 37533541 36623927 35866394 35272831 34894859 34542510 34367197 34292263
5040 34292263 34181259 33939122 33527876 33088308 32733970 32387836 32105364 31911579 31632561
5031 31632561 31409240 31179573 31012428 30882775 30776020 30671623 30458445 30316245 30271886 30222213
5021 30222213 30092404 29786377 29671875 29529441 29376189 29375577 29498242 29612092 29755357 30016082
5011 30016082 30387756 30738635 31104656 31483730 31949631 32437799 32772781 33122458 33516216
5002 33516216 33962855 34353869 34924226 35536346 36090550 36675580 37451512 38152105 38758068
4993 38758068 39470721 40211855 40895980 41333579 41851737 42374504 42890815 43466075 43875322
4984 43875322 44465768 45222518 45897970 46798843 47771679 48760922 49972077 51209328 52572137
4975 52572137 54126839 55744138 57251136 58864824 60644213 62412347 64254397 66128596
4967 66128596 67882319 69333017 70349024 70796948 70801742 70457254 69786734 69188264 68561792
4958 68561792 67924159 67142672 66631500 66064018 65504248 65154780 64902084 64814526 64882689 65128065
4948 65128065 65433556 65822512 66540575 67448769 68366053 69526449 70923302 72367023 74012971
4939 74012971 75921957 78065017 80393665 82859938 85401200 87651376 89182611 89867834
4931 89867834 89775200 88970229 87578977 85938423 84259953 82873456 81654072 80598652 79920797
4922 79920797 79142080 78158103 76799260 74901897 72491764 70086490 67825527 65892862
4914 65892862 64186370 62810974 61625266 60745633 60096957 59681279 59504901 59674624 60081046
4905 60081046 60661243 61618687 62635281 63722120 64767370 65769413 66394848 66608220 66558965
4896 66558965 66246508 65943703 65976459 66334939 67202299 68605260 70271400 72102719 73876249
4887 73876249 75227834 75651333 74855766 72969364 70279288 66893110 63428564 60093285
4879 60093285 56905133 53796457 50884367 48249390 45939852 43939594 42129864 40541466
4871 40541466 39141357 38098374 37154537 36456341 35888921 35488113 35220220 35086165 35178040
4862 35178040 35418753 35764171 36163423 36834849 37713802 38622453 39714371 40958414 42280761
4853 42280761 43537248 44486276 44771430 44265927 43210160 41703272 39874699 37926459 35918460
4844 35918460 34179487 32618136 31189081 29910436 28818958 27693782 26778251 26048849
4836 26048849 25422187 25001385 24639444 24224009 23925732 23638513 23290110 22981738 22606188
4827 22606188 22428039 22091427 21774747 21658528 21482415 21190067 20927008 20768373 20707475 20653171
4817 20653171 20673009 20624214 20598420 20637058 20683789 20783948 20930361 20990900 21170235 21248705 21214112
4806 21214112 21280916 21204952 21198217 21303443 21304650 21356246 21465185 21566260 21862408 22154267 22350766
4795 22350766 22672086 22991962 23292849 23573632 23822510 24203735 24489556 24797902 25167268
4786 25167268 25576677 26179912 26775766 27324150 28001410 28680985 29351093 30291064 31097961
4777 31097961 31933895 32765712 33740516 34859181 35941288 37027320 38370897 39968127 41792503
4768 41792503 44053015 46534083 49194304 52510463 56200687 60314978 64856078 70096305
4760 70096305 75821279 82320261 89899016 98402855 107063190 113856404 117262697 116676499
4752 116676499 112891767 106405337 97842211 88500487 80018551 73193204 68010866 63943364
4744 63943364 60834243 58453762 56935871 56028638 55901824 56169683 56446382 56969899 57676675
4735 57676675 58410887 59254270 60019060 60659824 61115370 61365524 61568787 61664520 61527004 61332594
4725 61332594 60920218 60310824 59594597 58903141 58034930 57088319 56262490 55337497 54502519
4716 54502519 53899257 53413535 53075318 52964583 53039774 53462241 54158243 55190949 56487449
4707 56487449 58264274 60211423 62443097 64815858 67448901 70396105 73483847 76945652
4699 76945652 80890928 85383487 90740708 96572308 101482334 103810303 102918744 99191789
4691 99191789 92841211 84409431 75796684 68176682 61670482 56271922 51662082 47567937
4683 47567937 44037891 41316043 38942925 37019585 35481016 34213947 33298018 32446976
4675 32446976 31889792 31582360 31175884 30909685 30621255 30475785 30162494 29715122 29296231
4666 29296231 28685661 27851771 26972856 26036877 25030701 23920517 22719127 21589868 20570678
4657 20570678 19473313 18405093 17657272 16865437 16161879 15568342 14860369 14241043 13717264
4648 13717264 13256660 12789431 12427695 12145752 11880135 11600617 11314867 11117028 10992227
4639 10992227 10819775 10576801 10413153 10266422 10051760 9756176 9460706 9236725 9061289
4630 9061289 8874317 8760275 8532406 8377432 8180427 7955238 7822970 7784870 7568903 7477414
4620 7477414 7407473 7226423 7207297 7160600 7007831 6878471 6919503 6867692 6768560 6629246 6524182
4609 6524182 6507979 6492210 6494428 6393213 6368424 6384844 6326127 6447232 6514633 6484311 6464609
4598 6464609 6463344 6535682 6598609 6573631 6561075 6568649 6651107 6690608 6675174 6699801 6770826 6810196
4586 6810196 6796503 6929040 7006386 6879402 6796569 6788326 6564215 6421760 6376455 6329012 6276549
4575 6276549 6205638 6124945 6073478 6013489 6007038 6004749 6053843 5918331 5875814 5891106 5803190 5798964
4563 5798964 5726890 5667771 5671733 5548443 5527712 5512153 5515692 5512763 5510552 5575336 5557238 5586555
4551 5586555 5596252 5562242 5470301 5408183 5400001 5317110 5254987 5198935 5075665 4996696 5009937 5010712
4539 5010712 4940646 5052120 5107161 5182749 5225691 5260210 5323479 5266513 5187425 5202110 5198793
4528 5198793 5204106 5226777 5265442 5363424 5539288 5556991 5462400 5467656 5582044 5510909 5601209
4517 5601209 5677191 5568517 5479828 5453666 5368420 5256680 5197886 5193419 5172718 5079824 5151005
4506 5151005 5121957 5147732 5164124 5092336 5031271 5025594 5121651 5108357 5135357 5122004 5127479 5118367
4494 5118367 5117727 5135013 5176629 5234269 5366421 5457152 5484837 5491653 5551732 5494267 5348241 5332307
4482 5332307 5268334 5262263 5222021 5022225 5074960 5179170 5054779 5122742 5151006 5177188 5203734
4471 5203734 5281782 5336705 5335013 5433652 5407739 5307006 5449972 5484341 5551824 5559674 5589956
4460 5589956 5787739 5843455 5837424 6053455 6303890 6415015 6609744 6792328 6989849 7270841
4450 7270841 7556082 7821078 7998884 7931502 7732522 7471318 7186199 7006705 6954641 7002804
4440 7002804 6933504 6986353 6984032 6926134 7045340 7062131 7004507 7047895 6930400 6887501 7010761
4429 7010761 7026284 7101583 7093600 7052420 7231714 7388778 7405568 7462314 7507254 7625310 7690833
4418 7690833 7810406 7964693 8003970 8057359 8134103 8217270 8298385 8491649 8538023 8645730 8872457
4407 8872457 9150317 9353552 9460326 9575813 9739131 9921575 9941496 10156728 10353982 10499466
4397 10499466 10661823 10879856 11167829 11461184 11712594 12161572 12547394 12735906 12963833
4388 12963833 13086172 13396388 13689069 14056281 14347216 14650516 14967769 15331329 15694273
4379 15694273 15909239 16426317 17051767 17676341 18294130 19022614 19721876 20607453 21517427
4370 21517427 22217717 22770008 23230981 23592222 23856156 23861504 23865419 23822795 23636212 23570827
4360 23570827 23644672 23833308 24056570 24085252 24285225 24576190 24885527 25126888 25508399 25850060
4350 25850060 26137204 26507757 26930742 27286861 27733283 28291907 28891533 29570306 30165478
4341 30165478 30950363 31673875 32456506 33399625 34255248 35066608 35969461 36931451 37908649
4332 37908649 38805799 39889758 41016484 42554362 44063405 45743239 47597021 49610059
4324 49610059 51975230 54393488 56998228 59657964 62685674 66106091 69913620 74155762
4316 74155762 78891083 84405201 90813642 98315006 107011400 116931851 128028600 140592516
4308 140592516 154235413 168613056 182876254 196205919 207453050 215939152 221473754
4301 221473754 223287693 220900760 214663771 205108862 193085320 179637579 165891311 152343268
4293 152343268 139562186 128241241 118562196 110632554 104227378 99274338 95438749 92459197
4285 92459197 90042093 87758106 85424914 82900267 79997096 76531136 72639855 68511273
4277 68511273 64024295 59454906 55118408 51114195 47726786 44923175 42558867 40560639
4269 40560639 39013170 37682776 36661321 35809929 35262088 35048291 34845780 34632849 34272082
4260 34272082 33899729 33213209 32014087 30558343 29165222 27741927 26375995 25171994
4252 25171994 24096917 23183465 22501407 21892285 21385150 20857699 20421149 20057348 19613452
4243 19613452 19265403 19079995 18871152 18872181 18832306 18878573 18921085 18986426 19106479 19122254 18911150
4232 18911150 18522359 17976353 17556307 16904298 16387273 15862514 15288009 14817810 14448101
4223 14448101 14185486 13843850 13507369 13333262 13118009 12922169 12827006 12720296 12596834 12413688
4213 12413688 12396998 12362887 12231489 12133317 12007821 11868448 11723852 11797240 11791731 11800323 11794599
4202 11794599 11879078 11918890 11860197 11840485 11754366 11936004 11982676 12049334 12102096 12164403 12193136
4191 12193136 12215620 12287394 12401064 12512079 12613403 12615328 12755859 12793117 12914020 13187129
4181 13187129 13412345 13629780 13921668 14076718 14325978 14530927 14762262 14920973 14869594 14786610
4171 14786610 14604316 14331347 14183269 14011770 13935032 14014655 13969852 13976775 14023267 14052099 14053594
4160 14053594 14123604 14094713 14097577 14218230 14310738 14405782 14507493 14548645 14611064 14894521 15061773
4149 15061773 15348414 15516472 15626689 15867760 16067866 16326114 16638898 17012766 17384707
4140 17384707 17962093 18582917 19253749 19990669 20911700 21859958 22892503 24093598 25264517
4131 25264517 26602197 27847184 28819219 29306890 29411883 29233399 29379790 29782865 30419828
4122 30419828 31380646 32805759 34464800 36318096 38357443 40361701 42462546 44848714
4114 44848714 47868810 51543009 56284617 61866741 68061416 74089707 78529894 79595281
4106 79595281 76297204 69849216 62578571 56152438 50706050 46025970 42055671 38627459
4098 38627459 35742015 33337451 31170935 29264892 27652216 26145793 25097048 24249606
4090 24249606 23575435 23033405 22587397 22383871 22138642 21967756 21723730 21663443 21714600 21665086
4080 21665086 21789245 22268461 22585628 23117548 23991614 25001285 26295436 27466832 28933627
4071 28933627 30449730 32036602 33665140 35090144 36322256 37090568 37373166 37024482 36122717
4062 36122717 34898292 33410409 31857298 30499052 29410017 28462001 27694727 26981410 26466190
4053 26466190 26146774 26043517 25947319 25972211 26156903 26519779 26865961 27304312 27733020 28154144
4043 28154144 28677607 29257048 30054491 31037526 32339169 33896851 35548171 37313288 38993199
4034 38993199 40434107 41595594 42445477 42563176 42153039 41107342 39402871 37218978 34883518
4025 34883518 32786681 31011276 29391819 27947796 26758588 25757297 24939322 24232055
4017 24232055 23717314 23505219 23417360 23140948 23113549 23180711 23333270 23531593 23669021 23964618
4007 23964618 24467431 25117102 25843304 26631038 27524598 28562608 29633431 30674291 31496001
3998 31496001 31941631 31900339 31369260 30332380 28946878 27511031 25975865 24547182 23182295
3989 23182295 21951890 20873206 19974637 19307128 18595206 18218122 17885294 17492487 17390361
3980 17390361 17298386 17180419 16989081 17105544 17099313 17182930 17238654 17336248 17505618 17648585
3970 17648585 17778944 17997744 18290380 18512425 18854520 19180013 19315483 19442130 19441211 19194094
3960 19194094 19016361 18657198 18214227 17767771 17368721 17084441 16748414 16401306 16109889
3951 16109889 15914310 15809111 15694396 15771927 15882039 15967665 16162153 16372616 16541452 16707322
3941 16707322 16899208 16969095 17102199 17086383 17072244 17225211 17297836 17318735 17429001 17566908
3931 17566908 17675409 17781161 17786158 17935333 18118801 18113495 18155123 18141691 18075753 18005957 17849223
3920 17849223 17684109 17748014 17662023 17602346 17752071 17974562 18232105 18591375 18993526 19358718
3910 19358718 19694032 19935974 20215096 20483309 20693778 20650798 20672126 20640735 20471420 20188883
3900 20188883 19902465 19615954 19423321 19268435 19188512 19058507 18738448 18482306 18282102 18213212
3890 18213212 18107475 17891368 17615144 17469921 17399869 17419561 17426826 17544193 17616111 17796094
3880 17796094 18070786 18435369 18793943 19151456 19471043 19772857 20033456 20181789 20276908 20285443
3870 20285443 20064828 19758950 19435753 18937287 18401131 17770464 17181338 16541781 16007077
3861 16007077 15506975 15203621 14765993 14320705 14016188 13759709 13584687 13347979 13170392
3852 13170392 13074788 12896511 12766090 12603077 12568236 12641705 12766570 12934150 13106357 13283255
3842 13283255 13523587 13641436 13663265 13721336 13593295 13381989 13210201 12973485 12682944 12251170
3832 12251170 11744097 11148586 10794989 10394329 10010732 9725916 9488397 9158420 8895476
3823 8895476 8710618 8420895 8120954 7983802 7734847 7572588 7468484 7249468 7192627 7237359
3813 7237359 7152132 7021741 6945430 6985458 6966108 6979664 7024506 6992169 6926099 7008617 6984387
3802 6984387 6893826 6783162 6517831 6445806 6348995 6096970 5874908 5855206 5747004 5509682
3792 5509682 5253764 5183256 5133520 5011656 4865326 4801136 4693583 4713977 4654643 4594780 4477885
3781 4477885 4461521 4408371 4419867 4385450 4314012 4255284 4218466 4166492 4139770 4205606 4182551
3770 4182551 4075603 4056440 3955808 3948956 3950197 3876528 3906418 3969965 3839449 3887088 3923776
3759 3923776 3880898 3817170 3954294 3902655 3747636 3706937 3714583 3704545 3655716 3624921 3537696
3748 3537696 3578705 3566052 3533937 3493805 3472986 3495053 3476995 3481138 3410391 3342978 3329419 3365015
3736 3365015 3325782 3221310 3235285 3151672 3166243 3216118 3226444 3114337 3055282 2980362 3028004
3725 3028004 2944966 2903745 2919804 2852083 2736952 2745715 2785487 2795166 2895636 2835652 2662493
3714 2662493 2640144 2653063 2648373 2648907 2534807 2649680 2661858 2559273 2577626 2539789 2440329
3703 2440329 2310680 2361106 2402315 2402028 2407963 2365757 2441045 2449431 2525308 2537017 2460477 2398710
3691 2398710 2336275 2356453 2199613 2241396 2271428 2233686 2215991 2146006 2217035 2241051 2381939
3680 2381939 2332675 2318803 2344680 2220645 2239021 2193076 2169331 2306100 2335430 2357783 2368738
3669 2368738 2329213 2295250 2203159 2249393 2227815 2333714 2378310 2403698 2338652 2234064 2163060
3658 2163060 2048473 2143495 2318505 2198793 2162329 2194453 2296230 2260356 2261106 2348438 2476905
3647 2476905 2457988 2390038 2403986 2390645 2402994 2439423 2429888 2367483 2357208 2291634 2236679 2233427
3635 2233427 2214052 2176312 2281818 2263596 2141584 2103877 2180578 2175243 2178945 2238674 2285478
3624 2285478 2284015 2244762 2155038 2095716 2125913 2041966 2014050 2038848 2060703 2088577 2147040 2184339
3612 2184339 2228871 2204433 2078237 2044201 2069875 2157260 2231516 2124917 2161210 2212384 2214230
3601 2214230 2293007 2208290 2180706 2286273 2329198 2208000 2313734 2300867 2243830 2248648 2289325
3590 2289325 2358478 2388410 2449672 2470941 2524928 2692684 2757280 2767030 2779067 2796086 2916563
3579 2916563 3044756 3166471 3331658 3297025 3379417 3299796 3144589 2985474 2852168 2698007
3569 2698007 2605074 2548337 2521760 2378916 2187167 2108775 2192974 2212063 2136816 2031210 2018132
3558 2018132 2000563 1979854 1852188 1910564 1902428 1824622 1887556 1751248 1749588 1728844 1744489
3547 1744489 1816792 1857609 1783110 1775596 1749936 1696915 1703868 1828926 1689024 1619778 1553901
3536 1553901 1568871 1541623 1573253 1638149 1650596 1620446 1641712 1628135 1775871 1725137 1598009
3525 1598009 1675093 1577845 1479182 1501574 1408354 1343986 1357047 1360750 1368707 1318257 1296411 1315481
3513 1315481 1330643 1356847 1434845 1453696 1311002 1297726 1305106 1343750 1288841 1300563 1280340
3502 1280340 1251384 1379666 1442863 1488552 1393287 1350656 1329125 1419603 1426660 1324898 1278870
3491 1278870 1282032 1248590 1292894 1295207 1306623 1216775 1293755 1310074 1370782 1382140 1224052 1333476
3479 1333476 1322379 1281070 1299905 1264779 1254994 1232869 1336197 1385518 1317041 1185608 1222191
3468 1222191 1270340 1364161 1348070 1352775 1338896 1317688 1232258 1235048 1188299 1050245 1150575
3457 1150575 1197741 1290665 1292241 1252596 1143917 1239440 1199983 1209986 1251706 1271196 1237561
3446 1237561 1204654 1197051 1201013 1134307 1081616 1072563 1033485 1146716 1172438 1220036 1184622 1135791
3434 1135791 1284206 1273081 1211263 1160933 1225350 1270012 1319524 1299926 1236582 1223697 1127179
3423 1127179 1150376 1180343 1194520 1240030 1290961 1272957 1335242 1427233 1371196 1324284 1338086
3412 1338086 1304813 1372496 1324718 1316923 1234021 1350729 1386004 1446588 1487960 1499347 1533055
3401 1533055 1442536 1493395 1569112 1652460 1687734 1704338 1673496 1713044 1703438 1832283 1901390
3390 1901390 1972078 2047457 1987059 1891151 1866386 1899054 1790851 1690770 1682976 1657197 1614609
3379 1614609 1666533 1595262 1586577 1549967 1379849 1416909 1419783 1322099 1439781 1513759 1574047
3368 1574047 1665668 1586435 1586757 1574339 1587396 1639669 1667886 1599591 1545349 1581535 1594332 1622941
3356 1622941 1645036 1652408 1701595 1740532 1755601 1792733 1827044 1848774 1888097 1851348 1883529 1876267
3344 1876267 1866106 1918076 1965877 1967419 2059727 2099096 2256072 2188493 2167167 2231663 2284271
3333 2284271 2375588 2473708 2474905 2459966 2477925 2483825 2504356 2574239 2564486 2665745 2750755 2709526
3321 2709526 2833406 2867845 3045961 3010046 3094931 3230126 3336120 3181112 3287613 3466598
3311 3466598 3380926 3369530 3396104 3402577 3429061 3476330 3564152 3774334 3901195 3830757 3891784
3300 3891784 4033332 4136217 4311679 4436841 4515648 4513867 4647148 4781172 4870602 4830166
3290 4830166 4838856 4895566 5008889 5293699 5436350 5515651 5612391 5800681 5865869 6052168 6087324
3279 6087324 6267103 6404562 6354932 6424024 6509106 6665772 6929398 7110025 7273366 7482639
3269 7482639 7643893 7917538 8225855 8540157 8728273 8848156 8979733 9106124 9363488 9585262
3259 9585262 10069610 10425845 10867628 11520774 12176227 12902081 13737683 14818626 15942663
3250 15942663 17262613 18834514 20686007 22763290 24804252 26008192 25696627 24110495
3242 24110495 22377857 21162503 20376899 19839089 19457824 19322138 19346223 19285051 19336318 19336956
3232 19336956 19456615 19479186 19485804 19427151 19408117 19445805 19499483 19468235 19632460 19844044 20163812
3221 20163812 20721764 21602189 22821842 24389100 26595491 29447789 32633961 35452223
3213 35452223 36270609 33904431 29527769 25200055 21675579 18979755 16871251 15023092
3205 15023092 13451073 12139687 11133582 10364325 9651283 9093997 8669050 8409708 8174497
3196 8174497 8016492 8103621 8154775 8256459 8414242 8622980 8934082 9252351 9830717 10530758
3186 10530758 11375546 12424571 13933388 15566216 16825942 17123068 15966889 13915483
3178 13915483 11821795 10341884 8991092 8020277 7126710 6231586 5661867 5179427 4590716
3169 4590716 4213960 3894869 3640948 3514646 3395741 3236630 3151286 3097438 2986015 2818121
3159 2818121 2659301 2524186 2411023 2460878 2380000 2245291 2247302 2061882 1952241 1907718
3149 1907718 1946691 1921089 1955889 1862903 1729681 1614932 1618022 1665412 1507850 1442187 1471115
3138 1471115 1411758 1432326 1372571 1329660 1255589 1280793 1310069 1282698 1267176 1230828 1305709
3127 1305709 1259420 1151951 1167815 1244283 1181189 1050154 980350 1035684 1029296 963821 902084
3116 902084 897462 931672 969465 883922 900278 901388 853053 812763 911454 860640 876015 804093
3104 804093 763946 687984 681850 769630 694083 600650 647393 720474 770035 768413 764544 732604
3092 732604 686192 676748 668397 653938 638860 541021 527959 500027 501788 483674 451083 480945
3080 480945 501313 541840 527990 643508 629116 517473 500265 464120 406103 456540 446710
3069 446710 555089 526490 498474 485375 395882 388640 405200 512822 477053 401593 419736
3058 419736 472681 420112 458092 485691 358095 350304 478151 396610 336167 411356 457833
3047 457833 514857 517610 451040 424290 418292 358501 459344 406353 343208 365648 378013 431572
3035 431572 444281 295460 295133 367748 511776 505417 474472 437804 367532 438642 447579 504323
3023 504323 381843 362888 384077 406425 382292 340724 345504 329101 367714 460146 514583 441052
3011 441052 291284 354260 427062 396030 487531 363682 355770 361523 398754 352277 437346 497268
2999 497268 414631 496987 486460 372301 449844 456727 514928 619221 551800 495090 532846
2988 532846 526486 559290 525213 364354 434029 500178 588256 659538 601500 549304 591775 627184
2976 627184 628193 653292 604506 598884 596238 647292 532828 426314 519532 581986 623903 641610
2964 641610 645011 698002 753890 726303 775849 698864 679451 743495 801720 722390 703087 684834
2952 684834 674066 663642 720552 813399 825624 858045 916821 998994 1093725 1093057 968016 970536
2940 970536 873284 915269 946547 1057903 1024595 1075067 1266888 1207412 1239643 1294928 1429702
2929 1429702 1525812 1588313 1633101 1734040 1700677 1692187 1621088 1703876 1669110 1585233 1591783 1707128
2917 1707128 1757068 1722626 1601120 1649035 1648883 1598164 1709084 1659349 1719046 1823244 1822318 1814063
2905 1814063 1813553 1827221 2028138 2180283 2214285 2257072 2409739 2608561 2530175 2494192 2430714
2894 2430714 2322401 2176080 1971985 1912722 1805905 1691551 1571551 1488661 1333654 1401738
2884 1401738 1380681 1309519 1310168 1313277 1308222 1132389 1199638 1224186 1281835 1264097 1221869 1249166
2872 1249166 1260661 1267653 1311374 1325879 1328931 1358675 1323007 1251604 1303682 1197016 1058367
2861 1058367 1089379 1080933 1063512 880882 810082 797307 798096 683904 653338 703134 719269 661696
2849 661696 644826 496340 444727 529326 502903 467350 412295 394294 463832 340713 253343
2838 253343 207786 229467 293973 270184 193878 210729 240337 246676 262031 263904 244300 304852
2826 304852 275563 213556 242141 311630 192238 155574 147341 108878 112748 190664 129434 68626
2814 68626 76640 184385 195963 129294 147242 171748 116848 105875 88345 110858 120318 161371
2802 161371 215480 98890 78797 152656 69163 44232 82311 52601 -4991 -5476 66331 -64827
2790 -64827 33990 -7487 100441 69270 7654 51365 93281 97769 14699 6686 88074 86432
2778 86432 132529 154734 140039 84017 -5782 -32851 -16502 5689 -37829 -23959 -12457 15200
2766 15200 25292 -35466 -30757 -58632 -24530 -58700 -100597 -40634 -27065 -21156 -42071 -122674
2754 -122674 -43878 8306 33241 -3983 -29434 21699 109525 33037 32728 59456 53257 -83426
2742 -83426 -48265 -51373 -113667 -46480 -50302 -12692 -170924 -203612 -98195 5968 83869 3526
2730 3526 -108422 -111019 -80043 -13093 -89330 -81996 37359 30504 -12761 -23517 17307 -56591
2718 -56591 -127448 -75756 -21988 -73842 -39498 28336 52073 2120 -27171 -56367 -16834 -26056
2706 -26056 -64206 -74952 -45191 -18608 -14655 -38189 -106877 944 11330 2475 33453 -50679
2694 -50679 -53034 -12322 -31888 -11423 -82252 -115011 -106176 -161666 -45437 -2188 -49930 -20921
2682 -20921 -68337 -140230 -210415 -161664 -119761 -59086 -53045 -103496 -68878 -49155 -62919 5684
2670 5684 -80769 -69185 -107427 -179769 -185401 -155885 -200283 -98207 -72987 -51037 -113268 -34802
2658 -34802 -118392 -82391 11369 -3869 51173 -60270 -117318 -87785 -143596 -148112 -132561 -19015
2646 -19015 -82682 -129431 30837 46414 12243 28076 54608 126341 28770 -20057 -2550 -86253
2634 -86253 -54154 -30110 -59104 -48833 -89157 -95252 18671 -75664 -120768 -97843 -68242 -21281
2622 -21281 17089 -99407 -102839 -47046 -34533 -45486 -29713 -63994 -134770 -85609 -61489 -57468
2610 -57468 -47235 -80795 -51228 -42184 -12990 -170499 -157978 -23798 -74445 -121769 -79166 -76437
2598 -76437 -79984 -153417 -125317 -91961 -124934 -89686 -17170 71083 92521 44990 -22480 -186934
2586 -186934 -157539 -198987 -196497 -239025 -197783 -180159 -128161 -19999 -26323 15699 -67837 -212617
2574 -212617 -136499 -140546 -65647 -73035 -53472 -58054 -84447 -137779 -133849 -35022 -63089 62135
2562 62135 76618 1245 -62785 5349 6166 -78773 -106706 -50074 -77217 -120532 -75947 -143269
2550 -143269 -105809 -68955 -69473 1596 -90644 -173596 -173018 -131220 -184157 -84570 -14031 -23456 -103899
2537 -103899 -151564 -148736 -87960 -89950 -108189 -192253 -149879 -114353 -127742 -144602 -95403 -55486
2525 -55486 -165249 -176025 -92119 -100270 -4888 -13848 113524 36147 -55936 48786 50222 -6914
2513 -6914 -56346 -137348 -198180 -186781 -174171 -154118 -98154 -50537 2754 -22180 -82286 -55896
2501 -55896 -128999 -156717 -222680 -185399 -92660 -28134 -56431 -105831 -84190 -86361 -171005 -156319
2489 -156319 -98828 -54180 -129136 -121747 -110435 -96824 -102936 -117307 -93041 -210722 -233102 -149720
2477 -149720 -96821 -149759 -200001 -167585 -114008 -8032 43334 25081 7621 25638 -73277
2466 -73277 -87049 -114067 -82145 -116458 -43295 79803 10904 15601 -5885 -97802 -65995 42921
2454 42921 -13360 2591 -39707 -42184 -93504 -66994 -115476 -106467 -83096 -131639 -120494 -23200
2442 -23200 42810 16099 119530 -70414 -126823 -70361 -6729 -4408 -9395 -93418 -88262 219
2430 219 24011 -64684 7179 53087 5841 16544 95920 130148 -25082 -30896 43867 91294
2418 91294 66130 -34534 -111343 -71294 -22288 -24002 6286 -71473 -112977 -25218 -6028 -94903
2406 -94903 -56542 -64800 -45579 -40582 -81164 -47848 -66922 -127944 -238432 -182846 -44313 -86845
2394 -86845 32374 46568 -70361 28920 41997 173778 24763 -69372 -10440 70307 -25394
2383 -25394 3230 37710 -16236 52620 13392 -18345 28091 -107354 -89387 96415 169115
2372 169115 30767 -73768 -19962 4997 -57826 -92053 -103296 -148201 -129133 -59944 -69617
2361 -69617 -90580 -184214 -204180 -138282 -152665 -45378 -13384 -45064 -70690 -110437 -159564 -103055
2349 -103055 -53279 -81313 -148273 -218156 -191937 -178902 -91116 9376 47470 23790 -17195
2338 -17195 -20145 82681 120171 -24728 -127804 -49864 -68853 11779 21805 21466 112190 107754
2326 107754 95134 -80728 -71072 -49531 -115579 -108035 22217 -7172 503 16931 13332 57352
2314 57352 9954 13112 -34858 -18796 -22824 -14916 10585 -71133 -76045 -40133 27386 109991 82729
2301 82729 53945 24276 3862 103330 97263 20303 -51137 -73925 -109840 -117148 21418 -68305
2289 -68305 -82720 -12389 -63417 12593 4388 49548 -29129 -67959 -46051 -13682 -437 50424
2277 50424 50540 -16412 81848 134295 82069 17032 -41746 110194 65051 75158 130448 100155
2265 100155 -348 -39301 -13303 15111 -42459 -104240 -3089 5198 9600 -22754 21617 -95342
2253 -95342 -124663 -41850 -53856 -53890 -4880 8797 59266 -4841 -65199 465 -72012 -2291
2241 -2291 72643 103601 -40063 -34357 -17939 12520 6967 35898 47989 4123 62244 101501
2229 101501 70426 51612 124814 147035 98825 55703 88570 111207 233873 174275 81578
2218 81578 20587 -54631 -80817 21301 43448 198552 219952 110602 160564 159626 101652 72175
2206 72175 134257 90703 92101 191281 157232 145249 141042 129823 54523 172152 114353 138450
2194 138450 239709 262743 256576 224026 292560 242116 282130 306974 333492 308268 258117 284266
2182 284266 324324 305416 200008 222565 354073 393614 407840 546267 524881 497386 477267
2171 477267 506072 532923 496998 519700 505014 540007 539039 505888 685107 720192 579610 582590
2159 582590 713374 755544 785968 773202 826201 841680 839426 863348 886590 777738 802743
2148 802743 893416 843444 893644 990180 1087935 1146019 1173685 1159655 1115154 1174247 1234570 1214866
2136 1214866 1274091 1328744 1390416 1445076 1553853 1632043 1708766 1731016 1859252 2019821 2287773
2125 2287773 2434622 2504039 2501708 2622896 2952283 3128645 3343030 3632676 3859951 4093294
2115 4093294 4498461 5069411 5681064 6483154 7409116 8603910 10103882 11864835 13940861
2106 13940861 16214447 17918899 17898671 15777672 12780675 10467413 8754500 7398262
2098 7398262 6308976 5201342 4332446 3831857 3323974 2894009 2646766 2459773 2439179
2089 2439179 2266984 1957231 1801117 1685861 1548047 1441321 1434990 1385902 1166143 1072813
2079 1072813 1069161 1048327 912838 771415 647760 610203 705651 779434 760619 654117 727992
2068 727992 663294 510449 404132 331857 444663 397323 491804 507714 400009 373604 430870
2057 430870 396243 335031 330754 398934 343317 404429 431291 334912 380180 311551 272034 177131
2045 177131 186919 280677 287994 298232 256498 349406 277295 128014 19512 96125 197694
2034 197694 206809 186212 82922 140381 106493 50189 15281 95587 99174 133326 167868 200135
2022 200135 108804 99498 75777 28454 28861 85064 56484 32565 45441 58583 128847 172122
2010 172122 120205 95008 65615 -7708 45905 81997 103113 99554 23102 113326 99143 -13197
1998 -13197 103004 47266 7880 14936 -22363 -80987 -140297 -94050 -2885 -45569 -64071 24417
1986 24417 72678 145423 31283 -61183 -20718 55592 144655 74712 83102 18494 21459 16933
1974 16933 20627 68745 119440 143635 11519 -5766 -19988 42671 -10906 25856 9733 51695
1962 51695 84794 33625 -67175 -89128 -100499 -115422 -17532 39331 47445 66159 65515 -49638
1950 -49638 -18514 -19149 1154 -35351 -31262 -17735 -31777 -79946 -184968 -77276 31006 45080
1938 45080 -2471 -56045 -35404 104757 90420 18278 53713 -93281 -140897 9144 -80388
1927 -80388 -96589 98574 79824 -22676 23192 16313 28241 16446 -22308 -38360 -33791 -80491
1915 -80491 -27855 -50100 -128908 -88257 8232 38269 21163 -37304 -134114 -93479 81493 101761
1903 101761 70959 54222 8099 -116769 -53865 34754 -40576 -74572 -103123 21635 46243
1892 46243 8096 26652 54924 -35055 -54864 22262 86051 40895 64561 17100 -17214 16197
1880 16197 93856 30780 -58816 -54411 -4186 -11813 42319 67242 82258 75401 69946 1309 -5640
1867 -5640 1494 -1672 -15133 -9142 -176161 -155629 -45785 16307 26980 793 39573 47979
1855 47979 48908 31296 110843 127738 73695 41062 -121656 -167793 -962 87812 71483 42318
1843 42318 37839 -1802 119745 75646 37698 178822 212205 201893 125070 111042 40665 57332
1831 57332 20589 -31179 -54405 -9621 31788 19882 66210 45011 109382 49982 -82857 30920
1819 30920 80299 57332 3859 -68457 -125640 -62145 57952 -8129 11058 -104993 -23558
1808 -23558 -50640 -65931 -156130 -132318 -156953 -168433 -139885 -127508 -45078 -96892 -90465 -47683
1796 -47683 -109649 -34748 -12488 7365 -9529 -35549 -59316 -84776 -78174 -78516 -56896 -18569
1784 -18569 55659 -134311 -218835 -21466 -43455 13650 -63447 -19885 -44191 -99166 -34908
1773 -34908 -69583 36239 -11776 -86065 -63335 172 -88695 -83196 -72518 80081 129329 65618
1761 65618 -51001 -147028 -282630 -279559 -40396 78875 -45397 -52994 -59185 10558 -79741
1750 -79741 -95130 -84192 -116296 -146720 -214587 -147426 -124727 -124655 -83358 -45711 -119876 2216
1738 2216 3819 -30538 -72391 -86828 -104934 -92448 -66208 -84905 -116790 -18128 38940 53652
1726 53652 51620 -69621 -67091 81178 138692 -40192 -119122 -2647 -81624 -52856 21439
1715 21439 15599 -9421 -96365 -91684 13028 28152 23024 39867 5968 -75920 26216 -37195
1703 -37195 -78020 30808 -78344 -58325 -128668 -132737 -34061 -62076 -10091 57380 -16797 -79251
1691 -79251 -109037 -87284 -160157 -111097 18095 -23253 -117551 -62855 -140996 -158870 -111447 15940
1679 15940 124705 68950 11598 -75295 -51352 -1534 -45199 -63921 5210 -14992 3218 -122934
1667 -122934 -130133 -68754 -68282 -60555 -96921 -67380 -64538 9366 -70425 -59888 -54083 -115429 -44492
1654 -44492 -102574 -63160 -22512 -6907 7579 -96490 -48774 -11375 68854 615 -40033 -19590
1642 -19590 -63326 21612 18988 1461 35739 67582 44064 140973 134114 16376 131253 58800
1630 58800 -19547 8103 -87673 -131261 33167 46114 -54223 -50148 -152943 -155565 -37031
1619 -37031 -34767 -82804 -68500 -82002 13325 34921 -17237 53602 68190 4691 6177 46246
1607 46246 24581 69965 183903 -2891 -172674 -105862 -46450 -33795 -70627 -12579 -129338
1596 -129338 -34485 -12447 -55086 -72364 -44197 31778 22911 -56353 9358 37192 48069 48365
1584 48365 -39923 -23625 -89500 42299 -15933 -34815 -51146 -57087 -22750 -17953 -16722 26385
1572 26385 82534 42827 33021 57804 -24970 -11674 30085 69551 66160 72316 81913 76542 141091
1559 141091 135014 35052 -66404 -60038 39410 -37872 -31919 -38571 -84785 -41505 -34302 28360
1547 28360 -20994 -65855 -80960 -110585 -192884 -140417 -42729 -25767 -59263 -93631 -17513 -14391
1535 -14391 -48201 -12032 -14306 -6855 -26019 -70766 27018 19144 -25217 -65367 10152 33547
1523 33547 17269 21600 -54597 -35100 -2176 -39633 -57057 -58491 47993 68108 -105663 -68425
1511 -68425 -86265 -14806 86394 -69755 -85472 -38834 18855 73383 58254 68061 -15282 -333
1499 -333 86795 -82534 -92794 -2025 -18833 -120303 -159649 -80446 -69245 -2218 80061 59459
1487 59459 10291 -49956 -54104 56080 64570 68456 44101 32904 30103 58808 23665 -37482
1475 -37482 -31549 -72119 -117335 -66422 -77899 -123219 -126084 -82303 -103509 -59769 -55281 86391
1463 86391 109871 86869 100541 88769 26752 2046 -47908 -104853 -120644 -151745 -145035 -41132
1451 -41132 110616 77855 -46274 791 151487 151596 150123 107978 28337 -57757 -75161 -401
1439 -401 -43670 34163 66474 13002 -24951 -32069 -37176 -151618 -55915 -75755 -32014 -97087
1427 -97087 -42918 -24427 -55093 -91076 -34604 -104439 -7874 85371 26245 -22810 -72357 -78668
1415 -78668 3231 28709 76003 89781 52891 22158 50546 -60946 -8340 200858 133562
1404 133562 65737 94829 141753 72249 55296 35727 27447 -47649 -17358 36988 118184 18782
1392 18782 36976 148252 63362 -60450 -17205 74078 107857 91065 101991 122877 34204
1381 34204 -81692 -51597 -95399 -73927 -27274 -55383 -23062 -21991 -125355 -48877 -2278 4835
1369 4835 50580 15586 -48105 -66950 -48533 -27355 31502 14786 -121230 -69304 -13619 -65573
1357 -65573 -47796 -2260 35088 55878 86214 117420 -28555 -11524 40286 -1795 -44962 -25209
1345 -25209 11359 -1758 39274 6340 -15192 -1232 -6136 8258 -83295 -148165 -63346 -33898
1333 -33898 16632 -1602 -69979 -126455 -188834 -161456 -114643 -61178 -5403 -67697 -100438 -87166
1321 -87166 -82062 11936 -29421 16820 42438 -14605 -12088 -57240 -97349 -99682 -62313 -94558
1309 -94558 -21613 7539 -20481 47518 3454 -91727 -58762 -637 -16318 -47918 -35816 -24543
1297 -24543 71653 29376 59068 70151 92084 81236 117968 164013 53820 -35182 -28107 -69996
1285 -69996 -40272 8641 3433 -18957 46080 -10192 -6895 115710 25176 -55962 -21942 -32875
1273 -32875 12902 -16032 -384 7321 81389 110327 113854 1608 -29117 -7535 11234 -32698
1261 -32698 -110159 -63186 8090 -9123 -79800 -46024 -64887 38710 55138 32613 -60623 -48526
1249 -48526 28352 -50553 -29339 7027 -15198 15417 45689 -6458 71201 15932 32067 62939
1237 62939 -10685 -65265 -68369 -78914 -35687 -1627 -3730 -63145 -67686 -20152 -28889 -42326 -67093
1224 -67093 -47371 -65213 -9995 -90257 -51908 -62502 -3354 -30141 93441 -18460 -30096
1213 -30096 -9498 -53989 -60891 -51115 -60949 4117 -37406 -7974 113483 43735 45631 59044
1201 59044 42098 20906 660 -94309 -121946 -39287 -9359 50209 84802 179311 149115 27100
1189 27100 -75177 -57115 -64658 -23034 39099 -44101 -39213 -3168 89992 12853 -73782 -102232
1177 -102232 -153815 -103020 72733 72879 86366 12684 16961 -79 -10787 -96947 -80778 34932
1165 34932 83964 137673 145736 53031 -16673 -6195 68506 115323 117721 8026 -82365 -49348
1153 -49348 -101089 -69511 -23490 -26387 -136328 -47614 -41590 -50520 -63178 42421 51751 53974
1141 53974 -31130 -63944 1156 1813 69168 83200 -52425 -45247 -33026 -117373 -105485 -89048
1129 -89048 73131 83396 113932 109190 85815 65946 -17852 -67404 -5034 34985 -16288 -41072
1117 -41072 -17824 -34241 63120 856 -65312 -32135 -48648 -100878 -98903 -31086 -23535 -16378
1105 -16378 -33097 -75691 -80799 -122285 -166358 -181703 -131973 -44855 -68292 -16530 53297 -2586
1093 -2586 -38552 -2837 143813 146737 25013 85482 169879 104191 -37720 60965 20251 -68390
1081 -68390 8383 19740 149849 56999 -3162 -13945 -13291 -97648 10168 40818 -113201 18570
1069 18570 69804 -34697 -71339 -88825 38353 61531 61569 20542 -190 41277 14046 -39626
1057 -39626 36053 213282 123802 70540 40560 26351 25446 79011 54152 66536 31990 68313
1045 68313 86942 72392 107595 -24896 7757 96115 93182 130946 113379 50091 -16966 -73844
1033 -73844 -12246 35513 -19417 -59582 44655 -33084 -19198 -46085 -60858 8599 32396 18432
1021 18432 17109 -22986 -62640 -17459 53352 104152 85409 30614 65703 89847 69217 62437
1009 62437 -32863 -13075 35842 -34818 -90751 14432 8108 -11377 101651 93692 -158 107949
997 107949 45595 49662 22668 15984 13860 -3806 -39930 -50709 -10123 30441 31123 26691 12319
984 12319 28817 63924 14637 83614 77624 -19201 -13388 7773 26464 12765 128526 145799
972 145799 163885 47874 -23365 -34586 -14849 -8350 -36107 -124013 -103226 23986 -9285 78279
960 78279 102269 -96524 -88689 43884 13590 84224 -9268 -22428 29136 6184 23505 82157
948 82157 96035 40705 68230 -48180 104460 169261 2671 -69792 -139906 -73141 -12145
937 -12145 -76129 -66845 -150134 -184242 -28005 51326 105966 161793 192679 81242 -651 -107695
925 -107695 -71305 10280 -55300 -46748 -9181 -30282 5097 -36847 -15603 -8466 9444 45521
913 45521 66284 100039 104466 53189 46714 38198 124162 82599 106323 74816 30682 58870 3999
900 3999 -10253 58839 49764 145505 61654 36036 148018 149226 92906 63733 50462 22013
888 22013 -63534 -19867 105079 19243 -15700 -58721 -51695 -46598 75935 49004 67194 17332
876 17332 -36200 46465 -64661 -115975 -48808 -12236 52943 13721 14540 -26184 -38902 41805
864 41805 -29894 -105519 -135336 -64192 -3034 -72918 -78563 -15611 -58185 -36618 -34839 -60397
852 -60397 -35905 -92660 -89869 -45442 61806 -30212 -105254 -122505 -53022 36001 9770 -73838
840 -73838 -96813 -21514 -23309 -3806 118384 147714 156393 49390 -3457 56378 103720 154957
828 154957 68240 47176 67825 121177 88039 -116840 -114365 -88717 -14883 7068 -83280 -43403
816 -43403 2927 -1032 43595 -9881 -109886 -88020 -121113 26100 33303 16445 34380 -27588
804 -27588 24044 -2381 -53700 -9581 -7004 89718 96261 40848 53716 74040 -8459 -24364
792 -24364 -85561 -95141 -72763 -77026 -47603 34114 71389 74676 61617 80164 -24037 -44656
780 -44656 30570 117779 47508 -42330 -66631 -72516 -68844 -144188 -110782 -83939 -52421 -6178
768 -6178 -76481 -165088 -77750 -29426 -93991 -111170 -70914 -78078 -16387 -14227 -53839 -31775 -53711
755 -53711 -7411 65616 13658 244 2885 -86371 -115263 -37124 43672 13814 -1882 20011
743 20011 11229 -44309 -76014 -67780 -108163 -53266 -110791 -22304 18119 51639 83736 127766
731 127766 45391 15395 -64372 -80402 -71687 -78133 -6376 43093 37154 97983 58380 61266 72608
718 72608 23827 -27948 64485 74958 -5943 -47517 -92860 -131141 -59551 64258 -7153 -66655
706 -66655 -58374 -103849 -92992 -46605 -139487 -112963 -69522 -35639 13465 -32537 54149 74126
694 74126 -16508 44944 43726 16030 60674 57058 44928 53561 68723 34086 33890 7436 -60960
681 -60960 43100 103219 -18227 -53228 65375 61571 -56415 -131345 -32460 -52402 18473
670 18473 40331 -21392 -46462 5689 -25515 96277 100140 110608 62270 54945 -6491 -89843
658 -89843 -68709 -48870 23091 20804 -131477 -121748 -38089 -29138 -8899 7087 36715 -4222
646 -4222 25298 38427 22204 -3657 -12484 -70170 -21449 -22274 -68146 -86839 -37706 -35757 17717
633 17717 110561 105170 125976 80865 3110 -47285 112628 91732 30772 16183 -17407 -25816
621 -25816 -33101 -59569 -10416 -5571 -48928 -40567 -98375 -75175 -69913 53305 87760 51482 43267
608 43267 25053 -55583 -77126 -85540 18860 -29178 -38401 -91284 -19014 -15445 -105547 -6550
596 -6550 -9108 45789 17018 48470 -106868 -88163 6278 -7027 4934 -20257 45834 -35810
584 -35810 -34420 -10916 960 -24389 61370 62048 105333 77158 28655 87447 -61423 43328
572 43328 105290 25877 -19778 139935 108910 193425 90546 14391 5196 -20869 40851 29196
560 29196 69148 102652 40143 -123671 -91417 -60066 -35340 148446 103930 31580 36099 78312
548 78312 72090 57117 23057 -6614 49470 36299 92934 128032 102894 53489 14453 -130638
536 -130638 -48976 44182 61383 -46963 -86807 -69343 14114 35350 60402 25500 -22430 82095
524 82095 123807 76218 103980 119659 28486 -13767 84342 71297 83212 54997 23900 -38750
512 -38750 9429 -9946 12638 68242 177823 120861 77080 103212 109110 61923 117735 140815
500 140815 121453 119394 61499 112687 28620 -18525 37995 84845 22932 -35856 -2749 -5597
488 -5597 -103497 -28851 22557 -37100 -35071 56922 -29689 65982 153417 105948 56565 55443 9624
475 9624 -9234 44873 105040 99215 27732 -52665 -4923 10925 27544 2987 30237 52147
463 52147 64898 26326 23897 54196 -54935 -82555 14213 -2794 -72745 -83658 -65718 46653
451 46653 7736 15240 83530 65555 50000 -48315 134549 126583 37152 19408 -84409 3450
439 3450 -7577 73575 58369 21328 1628 12151 25946 -48113 40427 120703 40250 -20458
427 -20458 55424 26727 -10635 -17803 12760 -7580 -56386 -52707 -19435 39011 -37727 -66340
415 -66340 -35932 21988 84487 52781 -785 11851 -269 -94687 -79732 -484 -8450 7968
403 7968 23305 54036 76613 122121 156543 122664 -15751 3701 44306 -7833 -6248 -341
391 -341 -73828 -76858 17718 -29584 -45534 -21912 30894 33143 61146 109157 167801 131819 17849
378 17849 -25440 31088 77171 20809 53874 86369 -26493 38435 44725 98384 63529 -4724
366 -4724 154974 137194 134085 75698 -33227 27778 66201 88635 131933 132342 9332 31638
354 31638 72589 9156 -6602 -13106 15318 75722 30067 30431 70250 39463 44338 66207 118319
341 118319 28694 36562 85320 44710 8925 121762 134053 65619 92187 -41319 -81536 -25303
329 -25303 68034 36180 103877 62829 -23228 -15034 -48459 -58310 -52889 76715 42516 70219
317 70219 6500 -14902 53634 150337 103120 32661 -19516 -61736 -8004 -29580 -49755 -8286
305 -8286 -11402 82057 75270 39534 20002 22925 78415 50403 -72422 -88665 63269 65903 -78676
292 -78676 32336 90823 36826 6606 -30120 49180 88497 -27493 -85712 23117 49382
281 49382 96005 51480 -32156 781 38947 77701 24921 6113 -10943 49727 130684 133454
269 133454 101394 73570 -46086 -29488 -23114 18892 106379 47119 -19494 -60729 19814 12320
257 12320 67083 167412 90797 27902 64654 89571 76794 93207 105372 114291 111073 4308
245 4308 54069 89304 114575 81033 73415 77869 117370 129119 137127 29065 4310 102293 123189
232 123189 132553 54730 39406 157412 175332 111282 136808 4012 33187 30908 -48139 4767
220 4767 76999 59806 -19808 61248 18052 -3478 24767 161365 97226 6655 -15731 76024
208 76024 52165 -6601 50553 -27165 -30777 -4390 -9091 78222 97302 86444 22469 -13783
196 -13783 34124 5778 -16995 -25147 94866 144901 132061 118000 39925 67052 44268 62562
184 62562 218076 135864 100008 35248 21950 84878 110097 81714 59978 46016 28534 36127
172 36127 -3009 70554 1921 -39165 -209 15989 15885 59418 91712 3537 12617 38621 3865
159 3865 499 105825 139525 170167 133889 78846 118479 178185 102056 13987 16071 -36348
147 -36348 91118 99227 89532 11115 1879 -47874 -82434 9581 58435 153631 180561 150396
135 150396 142207 160461 116308 108478 152635 68756 116709 59985 58322 133791 50369 83931
123 83931 29421 47313 64160 35783 -16312 18575 17192 11438 73840 78080 114143 188167 115887
110 115887 85493 102865 139241 109116 130532 112565 3579 20832 422 28502 100132 73793
98 73793 77888 36782 64903 29325 59209 60325 65896 13423 -8080 73519 85631 90351 66966
85 66966 45142 55675 83861 106537 59947 52995 85917 93384 52561 38797 76167 114987 109224
72 109224 140229 99817 30138 33953 77980 92663 35798 11490 21327 28720 90873 118700 51766
59 51766 68410 63925 47981 76431 94714 105230 51226 87294 122803 17260 47219 32872
47 32872 61692 3401 64991 118516 30249 15833 44491 7884 1638 29570 107538 109903 67819
34 67819 99094 63995 65349 124878 52842 54974 98975 122060 72540 83345 188212 191736 160530
21 160530 132296 93920 73014 90897 117229 132272 97351 52593 85804 79351 84105 100055
9 100055 51040 61199 78624 136116 105758 51877 76790 43565 1798
0 1798
$$ Imaginary data points
##PAGE= N=2
##DATA TABLE= (X++(I..I)), XYDATA
16383 -1376685 -1368915 -1339423 -1217837 -1198011 -1155875 -1131443 -1094013 -1114956 -1143168 -1069230 -992358
16372 -992358 -1017537 -994492 -930167 -925138 -845975 -773568 -745901 -705825 -647500 -672445 -602014 -588554
16360 -588554 -659907 -575358 -521468 -495193 -452076 -480692 -420458 -323213 -297365 -287195 -178012
16349 -178012 -195557 -213639 -133059 24105 35777 19523 -13303 96544 133509 132304 190424
16338 190424 153634 176468 224685 284368 346497 404765 361896 373750 373630 417406 471623 506489
16326 506489 519256 562818 586183 712481 733781 769919 821042 842786 799129 867598 939867
16315 939867 966325 966342 966647 1023594 1051575 1007832 1127565 1192150 1271607 1329198 1313543 1280392
16303 1280392 1268731 1326483 1395406 1386209 1402460 1331042 1351200 1468381 1491632 1568974 1630062
16292 1630062 1620033 1740493 1803140 1689686 1732786 1747433 1808719 1777851 1788195 1909352 1888925
16281 1888925 1890528 1977712 1970721 1886013 1905057 2016118 2109454 2129262 2191675 2218021 2154422
16270 2154422 2186189 2219831 2202722 2270345 2347598 2396421 2420157 2353710 2343349 2378573 2419265
16259 2419265 2508940 2471760 2434712 2512642 2563952 2643268 2631412 2679667 2616959 2712101 2718665
16248 2718665 2726125 2705487 2727403 2708487 2767437 2786863 2771302 2789089 2817382 2931894 2991713
$$ [...]
##END NTUPLES=NMR SPECTRUM
##END=
