##TITLE=1H_EC-3322(2)
 CDCl3
 8 sc, 
 3.4.2024
##JCAMPDX= 6.0         $$ Bruker NMR JCAMP-DX V2.0
##DATA TYPE= NMR SPECTRUM
##DATA CLASS= NTUPLES
##ORIGIN= UXNMR, Bruker Analytische Messtechnik GmbH
##OWNER= root
$$ XWIN-NMR		Version 3.5
$$ Wed Apr  3 14:04:38 2024 Russian Standard Time (UT+4h)  she@DPX200
##.OBSERVE FREQUENCY= 200.1309
##.OBSERVE NUCLEUS= ^1H
##.ACQUISITION MODE= SIMULTANEOUS
##.ACQUISITION SCHEME= undefined
##.AVERAGES= 8
##.DIGITISER RES= 18
##SPECTROMETER/DATA SYSTEM= spect
##.PULSE SEQUENCE= zg30
##.SOLVENT NAME= MeOD
##.SHIFT REFERENCE= (INTERNAL, MeOD, 0, 15.7271)
##AUDIT TRAIL= $$ (NUMBER, WHEN, WHO, WHERE, WHAT)
$$ ##TITLE= Audit trail, XWIN-NMR		Version 3.5
$$ ##JCAMPDX= 5.01
$$ ##ORIGIN= Bruker BioSpin GmbH
$$ ##OWNER= she
$$ F:/spectra/data/she/nmr/H-F/1/pdata/1/auditp.txt
$$ ##AUDIT TRAIL=  $$ (NUMBER, WHEN, WHO, WHERE, WHAT)
(   1,<2024-04-03 14:02:31.82 +0400>,<she>,<DPX200>,
      <created by zg, POWCHK disabled, PULCHK disabled
       configuration hash MD5:
       00 E9 B6 7A A2 85 ED C7 34 08 36 98 17 FE 4E 26
       data hash MD5: 16K
       A9 5B 0B 13 9E 26 06 5E 71 FA 77 19 7A 49 16 08>)
(   2,<2024-04-03 14:02:38.78 +0400>,<she>,<DPX200>,
      <Start of raw data processing
       efp BC_mod = 2 LB = 0.24 FT_mod = 6 PKNL = 1 PHC0 = -25380.45 PHC1 = 14.58731 SI = 16K 
       data hash MD5: 16K
       2B C4 59 76 68 A9 0B 52 F0 D4 C9 D2 3F 0D 35 71>)
(   3,<2024-04-03 14:03:53.01 +0400>,<she>,<DPX200>,
      <pk PHC0 = 79.88979 PHC1 = -0.2 
       data hash MD5: 16K
       BD 87 D1 80 A1 8D CC 98 D9 68 83 22 B2 EA 52 55>)
(   4,<2024-04-03 14:03:56.51 +0400>,<she>,<DPX200>,
      <abs ABSG = 5 
       data hash MD5: 16K
       22 44 00 62 89 B3 84 9F 71 94 93 10 91 E9 07 22>)
$$ ##END=
$$ 
$$ hash MD5
$$ BB A6 F0 E9 0F AB 8B 9B 34 5E 20 49 70 1F 05 E2
##$RELAX= 
##$RELAX= 
##$RELAX= 
##$RELAX= 
##$RELAX= 
##$RELAX= 
$$ Bruker specific parameters
$$ --------------------------
##$DU= <F:/spectra>
##$EXPNO= 1
##$NAME= <H-F>
##$PROCNO= 1
##$TYPE= <nmr>
##$USER= <she>
##$AMP= (0..31)
100 100 100 100 100 100 100 100 100 100 100 100 100 100 100 100 100 100 
100 100 100 100 100 100 100 100 100 100 100 100 100 100 
##$AQSEQ= 0
##$AQ_mod= 1
##$AUNM= <au_zg>
##$AUTOPOS= <>
##$BF1= 200.13
##$BF2= 200.13
##$BF3= 200.13
##$BF4= 200.13
##$BF5= 200.13
##$BF6= 200.13
##$BF7= 200.13
##$BF8= 200.13
##$BYTORDA= 1
##$CFDGTYP= 0
##$CFRGTYP= 5
##$CHEMSTR= <none>
##$CNST= (0..31)
1 1 145 1 1 1 1 1 1 1 1 1 1 1 1 1 1 1 1 1 1 1 1 1 1 1 1 1 1 1 1 1 
##$CPDPRG= <>
##$CPDPRG1= <>
##$CPDPRG2= <>
##$CPDPRG3= <>
##$CPDPRG4= <mlev>
##$CPDPRG5= <mlev>
##$CPDPRG6= <mlev>
##$CPDPRG7= <mlev>
##$CPDPRG8= <mlev>
##$CPDPRGB= <>
##$CPDPRGT= <>
##$D= (0..31)
0 1.2 0 0 0 0 0 0 0 0.06 0 0.03 0 0 0 0 0.0002 0 0 0 0 0 0 0 0 0 0 0 0 
0 0 0 
##$DATE= 1712138551
##$DBL= (0..7)
120 120 120 120 120 120 120 120 
##$DBP= (0..7)
150 150 150 150 150 150 150 150 
##$DBP07= 0
##$DBPNAM0= <>
##$DBPNAM1= <>
##$DBPNAM2= <>
##$DBPNAM3= <>
##$DBPNAM4= <>
##$DBPNAM5= <>
$$ [...]
##$SUBNAM3= <"">
##$SUBNAM4= <"">
##$SUBNAM5= <"">
##$SUBNAM6= <"">
##$SUBNAM7= <"">
##$SUBNAM8= <"">
##$SUBNAM9= <"">
##$SW= 18.0517689322627
##$SWIBOX= (0..15)
0 0 2 0 0 0 0 0 0 0 0 0 0 0 0 0 
##$SW_h= 3612.71676300578
##$TD= 16384
##$TD0= 1
##$TE= 0
##$TE2= 300
##$TE3= 300
##$TEG= 300
##$TL= (0..7)
0 120 120 120 120 120 120 120 
##$TP= (0..7)
150 150 150 150 150 150 150 150 
##$TP07= 0
##$TPNAME0= <>
##$TPNAME1= <>
##$TPNAME2= <>
##$TPNAME3= <>
##$TPNAME4= <>
##$TPNAME5= <>
##$TPNAME6= <>
##$TPNAME7= <>
##$TPOAL= (0..7)
0.5 0.5 0.5 0.5 0.5 0.5 0.5 0.5 
##$TPOFFS= (0..7)
0 0 0 0 0 0 0 0 
##$TUNHIN= 0
##$TUNHOUT= 0
##$TUNXOUT= 0
##$USERA1= <user>
##$USERA2= <user>
##$USERA3= <user>
##$USERA4= <user>
##$USERA5= <user>
##$V9= 5
##$VALIST= <valist>
##$VCLIST= <CCCCCCCCCCCCCCC>
##$VD= 0
##$VDLIST= <DDDDDDDDDDDDDDD>
##$VPLIST= <PPPPPPPPPPPPPPP>
##$VTLIST= <TTTTTTTTTTTTTTT>
##$WBST= 1024
##$WBSW= 4
##$XGAIN= (0..3)
0 0 0 0 
##$XL= 0
##$YL= 0
##$YMAX_a= 380231
##$YMIN_a= -394528
##$ZGOPTNS= <>
##$ZL1= 120
##$ZL2= 120
##$ZL3= 120
##$ZL4= 120
##$ABSF1= 15.6369
##$ABSF2= -2.414988
##$ABSG= 5
##$ABSL= 3
##$ALPHA= 0
##$AQORDER= 0
##$ASSFAC= 0
##$ASSFACI= 0
##$ASSFACX= 0
##$ASSWID= 0
##$AUNMP= <proc_1d>
##$AZFE= 0.1
##$AZFW= 0.1
##$BCFW= 0
##$BC_mod= 2
##$BYTORDP= 0
##$COROFFS= 0
##$CY= -3
##$DATMOD= 1
##$DC= 0
##$DFILT= <>
##$DTYPP= 0
##$F1P= 0
##$F2P= 0
##$FCOR= 1
##$FTSIZE= 16384
##$FT_mod= 6
##$GAMMA= 0
##$GB= 0
##$INTBC= 1
##$INTSCL= 3.70164e-10
##$ISEN= 128
##$LB= 0.24
##$LEV0= 0
##$LPBIN= 0
##$MAXI= 10000
##$MC2= 0
##$MEAN= 0
##$ME_mod= 0
##$MI= 1.114404
##$NCOEF= 0
##$NC_proc= -7
##$NLEV= 6
##$NOISF1= 3.799351
##$NOISF2= 2.8
##$NSP= 0
##$NTH_PI= 0
##$NZP= 0
##$OFFSET= 15.72709
##$PC= 1
##$PHC0= -25300.56
##$PHC1= 14.38731
##$PH_mod= 1
##$PKNL= yes
##$PPARMOD= 0
##$PSCAL= 0
##$PSIGN= 0
##$REVERSE= no
##$SF= 200.129558902056
##$SI= 16384
##$SIGF1= 3
##$SIGF2= 2
##$SINO= 5.538805
##$SIOLD= 16384
##$SREGLST= <1H.CDCl3>
##$SSB= 0
##$STSI= 16384
##$STSR= 0
##$SW_p= 3612.71676300577
##$SYMM= 0
##$S_DEV= 0
##$TDeff= 16384
##$TDoff= 0
##$TI= <>
##$TILT= no
##$TM1= 0
##$TM2= 0
##$TOPLEV= 0
##$USERP1= <user>
##$USERP2= <user>
##$USERP3= <user>
##$USERP4= <user>
##$USERP5= <user>
##$WDW= 1
##$XDIM= 16384
##$YMAX_p= 475520747
##$YMIN_p= -913150
$$ End of Bruker specific parameters
$$ ---------------------------------
##NTUPLES= NMR SPECTRUM
##VAR_NAME=  FREQUENCY,     SPECTRUM/REAL,   SPECTRUM/IMAG
##SYMBOL=    X,             R,               I
##VAR_TYPE=  INDEPENDENT,   DEPENDENT,       DEPENDENT
##VAR_FORM=  AFFN,          ASDF,            ASDF
##VAR_DIM=   16384,         16384,           16384
##UNITS=     HZ,            ARBITRARY UNITS, ARBITRARY UNITS
##FACTOR=    0.220516191357247, 1,           1
##FIRST=     3147.45556087703, 0,            0
##LAST=      -465.261202128741, 0,           0
##MIN=       -465.261202128741, -913150,     0
##MAX=       3147.45556087703, 475520747,    0
$$ Real data points
##PAGE= N=1
##DATA TABLE= (X++(R..R)), XYDATA
$$ [...]
11675E2930J83602j81657N6374o9837n4616j00907r8235n9114M3050J43417J03162
$$ 52930 236532 54875 111249 41412 -13204 -114111 -212346 -271460 -228410 -84993 18169
11664A8169k14221R5689K11740j09620Q6015r4755j90194Q3380K63342p4876j90474
$$ 18169 -196052 -100363 111377 1757 87772 -6983 -197177 -113797 149545 74669 -115805
11653a15805R9187Q7854k08168k32964k2991K5688R9291J18678M3577J5686p9336
$$ -115805 -16618 71236 -136932 -369896 -392887 -367199 -267908 -149230 -105653 -89967 -169303
11642a69303n5508O3485J46878L8545J15540j81567j27232L5006r4995M2235j19368
$$ -169303 -224811 -161326 -14448 24097 139637 -41930 -169162 -134156 -229151 -186916 -306284
11631c06284Q4179m20Q835K5599Q0846j44529N5818J74258K33801j9208l28461
$$ -306284 -222105 -222525 -213690 -188091 -107245 -251774 -195956 -21698 212103 192895 -135566
11620a35566j02168M1919J87937R145l260J49139l53689j29003K16171J777j41
$$ -135566 -237734 -195815 -7878 1267 -1993 147146 -206543 -335546 -119375 -117598 -117739
11609a17739J65401j07975j7344L00517k46153m19940K40986K1902k7126P1666
$$ -117739 47662 -60313 -77657 222860 -23293 -443233 -202247 -180345 -207471 -135805
11599a35805q3823J17653R1784m1434p718K39298m9168m0628l00558j68873J50011
$$ -135805 -219628 -101975 -10191 -51625 -59343 179955 130787 90159 -210399 -379272 -229261
11588b29261l3557Q7688k4243J32473J62263j21188j2046p7518J24092j97338
$$ -229261 -262818 -175130 -199373 -66900 95363 -25825 -37871 -115389 8703 -188635
11578a88635j15410K33993J9212q9283J98663p1328J325j9524n7216K56606n906
$$ -188635 -304045 -70052 -50840 -140123 58540 -12788 -11463 -30987 -88203 168403 162497
11567A62497j77041j23304j7925r6434N7038P7728q895p7776J41372n1025J60343
$$ 162497 -14544 -137848 -155773 -252207 -195169 -117441 -126336 -204112 -62740 -113765 46578
11556D6578J06794k55968r7133N2042R8457L8443N7291j66153n3617M9518Q1604
$$ 46578 153372 -102596 -199729 -147687 -49230 -10787 46504 -119649 -173266 -123748 -42144
11545d2144j1015J19239J44589n4722k72078j11319n9851J34011m911J71809q778
$$ -42144 -53159 66080 210669 155947 -116131 -227450 -287301 -153290 -158201 13608 4830
11534D830k8444j37859j39367K46936j3611j19078J01984J07225J2447o5784L4814
$$ 4830 -23614 -161473 -300840 -53904 -67515 -186593 -84609 22616 35063 -30721 4093
11523D093K59631p6811n4629j24845j96169K22014J21496q3941p9614K4507j9827
$$ 4093 263724 186913 132284 7439 -188730 33284 154780 70839 -8775 15732 -4095
11512d095r2632j67095J50047J60433L4473m2782j33982J10942Q109k2485N8923
$$ -4095 -96727 -263822 -113775 46658 81131 38349 -95633 15309 23418 933 59856
11501E9856O8500k13148k5707Q1831j9088J41998J47144k03771j94634M3877K47346
$$ 59856 128356 -84792 -110499 -28668 -47756 94242 241386 37615 -157019 -113142 134204
11490A34204k2437r6441j09382q2722j1023J41332L1442n0506K20611J0048k68883
$$ 134204 111767 15326 -94056 -176778 -187801 -46469 -15027 -65533 155078 165126 -103757
11479a03757j66155j04471J48582P9389j9077K17533O6737j44440o1362j46943
$$ -103757 -269912 -374383 -225801 -146412 -165489 52044 118781 -25659 -87021 -233964
11469b33964m9583L0153J0577K99174k9657r2658P0469j6338j70326P2711L823
$$ -233964 -283547 -253394 -242817 56357 26700 -65958 4511 -11827 -182153 -109442 -105619
11458a05619Q8239j22032n6004k6813N9225K67993j10995j21734M8130j28352
$$ -105619 -17380 -139412 -195416 -222229 -163004 104989 -6006 -127740 -79610 -207962
11448b07962n7755j22343J16284K69094N0913n474j90315j2694M3400J28558r4834
$$ -207962 -265717 -388060 -271776 -2682 48231 42757 -147558 -160252 -116852 11706 -83128
11437h3128L422l7044p3215M6502O2769K9921J10675k48324L2623J11384k01958
$$ -83128 -79706 -116750 -189965 -143463 -80694 -50773 59902 -188422 -155799 -44415 -246373
11426b46373J6998J67950p26j85574J48016N4305r3930l2171j13039N1977K13742
$$ -246373 -229375 -61425 -62151 -247725 -99709 -45404 -139334 -171505 -284544 -232567 -18825
11415a8825r4697j06165J47978j92154J42701j84700r1464o7922M8981L2376J83548
$$ -18825 -113522 -219687 -71709 -263863 -121162 -305862 -397326 -465248 -416267 -383891 -200343
11404b00343J30626k1024k8619J03827K4530K00279o3780k36028N7627j80333
$$ -200343 -69717 -90741 -119360 -15533 8997 209276 145496 -90532 -32905 -213238
11394b13238O4336L1565k2717n6278J7082K02556j83780L4616J92843L6585R0858
$$ -213238 -148902 -117337 -140054 -196332 -179250 23306 -160474 -125858 66985 103570 194428
11383A94428k78751K3194j52643j12183O1848K17012P616K5084p1087j74358m5836
$$ 194428 -84323 -61129 -213772 -325955 -264107 -47095 -39479 -14395 -85482 -259840 -305676
11372c05676N3813K15879J7898O1431j8602K0166L251n601J05371L2027J43967
$$ -305676 -251863 -35984 -18086 43345 24743 44909 48160 42559 147930 179957 323924
11361C23924k30049k16702M4291J70899j47559J87349k08498j59407R5938O7016
$$ 323924 93875 -122827 -78536 92363 -55196 132153 -76345 -235752 -139814 -72798
11351g2798P3697M6792M6776n8499j04250J20394j52885R8485L0964k27735L4051
$$ -72798 899 47691 94467 35968 -68282 52112 -100773 -2288 28676 -199059 -165008
11340a65008P2812j09495o1202J71289n2446Q7643P882j4158m7342J03381o2953
$$ -165008 -92196 -201691 -262893 -91604 -144050 -56407 -48525 -62683 -110025 -6644 -69597
11329f9597j34303J61112Q9738j32568O405O3525l4417J56775o4304O8594k4457
$$ -69597 -203900 -42788 46950 -85618 -79213 -15688 -50105 106670 42366 110960 86503
11318H6503l21912J54754R1413P8920k29219n3443K77891J9086J4690q4670j92587
$$ 86503 -235409 -80655 10758 89678 -139541 -192984 84907 103993 118683 34013 -158574
11307a58574J03295J37167p6841O9751q3044J56878J1382k70490J14680N4416
$$ -158574 -55279 81888 5047 74798 -8246 148632 160014 -110476 4204 58620
11297E8620l1362R2672O5048k52327j51117O5541J02507J71062j73924Q8652Q7338
$$ 58620 27258 119930 184978 -67349 -218466 -152925 -50418 120644 -53280 35372 122710
11286A22710k98220q4059J63562q0073o4869K49069k7590j12693K04927J07035
$$ 122710 -175510 -259569 -96007 -176080 -240949 8120 -19470 -132163 72764 179799
11276A79799k36817j00692J53951j61535o1606J19310K24293n6596j56062j13231
$$ 179799 -57018 -157710 -3759 -165294 -226900 -107590 116703 60107 -95955 -209186
11266b09186m2408K11425p0046Q4501O2313j07827k770N1310m0928j5449L8601
$$ -209186 -251594 -40169 -110215 -25714 36599 -71228 -73998 -22688 -63616 -79065 -40464
11255d0464J74156p4314o3243M2438k0936j36232k01376P3595J96696j09071K4104
$$ -40464 133692 59378 -3865 38573 17637 -118595 -319971 -246376 -49680 -158751 -134647
11244a34647K6680O5782j33691J5266O178o6305K20339P351p6249J30626p507
$$ -134647 -107967 -42185 -175876 -160610 -154432 -220737 -398 6953 -69296 61330 53823
11233E3823j44353j00987O7732Q0745M4474Q9493Q8551M8313k20096j39231m4003
$$ 53823 -90530 -191517 -123785 -43040 1434 90927 179478 227791 7695 -131536 -175539
11222a75539J37667J12120L30J9541p5248j56536O0804N087j4139J51929Q955
$$ -175539 -37872 74248 74578 94119 18871 -137665 -76861 -71774 -85913 66016 74971
11211G4971n4377j64888l5600K77413J48171j38003O2870j66013o9537o7323K61580
$$ 74971 20594 -144294 -179894 97519 245690 107687 170557 4544 -64993 -132316 129264
11200A29264J295m2960p4976M9490q6126O4231j3749j6084j11850j60701J49345
$$ 129264 130559 87599 12623 62113 -24013 40218 26469 10385 -101465 -262166 -112821
11189a12821J36902m164j71610J15737k010k1573J2624p338r5138o7968Q9797
$$ -112821 24081 19917 -151693 -35956 -37966 -59539 -46915 -54253 -149391 -217359 -127562
11178a27562J03630m2831K1940R5803J05654j27303o189j4533j2248p566p8735
$$ -127562 -23932 -66763 -44823 50980 156634 29331 23142 8609 -3639 -11205 -89940
11167h9940J27035p5659j26006K64676o1361j10526O5400J7933m4600J807k65011
$$ -89940 37095 -38564 -164570 100106 38745 -71781 -6381 11552 -33048 -31241 -296252
11156b96252J16443K92725k0607j47285j67358J28956K89268M0033l5802j1658
$$ -296252 -179809 112916 92309 -54976 -222334 -93378 195890 235923 200121 188463
11146A88463N85j20628N2180j60419Q3406J76193p3621j9591L4502k89327J70017
$$ 188463 189048 68420 120600 -39819 43587 219780 146159 126568 161070 -128257 41760
11135D1760j32535M5412N1797O5884n4026K929P2700k1185k0129l7731J3081o2381
$$ 41760 -90775 -45363 6434 72318 18292 21221 93921 72736 52607 14876 27957 -34424
11123c4424O5798m8325j15234j08147L14762K30304j41185p1355k11808k09103
$$ -34424 31374 -16951 -132185 -240332 74430 304734 163549 92194 -119614 -328717
11113c28717K11597N6016J06103M4297l60259J27942J48333q1812J93840r9286
$$ -328717 -117120 -61104 44999 89296 -270963 -143021 5312 -76500 117340 18054
11103A8054j38165j35235J01475M4744l420m4023K92523n0348p3328J63296p3066
$$ 18054 -120111 -255346 -153871 -109127 -112547 -156570 135953 85605 12277 175573 102507
11092A02507P6210j32118j3589j10915n4396K8669j2647K00877k18800Q8738J88813
$$ 102507 178717 46599 33010 -77905 -132301 -103632 -116279 84598 -134202 -45464 143349
11081A43349m4147j80429L6923N5863j5557J1191n9606O0680k1987J3034j93698
$$ 143349 99202 -81227 -44304 11559 -3998 7193 -52413 8267 -13720 -686 -194384
11070a94384J31994J10640l4991m4348J15015J65290p9191j33917k17447l2860
$$ -194384 -62390 48250 13259 -31089 83926 249216 170025 36108 -181339 -214199
11060b14199J6979K1045M257P032N4271K17945m9628j18183J04837P4552q1802
$$ -214199 -197220 -176175 -171918 -164886 -110615 107330 57702 -60481 44356 118908 37106
11049C7106O6838m0097j31006M8534J38726l2065R8264k84345O578J78348j07823
$$ 37106 103944 63847 -67159 -18625 120101 88036 186300 -98045 -91467 86881 -20942
11038b0942k1227N1836J0827J01561k9803P8147N4664p2805P8445p391k34802
$$ -20942 -42169 9667 20494 122055 92252 170399 225063 152258 230703 223312 -11490
11027a1490M4802Q0665j13979M9295M5157j9857J7023M1779J20380P0639r3414
$$ -11490 33312 113977 -2 49293 94450 74593 91616 133395 253775 324414 231000
11016B31000j97727j70831P7527p4850KJ10642O9490K32788j10228j10472r3469
$$ 231000 33273 -137558 -60031 -134881 -134879 -24237 45253 278041 167813 57341 -36128
11005c6128N6021j8416L8155J62288j27708P0327P682j94420k6683J71904n3679
$$ -36128 19893 1477 39632 201920 74212 144539 152221 -42199 -68882 103022 49343
10994D9343J58282p422q8825n4631j6587J462j19588j55220R3133K52989j39952
$$ 49343 207625 200203 111378 56747 40160 41622 -77966 -233186 -140053 112936 -27016
10983b7016j58077J70207J53181R3135j2109k50853j50203N9604j33318N6583
$$ -27016 -185093 -14886 138295 231430 219321 -31532 -181735 -122131 -255449 -198866
10973a98866n18N8439J17049n5948K8064J43437K3095k09021m5659l2222M6979
$$ -198866 -199384 -140945 -23896 -79844 -51780 91657 114752 -94269 -139928 -172150 -125171
10962a25171J27389Q9555M8341j97896p8436l10952N0882J96249J55902J54236
$$ -125171 2218 91773 140114 -57782 -136218 -447170 -396288 -200039 -44137 110099
10952A10099O3977J17698K2103k79037j02344J50234l65k2284J47948j15881l14557
$$ 110099 174076 291774 313877 34840 -67504 82730 82365 60081 208029 92148 -222409
10941b22409P4042P4640R6293J28980k26444k5991N3651j37196K20642N1795o9365
$$ -222409 -148367 -73727 22566 151546 -74898 -100889 -47238 -184434 36208 88003 18638
10930A8638j13813J15559p039k88276J83310k3006R1429j0792j60343o841M5037
$$ 18638 -95175 20384 13345 -274931 -91621 -114627 -23198 -33990 -194333 -201174 -156137
10919a56137J80105J58807J676j79772j7337Q9122j76007k96184K17960J84736
$$ -156137 23968 182775 184451 4679 -12658 76464 -99543 -395727 -177767 6969
10909F969O778j72565O1524J40489k0092r0655j3678r971k11932K03020J58688
$$ 6969 13747 -158818 -97294 43195 23103 -67552 -81230 -91201 -303133 -100113 58575
10898E8575j79702R403Q4914j23828K1013j740J54020J29028O9477p0558m3825
$$ 58575 -121127 -111724 -26810 -150638 -129625 -131365 22655 151683 221160 150602 106777
10887A06777o406R8226J9552k02282j19181Q340O7362j733K8305O0005J33218
$$ 106777 100371 198597 218149 15867 -103314 -94974 -27612 -29345 -1040 58965 192183
10876A92183q3111J46022p3600j94933p8236R2409J61469j78406P684M6618l9445
$$ 192183 109072 255094 181494 -13439 -91675 734 162203 -16203 -8519 38099 -1346
10865a346J64818J85567j94351j16507M06084r7306l07133J92393J05707j65314
$$ -1346 163472 349039 154688 38181 444265 346959 39826 232219 337926 172612
10855A72612l02537p0729J41395J08066N9057K52025k52689J04776N0510j04143
$$ 172612 -129925 -200654 -59259 48807 107864 359889 107200 211976 262486 158343
10845A58343J47276j52342j72533N8438J37415j1295p1169j85472J66371j0451
$$ 158343 305619 153277 -19256 39182 176597 165302 94133 -91339 75032 64581
10835F4581p8000J698q7439r6175J17806P1689J51881k18119J6569J82530r7470
$$ 64581 -13419 -11721 -99160 -195335 -77529 -5840 146041 -72078 -55509 127021 29551
10824B9551N3326M9306k15655J2589R6967K3988k70832m7195K61449J59651j3315
$$ 29551 82877 132183 -83472 -70883 26084 50072 -220760 -267955 -6506 153145 139830
10813A39830j25365j93857J37058J32756Q5329p9545l8486j0158Q1020P148L5267
$$ 139830 14465 -179392 -42334 90422 175751 96206 57720 47562 128582 135730 170997
10802A70997K466k06560m9259J91636q6601j19285j08581J35895N5718j52162
$$ 170997 173463 -33097 -82356 109280 22679 -96606 -205187 -69292 -13574 -165736
10792a65736m9023K14425M0675Q494J76094j40849N2629N852j06456k44242L11976
$$ -165736 -214759 -334 40341 48835 224929 84080 136709 142561 36105 -208137 103839
10781A03839o3520p6330n2108j10405J37553o1199k16344J31824K00493k9226
$$ 103839 40319 -36011 -88119 -198524 -60971 -122170 -338514 -206690 -6197 -35423
10771c5423j5696K3732j4065j3989p4627J75559l2498p2225p3710L19738K20982
$$ -35423 -51119 -27387 -41452 -55441 -130068 45491 12993 -59232 -132942 186796 407778
10760D07778j54757j47206J69094j14319j00898J3492k18086Q9715j2882L7288
$$ 407778 253021 105815 274909 160590 59692 73184 -144902 -55187 -68069 -30781
10750c0781R4173j54283K3522J74129J64858k77993l6639J37130j27784o3951
$$ -30781 63392 -90891 -67369 106760 271618 -6375 -43014 94116 -33668 -97619
10740i7619J77823J43276k7364l5996q77k7789j72681j38971K7390Q5390J2345
$$ -97619 80204 223480 196116 160120 159243 131454 -41227 -180198 -152808 -67418 -55073
10729e5073Q9762M8908o8220m6133O9920j04202r7202J42640L16056j13047J15354
$$ -55073 34689 83597 15377 -30756 39164 -65038 -162240 -19600 296456 183409 298763
10718B98763j19282j20416l22434J66930L88507p9434k01791k64377K75280k7310
$$ 298763 179481 59065 -263369 -96439 292068 212634 10843 -253534 21746 -5564
10708e564j8299J4827l99J53371j6133k49262J59654K4642m3681q1602Q531k6534
$$ -5564 -23863 -9036 -9435 143936 127803 -121459 38195 62837 19156 -62446 -53915 -80449
10696h0449J42074k0743j2706K0004j36918K1060L57268n8790n1214j08042j04616
$$ -80449 61625 40882 28176 48180 -88738 -67678 289590 230800 179586 71544 -33072
10685c3072q1585j13610J20318j6987L9392P5560K39661j69615k17O9883P6413
$$ -33072 -114657 -228267 -107949 -124936 -85544 -9984 229677 60062 59845 129728 206141
10674B06141j16307r7173m9432j87617n5592J63335J06839J42784J21801p0142
$$ 206141 89834 -7339 -56771 -244388 -299980 -136645 -29806 112978 234779 164637
10664A64637m29103O8331J00569J92874K25662r3357j03173k25253j10625K23080
$$ 164637 -264466 -196135 -95566 97308 322970 229613 126440 -98813 -209438 13642
10654A3642M5169j09252j42209j30951P4749R2692K30801k7679N3068J02769o7912
$$ 13642 58811 -50441 -192650 -323601 -248852 -156160 74641 46962 100030 202799 134887
10643A34887n264k31027k5748P6599J6678o7476J84097J20696J4474O6406N920
$$ 134887 129623 -101404 -127152 -50553 -33875 -101351 82746 203442 217916 284322 290242
10632B90242p5944j69398R3815O4733j13208L1798J7318M4324o8221o1113j29750
$$ 290242 214298 44900 138715 203448 90240 122038 139356 183680 115459 54346 -75404
10621g5404j6142k4777J7570J37280r8299J54069J21479l4061l14942M8340J15781
$$ -75404 -91546 -116323 -98753 38527 -59772 94297 215776 181715 -133227 -84887 30894
10610C0894m3715m424M9517J40268j55739n5439o6818K25663q5923J27788l4731
$$ 30894 -12821 -17245 32272 172540 16801 -38638 -105456 120207 34284 162072 127341
10599A27341O7832j26730J7273J38109j05185K8971j19435J28233r2795j29201
$$ 127341 195173 68443 85716 223825 118640 147611 28176 156409 63614 -65587
10589f5587m2122J02719J5284J29188O267r0871k0158J01581n0890n6578N0041
$$ -65587 -107709 -4990 10294 139482 145749 54878 34720 136301 85411 28833 78874
10578G8874J7533j1546j2521j69071Q4159N682P5912k4478o718p2640P6561j42600
$$ 78874 96407 84861 72340 -96731 -12572 -6890 69022 44544 37826 -34814 41747 -100853
10566a00853J35388P1740n0160q0906N5256j9042J9153N9913O1074r8715p1961
$$ -100853 34535 106275 56115 -24791 30465 11423 30576 90489 151563 52848 -19113
10555a9113J64660j03218k9700r4693J493j10957j1943n8462J99631r9399R5147
$$ -19113 145547 42329 12629 -82064 -80571 -191528 -203471 -261933 -62302 -161701 -66554
10544f6554Q0164o173J63317M5403K7450q3556j50576J15334k267J76095R2203
$$ -66554 13610 7437 170754 216157 243607 160051 9475 124809 122542 298637 390840
10533C90840k11269P5271j00485J12661j27786p569J49438L447j16695n863p251
$$ 390840 179571 254842 154357 267018 139232 131663 281101 284548 167853 161990 154739
10522A54739k38473K31648J541j7866o077j75481L0974m7625J98646m4663J92553
$$ 154739 -83734 147914 149455 131589 125512 -49969 -18995 -66620 132026 87363 279916
10511B79916P9036k30143j34224J10984K1400k10649O2564o1207J2288L6558j11900
$$ 279916 358952 128809 -5415 105569 126969 -83680 -21116 -82323 -70035 -33477 -145377
10500a45377J14788K13470m1862L1385N3489L0084j53905j29312j5271J13628
$$ -145377 -30589 182881 141019 172404 225893 255977 102072 -27240 -42511 71117
10490G1117p9694J48158p19j01539l0013J86915p9055K6715K05077o401L5405
$$ 71117 -8577 139581 138862 37323 7310 194225 115170 141885 346962 340561 375966
10479C75966q9343j10460j20451m6851J527J82751j37985k29026L4878O4619K90682
$$ 375966 286623 176163 55712 8861 10388 193139 55154 -173872 -138994 -74375 216307
10468B16307p1363m2805j69087j55743J09761j1897K05098j70732k4862O4219
$$ 216307 144944 102139 -66948 -222691 -112930 -124827 80271 -90461 -115323 -51104
10458e1104O3249r0072L470j8235R8457K32691N9895o5572p6377L7746j3337k0560
$$ -51104 12145 -77927 -74457 -92692 5765 238456 298351 232779 156402 194148 180811 160251
10446A60251J4164q0525p8541l9001J01185R2421N549l7102j35825K20144J06435
$$ 160251 174415 93890 15349 -23652 77533 169954 175503 138401 2576 222720 329155
10435C29155k0691o223j08685n7073Q8433R8220j48493q6846J3719P5949R4578
$$ 329155 308464 302241 193556 136483 224916 323136 174643 87797 101516 177465 272043
10424B72043j90574L5235M8555j1879j3781K0557m1721j47603J880J47008K4990
$$ 272043 81469 116704 165259 153380 139599 160156 118435 -29168 -27288 119720 144710
10413A44710j7896k5478Q3514l8104j45879J76366j866L2706r1373r2665L6877
$$ 144710 126814 101336 184850 146746 867 177233 175367 208073 116700 24035 60912
10402F0912K7634L0653J24194j00063q4044m6891o1841K26403K37448k47709M1511
$$ 60912 88546 119199 243393 143330 59286 12395 -49446 176957 414405 166696 208207
10391B08207J01148k7430J702j54755J2924K7137K0751j648N4170l1695N0294
$$ 208207 309355 281925 283627 128872 141796 168933 189684 188036 242206 210511 260805
10380B60805J47873j42155q0516j43473N129P891J67074O6350k97447K47077J82267
$$ 260805 408678 266523 186007 42534 47663 55554 222628 288978 -8469 238608 420875
10369D20875j10149n0075j46007r5400J83672m5914J3510j43520J83163l17459
$$ 420875 310726 260651 114644 19244 202916 157002 170512 26992 210155 -107304
10359a07304K21384J57690o7304J3214j65964Q9085p055k3121m4310J61264L4140
$$ -107304 114080 271770 204466 217680 51716 140801 133746 110625 66315 227579 261719
10348B61719j05099l1699J43917r2736o5377N9581M9380j22574K6753J12522P6005
$$ 261719 156620 124921 268838 176102 110725 170306 219686 97112 123865 236387 312392
10337C12392N792k31469Q2859J49454q3647N0905j54876k3048j44226O5082K36750
$$ 312392 318184 86715 169574 319028 235381 286286 131410 108362 -35864 29218 265968
10326B65968j41514K927k17206J95499J13954j31116j55229m0948k656o7583K57151
$$ 265968 124454 127381 -89825 105674 219628 88512 -66717 -107665 -110321 -177904 79247
10315G9247Q6063J84530L4142p6062j96515j44106J0295J49042o4465K7259m8358
$$ 79247 165310 349840 383982 307920 111405 -32701 -22406 126636 62171 89430 41072
10304D1072n2949K1376K7818l6896K69564m0313R839m6701J449o2844j43230J97241
$$ 41072 -11877 9499 37317 421 269985 229672 239511 192810 194259 131415 -11815 185426
10292A85426l5916o1028O2728o5704p0469J44163M8720q6089j06452N5786K08031
$$ 185426 149510 88482 151210 85506 15037 159200 207920 121831 15379 71165 279196
10281B79196P3873p598j41822K4745K12806j81462j65685Q7622J38862k15991
$$ 279196 353069 345471 203649 228394 441200 259738 94053 181675 320537 104546
10271A04546m452O3940K52999j58208k0073J0250k42376J73177r98j48695k1534
$$ 104546 100094 164034 417033 258825 238752 249002 6626 179803 178805 30110 8576
10260H576J19271l7765N437J02435M802R407j04120P5800q7251j30921J00004
$$ 8576 127847 90082 95519 197954 202756 212163 108043 183843 96592 -34329 65675
10249F5675p33R2088K8621K7857J19652P9292K7161k10718k2357p4921J42856
$$ 65675 64942 157030 185651 213508 333160 412452 439613 228895 206538 131617 274473
10238B74473L38978p5835m8135m8221j06645m7171N109J06831m3280k08505K15972
$$ 274473 613451 537616 489481 441260 334615 287444 292553 399384 356104 147599 363571
10227C63571j33839O9699P3089M9408J58463k07950P2884K62301p9458k28632
$$ 363571 229732 299431 372520 421928 580391 372441 445325 707626 628168 399536
10217C99536J37539o423K5466j86132q0132k3764P5509m4702J0111l3571n6725
$$ 399536 537075 530652 556118 369986 289854 266090 341599 296897 307008 273437 216712
10206B16712R3945n2773o1570J60825K13598o0263r4283k0219R1360m4270r368
$$ 216712 310657 257884 196314 357139 570737 510474 416191 395972 487332 443062 433694
10195D33694R5987k32619J06413j03844K3457R6850j70954k69582k9437K26330
$$ 433694 529681 297062 403475 299631 323088 419938 248984 -20598 -50035 176295
10185A76295k2978Q8893J12258j34751j15711J89852J0507m0555k3522K7939m664
$$ 176295 153317 242210 354468 219717 104006 293858 304365 263810 240288 268227 263563
10174B63563O1072m3271L15921P3065j81008k10102j22934Q4359n2711q1746K23187
$$ 263563 324635 281364 597285 670350 489342 279240 156306 240665 187954 106208 329395
10163C29395Q0571j933L2001p0677R1528j58906Q4616m4795j73222P6550l1906
$$ 329395 409966 408033 440034 369357 460885 301979 386595 341800 168578 245128 213222
10152B13222M4649q7650Q8780M7279L7404J04079l2193j03064o0941j0263J5113
$$ 213222 257871 170221 259001 306280 343684 447763 415570 312506 251565 241302 256415
10141B56415K93067O4644j61770r0474m2629j66511P0629O7124j60438K28624
$$ 256415 549482 614126 452356 361882 319253 152742 223371 290495 130057 358681
10131C58681j06322M8691R211k79452R0194J65741j3755k3696q1855J37251N7469
$$ 358681 252359 301050 310261 30809 121003 286744 272989 249293 167438 304689 362158
10120C62158J9246j04840j67221q3271J13939L14503k924q6847j33588K10724
$$ 362158 381404 276564 109343 26072 140011 454514 451590 364743 231155 441879
10110D41879Q4345j55356j7765K0696n2746j93479n9819J35485K20243Q6296o5743
$$ 441879 526224 370868 353103 373799 321053 127574 67755 203240 423483 509779 444036
10099D44036L2135k54656m2509L03543j29640Q377J12559l3218j51798N334J17730
$$ 444036 476171 221515 179006 482549 352909 361286 473845 440627 288829 294163 411893
10088D11893p9040j34776J07913J03609n8627r2243q7456J8317J45313J57560
$$ 411893 332853 198077 305990 409599 350972 258729 171273 189590 334903 492463
10078D92463J62346k69631j67743J98065j17177N7628M2160j0531q9397q2327
$$ 492463 654809 385178 217435 415500 298323 355951 398111 387580 298183 215856
10068B15856O6216J47941k5067j2955J13605K3123j4547j03610J462R3313P4248
$$ 215856 282072 430013 404946 391991 505596 528719 514172 410562 412024 505337 579585
10057E79585k9264r5486N8017N04p4916j4706J87431r0535K7712j85382n4931
$$ 579585 550321 454835 512852 513356 438440 423734 611165 520630 548342 362960 308029
10046C08029N7452j09524p321L2497l2764J44074L4507M323J376O496J05593j34423
$$ 308029 365481 255957 248636 281133 248369 392443 426950 431273 432649 439145 544738 410315
10034D10315j80846M6774p6968J29495J14879k3584j30775j5380m5264J60821
$$ 410315 229469 276243 199275 328770 443649 420065 289290 273910 228646 389467
10024C89467P8493j30104m0245r621J6314J89139J19489j87411k17304p4781O7311
$$ 389467 467960 337856 297611 287990 304304 493443 612932 425521 208217 133436 200747
10013B00747P2742J79493j06188J45956p1508j7341M7498J05165j61012k61454
$$ 200747 273489 452982 346794 492750 421242 403901 451399 556564 395552 134098
10003A34098M7940K3043k5165J71167K32695J3189j80016j2938K9541k8310j6116
$$ 134098 182038 205081 179916 351083 583778 596967 416951 404013 433554 405244 389128
9992C89128N8399J00723q5501M7051K1674N2302J63251o9027o1148q179N4046
$$ 389128 447527 548250 462749 509800 531474 583776 747027 678000 616852 608673 662719
9981F62719J7685j38076n8327j6775j07109K51711j49302J66244P6343k7817j01176
$$ 662719 680404 542328 484001 467226 360117 611828 462526 628770 705113 677296 576120
9970E76120L6298J69051j57470q2656j28977r9077J59J36162K63892Q510j16306
$$ 576120 612418 781469 623999 541343 412366 313289 313448 449610 713502 722012 605706
9959F05706j46781J62837k8224M816K5888o526j78531K26191J33359n7483j37531
$$ 605706 458925 621762 593538 598354 624242 617716 439185 665376 798735 741252 603721
9948F03721j80962O719K0006n7425k2038K0915R7710J27749j51332K00485n9629
$$ 603721 422759 429478 449484 392059 370021 390936 488646 616395 465063 665548 605919
9937F05919k9486p6886P3006J01525R9724j67950P9898j07224j1811p415J77821
$$ 605919 576433 499547 572553 674078 773802 605852 685750 578526 566715 559300 737121
9926G37121L8147j24788j12512j19084k6758q3985O5912K35779k8603j71557J50164
$$ 737121 775268 650480 537968 418884 392126 308141 374053 609832 581229 409672 559836
9915E59836R7312m8018J0342k31729J59541k04737q4529L07009l2207l8754K10469
$$ 559836 657148 609130 619472 387743 547284 342547 258018 565027 532820 494066 704535
9904G04535k55001p656K19126m9464n4719k6214O474N8243L9697Q7730j59021
$$ 704535 449534 441878 661004 611540 556821 530607 537081 595324 635021 722751 563730
9893E63730J79066l6404k2180J65731j91211j0118k47656K1700K78635l4141r1084
$$ 563730 742796 706392 684212 849943 658732 648614 400958 422658 701293 667152 576068
9882E76068K3147q4316P7926j76381J17632K1265Q3087r1110l1876Q7362K26906
$$ 576068 599215 514899 592825 416444 534076 555341 638428 547318 515442 602804 829710
9871H29710M4919j21304j16345j17254J4938J9136m4315L9880K10052N3845l6617
$$ 829710 874629 753325 636980 519726 534664 553800 509485 549365 759417 813262 776645
9860G76645Q5496j17579q9245q6069N7436M4814J29272J04093j32539M0039o7198
$$ 776645 862141 744562 655317 569248 626684 671498 800770 904863 772324 812363 745165
9849G45165p7368r4895J0394m9815n2933O7076J945K70987l0966K8907J82080
$$ 745165 667797 572902 583296 533481 480548 547624 549569 820556 789590 818497 1000577
9838A000577j05065j32632j57514K3630J25249N4630o4523o131M6315p407M6090
$$ 1000577 895512 762880 605366 628996 754245 808875 744352 738221 784536 777129 823219
9827H23219P1276l45j63312M9817J4994Q3571R5425L11m9433n9966r0466Q3136
$$ 823219 894495 894150 730838 780655 795649 879220 974645 974956 925523 865557 775091 858227
9815H58227p7060j4344n929J72488L5124j2912R7837j45752Q9458l4209O8695
$$ 858227 781167 766823 760894 933382 968506 955594 1053431 907679 997137 962928 1031623
9804A031623K37459J02678j04222L680K6100P9102n2176j07486o0847K03801J72556
$$ 1031623 1269082 1371760 1267538 1271218 1297318 1376420 1324244 1216758 1155911 1359712 1532268
9793A532268p3031J5134J06543j94269j6787J74133j4939R748J815m5704O682
$$ 1532268 1459237 1474371 1580914 1386645 1369858 1543991 1529052 1538800 1540615 1494911 1501593
9782A501593q6246M1591j73074j14726J58774K8069N4820j66400R2735J64829
$$ 1501593 1415347 1456938 1283864 1169138 1327912 1355981 1410801 1244401 1337136 1501965
9772A501965q9225J54293p7667l07189K6075M8145J72842k3510j3425K055o6960
$$ 1501965 1412740 1567033 1489366 1182177 1208252 1256397 1429239 1405729 1392304 1394359 1327399
9761A327399N9206J04096j53896j93696J26518K29369o7995k31316M06705j65120
$$ 1327399 1386605 1490701 1336805 1143109 1269627 1498996 1431001 1199685 1606390 1441270
9751A441270J26532k1921j39023K91517k61405k27685J68972J39121Q2886j64026
$$ 1441270 1567802 1545881 1406858 1698375 1436970 1209285 1378257 1517378 1600264 1436238
9741A436238o7445J14580J74631K64017r2063j26991j45701J29251n6065p9431
$$ 1436238 1368793 1483373 1658004 1922021 1829958 1702967 1557266 1686517 1630452 1551021
9731A551021L34901p9402N3209j10760j46922J10530K66827j11446n8252j63361
$$ 1551021 1885922 1806520 1859729 1748969 1602047 1712577 1979404 1867958 1809706 1646345
9721A646345J696J79759j3109j07260l1306J36510J03629r192l3539J37816n771
$$ 1646345 1648041 1827800 1814691 1707431 1676125 1812635 1916264 1907072 1873533 2011349 2005578
9710B005578j44412k99224J1636L23757J05733j37271K8081J26909J29297N3725
$$ 2005578 1861166 1561942 1573578 1897335 2003068 1865797 1893878 2020787 2150084 2203809
9700B203809M8493m9736m6095j34073l1997O1531J00076j80447k2611L03224O6025
$$ 2203809 2252302 2202566 2156471 2022398 1990401 2051932 2152008 1971561 1948950 2252174 2318199
9689B318199l4010r4440K5912j30694l1561J00301n5657L56693J32132n0935l0486
$$ 2318199 2284189 2189749 2215661 2084967 2053406 2153707 2098050 2454743 2586875 2535940 2505454
9678B505454n8003Q6694J5328l8414K41873n7198R9867J29697j5539J22224O3776
$$ 2505454 2447451 2534145 2549473 2511059 2752932 2695734 2795601 2925298 2909759 3031983 3095759
9667C095759j30681N4302J05494l922O785K6551J20591K71808J24224l9971O9950
$$ 3095759 2965078 3019380 3124874 3120952 3127737 3154288 3274879 3546687 3670911 3630940 3700890
9656C700890P5093j2113N9901K1883J87467K96396m277j26945J64540J03468J15549
$$ 3700890 3775983 3763870 3823771 3845654 4033121 4329517 4325240 4198295 4362835 4466303 4581852
9645D581852l5868J24765K07377J01874K6907J07507j9134K07830K29455L01241
$$ 4581852 4545984 4670749 4878126 4980000 5006907 5114414 5095280 5303110 5532565 5833806
9635E833806P7702J40166K44101J19707M2910K73623M87364K07251J45734L71873
$$ 5833806 5911508 6051674 6295775 6415482 6458392 6732015 7219379 7426630 7572364 7944237
9625G944237M24071L44801L33174N44812M22223N29310N51923O15101O03535O98415
$$ 7944237 8368308 8713109 9046283 9591095 10013318 10542628 11094551 11709652 12313187 13011602
9615A3011602J098850R15107J094071J205209J364092J286556J596400J198232
$$ 13011602 14110452 15025559 16119630 17324839 18688931 19975487 21571887 22770119
9607B2770119J284157J089067P59838N92975N70397J36150L36009N9421J25220
$$ 22770119 24054276 25143343 25903181 26496156 27066553 27202703 27538712 27598133 27723353
9598B7723353q7538j00443k59102p02468r45667r97803j162706j620987j487502
$$ 27723353 27635815 27535372 27276270 26573802 25628135 24630332 23467626 21846639 20359137
9589B0359137j572267j565538j018819j093577j081764r55066n98441o76847n11876
$$ 20359137 18786870 17221332 16202513 15108936 14027172 13072106 12473665 11796818 11284942
9580A1284942o29360m33643l23694o07046l88575n1151k67148k84311l03679l21663
$$ 11284942 10655582 10221939 9898245 9291199 8902624 8851473 8584325 8300014 7996335 7674672
9570G674672j95048j60557p397k06311j08853j04982j70562q6863J10428P3119
$$ 7674672 7479624 7319067 7311670 7105359 6996506 6891524 6720962 6634099 6744527 6817646
9560F817646l23235k1178L02609j38700P4777K28098R7443o7846N400R1896K15647
$$ 6817646 6494411 6473233 6775842 6637142 6711919 6940017 7037460 6969614 6975014 7066910 7282557
9549G282557J35562R4444J34881J55704J27838N02221N30812L99375O74290N72636
$$ 7282557 7418119 7512563 7647444 7803148 7930986 8433207 8964019 9363394 10037684 10610320
9539A0610320L77403O71753P67252P63216N73861R07310M43884O13848K94257
$$ 10610320 10987723 11659476 12426728 13189944 13763805 14671115 15114999 15728847 16023104
9530A6023104K63631K60400k6977N3292q4765q8032k90871k97977m94121n28552
$$ 16023104 16286735 16547135 16520158 16573450 16488685 16400653 16109782 15811805 15317684 14789132
9520A4789132p49952q02744q01149p77911p45100o51241m70860l54431k97112
$$ 14789132 14039180 13236436 12435287 11657376 10912276 10261035 9790175 9435744 9138632
9511I138632k25014j32785n9102j82445k19845k25630r0746J72763J15767q7717
$$ 9138632 8913618 8780833 8721731 8539286 8319441 8093811 8003065 8175828 8291595 8203878
9501H203878m4360J12878L6709J09279N4903L0967j06058J07481J52185K08046
$$ 8203878 8159518 8272396 8309105 8418384 8473287 8504254 8398196 8505677 8657862 8865908
9491H865908L83491o4008N8230N4105O7646L53674J84040J30459P6697M40831
$$ 8865908 9249399 9185391 9243621 9297726 9365372 9719046 9903086 10033545 10110242 10551073
9481A0551073J87737J21066R3120J19116J84972J26142J67580K46655L87126K68296
$$ 10551073 10738810 10859876 10952996 11072112 11257084 11383226 11550806 11797461 12184587 12452883
9471A2452883L53852L57059J03326L30239L13049K07699L85150K64352L54654
$$ 12452883 12806735 13163794 13267120 13597359 13910408 14118107 14503257 14767609 15122263
9462A5122263L83914J82885J30890M18932L37629N93006M56444M95685O11751
$$ 15122263 15506177 15689062 15819952 16238884 16576513 17169519 17625963 18121648 18733399
9453A8733399K46796N79800P35823P96987N71208M13235P88113P74018P95494
$$ 18733399 18980195 19559995 20295818 21092805 21664013 22077248 22865361 23639379 24434873
9444B4434873R32728J080008J123733J296764J273394J357664J386162J574866
$$ 24434873 25367601 26447609 27571342 28868106 30141500 31499164 32885326 34460192
9436C4460192K048087K502706K770021L214947L652193L949993M354521M126361
$$ 34460192 36508279 39010985 41781006 44995953 48648146 52598139 56952660 61079021
9428F1079021L619629L417718L707557M128440N272962N829837M544126K976118
$$ 61079021 64698650 68116368 71823925 75952365 81225327 87055164 91599290 94575408
9420I4575408R40665j250264k162036j459493m74547N79522J021510l28896j735344
$$ 94575408 95516073 94265809 92103773 90644280 90169733 90749255 91770765 91441869 89706525
9411H9706525k947250l676906l411692k318499r38690J32830J247440K525193
$$ 89706525 86759275 83082369 79670677 77352178 76413488 76546318 77793758 80318951
9403H0318951L501798L818333L082606Q89189j145378k580622k712451j665467
$$ 80318951 83820749 87639082 90721688 91610877 90465499 87884877 85172426 83506959
9395H3506959q693J051697J796590O23952k401028m149042n684370o011286n151657
$$ 83506959 83498266 84549963 86346553 86970505 84569477 80420435 74736065 68724779 63573122
9386F3573122l815950k840799j850495j192191o98245l64153K19965O81883R22868
$$ 63573122 59757172 56916373 55065878 53873687 53175442 52811289 53031254 53713137 54636005
9377E4636005J550035K102588K368309K555684L093562L364704M008408M246455
$$ 54636005 56186040 58288628 60656937 63212621 66306183 69670887 73679295 77925750
9369G7925750N176103N539880O642059P313178O841243M329897L51885k937759
$$ 77925750 83101853 88641733 95283792 102596970 109438213 113768110 114119995 111182236
9361A11182236n759596n212710k740090l78537J754746K260908j052860m719409
$$ 111182236 105422640 100209930 97469840 97091303 98846049 101106957 100054097 95334688
9353I5334688p688101r998141r624133q295019o535323m743012l776705l309607
$$ 95334688 87646587 77648446 68024313 59729294 53193971 48450959 44674254 41364647
9345D1364647k691982k550850j970462j559076j329229j185856j084536q06122
$$ 41364647 38672665 36121815 34151353 32592277 31263048 30077192 28992656 28186534
9337B8186534p10776n93575q81939q20726o41821q55642o78194n78410o88099
$$ 28186534 27475758 26882183 26000244 25179518 24537697 23682055 23003861 22425451 21737352
9328B1737352m35873k4534k91543m37678l89053o85067m13080o24989n70733r2375
$$ 21737352 21301479 21276945 20985402 20547724 20158671 19473604 19060524 18435535 17864802 17772427
9318A7772427k00285P3140K47329l8161M42984L20449L64979j30542l61080J79926
$$ 17772427 17572142 17645282 17892611 17854450 18297434 18617883 18982862 18852320 18491240 18671166
9308A8671166K61353M03358L11639L24896N89330J56818n16315o82361k96673
$$ 18671166 18932519 19335877 19647516 19972412 20561742 20718560 20202245 19519884 19223211
9299A9223211l89712m5457M0588p7982k47658n32032o93616q43959j84883j94795
$$ 19223211 18833499 18788042 18828630 18750648 18502990 17970958 17277342 16433383 16248500 16053705
9289A6053705k96010l20618k64972o17803m04470l12432k97816q2326J70247j20375
$$ 16053705 15757695 15437077 15172105 14554302 14149832 13837400 13539584 13457258 13627505 13507130
9279A3507130j93570J72090J1736J67391L54748K63044L13250j22147l34734j01367
$$ 13507130 13313560 13485650 13497386 13664777 14019525 14282569 14595819 14473672 14138938 14037571
9269A4037571K34335K73385k03520M01897Q6456j52862L8227o2150j9819q9939
$$ 14037571 14271906 14545291 14341771 14743668 14830124 14677262 14715489 14653339 14633520 14543581
9259A4543581J35165J90801L6138J02309J2009K69151L61866M50824N57290L27333
$$ 14543581 14678746 14869547 14905685 15007994 15020003 15289154 15651020 16101844 16659134 16986467
9249A6986467N25959M65372O19172O53933O19649Q87945R72152R47539J372470
$$ 16986467 17512426 17977798 18596970 19250903 19870552 20758497 21730649 22678188 24050658
9240B4050658J472113J448559J726685K130066K616094K565103K755791K911091
$$ 24050658 25522771 26971330 28698015 30828081 33444175 36009278 38765069 41676160
9232D1676160K836039L384687M168411M504478M205621L849787L025329J104653
$$ 41676160 44512199 47896886 52065297 56569775 60775396 64625183 67650512 68755165
9224F8755165j540416l049824k555842k123334j474065j231744j053613r44448
$$ 68755165 67214749 64164925 61609083 59485749 58011684 56779940 55726327 54781879
9216E4781879r46682j211468j100221j267011j676127j590166j971755k166540
$$ 54781879 53835197 52623729 51523508 50256497 48580370 46990204 45018449 42851909
9208D2851909k122920k291333k187765j707854j589301j284362o05795m88817
$$ 42851909 40728989 38437656 36249891 34542037 32952736 31668374 31062579 30573762
9200C0573762j67230m0921O16517P92747Q57936J391627J773008J864385K384581
$$ 30573762 30406532 30365611 30982128 31774875 32632811 34024438 35797446 37661831 40046412
9191D0046412K605019J912887J472388j93134j465289k364512l454244l701852
$$ 40046412 42651431 44564318 46036706 45843572 44378283 42013771 38559527 34857675
9183C4857675l307237l032648k693149k426132j849127j426373j235217j097669
$$ 34857675 31550438 28517790 25824641 23398509 21549382 20123009 18887792 17790123
9175A7790123j003584q66646p70012o63530m82033o00720m54022m47546m93431
$$ 17790123 16786539 15919893 15149881 14486351 14004318 13403598 12949576 12502030 12008599
9166A2008599l91819k82850j49173l24799k45349n18529m16304j97708n26233
$$ 12008599 11616780 11333930 11184757 10859958 10614609 10096080 9679776 9482068 8955835
9157H955835l06542j77564l20361l01596m4657k36999m0704j97279k22408M4802
$$ 8955835 8649293 8471729 8151368 7849772 7805115 7568116 7527412 7330133 7107725 7152527
9147G152527M8177r8238j55440j5414j61203k2223j15011L6129R5210m0117L5437
$$ 7152527 7200704 7102466 6947026 6931612 6770409 6748186 6633175 6669304 6764514 6724397 6759834
9136F759834R3469R7803l7747L03615o0712P5394K45229K89261K63063J75777
$$ 6759834 6853303 6951106 6913359 7216974 7156262 7231656 7476885 7766146 8029209 8204986
9126H204986N14756L13957K56579L19916K50841k00848k32422K86636J04553j98591
$$ 8204986 8719742 9033699 9290278 9610194 9861035 9660187 9427765 9714401 9818954 9620363
9116I620363L06799M55679M73105q9058l44183k93836j66211j47019l885M0139
$$ 9620363 9927162 10382841 10855946 10766888 10422705 10128869 9962658 9815639 9811754 9851893
9106I851893L35713M11440L21139L15059m73254k46482l37001J11588J08226k15731
$$ 9851893 10187606 10599046 10920185 11235244 10761990 10515508 10178507 10290095 10398321 10182590
9096A0182590o8269o6648k47252k88196k75153j40986j05877L5410N7373K11757
$$ 10182590 10114321 10047673 9800421 9512225 9237072 9096086 8990209 9025619 9082992 9294749
9086I294749L47301L82526M98023M56546M09919K56210q5445j188P3335j78378
$$ 9294749 9642050 10024576 10522599 10979145 11389064 11645274 11559829 11558641 11631976 11453598
9076A1453598J39902j13609N1972P6237n24345n87521m31839l19845k42991m73149
$$ 11453598 11593500 11479891 11531863 11608100 11083755 10496234 10064395 9744550 9501559 9028410
9066I028410n29829m48753n20491k43526o1087n8054J4371j17356k12243l4675
$$ 9028410 8498581 8049828 7529337 7285811 7224724 7166670 7181041 7063685 6851442 6816767
9056F816767n33j21279K63727l20078k4966k022j10576N3455K7272L9496J82351
$$ 6816767 6816234 6694955 6958682 6638604 6613638 6611616 6501040 6554495 6581767 6621263 6803614
9045F803614P151K73564K76455m3252K39038j9557n3636j49073K6520j20443J12327
$$ 6803614 6810765 7084329 7360784 7317532 7556570 7537013 7483377 7334304 7360824 7240381 7352708
9034G352708J09651Q1669Q2811j65476k88701r4438r2901j46348p1996j60449
$$ 7352708 7462359 7544028 7626839 7461363 7172662 7078224 6985323 6838975 6766979 6606530
9024F606530Q9991q3117K49952J80035k5215j36072M9517l2501k23059K91065
$$ 6606530 6696521 6613404 6863356 7043391 7018176 6882104 6931621 6899120 6676061 6967126
9014F967126K36157L2435P5339J0794K6382P5213j17260J33057J03140K25137
$$ 6967126 7203283 7235718 7311057 7321851 7348233 7423446 7306186 7439243 7542383 7767520
9004G767520n118J97863R5853k41426L14143K18724j05802Q4004K57549J69916
$$ 7767520 7762402 7960265 8056118 7814692 8128835 8347559 8241757 8325761 8583310 8753226
8994H753226J79362K02809J20484P7026J68331J6879M24183J58380j3133R0525
$$ 8753226 8932588 9135397 9255881 9332907 9501238 9518117 9942300 10100680 10087547 10178072
8984A0178072K79665M71863M37250J69038J7159K16992M46308R4643K09299L40031
$$ 10178072 10457737 10929600 11366850 11535888 11553047 11770039 12216347 12310990 12520289 12860320
8974A2860320L81098J82445J86999K67329L24465L29642M03046M01109L23300
$$ 12860320 13241418 13423863 13610862 13878191 14202656 14532298 14935344 15336453 15659753
8965A5659753J42636N42721N15778J78766O46470N18541O52749O00777N95673
$$ 15659753 15802389 16345110 16860888 17039654 17686124 18204665 18857414 19458191 20053864
8956B0053864P31802R08807J005845J163823J266059J478332J669538J799218
$$ 20053864 20785666 21694473 22700318 23864141 25130200 26608532 28278070 30077288
8948C0077288K070569J698793R97833Q75949J530958K220992K332138K816304
$$ 30077288 32147857 33846650 34844483 35720432 37251390 39472382 41804520 44620824
8940D4620824L248909K638647O26118j816434j955055r21414k70820M25352R03697
$$ 44620824 47869733 50508380 51134498 49318064 47363009 46441595 46170775 46596127 47499824
8931D7499824J440246P03220p70472k025116j732455j221435p31074o57446o76103
$$ 47499824 48940070 49643290 48872818 46847702 45115247 43893812 43162738 42505292 41829189
8922D1829189o2825L80160P66771O33416Q00046J457770J390605J435389J780328
$$ 41829189 41766364 42146524 42913295 43546711 44346757 45804527 47195132 48630521 50410849
8913E0410849J990263K679712L642154M049715M644988M827135M047042J925263
$$ 50410849 52401112 55080824 58722978 62772693 67417681 72244816 76291858 78217121
8905G8217121M73698Q48492K182225L542057M812613N125069L604745l93902l464640
$$ 78217121 78690819 79539311 81721536 85263593 90076206 95201275 98806020 98412118 94947478
8896I4947478m025314l242596j496346r3425J708455K034518P29601o62227r51594
$$ 94947478 90922164 87679568 86183222 86089797 87798252 89832770 90562371 89900144 88948550
8887H8948550K69157J062280j55494l320988m231541k910682j398745L6930J301163
$$ 88948550 89217707 90279987 90124493 86803505 82571964 79661282 78262537 78299467 79600630
8878G9600630K238655K080396o1822l116244l886310k416883p42258p3393J089980
$$ 79600630 81839285 83919681 83857859 80741615 76855305 74438422 73696164 73622771 74712751
8869G4712751J925489K213204J620598n50327j695821j810183j049589K33955
$$ 74712751 76638240 78851444 80472042 79921715 78225894 76415711 75366122 75600077
8861G5600077J228201J280679J687450R31647j514144k805518k412322j358094
$$ 75600077 76828278 78108957 79796407 80728054 79213910 76408392 73996070 72637976
8853G2637976j5919J040661J847639L228908M434563N048140O090078N126623
$$ 72637976 72622057 73662718 75510357 78739265 83173828 88221968 94312046 99438669
8845I9438669J186520k018854k291659q70858L31183R40684J334845J631195L30506
$$ 99438669 100625189 98606335 96314676 95443818 95775001 96715685 98050530 99681725 100012231
8836A00012231l704834o285773o202644m852600l603768l589033l080682l152776
$$ 100012231 96307397 90021624 83818980 78966380 75362612 71773579 68692897 65540121
8828F5540121l137796k726339k398150k187172j797613j818322j731943j378526
$$ 65540121 62402325 59675986 57277836 55090664 53293051 51474729 49742786 48364260
8820D8364260j225714j280626j366024j006417p85010o94017m70635n50910k32245
$$ 48364260 47138546 45857920 44491896 43485479 42700469 42006452 41535817 40984907 40752662
8811D0752662J16230L91273M53628M97393P25955J134745R85639P80511Q62241
$$ 40752662 40868892 41260165 41713793 42211186 42937141 44071886 45057525 45838036 46700277
8802D6700277O47242q6445q5770l16270k98222R3049K20002N26701M93237K83697
$$ 46700277 47347519 47261074 47175304 46859034 46560812 46653861 46873863 47400564 47893801 48177498
8792D8177498l71424r72487n90959j102934j173191r29192l06115J36759K64386
$$ 48177498 47806074 46833587 46242628 45139694 43966503 43037311 42731196 42867955 43132341
8783D3132341L14122N53412P28582Q47050O41932N93123j07775q5327l02275j97106
$$ 43132341 43446463 43999875 44728457 45575507 46217439 46810562 46702787 46617460 46315185 46118079
8773D6118079k9235J73282N28213N75190M2673M91621L89793k6920L3784j17177
$$ 46118079 46088844 46262126 46790339 47365529 47408202 47899823 48289616 48262696 48296480 48179303
8763D8179303n5756j27140p4487J81770M76086O76951L33086O94310P75326J078046
$$ 48179303 48123547 47996407 47921920 48103690 48579776 49256727 49589813 50284123 51059449 52137495
8753E2137495Q57286J155047J512992J281503J633893J606165J886935K390784
$$ 52137495 52994781 54149828 55662820 56944323 58578216 60184381 62071316 64462100
8745F4462100K501543K936536L106511L350535L615517M007769M272572L911042
$$ 64462100 66963643 69900179 73006690 76357225 79972742 83980511 88253083 92164125
8737I2164125M104442M590502M863019N715987O538089P483691P360472N972854
$$ 92164125 96268567 100859069 105722088 111438075 117976164 125459855 132820327 138793181
8729A38793181M455483K644013J224612N76238J03016k12750L97332J155947L010795
$$ 138793181 143248664 145892677 147117289 147693527 147796543 147583793 147981125 149137072 152147867
8720A52147867N116235P092024R590185J3206553J6436710K1064153K7733759
$$ 152147867 157264102 164356126 173946311 187152864 203589574 224653727 252387486
8713B52387486L5790135M2397765N0111881N6816761L8016719m2426411q3160406
$$ 252387486 288177621 330575386 380687267 437504028 475520747 433094336 349933930
8706C49933930o3822364m3588711l0940573k6133360j9902359j4549928j0241356
$$ 349933930 286111566 242522855 211582282 185448922 165546563 150996635 140755279
8699A40755279p570908n614476m525337j840775l18894J419619K517798M048309
$$ 140755279 133184371 127569895 123044558 121203783 120884889 122304508 124822306 128870615
8691A28870615M279984M231127M047942M021447L870639L630871N79048l587400
$$ 128870615 133150599 137381726 141429668 145451115 149321754 152952625 153531673 149944273
8683A49944273p443659j0335246j1814616j0492520q684962o993632n457288m289109
$$ 149944273 142500614 132165368 120350752 109858232 101173270 94179638 88722350 84433241
8675H4433241l121079j938402j359736m56300o8652N58134J221364J999748K599835
$$ 84433241 81312162 79373760 78014024 77557724 77489072 78047206 79268570 81268318 83868153
8666H3868153K724219J289610r19858l003889m570384n533814n090116m094871
$$ 83868153 86592372 87881982 86962124 83958235 79387851 73854037 68763921 64669050
8658F4669050l202547k209581j405209j572489k63938M26247Q08428J496376K769674
$$ 64669050 61466503 59256922 57851713 56279224 56015286 56441533 57249961 58746337 61516011
8649F1516011L268676L993688M500130L958467J577704j164142l193496n677709
$$ 61516011 64784687 68778375 73278505 77236972 78814676 77650534 74457038 68779329
8641F8779329o321757n424052m449145l191155k480340j672733j279649n54811
$$ 68779329 62457572 57033520 52584375 49393220 46912880 45240147 43960498 43405687
8633D3405687K463N15111Q49623J359172J707166J912965K300383J546454L41717
$$ 43405687 43408150 43923261 44772884 46132056 47839222 49752187 52052570 53599024 53940741
8624E3940741j573365k472861l813093m388749l588514l139012k519912k347886
$$ 53940741 52367376 49894515 46081422 41692673 38104159 34965147 32445235 30097349
8616C0097349k069465j436411j173135j014667o22050r63630p88960m87896n60107
$$ 30097349 28027884 26591473 25418338 24403671 23781621 22817991 22029031 21541135 20981028
8607B0981028m27520j5796k52636j71181j6757Q6024p1572R7112J56921K227j44632
$$ 20981028 20553508 20537712 20285076 20113895 20097138 20183162 20111590 20208702 20365623 20367850 20223218
8596B0223218J58727J16478K28162M51003N22044N09558O70993Q44110Q67926
$$ 20223218 20381945 20498423 20726585 21177588 21699632 22209190 22880183 23724293 24592219
8587B4592219J003100J287140J205574R53303J185909L67096m45123j131933j584895
$$ 24592219 25595319 26882459 28088033 29041336 30227245 30594341 30149218 29017285 27432390
8578B7432390j886147j987243j835071j547097j392710q53393j056261q27549
$$ 27432390 25546243 23559000 21723929 20176832 18784122 17930729 16874468 16046919
8570A6046919o70207n07138m15920j85704m06313l63732J76831L3938k42811l1742
$$ 16046919 15376712 14869574 14453654 14267950 13861637 13497905 13674736 13708674 13465863 13434121
8560A3434121q3629n7183J19558n2263o7001k24720J76977j3166J42209M40575
$$ 13434121 13350492 13293309 13412867 13360604 13293603 13068883 13245860 13232694 13374903 13815478
8550A3815478L84617O47978N71236N80578R28238J052427Q33809N05961J25538
$$ 13815478 14200095 14848073 15419309 15999887 16928125 17980552 18814361 19320322 19445860
8541A9445860j46278q24623j153421j214733j280445j056002q46322j008567p18198
$$ 19445860 19299582 18474959 17321538 16106805 14826360 13770358 12924036 11915469 11197271
8532A1197271m56195l36461m58159n23101n49691j87161k11435l49244k36122
$$ 11197271 10741076 10404615 9946456 9423355 8873664 8686503 8475068 8125824 7889702
8523G889702R5394l71182j38094n8157l57849j06029N5860k43271j83781k93910
$$ 7889702 7985096 7613914 7475820 7417663 7059814 6953785 7009645 6766374 6582593 6288683
8513F288683J19841j34934j36652k0687O7085n7830j40078l3699J38702R3093
$$ 6288683 6408524 6273590 6136938 6116251 6183336 6125506 5985428 5951729 6090431 6183524
8503F183524k24849j51387o5168l8288J1784K3955J15389r9514L5623J5492j06536
$$ 6183524 5958675 5807288 5742120 5703832 5715616 5739571 5854960 5755446 5791069 5806561 5700025
8492E700025K6177j6191l1554J4051p9676j30518j22249l9576k92042k52450O8299
$$ 5700025 5726202 5710011 5678457 5692508 5612832 5482314 5360065 5320489 5028447 4775997 4844296
8481D844296K817r1258n3976j3121j45561k47335p6707j6789n6403M3937j40447
$$ 4844296 4847113 4755855 4701879 4688758 4543197 4295862 4219155 4202366 4145963 4189900 4049453
8470D049453Q4590l3019L5416j39736n9494l5835k0757j244J20879j37068o3024
$$ 4049453 4134043 4101024 4136440 3996704 3937210 3901375 3880618 3879374 4000253 3863185 3800161
8459C800161K03657r1939M1388J69509j16301k01602j1048J08864l55316O4337
$$ 3800161 4003818 3911879 3953267 4122776 4006475 3804873 3793825 3902689 3547373 3611710
8449C611710N1913l7664q4622P0266k62669j5867M6766j25718j08945k06300o541
$$ 3611710 3663623 3625959 3541337 3611603 3348934 3333067 3379833 3254115 3145170 2938870 2932329
8438B932329K7103K50551m7490j8085r656j82807j96421L5373j29872J28699J94632
$$ 2932329 2959432 3209983 3162493 3144408 3134752 2951945 2755524 2790897 2661025 2789724 2984356
8427B984356j45675j19928J989J71561j48143N0685n7133m1064J31231q5146L5421
$$ 2984356 2838681 2718753 2720742 2892303 2744160 2794845 2737712 2696648 2827879 2742733 2778154
8416B778154N7438j80657J9720O9598J44485k13548J64884r6785j11198L3296
$$ 2778154 2835592 2654935 2674655 2744253 2888738 2675190 2840074 2743289 2632091 2665387
8406B665387r3362k02551j7404K7809J13538J10259m4528J1148j4822m9904J33843
$$ 2665387 2572025 2369474 2352070 2379879 2493417 2603676 2559148 2570296 2555474 2505570 2639413
8395B639413m8667q4787j29547j7596J5857m3744o0767J26914j43946j47497k7767
$$ 2639413 2590746 2505959 2376412 2358816 2374673 2330929 2270162 2397076 2253130 2105633 2077866
8384B077866J13391o1884j09616J27615n2889O9337r3780J59701J5141L8830j39836
$$ 2077866 2191257 2129373 2019757 2147372 2094483 2163820 2070040 2229741 2244882 2283712 2143876
8373B143876K9055p6043j19238L9353n0276k9823K38808K08766m3585j3219k29030
$$ 2143876 2172931 2096888 1977650 2017003 1966727 1936904 2175712 2384478 2340893 2327674 2098644
8362B098644r8930K6709J81305J03206j61485o2662M1893j34818o4884K47559
$$ 2098644 1999714 2026423 2207728 2310934 2149449 2086787 2128680 1993862 1928978 2176537
8352B176537j66905m5779j12093r1223J225J14528j55734r9411p1902R9693j05923
$$ 2176537 2009632 1963853 1851760 1760537 1761762 1876290 1720556 1621145 1549243 1648936 1543013
8341A543013P4242M4158N5047l2598L4606j8573K2823j33100k34022j4168J08774
$$ 1543013 1617255 1661413 1716460 1683862 1718468 1699895 1722718 1589618 1355596 1341428 1450202
8330A450202K17738J5973k34181o3990L27393k5686J9926L0229J71656m8653k03825
$$ 1450202 1667940 1683913 1449732 1385742 1713135 1687449 1707375 1737604 1909260 1860607 1656782
8319A656782R2120J23037L9871k3573O9564j35922j9682q1640J4100l7176n8642
$$ 1656782 1748902 1871939 1911810 1888237 1957801 1821879 1802197 1720557 1734657 1697481 1638839
8308A638839j31297k8729n2305q2692j9475j71304K4109M27634j7721k27548J8962
$$ 1638839 1507542 1478813 1426508 1343816 1324341 1153037 1177146 1604780 1587059 1359511 1378473
8297A378473m4760M1094m6702J11578K61737l8041j58971J63459j62156L8482
$$ 1378473 1333713 1374807 1328105 1439683 1701420 1663379 1504408 1667867 1505711 1544193
8287A544193j13403m696J5974j46202J98174J33913J5738j8018R9906n0839k31789
$$ 1544193 1430790 1426094 1442068 1295866 1494040 1627953 1643691 1625673 1725579 1674740 1442951
8276A442951j04340J33785J20889l5045q4043r6870K3922R8784l19509l1978K43423
$$ 1442951 1338611 1472396 1593285 1558240 1474197 1377327 1401249 1500033 1180524 1148546 1391969
8265A391969l876l0662j27261K9300M35043j10654O0789L2144j77827p8005P0619
$$ 1391969 1388093 1357431 1230170 1259470 1694513 1583859 1644648 1676792 1498965 1420960 1491579
8254A491579j53798K1963J21135j67048J03528J73697k4580j33482R9942O951
$$ 1491579 1337781 1359744 1480879 1313831 1417359 1591056 1566476 1432994 1532936 1539887
8244A539887J34775j88066K25964j03271J00935R8144K04634K27594j563K88746
$$ 1539887 1674662 1486596 1712560 1609289 1710224 1808368 2013002 2240596 2239033 2527779
8234B527779K38431J66582L2621L3424l52344l02842r2098j47926j73510j26051
$$ 2527779 2766210 2932792 2965413 2998837 2646493 2343651 2251553 2103627 1930117 1804066
8224A804066j61026j15259q8443k5523r8612q2967N864r1340l4809L0299J0511
$$ 1804066 1643040 1527781 1439338 1413815 1315203 1232236 1238100 1146760 1111951 1142250 1152761
8213A152761r3314P3182m0594K30149q7251l11071J37531P9656l0918r9178o811
$$ 1152761 1059447 1132629 1092035 1322184 1234933 923862 1061393 1141049 1110131 1010953 1004142
8202A004142J35487k41502j51078K29622Q878m7509N3265k28114K28912K08303
$$ 1004142 1139629 898127 747049 976671 985549 938040 991305 763191 992103 1200406
8192A200406N97317l70144n63725J8341J72858P7613o3630M8788l21868J27045
$$ 1200406 1797723 1427579 863854 882195 1055053 1132666 1069036 1117824 795956 923001
8182I23001J65152R4684j84458M3912j89141j4086J2671M3658o5725J72409j2758
$$ 923001 1088153 1182837 998379 1042291 853150 839064 851735 895393 829668 1002077 989319
8171I89319k84063l4962J32857K69085j70677j13666j54040k0291N3501O9670
$$ 989319 705256 670294 803151 1072236 901559 787893 633853 613562 667063 736733
8161G36733J64203N8299r5286k6013J57999j03267j94623j7780k2505M2567o1556
$$ 736733 900936 959235 863949 837936 995935 892668 698045 680265 657760 700327 638771
8150F38771j27092j6379J12858Q3259j7788k6618o2560k5469N1194j28935J2466
$$ 638771 511679 495300 608158 691417 673629 647011 584451 558982 610176 481241 493707
8139D93707K74067J37194n1497q0882R1045m8846j66844M3958j1258K9336q276
$$ 493707 767774 904968 853471 772589 863634 814788 647944 691902 680644 709980 701704
8128G01704K3020r6993j56396J04461K42273m110j68507L1889j37341J1960l4167
$$ 701704 724724 627731 471335 575796 818069 813959 645452 677341 540000 551960 517793
8117E17793J28718j01133q063Q5991J10826k66215n8453K47304K27548L4817j39498
$$ 517793 646511 545378 537315 623306 734132 467917 409464 656768 884316 919133 779635
8106G79635k39275k2362r7912k01515j1767j11291K27645M9669J86688K5263m7280
$$ 779635 540360 517998 420086 218571 206804 95513 323158 372827 559515 584778 537498
8095E37498q2924o4829n8635J34246M0561j1598K921l8456P6158m4013P7930P991
$$ 537498 454574 389745 331110 465356 505917 494319 497240 458784 534942 490929 568859 576850
8083E76850k34403K2690Q7723J19905k5673j95926J2141K07414o3612j3744k39556
$$ 576850 342447 365137 452860 572765 547092 351166 363307 570721 507109 493365 253809
8072B53809l8818J28146m3420K16248p6193Q5406j68984j53883Q9011M3458J11122
$$ 253809 214991 343137 299717 515965 439772 525178 356194 202311 291322 334780 445902
8061D45902O7680r2725r6438k6719J05201k20659j8273R3326J9204o868K35399
$$ 445902 513582 420857 324419 297700 402901 182242 163969 257295 276499 269631 505030
8050E05030n4965p1764J2458J8713R4271m0185p1018j21291l888R1628j25697
$$ 505030 450065 378301 390759 409472 503743 463558 392540 271249 267361 358989 233292
8039B33292j99791K3309K20529p7673O1833m7260Q614K06704O2361k61433k44294
$$ 233292 33501 56810 277339 199666 261499 214239 222853 429557 491918 230485 -13809
8028a3809P0865J59174k7094P2563P570k5654K80533k9098j91980O9320P3019
$$ -13809 57056 216230 189136 261699 269269 243615 524148 495050 303070 372390 445409
8017D45409j5583l00763o4285J17849r4478K22344j28423L13865r7256k17081
$$ 445409 429826 129063 64778 182627 88149 310493 182070 495935 398679 181598
8007A81598j73728J74871q2255J13476L32159k19314p8474Q6737J22507o8655
$$ 181598 7870 182741 100486 213962 546121 326807 248333 335070 457577 388922
7997C88922k96400J07385o6274J01532K8734l2419j70293l5910R1105J61482q1226
$$ 388922 92522 199907 133633 235165 263899 231480 61187 25277 116382 277864 196638
7986A96638m164r3649j2855R7469K2781J963Q8566j76023k17791J71546O8451
$$ 196638 192474 98825 85970 183439 206220 208183 296749 120726 -97065 74481 142932
7975A42932J11765m5797j7845K3399m7473j00700J83105r3234j28538q9307J17089
$$ 142932 254697 208900 191055 214454 166981 66281 249386 156152 27614 -61693 55396
7964E5396j4745M8938J02020O8779J91522j36488j62724j6762N6153M5161L0766
$$ 55396 40651 89589 191609 260388 451910 315422 152698 135936 192089 237250 268016
7953B68016J01694j55372j80827P8634J90917p2677L0741j31529J26061n6311
$$ 268016 369710 214338 33511 112145 303062 230385 261126 129597 255658 199347
7943A99347j25949j16676J43880M8759L5075L261k0010K1779k11117n8718J0973
$$ 199347 73398 -43278 100602 149361 184436 187697 167687 189466 -21651 -80369 -69396
7932f9396J51764K37978q7429k37906l9372K33003o1371L2730J00404n128j16873
$$ -69396 82368 320346 232917 -4989 -44361 188642 127271 160001 260405 255277 138404
7921A38404Q7078j62426N2146J05731m4005L675r87J10865r6889m13607o3891
$$ 138404 225482 63056 115202 220933 176928 180603 179616 290481 193592 -220015 -283906
7910b83906L60497l0547J49738o5133o2030J6606p3021Q6505R4899k52783N7174
$$ -283906 76591 46044 195782 130649 68619 85225 12204 98709 193608 -59175 -2001
7899b001j5632J1258j06902p742P4305L62105j85429l2268L8194p0137n2660J25123
$$ -2001 -17633 -6375 -113277 -121019 -46714 315391 129962 97694 135888 65751 13091 138214
7887A38214m4693K1051o2885j12299j13493J15190k5769N6179k9730k18915N7623
$$ 138214 93521 114572 51687 -60612 -174105 -58915 -84684 -28505 -58235 -277150 -219527
7876b19527P9383K10543r0547L3186Q2842Q6223k58686R8238Q3615O0322m1578
$$ -219527 -140144 70399 -20148 13038 95880 182103 -76583 21655 105270 165592 124014
7865A24014l5575j8353r390j70834M517l069l2627J09051j38744l2573J47693
$$ 124014 88439 70086 60696 -110138 -105621 -108690 -141317 -32266 -171010 -203583 -55890
7854e5890q8264j02535J2207Q4778Q6374K01624j42780j40708k37859J32474K14010
$$ -55890 -144154 -246689 -234482 -149704 -63330 138294 -4486 -145194 -383053 -250579 -36569
7843c6569q2309N8684j27297p1041J56165Q7137J3630J6932l8578j53281L9504
$$ -36569 -118878 -60194 -187491 -258532 -102367 -15230 -1600 15332 -23246 -176527 -137023
7832a37023M0462K70599r8336k96104K24171N2166K1862j79163J75038M9175l46027
$$ -137023 -96561 174038 75702 -220402 3769 55935 77797 -101366 73672 122847 -223180
7821b23180J26755K21363j34980m781J408J82547m8696k12567K7301N7580j72072
$$ -223180 -96425 124938 -10042 -14823 -13415 169132 120436 -92131 -64830 -7250 -179322
7810a79322N3095L4544J30692Q3819o2342k02080J02535K9787M74469k1280p19742
$$ -179322 -126227 -91683 39009 122828 60486 -141594 -39059 -9272 465197 443917 -275825
7799b75825M3378L04289K3270j05332R6891j95328J3999M3173O0563P459o3850
$$ -275825 -232447 71842 95112 -10220 86671 -108657 -94658 -51485 9078 16537 -47313
7788d7313j24016K3478k7180P3294L9743J16718j26399l5997O0352j78480N553
$$ -47313 -171329 -147851 -175031 -101737 -61994 54724 -71675 -107672 -47320 -225800 -220247
7777b20247m6856K5810j5064K35J96555J603M331M0607j61784l907j02788J71586
$$ -220247 -267103 -241293 -256357 -256122 -59567 -57964 -53633 -13026 -174810 -178717 -281505 -109919
7765a09919J92394k20760L8723k3879J41193j79843L9858r8964j61588K38325
$$ -109919 82475 -138285 -99562 -123441 17752 -162091 -122233 -221197 -382785 -144460
7755a44460K03270K7081Q9429p0014k45005k1449r5893J09358N6697J25424R7427
$$ -144460 58810 85891 175320 105306 -139699 -161148 -257041 -147683 -90986 34438 131865
7744A31865k28391j98314k5175J08215Q3811P1164k10970J17083K16403J19205
$$ 131865 -96526 -294840 -320015 -211800 -127989 -56825 -267795 -150712 65691 184896
7734A84896j18506p7415P7614k05087l2329K4923j21247k7978M4267O2284J22857
$$ 184896 66390 -11025 66589 -138498 -170827 -145904 -267151 -295129 -250862 -188578 -65721
7723f5721o0400j28772J97013J08281j94220P6762K3582J88719j38761j65995
$$ -65721 -126121 -254893 -57880 50401 -143819 -67057 -43475 145244 6483 -159512
7713a59512n1925K13470j7318L735j13553n4885l8829k5573O3088N6256R3174
$$ -159512 -211437 2033 -15285 -11550 -125103 -179988 -218817 -244390 -181302 -125046 -31872
7702c1872o0580q093k7856j22704J28840p1162n1651K0001p2976j8676n7785J60643
$$ -31872 -92452 -100545 -128401 -251105 -122265 -193427 -245078 -225077 -298053 -316729 -374514 -213871
7690b13871J99405l3838M7786j50447n3856J94845k13294m9059R7176J58925R1635
$$ -213871 -14466 -48304 -518 -150965 -204821 -9976 -223270 -272329 -175153 -16228 75407
7679G5407j88075r8135M76782J07121k28264j04477m5002J53049j08015l1342
$$ 75407 -112668 -210803 265979 373100 144836 40359 -4643 148406 40391 9049
7669I049J0383J29398n2677j51268O626j05897j4527R5026k07861P7892J06682
$$ 9049 19432 148830 96153 -55115 -48489 -154386 -168913 -73887 -281748 -203856 -97174
7658i7174j14928P2041m5997J1953m7785L4810K50816K1480l11824J09902J1878
$$ -97174 -212102 -140061 -186058 -174105 -221890 -187080 63736 85216 -226608 -116706 -104828
7647a04828K3221J9479k7948j9025M9485J13417k579r130q8255J43342Q0182q0653
$$ -104828 -81607 -62128 -90076 -109101 -59616 53801 51222 42092 -46163 97179 177361 96708
7635I6708j86139M8078m3374j73683j51312J86011L37833j95303j73953J43200
$$ 96708 -89431 -41353 -84727 -258410 -409722 -223711 114122 -81181 -255134 -111934
7625a11934P35J74567n8941n2429P7341o4719l1078P4235j13334m9449J12221
$$ -111934 -111199 63368 4427 -48002 29339 -35380 -66458 7777 -105557 -155006 -42785
7614d2785m032J25939k5826J06509j51454k11723K0374K40381p6300o9012J85633
$$ -42785 -46817 79122 53296 159805 8351 -203372 -182998 57383 -18917 -87929 97704
7603I7704r3612j02268j11077j49347J41700K26058P5283j62065j14885J45560
$$ 97704 4092 -98176 -209253 -358600 -216900 9158 84441 -77624 -192509 -46949
7593d6949K6331j19777j76531J8339K06934q7886M7808j36557l4627R509L25677
$$ -46949 -20618 -140395 -316926 -298587 -91653 -179539 -131731 -268288 -302915 -293406 32271
7582C2271r4353p4631p5281J04826O2744l2093m9227P4965J27546m9651l345K010
$$ 32271 -62082 -136713 -211994 -107168 -44424 -76517 -125744 -50779 76767 27116 23771 25781
7570B5781Q2868j66891n0210J90427j01563k18452m2683J43948J15797K6864l6787
$$ 25781 108649 -58242 -108452 81975 -19588 -238040 -280723 -136775 -20978 5886 -30901
7559c0901q6720J1684l8852R0200n9472j12417J2506N4840n8991m2966J22417
$$ -30901 -117621 -105937 -144789 -54589 -114061 -226478 -213972 -159132 -218123 -261089 -138672
7548a38672j03971j81240O1562j13052K13414Q8861J4228K04805J5679j88005
$$ -138672 -242643 -423883 -362321 -475373 -261959 -173098 -158870 45935 61614 -126391
7538a26391M7202J31735m9374j27806J21767l4233l8029j29373j29493N1233l4043
$$ -126391 -79189 52546 3172 -124634 -2867 -37100 -75129 -204502 -333995 -282762 -316805
7527c16805J28819P999R3318J19832n2751J7131j94391j00408K81761k8856j10078
$$ -316805 -187986 -179987 -86669 33163 -19588 -2457 -196848 -297256 -15495 -44351 -154429
7516a54429l8413O0179L9284j22155J24517J03422q354J00603k36589k2725J49781
$$ -154429 -192842 -132663 -93379 -215534 -91017 12405 4051 104654 -131935 -154660 -4879
7505d879j3489r6471k16626M5302K4702Q9192q6625Q8834O5024J04549j57418
$$ -4879 -18368 -114839 -331465 -286163 -261461 -172269 -258894 -170060 -105036 -487 -157905
7494a57905p08J4516k7606k5988J51949L4294Q4325j67825M1912m541m2537n1623
$$ -157905 -158613 -144097 -171703 -197691 -45742 -11448 72877 -94948 -53036 -57577 -100114 -151737
7482a51737J07016J18728r8487J8904M8154k3023j56665N3652L0319K4653K1065
$$ -151737 -44721 74007 -24480 -5576 42578 19555 -137110 -83458 -53139 -28486 -7421
7471g421p7964j01774J28996M268p7267L6824J80917q6610o5125J66013n2531
$$ -7421 -85385 -187159 -58163 -53895 -131162 -94338 86579 -31 -65156 100857 48326
7460D8326j96570Q0536r9120J06137j76179N3903n1916r886J46066K5816J39707
$$ 48326 -148244 -67708 -166828 -60691 -236870 -182967 -234883 -244769 -98703 -72887 66820
7449F6820p772r5911q557j27791n3825J28204J13881p4522j8299k6616R9274J2767
$$ 66820 59048 -36863 -45420 -173211 -227036 -98832 15049 -59473 -77772 -104388 -5114 7653
7437G653j0019O4457m2924k55000R1917J37895J42191M0081j55697k62726M1303
$$ 7653 -2366 62091 19167 -235833 -143916 -6021 136170 176251 20554 -242172 -200869
7426b00869J84584j24318k854M2102J34635j57859j24478J59011J6555j40413
$$ -200869 -16285 -140603 -143457 -101355 33280 -124579 -249057 -90046 -73491 -213904
7416b13904L29046j71623O4361J61613j133k3102j39095m5468k09515n2982K21391
$$ -213904 115142 -56481 7880 169493 168360 145258 6163 -39305 -248820 -301802 -80411
7405h0411r9408q5336J8952O7802j21895Q4421J19098m1960j35867K8367J29171
$$ -80411 -179819 -265155 -246203 -178401 -300296 -215875 -96777 -138737 -274604 -246237 -117066
7394a17066n5685J38090O3144p5312K33296O1390j86240J9090j25358p7852R0540
$$ -117066 -172751 -34661 28483 -46829 186467 247857 61617 80707 -44651 -122503 -31963
7383c1963R7277m795o4974k43564O4731K79681j3502O1689j36114N058p4563k32784
$$ -31963 65314 60519 -4455 -248019 -183288 96393 82891 144580 8466 13524 -61039 -293823
7371b93823O7420K22146J39668j42108j39979J67841o5805J06500k6231k6043
$$ -293823 -226403 -4257 135411 -6697 -146676 21165 -44640 61860 35629 9586
7361I586M7964j6482l865l9825J02315l48130N7199M4879J4324O8912l6405K0487
$$ 9586 57550 41068 37203 -2622 99693 -248437 -191238 -146359 -132035 -63123 -99528 -79041
7349g9041j9302Q239N6492k09488M8343L6320O44L6386q682P2467l4001l1885
$$ -79041 -98343 -90104 -33612 -243100 -194757 -158437 -157793 -121407 -130089 -57622 -91623 -123508
7337a23508N2874J4353R3222p7291J50413j40201R5489n0710J6885j28773J52199
$$ -123508 -70634 -56281 36941 -40350 110063 -30138 65351 14641 31526 -97247 54952
7326E4952J30399l7112j17187O1845p5681j46630o7798j9841m5084n5985J61375
$$ 54952 185351 148239 31052 92897 17216 -129414 -197212 -217053 -262137 -318122 -156747
7315a56747J31646j64285j3645K20644J22588j7789j46202j25116J79765J66562
$$ -156747 -25101 -189386 -203031 17613 140201 122412 -23790 -148906 30859 197421
7305A97421l5011q4619j88005j16101k09048J22250M3331M4770J7875R8480j35933
$$ 197421 162410 77791 -110214 -226315 -435363 -313113 -269782 -225012 -207137 -108657 -244590
7294b44590J69672j8206J15926J8589J17478k1537j94414M1670n9429q3021P2406
$$ -244590 -74918 -93124 22802 41391 158869 137332 -57082 -15412 -74841 -157862 -85456
7283h5456O6315K88859q2605o6687J2409L3140J4322j44538L0646K466j32683
$$ -85456 -19141 269718 187113 120426 132835 165975 180297 35759 66405 68871 -63812
7272f3812j05729J31607O9579L6346j49481k037M486j04855J64716j6598J98403
$$ -63812 -169541 -37934 31645 67991 -81490 -83527 -79041 -183896 -19180 -35778 162625
7261A62625J55045q4334k12676j5844K4199K48560q5896j03078J300J27080N6742
$$ 162625 317670 233336 20660 4816 29015 277575 191679 88601 89901 216981 273723
7250B73723j09498j24404o9873p1086O2316Q6228j04234l2669L9185k1456R6035
$$ 273723 164225 39821 -30052 -101138 -38822 47406 -56828 -89497 -50312 -71768 24267
7239B4267J71839j25471m969J00678L6870L5126j46901J5733N7031L1429o804
$$ 24267 196106 70635 65666 166344 203214 238340 91439 107172 164203 195632 188828
7228A88828j74106k4695L1906P1963N96r8368J23888K8699j00676N6556L7039
$$ 188828 14722 -9973 21933 93896 94492 -3876 120012 148711 48035 104591 141630
7217A41630l4419Q382J2325P9687r1885K8825p5919M4219J21227j39508j39166
$$ 141630 107211 115593 127918 207605 115720 144545 68626 112845 234072 94564 -44602
7206d4602K86198O230l10772J03327J88223j10411j13696J13728L1547K6614k81132
$$ -44602 241596 247826 -62946 40381 228604 118193 4497 118225 149772 176386 -104746
7195a04746J06126O7408Q0482l7285k7240j57953O4229J11252k17606J04850K24663
$$ -104746 1380 68788 149270 111985 84745 -73208 -8979 102273 -115333 -10483 214180
7184B14180J37075P7030m83398J30796J65395O638r1310J78906J10693k10149
$$ 214180 351255 428285 -55113 75683 241078 247716 156406 335312 446005 235856
7174B35856l2430p0987M62n0841L1226N9242j08634j8350k7323p1803J18273J62691
$$ 235856 203426 132439 132901 82060 113286 172528 63894 45544 18221 -53582 64691 227382
7162B27382r9944K0045o3623K6663J46819R1910k89073J40495J06401p1447r898
$$ 227382 127438 147483 83860 110523 257342 349252 60179 200674 307075 235628 225730
7151B25730L1226n7072j902k52756K824j11148j30288K46931J10023N4089j90047
$$ 225730 256956 199884 197982 -54774 -51950 -163098 -293386 -46455 63568 117657 -72390
7140g2390j5884K4722J13456q1338P9515j0112M5515j6140j48490j6965j6102
$$ -72390 -88274 -63552 49904 -31434 48081 37969 83484 67344 -81146 -98111 -114213
7129a14213J6746J42258j52587J46493J16014m9053J61933o6716j19455r7117
$$ -114213 -97467 44791 -107796 38697 154711 105658 267591 200875 81420 -15697
7119a5697M7504j1816q222J16697k56497J70051O5927l9659N1123O4466l0916
$$ -15697 31807 19991 11769 128466 -128031 42020 107947 68288 119411 183877 152961
7108A52961L4505n2600O9697J57576p5037j48756J5553L2335j3071R1278m668
$$ 152961 187466 134866 204563 362139 287102 138346 153899 186234 173163 264441 259773
7097B59773J1341q6423q8002q3642Q1074k02516j07664R6390Q4935j03505J99797
$$ 259773 271114 184691 96689 13047 94121 -108395 -216059 -119669 -34734 -138239 61558
7086F1558J62274n0343j09423J16569m8154J154J16216o8809R8499J8978r781
$$ 61558 223832 173489 64066 180635 132481 133635 249851 181042 279541 298519 288738
7075B88738j33796L1399K0831J75807l4783K1095J01173j26584m6141N1106j74448
$$ 288738 154942 186341 207172 382979 348196 369291 470464 343880 297739 348845 174397
7064A74397r403J62117K6520n6928o2917J23998K7240L820l910k22585J05930
$$ 174397 164994 327111 353631 296703 233786 357784 385024 388844 384934 162349 268279
7053B68279Q6640M2611O5816N8721l03071M7610j3008J50555k33055k03378K40247
$$ 268279 354919 397530 463346 522067 218996 266606 253598 404153 171098 -32280 207967
7042B07967K33023n182L0705j17887j8171J5403o4129J83142j05123K8406l4152
$$ 207967 440990 435808 466513 348626 330455 345858 281729 464871 359748 388154 354002
7031C54002j23069J31512q7968l0233O0500p980J04466J07945m634q5036Q6504
$$ 354002 230933 362445 274477 244244 304744 296764 401230 509175 504541 419505 506009
7020E06009p251k643j1669j06305J91213l305l9452K77088j65518j29987K39138
$$ 506009 498758 496115 484446 378141 569354 566049 526597 803685 638167 508180 747318
7009G47318n0303l38222L84179j07401M2347Q7536j25619K7170J9975K50709N8195
$$ 747318 697015 358793 742972 635571 677918 765454 639835 667005 686980 937689 995884
6998I95884j77651J50554J67779j00762k42468R2953J54909k19630K97870P1773
$$ 995884 818233 968787 1136566 1035804 793336 886289 1041198 821568 1119438 1191211
6988A191211j74294L03620k5689j16792q6375J24482J21158P2275R1684J12827
$$ 1191211 1016917 1320537 1294848 1178056 1091681 1216163 1337321 1409596 1501280 1614107
6978A614107j0198P377m1432Q3594J39277J5039O4251J91531q9795q0155K01130
$$ 1614107 1603909 1611286 1569854 1653448 1792725 1807764 1872015 2063546 1973751 1893596 2094726
6967B094726K34756J41984J75536J38261J68339J84851q0842L2685N5487o1328
$$ 2094726 2329482 2471466 2647002 2785263 2953602 3138453 3057611 3090296 3145783 3084455
6957C084455J46054J50227K08k5964M4951Q4680j35611q9646o3649j01232j5234
$$ 3084455 3230509 3380736 3380944 3354980 3399931 3484611 3349000 3259354 3195705 3094473 3079239
6946C079239L6299M4809K790q0231Q8986M8988J51539L7739K47560J87915K57824
$$ 3079239 3115538 3160347 3163137 3082906 3171892 3220880 3372419 3410158 3657718 3845633 4103457
6935D103457M03881K83382R6845J03709K18157J07163J83113n29o0591K95145
$$ 4103457 4507338 4790720 4887565 4991274 5209431 5316594 5499707 5499178 5438587 5733732
6925E733732J86830j61016k48078p6536k12413l88133l52854l17661j19714k00684
$$ 5733732 5920562 5759546 5511468 5434932 5222519 4834386 4481532 4163871 4044157 3843473
6915C843473j5701j93109j79050J01036J10643j4317k28725l6548L13009J27875
$$ 3843473 3827772 3634663 3455613 3556649 3667292 3652975 3424250 3387702 3700711 3828586
6905C828586J56786J5763L8598l0445N0912J38747J62213K14207q9454l1141N7233
$$ 3828586 3985372 4001135 4039733 4009288 4060200 4198947 4361160 4575367 4485913 4454772 4512005
6894D512005j02994k59667m05253l55301j77872j9571l17313k32992k6675k62986
$$ 4512005 4409011 4149344 3744091 3388790 3210918 3191347 2874034 2641042 2614367 2351381
6884B351381k18849q227l17961r0415j1830l6705R8483j1894j95214j09138J24481
$$ 2351381 2132532 2124305 1806344 1715929 1704099 1667394 1765877 1753983 1558769 1449631 1574112
6873A574112J26964j08430P6096J40977j03484j49218j25069R0812O70p0547k52721
$$ 1574112 1701076 1592646 1668742 1809719 1706235 1557017 1431948 1522760 1523430 1452883 1200162
6862A200162j7595J954n6951j51923p5958K5489O0613k05533L0540j01519K31206
$$ 1200162 1182567 1184521 1127570 975647 899689 925178 985791 780258 810798 709279 940485
6851I40485j37380O7382N6084k32197M9267N5838k08300j59754J7860R8206J48363
$$ 940485 803105 870487 926571 694374 743641 799479 591179 431425 449285 547491 695854
6840F95854j33431j02173L288l0794J09423J95253m822j54777j276J0036l594
$$ 695854 562423 460250 463538 432744 542167 737420 732598 577821 576545 586581 582987
6829E82987Q5800n6051p9440j63032k14360K00671Q7917n4430L4343J9788j29357
$$ 582987 668787 612736 533296 370264 155904 356575 444492 390062 424405 444193 314836
6818C14836L758J83992j75082n0966r9800J6171Q6179j24321J83005Q8511K88773
$$ 314836 318594 502586 327504 276538 176738 192909 279088 154767 337772 426283 715056
6807G15056L0849k35117n2957o3482j07719k9095L6044J65826Q6079r49p1791
$$ 715056 745905 510788 457831 394349 286630 257535 293579 459405 545484 544535 472744
6796D72744j09589J30275J02590N6858l91148K29293P0972J6410j71333l2583
$$ 472744 363155 493430 596020 652878 261730 491023 561995 578405 407072 374489
6786C74489K53352K3316m4747J48390K29713J12086k30790K31334K66297J42776
$$ 374489 627841 651157 606410 754800 984513 1096599 865809 1097143 1363440 1506216
6776A506216o395l22583j02109Q4766m83358j14550P7883J4830R5838k7336N9926
$$ 1506216 1499821 1177238 1075129 1159895 676537 561987 639870 654700 750538 723202 783128
6765G83128j17885P913j09176L6633j8212k70148Q6964R9363m9525K6008l929
$$ 783128 665243 673156 563980 600613 582401 312253 399217 498580 449055 475063 471134
6754D71134P3989o3346M3047j19431j24826p2839k4129J23330L2583P4086R4264
$$ 471134 545123 481777 524824 405393 280567 207728 183599 306929 339512 413598 507862
6743E07862K8821r5484o6494M315R6220J96804k47900j78196M2759j09622O6846
$$ 507862 536683 441199 374705 379020 475240 672044 424144 245948 288707 179085 245931
6732B45931J57456j00277j09326p3530J50619M2380L4421k36398M7627n7992J25160
$$ 245931 403387 303110 193784 120254 270873 313253 347674 111276 158903 100911 226071
6721B26071J42394J717Q4758j07145k1870k5851k60233K12064r5926Q6904K88544
$$ 226071 368465 370182 454940 347795 325925 300074 39841 251905 155979 242883 531427
6710E31427k66398N0421l5437J87958j11709j39568J41840j34851p7059M6926
$$ 531427 265029 315450 280013 467971 356262 216694 358534 223683 146624 193550
6700A93550m4407J22119j6908m7339j36288M4186K12291J2862j11096j10412R7881
$$ 193550 149143 271262 254354 207015 70727 114913 327204 340066 228970 118558 216439
6689B16439K6720K999j01741J28070J54264k52402J37584J09248j28237n2516
$$ 216439 243159 246158 144417 272487 426751 174349 311933 421181 292944 240428
6679B40428j8065j43688J26409J31012N107r3505K6829J51125J18j69459p718
$$ 240428 222363 78675 205084 336096 341203 247698 274527 425652 425770 256311 248593
6668B48593k66050K00181K79824k95697o9683J74289P6676R5315P0610j3926J3620
$$ 248593 -17457 182724 462548 166851 97168 271457 348133 443448 514058 500132 513752
6657E13752k2843l0133k9290k219m7120l0696j0736j2949j01116J98657M457j83011
$$ 513752 490909 460776 431486 429267 382147 351451 340715 327766 226650 425307 429764 246753
6645B46753K88395Q0854p4046K4732j26651q5201N1904r351j32082r6159J25625
$$ 246753 535148 616002 541956 566688 440037 354836 406740 397389 265307 169148 294773
6634B94773M177J68139N4551q4291L9320j55450l09214L38017J98428k40424j83480
$$ 294773 298950 467089 521640 437349 476669 321219 12005 350022 548450 308026 124546
6623A24546Q6818J17977k035P1856l3228j00698L2693K8517j06070R1485M3642
$$ 124546 211364 329341 327306 399162 365934 265236 297929 326446 220376 311861 355503
6612C55503k03294J48603K85494j03010j2649o6120L3126L1110N897M2475m7337
$$ 355503 152209 300812 586306 483296 470647 404527 437653 468763 474660 517135 469798
6601D69798l43422R4227Q8895o0823R0930Q1908l23453K56981P304l8533j62980
$$ 469798 126376 220603 309498 248675 339605 421513 98060 355041 362345 323812 160832
6590A60832K1936N9205K29006l04593j29630J37960J83451J10484k9454j9808
$$ 160832 182768 241973 470979 166386 36756 174716 358167 468651 439197 419389
6580D19389J49321l0975q3884L8658j83744M987k844m487p5033O8980J15916P9099
$$ 419389 568710 537735 453851 492509 308765 313752 310908 306421 231388 300368 416284 495383
6568D95383k5574k08542J55822K04266M176J21769L717p019j47318p798n6999
$$ 495383 469809 261267 417089 621355 625531 747300 751017 743998 596680 588882 531883
6557E31883q3181J82309J24567j33740J24950k6783k5536j44046J82594m4031
$$ 531883 448702 631011 755578 621838 746788 720005 694469 550423 733017 688986
6547F88986k21139O5745J82982l273j50245P0339J77016q4676o9897K7882Q2198
$$ 688986 467847 533592 716574 713301 563056 633395 810411 725735 655838 683720 765918
6536G65918j21238n4404J99958J87931k12319J00924K9284j19866j79911P0347
$$ 765918 644680 590276 790234 978165 765846 866770 896054 776188 596277 666624
6526F66624N2673J46650J01787L3317J251J01633r9062P2811j7903j35885q2577
$$ 666624 719297 865947 967734 1001051 1002302 1103935 1004873 1077684 1059781 923896 841319
6515H41319J23548N9241J1281j32265J1529k8082J38122N3217P3896O6078j17371
$$ 841319 964867 1024108 1035389 903124 914653 886571 1024693 1077910 1151806 1217884 1100513
6504A100513Q5254L9478K06639j16207j06967j34912J91551m985K17087J11216
$$ 1100513 1185767 1225245 1431884 1315677 1208710 1073798 1265349 1260364 1477451 1588667
6494A588667j22099K907N9108J47357r275M9165J36557L4677j83968j06724J10183
$$ 1588667 1466568 1469475 1528583 1675940 1666665 1715830 1852387 1887064 1703096 1596372 1706555
6483A706555N5681K29078j319M675R9342j9995R1550J37765L1239J48411M8111
$$ 1706555 1762236 1991314 1989995 1994670 2094012 2074017 2165567 2303332 2334571 2482982 2531093
6472B531093q8564l9901r3718l8256N5610n6408J65455J05600K5196O6233Q3968
$$ 2531093 2442529 2402628 2308910 2270654 2326264 2269856 2435311 2540911 2566107 2632340 2716308
6461B716308L5421J00420L19878J52353K3964K61043J24490r9414J16557K78069
$$ 2716308 2751729 2852149 3172027 3324380 3348344 3609387 3733877 3634463 3751020 4029089
6451D029089R5542J72234l293k2687k16556J23381j74852l6375p2091j04569p5701
$$ 4029089 4124631 4296865 4293572 4270885 4054329 4177710 4002858 3966483 3894392 3789823 3714122
6440C714122j69673k10196J34383M9257q2798J84657J03636R4548P8680J03613
$$ 3714122 3544449 3334253 3468636 3517893 3435095 3619752 3723388 3817936 3896616 4000229
6430D000229N9613L57053M95004q7972J5918O8129j23287j60839k75951L6194
$$ 4000229 4059842 4416895 4911899 4823927 4839845 4907974 4784687 4623848 4347897 4384091
6420D384091n3289j35633j91993l6366j00957L8167l06453k00627q2977j5563
$$ 4384091 4330802 4195169 4003176 3966810 3865853 3904020 3597567 3396940 3313963 3298400
6410C298400j88778l9185j628J68308K442J12306J48604N5084O8025j15452Q6862
$$ 3298400 3109622 3070437 3068809 3237117 3239559 3351865 3500469 3555553 3623578 3508126 3594988
6399C594988K02406k705j23086n5153j6000j76861n4863j2303O0022J95544j12595
$$ 3594988 3797394 3794689 3671603 3616450 3600450 3423589 3368726 3356423 3416445 3611989 3499394
6388C499394j5660j53076j01022j45078q3844o1202Q8150J0162k994j27297q7315
$$ 3499394 3483734 3330658 3229636 3084558 3000714 2939512 3027662 3037824 3034830 2907533 2820218
6377B820218p6208j93714J31564J56239K4605J7299j18562r1033J75287m934J38582
$$ 2820218 2744010 2550296 2681860 2838099 2862704 2880003 2761441 2670408 2845695 2840761 2979343
6366B979343L4465l0883P820k4793O2263j02258j60772Q0270m53682r0065J15766
$$ 2979343 3013808 2982925 2990745 2965952 3028215 2925957 2765185 2845455 2391773 2301708 2417474
6355B417474M798P9992j03627j30022m0635n6156J486K9628O7273J0257o5363
$$ 2417474 2422272 2502264 2398637 2268615 2227980 2171824 2173310 2202938 2270211 2280468 2215105
6344B215105J1055o3749J83086m6112m9870k6225k12954j12872K74451K3458j31948
$$ 2215105 2226160 2162411 2345497 2299385 2249515 2223290 2010336 1897464 2171915 2195373 2063425
6333B063425p132M2767L36624j35723m7308L7741n3068J49901J18515j98362k05426
$$ 2063425 2056293 2099060 2435684 2299961 2252653 2290394 2237326 2387227 2505742 2307380 2101954
6322B101954J86532J20096j5119j24160j01114p8168O1973J39231J9686R8018
$$ 2101954 2288486 2408582 2393463 2269303 2168189 2090021 2151994 2291225 2310911 2408929
6312B408929j70614M9183J81010k72881j01012j07139j599J79398L0734n1429
$$ 2408929 2238315 2287498 2468508 2195627 2094615 1987476 1985877 2165275 2196009 2144580
6302B144580J01376j56372p2473j27773K83278M4627n3245j74230O5275J09097
$$ 2144580 2245956 2089584 2017111 1889338 2172616 2217243 2163998 1989768 2055043 2164140
6292B164140j0716K00262j22429j1137j83565j55426j60010J82737J97307J3169
$$ 2164140 2153424 2353686 2231257 2220120 2036555 1881129 1721119 1903856 2101163 2114332
6282B114332q2007r9371J72222j56108J30530J52999p9695q1540p2847N7897l2087
$$ 2114332 2032325 1932954 2105176 1949068 2079598 2232597 2152902 2071362 1998515 2056412 2024325
6271B024325k2194J67596J19079k03589j4898j71833l215J32659K6330p6702m5067
$$ 2024325 2002131 2169727 2288806 2085217 2070319 1898486 1895271 2027930 2054260 1977558 1932491
6260A932491K2927p9714J68385J8533J817j32563J8060J36771J09556l1355r5240
$$ 1932491 1955418 1875704 2044089 2062622 2064439 1931876 1949936 2086707 2196263 2164908 2069668
6249B069668O4649q8579m0794J57776Q0659m6335k1652p9569Q6645J27944P568
$$ 2069668 2134317 2045738 2004944 2162720 2243379 2197044 2175392 2095823 2182468 2310412 2317980
6238B317980n7743P7695M0825L5984K9619m590j00741j47282j47297J44851J64843
$$ 2317980 2260237 2337932 2378757 2414741 2444360 2439770 2339029 2191747 2044450 2189301 2354144
6227B354144J90586p7317j63486K00757L974o6K54239j9901J17586n274R6043
$$ 2354144 2544730 2467413 2303927 2504684 2508658 2508592 2762831 2742930 2860516 2855242 2951285
6216B951285R216j66907j9284j16378P3116J85273j79357O3875J56700L5062J02338
$$ 2951285 2960501 2793594 2774310 2657932 2731048 2916321 2736964 2800839 2957539 2992601 3094939
6205C094939n1688n3508R0664J21099M7042J43610M8723k3637n8689M6889L99087
$$ 3094939 3043251 2989743 3080407 3201506 3248548 3392158 3440881 3417244 3358555 3405444 3804531
6194C804531k2687N6112K46522P8494o8329J5998K03171K38859K46500l6827J32160
$$ 3804531 3781844 3837956 4084478 4162972 4094643 4110641 4313812 4552671 4799171 4762344 4894504
6183D894504M8900Q8555k7310o7860J8540p522J20870J64471O6313J13707K12699
$$ 4894504 4943404 5031959 5004649 4936789 4955329 4947807 5068677 5233148 5299461 5413168 5625867
6172E625867J26212n2341K97174R6636J21707R5703J91825K15250J45672L76710
$$ 5625867 5752079 5699738 5996912 6093548 6215255 6310958 6502783 6718033 6863705 7240415
6162G240415O8969j94087K5510M1160L6456L7181q686J42452K29353M947l6984
$$ 7240415 7309384 7115297 7140807 7181967 7218423 7255604 7246918 7389370 7618723 7623670 7586686
6151G586686j05057r5206K52498N0726P9890L12827L73373L12607J75177K58659
$$ 7586686 7481629 7386423 7638921 7689647 7769537 8082364 8455737 8768344 8943521 9202180
6141I202180K66163K15722k7443L6130J33112j56703L3630L00604L1816J76063
$$ 9202180 9468343 9684065 9656622 9692752 9825864 9669161 9702791 10003395 10035211 10211274
6131A0211274j06959N462L40237M2337R2336L24487J48998K89755J58469L18717
$$ 10211274 10104315 10109777 10450014 10492351 10584687 10909174 11058172 11347927 11506396 11825113
6121A1825113M43718L63675K89938N4684M56138M36436L46401K31322K81355K78873
$$ 11825113 12268831 12632506 12922444 12977128 13433266 13869702 14216103 14447425 14728780 15007653
6111A5007653O53972P88120L48144L71098N09640N57938K77051N91307P57556
$$ 15007653 15661625 16449745 16797889 17168987 17678627 18236565 18513616 19104923 19862479
6102A9862479P76647Q08876P82201Q86905R90171J116906J234146J498893J454747
$$ 19862479 20639126 21448002 22230203 23117108 24107279 25224185 26458331 27957224 29411971
6093B9411971J707372J622217J698480J726102J732603J308411J182626O87309
$$ 29411971 31119343 32741560 34440040 36166142 37898745 39207156 40389782 41077091
6085D1077091K58053l92235n56654l28704m22144j60434K98283L66439M81604
$$ 41077091 41335144 40942909 40386255 40057551 39635407 39474973 39773256 40139695 40621299
6076D0621299Q26271J130112J232712J488776J991257J954495K046354K667383
$$ 40621299 41447570 42577682 43810394 45299170 47290427 49244922 51291276 53958659
6068E3958659L286751L575467L364282L636265L362304L186538K721080J593106
$$ 53958659 57245410 60820877 64185159 67821424 71183728 74370266 77091346 78684452
6060G8684452Q44414k57807o36743q94053j251170j172089j379364j776250j889138
$$ 78684452 79528866 79271059 78634316 77740263 76489093 75317004 73937640 72161390 70272252
6051G0272252j948135j754558j367263q60628n35764k55561N91090R10325J137488
$$ 70272252 68324117 66569559 65202296 64341668 63805904 63550343 64141433 65051758 66189246
6042F6189246J832074J796163K493510K693214K427777K209203K793439K573180
$$ 66189246 68021320 69817483 72310993 75004207 77431984 79641187 82434626 85007806
6034H5007806K253039J748395J964459J590410N23656k02214j883106l231344
$$ 85007806 87260845 89009240 90973699 92564109 93087765 92885551 91002445 87771101
6026H7771101m112111m551433m368823l753519l329169k577390j743758j304366
$$ 87771101 83658990 79107557 74738734 70985215 67656046 65078656 63334898 62030532
6018F2030532q87727j36238K94530N55515P47033J191361J689793J894033J587247
$$ 62030532 61142805 61006567 61301097 61856612 62603645 63795006 65484799 67378832 68966079
6009F8966079J806291J750542J189863O35999K20183m84360j117796j896316j954804
$$ 68966079 70772370 72522912 73712775 74348774 74568957 74084597 72966801 71070485 69115681
6000F9115681j991382k032785j791442j152501p80593j65922l7290O23831J214948
$$ 69115681 67124299 65091514 63300072 62147571 61366978 61201056 61163766 61787597 63002545
5991F3002545J452917K074764K378537K839678K986389K924415K254005J707827
$$ 63002545 64455462 66530226 68908763 71748441 74734830 77659245 79913250 81621077
5983H1621077R08371k35773j909256l102538l767802l491609k990347k140202
$$ 81621077 82529448 82293675 80384419 77281881 73514079 70022470 67032123 64891921
5975F4891921j385142q23636n02427L14390R73741J630056J916851K334180K553831
$$ 64891921 63506779 62683143 62180716 62495106 63468847 65098903 67015754 69349934 71903765
5966G1903765J933733J572175J324243Q70765Q41369n269j372959k764559l309708
$$ 71903765 73837498 75409673 76733916 77604681 78446050 78440781 77067822 74303263 70993555
5957G0993555k988342k515014k018290j889390k605746k876371k923367l062600
$$ 70993555 68005213 65490199 63471909 61582519 58976773 56100402 53177035 50114435
5949E0114435k174116j367274r95065n55283K58290O24614J083908R57669J185464
$$ 50114435 47940319 46573045 45577980 45022697 45280987 45905601 46989509 47947178 49132642
5940D9132642Q36234m92747j978644l408767l666318l494861l131885k630296
$$ 49132642 49968876 49476129 47497485 44088718 40422400 36927539 33795654 31165358
5932C1165358k248102j862297j633045j307300j256358j039677q21107q55011
$$ 31165358 28917256 27054959 25421914 24114614 22858256 21818579 20997472 20142461
5924B0142461o80558o22301m66235m25989l21807n56707l71691k60030m46251
$$ 20142461 19461903 18839602 18373367 17947378 17625571 17068864 16697173 16437143 15990892
5915A5990892l67634k22844m33048l44068o0380l36458r2813J7373K9267j76185
$$ 15990892 15623258 15400414 14967366 14623298 14562918 14226460 14133647 14151020 14180287 14004102
5905A4004102L4340R9583L52472L15875L50357K25400M39547L09600N19624N86077
$$ 14004102 14038442 14138025 14490497 14806372 15156729 15382129 15821676 16131276 16650900 17236977
5895A7236977P04102K55458o78182r13578q06185m20725j66244l67090l3360K44229
$$ 17236977 17941079 18196537 17518355 16604777 15798592 15377867 15211623 14844533 14811173 15055402
5885A5055402K92557K79369K62463L77583J62751l1766m8967L94514J29758M58533
$$ 15055402 15347959 15627328 15889791 16267374 16430125 16398359 16349392 16743906 16873664 17332197
5875A7332197N12190j39633l61770n21439o48505n15087r7911r3227J67643J45856
$$ 17332197 17844387 17704754 17342984 16821545 16173040 15657953 15560042 15466815 15634458 15780314
5865A5780314k89805n62852n69030l19585k19064K0499j31401k1791N42246P31495
$$ 15780314 15490509 14927657 14358627 14039042 13819978 13840477 13709076 13687285 14229531 14961026
5855A4961026L81916M15553l47892r98811r90514j052297r04743o10827m11766
$$ 14961026 15342942 15758495 15410603 14411792 13421278 12368981 11464238 10853411 10441645
5846A0441645l87537l92055l04152n9285j50805k38245j38516j00641K4671q7283
$$ 10441645 10054108 9662053 9357901 9298616 9147811 8909566 8771050 8670409 8695080 8607797
5836H607797r2077k9564L7572j32569k36162k83091P6345l92218j74928J79642
$$ 8607797 8515720 8486156 8523728 8391159 8154997 7871906 7948251 7556033 7381105 7560747
5826G560747n947m0346p4989n1444K6118k66110j93120L7557J0878L7830O863
$$ 7560747 7554800 7514454 7439465 7388021 7414139 7148029 6954909 6992466 7003344 7041174 7048037
5815G048037J32096O0346K44364J44371j28844p7461J60130J37700O4959M9213
$$ 7048037 7180133 7240479 7484843 7629214 7500370 7422909 7583039 7720739 7785698 7834911
5805G834911N0421J76940L31889l9500M90152P623j88340k82682l53218k21929
$$ 7834911 7885332 8062272 8394161 8354661 8844813 8852436 8664096 8381414 8028196 7806267
5795G806267k58071N384P59N3977L5757p821o8077K05249j89171P521R2263K33403
$$ 7806267 7548196 7553580 7554339 7608316 7644073 7636252 7568175 7773424 7584253 7591774 7684037 7917440
5783G917440J12288K00381K50562K20234r0502n0412J78388j43591m277M7324
$$ 7917440 8029728 8230109 8480671 8700905 8610403 8559991 8738379 8594788 8590511 8637835
5773H637835J6792o260M3372N2197J72086J56555J82562K05342L27425K97837
$$ 8637835 8654627 8648367 8691739 8743936 8916022 9072577 9255139 9460481 9787906 10085743
5763A0085743N8945M9989J37243K69783K00227K48365J49679K47816J4480r856
$$ 10085743 10144688 10194677 10331920 10601703 10801930 11050295 11199974 11447790 11462270 11452414
5753A1452414L05827K35450N1595J77933K09749M34299M25296L60871L84314K04112
$$ 11452414 11758241 11993691 12045286 12223219 12432968 12867267 13292563 13653434 14037748 14241860
5743A4241860K89495N96743N75647O71738N12115K02218P68958N45521O74054
$$ 14241860 14531355 15128098 15703745 16375483 16887598 17089816 17858774 18404295 19078349
5734A9078349Q62026J061420N85980N84834Q31957K67443R873k23084j93340k28336
$$ 19078349 19940375 21001795 21587775 22172609 23004566 23272009 23281882 23058798 22865458 22637122
5724B2637122l96439j16404k87312p2330q6543K34286K87095M98306M88435P58898
$$ 22637122 22240683 22124279 21836967 21764637 21678094 21912380 22199475 22697781 23186216 23945114
5714B3945114O62813Q14459J047391J139796J166514J378013J510319J335723
$$ 23945114 24607927 25422386 26469777 27609573 28776087 30154100 31664419 33000142
5706C3000142J306170Q00387J36690k15870p25942j479238j589683j704559j504155
$$ 33000142 34306312 35106699 35243389 35027519 34301577 32822339 31232656 29528097 28023942
5697B8023942j312131r32838r11471q61474o96556o47205k33143k204q437J70578
$$ 28023942 26711811 25778973 24867502 24006028 23309472 22662267 22429124 22426920 22418483 22589061
5687B2589061J27626M04782L12327M77638L10726N04399N33112K93186o2419l57898
$$ 22589061 22716687 23121469 23433796 23911434 24222160 24726559 25259671 25552857 25490438 25132540
5677B5132540n27924q39214n59788q79408r64316p66203p65386m37934l67718
$$ 25132540 24604616 23765402 23205614 22326206 21361890 20595687 19830301 19392367 19024649
5668A9024649K6400j69683k26840k92850m21496k64948n86014m04360j85256j15150
$$ 19024649 19051049 18881366 18654526 18361676 17940180 17675232 17089218 16684858 16499602 16384452
$$ [...]
##END NTUPLES=NMR SPECTRUM
##END=
