##TITLE=1H_EC-3322(1)
 CDCl3
 8 sc, 
 3.4.2024
##JCAMPDX= 6.0         $$ Bruker NMR JCAMP-DX V2.0
##DATA TYPE= NMR SPECTRUM
##DATA CLASS= NTUPLES
##ORIGIN= UXNMR, Bruker Analytische Messtechnik GmbH
##OWNER= root
$$ XWIN-NMR		Version 3.5
$$ Wed Apr  3 14:12:16 2024 Russian Standard Time (UT+4h)  she@DPX200
##.OBSERVE FREQUENCY= 200.1309
##.OBSERVE NUCLEUS= ^1H
##.ACQUISITION MODE= SIMULTANEOUS
##.ACQUISITION SCHEME= undefined
##.AVERAGES= 8
##.DIGITISER RES= 18
##SPECTROMETER/DATA SYSTEM= spect
##.PULSE SEQUENCE= zg30
##.SOLVENT NAME= MeOD
##.SHIFT REFERENCE= (INTERNAL, MeOD, 0, 15.7712)
##AUDIT TRAIL= $$ (NUMBER, WHEN, WHO, WHERE, WHAT)
$$ ##TITLE= Audit trail, XWIN-NMR		Version 3.5
$$ ##JCAMPDX= 5.01
$$ ##ORIGIN= Bruker BioSpin GmbH
$$ ##OWNER= she
$$ F:/spectra/data/she/nmr/H-F/1/pdata/1/auditp.txt
$$ ##AUDIT TRAIL=  $$ (NUMBER, WHEN, WHO, WHERE, WHAT)
(   1,<2024-04-03 14:10:33.09 +0400>,<she>,<DPX200>,
      <created by zg, POWCHK disabled, PULCHK disabled
       configuration hash MD5:
       00 E9 B6 7A A2 85 ED C7 34 08 36 98 17 FE 4E 26
       data hash MD5: 16K
       F1 53 B6 07 88 B7 1D 39 EA 9B 75 E9 F1 8E 89 28>)
(   2,<2024-04-03 14:10:35.35 +0400>,<she>,<DPX200>,
      <Start of raw data processing
       efp BC_mod = 2 LB = 0.24 FT_mod = 6 PKNL = 1 PHC0 = -25293.23 PHC1 = 2.387312 SI = 16K 
       data hash MD5: 16K
       AE 01 45 8C 60 43 AD 7F C7 3E D5 94 CC 7F EE 6E>)
(   3,<2024-04-03 14:11:09.90 +0400>,<she>,<DPX200>,
      <pk PHC0 = -164.7879 PHC1 = 9.600002 
       data hash MD5: 16K
       67 82 93 3D 16 B9 15 13 A5 FC D7 6F BF DE 3A 1E>)
(   4,<2024-04-03 14:11:13.10 +0400>,<she>,<DPX200>,
      <abs ABSG = 5 
       data hash MD5: 16K
       82 43 EA 62 89 14 4D 1E 2F 51 D0 4D 5B FE D9 E8>)
$$ ##END=
$$ 
$$ hash MD5
$$ 37 3B C9 7F 83 F9 61 83 9E 77 A7 91 20 D1 D4 15
##$RELAX= 
##$RELAX= 
##$RELAX= 
##$RELAX= 
##$RELAX= 
##$RELAX= 
$$ Bruker specific parameters
$$ --------------------------
##$DU= <F:/spectra>
##$EXPNO= 1
##$NAME= <H-F>
##$PROCNO= 1
##$TYPE= <nmr>
##$USER= <she>
##$AMP= (0..31)
100 100 100 100 100 100 100 100 100 100 100 100 100 100 100 100 100 100 
100 100 100 100 100 100 100 100 100 100 100 100 100 100 
##$AQSEQ= 0
##$AQ_mod= 1
##$AUNM= <au_zg>
##$AUTOPOS= <>
##$BF1= 200.13
##$BF2= 200.13
##$BF3= 200.13
##$BF4= 200.13
##$BF5= 200.13
##$BF6= 200.13
##$BF7= 200.13
##$BF8= 200.13
##$BYTORDA= 1
##$CFDGTYP= 0
##$CFRGTYP= 5
##$CHEMSTR= <none>
##$CNST= (0..31)
1 1 145 1 1 1 1 1 1 1 1 1 1 1 1 1 1 1 1 1 1 1 1 1 1 1 1 1 1 1 1 1 
##$CPDPRG= <>
##$CPDPRG1= <>
##$CPDPRG2= <>
##$CPDPRG3= <>
##$CPDPRG4= <mlev>
##$CPDPRG5= <mlev>
##$CPDPRG6= <mlev>
##$CPDPRG7= <mlev>
##$CPDPRG8= <mlev>
##$CPDPRGB= <>
##$CPDPRGT= <>
##$D= (0..31)
0 1.2 0 0 0 0 0 0 0 0.06 0 0.03 0 0 0 0 0.0002 0 0 0 0 0 0 0 0 0 0 0 0 
0 0 0 
##$DATE= 1712139032
##$DBL= (0..7)
120 120 120 120 120 120 120 120 
##$DBP= (0..7)
150 150 150 150 150 150 150 150 
##$DBP07= 0
##$DBPNAM0= <>
##$DBPNAM1= <>
##$DBPNAM2= <>
##$DBPNAM3= <>
##$DBPNAM4= <>
$$ [...]
##$SUBNAM3= <"">
##$SUBNAM4= <"">
##$SUBNAM5= <"">
##$SUBNAM6= <"">
##$SUBNAM7= <"">
##$SUBNAM8= <"">
##$SUBNAM9= <"">
##$SW= 18.0517689322627
##$SWIBOX= (0..15)
0 0 2 0 0 0 0 0 0 0 0 0 0 0 0 0 
##$SW_h= 3612.71676300578
##$TD= 16384
##$TD0= 1
##$TE= 0
##$TE2= 300
##$TE3= 300
##$TEG= 300
##$TL= (0..7)
0 120 120 120 120 120 120 120 
##$TP= (0..7)
150 150 150 150 150 150 150 150 
##$TP07= 0
##$TPNAME0= <>
##$TPNAME1= <>
##$TPNAME2= <>
##$TPNAME3= <>
##$TPNAME4= <>
##$TPNAME5= <>
##$TPNAME6= <>
##$TPNAME7= <>
##$TPOAL= (0..7)
0.5 0.5 0.5 0.5 0.5 0.5 0.5 0.5 
##$TPOFFS= (0..7)
0 0 0 0 0 0 0 0 
##$TUNHIN= 0
##$TUNHOUT= 0
##$TUNXOUT= 0
##$USERA1= <user>
##$USERA2= <user>
##$USERA3= <user>
##$USERA4= <user>
##$USERA5= <user>
##$V9= 5
##$VALIST= <valist>
##$VCLIST= <CCCCCCCCCCCCCCC>
##$VD= 0
##$VDLIST= <DDDDDDDDDDDDDDD>
##$VPLIST= <PPPPPPPPPPPPPPP>
##$VTLIST= <TTTTTTTTTTTTTTT>
##$WBST= 1024
##$WBSW= 4
##$XGAIN= (0..3)
0 0 0 0 
##$XL= 0
##$YL= 0
##$YMAX_a= 321903
##$YMIN_a= -229179
##$ZGOPTNS= <>
##$ZL1= 120
##$ZL2= 120
##$ZL3= 120
##$ZL4= 120
##$ABSF1= 15.72709
##$ABSF2= -2.3248
##$ABSG= 5
##$ABSL= 3
##$ALPHA= 0
##$AQORDER= 0
##$ASSFAC= 0
##$ASSFACI= 0
##$ASSFACX= 0
##$ASSWID= 0
##$AUNMP= <proc_1d>
##$AZFE= 0.1
##$AZFW= 0.1
##$BCFW= 0
##$BC_mod= 2
##$BYTORDP= 0
##$COROFFS= 0
##$CY= -3
##$DATMOD= 1
##$DC= 0
##$DFILT= <>
##$DTYPP= 0
##$F1P= 0
##$F2P= 0
##$FCOR= 1
##$FTSIZE= 16384
##$FT_mod= 6
##$GAMMA= 0
##$GB= 0
##$INTBC= 1
##$INTSCL= 3.70164e-10
##$ISEN= 128
##$LB= 0.24
##$LEV0= 0
##$LPBIN= 0
##$MAXI= 10000
##$MC2= 0
##$MEAN= 0
##$ME_mod= 0
##$MI= 1.114404
##$NCOEF= 0
##$NC_proc= -7
##$NLEV= 6
##$NOISF1= 3.799351
##$NOISF2= 2.8
##$NSP= 0
##$NTH_PI= 0
##$NZP= 0
##$OFFSET= 15.77116
##$PC= 1
##$PHC0= -25458.02
##$PHC1= 11.98731
##$PH_mod= 1
##$PKNL= yes
##$PPARMOD= 0
##$PSCAL= 0
##$PSIGN= 0
##$REVERSE= no
##$SF= 200.129550081509
##$SI= 16384
##$SIGF1= 3
##$SIGF2= 2
##$SINO= 5.538805
##$SIOLD= 16384
##$SREGLST= <1H.CDCl3>
##$SSB= 0
##$STSI= 16384
##$STSR= 0
##$SW_p= 3612.71676300577
##$SYMM= 0
##$S_DEV= 0
##$TDeff= 16384
##$TDoff= 0
##$TI= <>
##$TILT= no
##$TM1= 0
##$TM2= 0
##$TOPLEV= 0
##$USERP1= <user>
##$USERP2= <user>
##$USERP3= <user>
##$USERP4= <user>
##$USERP5= <user>
##$WDW= 1
##$XDIM= 16384
##$YMAX_p= 386477961
##$YMIN_p= -165540
$$ End of Bruker specific parameters
$$ ---------------------------------
##NTUPLES= NMR SPECTRUM
##VAR_NAME=  FREQUENCY,     SPECTRUM/REAL,   SPECTRUM/IMAG
##SYMBOL=    X,             R,               I
##VAR_TYPE=  INDEPENDENT,   DEPENDENT,       DEPENDENT
##VAR_FORM=  AFFN,          ASDF,            ASDF
##VAR_DIM=   16384,         16384,           16384
##UNITS=     HZ,            ARBITRARY UNITS, ARBITRARY UNITS
##FACTOR=    0.220516191357247, 1,           1
##FIRST=     3156.27518022626, 0,            0
##LAST=      -456.441582779506, 0,           0
##MIN=       -456.441582779506, -165540,     0
##MAX=       3156.27518022626, 386477961,    0
$$ Real data points
##PAGE= N=1
##DATA TABLE= (X++(R..R)), XYDATA
$$ [...]
$$ plain form
8206 2882583 2921489 2939914 2989372 3074607 3154231 3279356 3308513 3269887 3321643 3355857 3480018
8195 3480018 3619929 3802875 3812371 3970868 4222346 4212161 4524720 4651510 4828696 5016332
8185 5016332 5327840 5758289 6173846 6744408 7371539 8150420 9131699 10300765 11628041
8176 11628041 12987876 14160264 15042045 15489500 15310441 14580484 13404352 11888799 10432836
8167 10432836 9116320 8059074 7250375 6580540 6153580 5832360 5522347 5253713 5040632
8158 5040632 4865230 4743725 4666778 4619019 4585651 4545428 4548429 4583647 4661527 4672432 4867270
8147 4867270 5104552 5325815 5680264 6107956 6556925 7214217 8018795 9003683 10016009
8138 10016009 11088547 12027347 12631508 12801222 12490096 11724989 10586141 9330856 8037359
$$ packed form
8206B882583L8906J8425M9458Q5235P9624J25125K9157l8626N1756L4214J24161
8195C480018J39911J82946R496J58497K51478j0185L12559J26790J77186J87636
8185E016332L11508M30449M15557N70562O27131P78881R81279J169066J327276
8176A1628041J359835J172388Q81781M47455j79059p29957j176132j515553j455963
8167A0432836j316516j057246q08699o69835m26960l21220l10013k68634k13081
8158E040632j75402j21505p6947m7759l3368m0223L001L5218P7880J0905J94838
8147D867270K37282K21263L54449M27692M48969O57292Q04578R84888J012326
8138A0016009J072538R38800O04161J69714l11126p65107j138848j255285j293497
$$ plain form
8129 8037359 6853618 6039846 5445693 4857839 4364485 4024663 3703262 3431224 3241928
8120 3241928 3019592 2850021 2670419 2532018 2354741 2230231 2163492 2077104 1927284 1892560
8110 1892560 1827979 1797384 1748000 1727265 1663087 1616775 1586791 1479293 1485320 1490860 1453891 1452256
8098 1452256 1435016 1423035 1367073 1394453 1429150 1412355 1441867 1430603 1332958 1303526 1308466 1263267
8086 1263267 1257617 1251487 1216110 1160947 1050322 1007467 1020340 1047209 1044448 1021199 998049 1015485
8074 1015485 954261 891093 950960 951669 955396 895941 889401 912198 929142 939862 921499 895107
8062 895107 887190 909230 888159 867437 819031 800137 833814 873536 888531 796644 781341 868119
8050 868119 884239 925281 892066 859481 802795 800604 798558 760068 771612 761136 718813 741974
$$ packed form
8129H037359j183741q13772n94153n87854m93354l39822l21401k72038j89296
8120C241928k22336j69571j79602j38401j77277j24510o6739q6388j49820l4724
8110A892560o4581l0595m9384k0735o4178m6312k9984j07498O027N540l6969j635
8098A452256j7240j1981n5962K7380L4697j6795K9512j1264r7645k9432M940m5199
8086A263267n650o130l5377n5163j10625m2855J2873K6869k761k3249k3150J7436
8074A015485o1224o3168N9867P09L727n9455o540K2797J6944J0720j8363k6392
8062H95107p917K2040k1071k0722m8406j8894L3677L9722J4995r1887j5303Q6778
8050H68119J6120M1042l3215l2585n6686k191k046l8490J1544j0476m2323K3161
$$ plain form
8038 741974 747537 746720 777299 741695 786954 738181 780773 736557 768317 728088 720993 765479
8026 765479 712848 711160 721177 672532 632951 679988 648714 634718 620004 580228 582697 571382
8014 571382 564935 604727 630464 611832 561432 620288 617127 570847 587240 621168 631799 622172
8002 622172 644427 653437 665817 642299 576192 653999 733387 685049 592732 625837 605763 606282
7990 606282 690346 674730 617925 632173 649681 591970 609389 535526 457101 453996 510288 514311
7978 514311 517975 523654 525440 530944 568909 532039 553166 581865 504457 514073 569148 477493 421230
7965 421230 398753 414787 409286 429837 466565 467734 450642 468914 476764 496441 501983 469596
7953 469596 539263 548479 489602 525555 542620 595441 652486 578048 591287 634539 647758 611808
$$ packed form
8038G41974N563q17L0579l5604M5259m8773M2592m4216L1760m0229p095M4486
8026G65479n2631j688J0017m8645l9581M7037l1274j3996j4714l9776K469j1315
8014E71382o447L9792K5737j8632n0400N8856l161m6280J6393L3928J0631r627
8002F22172K2255R010J2380k3518o6107P7807P9388m8338r2317L3105k0074N19
7990F06282Q4064j5616n6805J4248J7508n7711J7419p3863p8425l105N6292M023
7978E14311L664N679J786N504L7965l6870K1127K8699p7408R616N5075r1655n6263
7965D21230k2477J6034n501K0551L6728J169j7092J8272P850J9677N542l2387
7953D69596O9667R216n8877L5953J7065N2821N7045p4438J3239M3252J3219l5950
$$ plain form
7941 611808 627890 585866 543206 550727 542307 554793 492957 528408 515198 511982 536996 442931
7929 442931 414542 404157 351079 321985 314291 402762 442898 376335 349744 374104 439062 405687
7917 405687 429248 536876 573961 518495 498756 487589 536366 543933 518469 534082 620595 576071
7905 576071 607274 621400 623421 601833 526018 499083 417352 422893 461295 481469 470071 484026
7893 484026 518445 436029 404860 436101 485346 500150 557793 535420 497883 472641 509116 531825
7881 531825 556341 607046 643796 544886 520361 528532 497545 581162 607606 620873 678895 656439
7869 656439 738082 739023 759036 784338 832782 890232 940355 912088 903955 938601 957656 906673
7857 906673 962809 1035459 1073472 1035290 1005808 1034818 936064 909366 868279 851482 794592 775219
$$ packed form
7941F11808J6082m2024m2660P521q420J2486o1836L5451j3210l216K5014r4065
7929D42931k8389j0385n3078k9094p694Q8471M0136o6563k6591K4360O4958l3375
7917D05687K3561J07628L7085n5466j9739j1167M8777P567k5464J5613Q6513m4524
7905E76071L1203J4126K021k1588p5815k6935q1731N541L8402K0174j1398J3955
7893D84026L4419q2416l1169L1241M9245J4804N7643k2373l7537k5242L6475K2709
7881E31825K4516N0705L6750r8910k4525Q171l0987Q3617K6444J3267N8022k2456
7869F56439Q1643R41K0013K5302M8444N7450N0123k8267q133L4646J9055n0983
7857I06673N6136P2650L8013l8182k9482K9010r8754k6698m1087j6797n6890j9373
$$ plain form
7845 775219 751127 815451 810793 748415 674936 673515 652763 680484 560664 601345 600500 613039
7833 613039 555078 521763 557898 552210 493899 494187 470850 468427 441642 419103 393097 349439
7821 349439 378112 343784 378356 451039 329109 300781 353743 379254 305572 329713 378196
7810 378196 322227 278712 293035 260896 279448 269406 283601 235927 264314 119322 179852
7799 179852 329018 196627 297431 234371 247347 275641 239502 191634 236876 222367 232458
7788 232458 265488 281493 205557 158144 192386 147518 76752 75284 114978 94245 83981 150759
7776 150759 145969 138557 144726 139820 127433 128264 93880 76846 147311 157583 59975 88264 143379
7763 143379 185746 219783 196795 151253 197304 187326 158150 125791 139936 168911 131485 139173
$$ packed form
7845G75219k4092O4324m658o2378p3479j421k0752K7721j19820M0681q45J2539
7833F13039n7961l3315L6135n688n8311K88k3337k423k6785k2539k6006m3658
7821C49439K8673l4328L4572P2683j21930k8328N2962K5511p3682K4141M8483
7810C78196n5969m3515J4323l2139J8552j0042J4195m7674K8387j44992O0530
7799A79852J49166j32391J00804o3060J2976K8294l6139m7868M5242j4509J0091
7788B32458L3030J6005p5936m7413L4242m4868p0766j468L9694k0733j0264O6778
7776A50759m790p412O169m906j2387Q31l4384j7034P0465J0272r7608K8289N5115
7763A43379M2367L4037k2988m5542M6051r978k9176l2359J4145K8975l7426P688
$$ plain form
7751 139173 94938 117929 149623 118420 105182 129460 151997 245737 252192 209912 230975 234730
7739 234730 254468 211912 208093 225167 206373 127768 85119 81637 157201 102291 50002 69477
7727 69477 98051 22341 -54825 -30827 21250 19189 29329 64703 17941 23003 -8647 -28924
7715 -28924 16469 -15713 -29407 82829 72283 32461 30189 -8672 -18769 -37167 -37398 17017
7703 17017 31141 -14172 -18806 -20890 -113618 -151594 -59538 -25530 -115291 -86197 -39352 13920
7691 13920 -49841 -95147 -70030 -54119 -44161 -31642 43299 29889 9365 -35454 -75012 -75505
7679 -75505 -73966 -27752 -4908 39597 15173 32280 81158 622 2501 69088 54096 72470
7667 72470 73711 60905 125873 126254 185655 117890 98626 66156 93881 127665 76278 8052
$$ packed form
7751A39173m4235K2991L1694l1203j3238K4278K2537R3740O455m2280K1063L755
7739B34730J9738m2556l819J7074j8794p8605m2649l482P5564n4910n2289J9475
7727F9477K8574p5710p7166K3998N2077k061J0140L5374m6762N062l1650k0277
7715b8924M5393l2182j3694J12236j0546l9822k272l8861j0097j8398k31N4415
7703A7017J4124m5313m634k084r2728l7976R2056L4008q9761K9094M6845N3272
7691A3920o3761m5306K5117J5911R958J2519P4941j3410k0524m4819l9558m93
7679g5505J539M6214K2844M4505k4424J7107M8878q0536J879O6587j4992J8374
7667G2470J241j2806O4968L81N9401o7765j9264l2470K7725L3784n1387o8226
$$ plain form
7655 8052 67667 88396 140836 191391 116816 66972 78673 26301 -35525 32786 -3411 51942
7643 51942 71756 53929 16794 14021 28412 -1019 -51405 15784 51692 32022 -27662 -65760
7631 -65760 -63289 -6352 44457 -17060 -71453 -95647 -85429 -40545 -10919 25890 16892 10590
7619 10590 -11734 -26611 21617 36572 61518 43607 78901 72991 57855 93454 121947 82985
7607 82985 22797 42476 -9190 24421 40977 1225 39739 -13552 -61327 -51763 -45770 -122
7595 -122 -5561 -29315 -12344 -49364 -26160 11861 -46365 -76573 -115914 -105584 -65656 35930
7583 35930 -42760 -38394 -67471 -41007 -20631 -69904 -57751 -63861 -52960 -53494 -98073 -77119 -27151
7570 -27151 -36738 -26603 -49423 -83517 -86211 -117233 -150579 -124090 -95792 -48104 -52645 -82862
$$ packed form
7655H052N9615K0729N2440N0555p4575m9844J1701n2372o1826O8311l6197N5353
7643E1942J9814j7827l7135k773J4391k9431n0386O7189L5908j9670n9684l8098
7631f5760K471N6937N0809o1517n4393k4194J0218M4884K9626L6809q998o302
7619A0590k2324j4877M8228J4955K4946j7911L5294n910j5136L5599K8493l8962
7607H2985o0188J9679n1666L3611J6556l9752L8514n3291m7775R564N993M5648
7595a22n439k3754J6971l7020K3204L8021n8226l0208l9341J0330L9928J01586
7583C5930p8690M366k9077K6464K0376m9273J2153o110J0901n34m4579K0954M9968
7570b7151r587J0135k2820l4094k694l1022l3346K6489K8298M7688m541l0217
$$ plain form
7558 -82862 -86336 -76859 -132715 -126599 -120110 -128094 -81794 -62313 -31177 -95563 -88531 -57342 -125985
7545 -125985 -116910 -135066 -110993 -62778 1406 56651 -58803 -102170 -82024 -60939 -47496 -56542
7533 -56542 -41023 -5320 50016 20911 -12311 -64621 -58380 -15916 -27560 -27294 -27014 41105 118479
7520 118479 -30134 -66730 -71676 -38387 -34753 -23898 1081 37446 4002 -7495 -40205 30005
7508 30005 33717 8387 38563 10475 51575 27599 -75950 -46291 14472 -26532 -40142 -82530
7496 -82530 -64551 -48889 -86536 -115412 -38597 -31247 -69406 -1512 21382 16631 65009 24697
7484 24697 61791 52531 22378 32503 16631 52723 30758 14994 16218 19151 21205 -34115 -90740
7471 -90740 -74956 -48531 -21705 -23621 -34367 -4574 6961 -12881 -54498 -78399 -72202 -76855
$$ packed form
7558h2862l474R477n5856O116O489p984M6300J9481L1136o4386P032L1189o8643
7545a25985R075j8156K4073M8215O4184N5245j15454m3367K0146K1085J3443r046
7533e6542J5519L5703N5336k9105l3222n2310O241M2464j1644K66K80O8119P7374
7520A18479j48613l6596m946L3289L634J0855K4979L6365l3444j1497l2710P0210
7508C0005L712k5330L0176k8088M1100k3976j03549K9659O0763m1004j3610m2388
7496h2530J7979J5662l7647k8876P6815P350l8159O7894K2894m751M8378m0312
7484B4697L7094r260l0153J0125j5872L6092k1965j5764J224K933K054n5320n6625
7471i0740J5784K6425K6826j916j0746K9793J1535j9842m1617k3901O197m653
$$ plain form
7459 -76855 -92073 -15866 22080 62501 38803 -26675 20183 64628 70846 46239 44226 6150
7447 6150 97131 135866 56752 84840 26368 46126 59116 27946 -38920 -65256 -46542 -90971
7435 -90971 -50136 -58528 33 -21076 -40883 -23681 40861 3306 -26461 -65311 -24267 43577
7423 43577 67073 7277 -16337 18405 -6335 -17402 31452 84772 82218 135338 156184 88264
7411 88264 75699 45595 33834 78974 111760 183636 100584 121295 135717 106758 73062 67368
7399 67368 52897 102092 94980 97984 120195 99587 97919 200125 136080 117366 138752 106631
7387 106631 120920 187408 278022 175892 154108 57563 44572 38392 -10587 56125 48735 52049
7375 52049 40433 119782 144114 86101 97888 86447 18240 44432 5495 -749 8081 101740
$$ packed form
7459g6855j5218P6207L7946M0421k3698o5478M6858M4445O218k4607k013l8076
7447F150R0981L8735p9114K8088n8472J9758J2990l1170o6866k6336J8714m4429
7435i0971M0835q392N8561k1109j9807J7202O4542l7555k9767l8850M1044O7844
7423D3577K3496n9796k3614L4742k4740j1067M8854N3320k554N3120K0846o7920
7411H8264j2565l0104j1761M5140L2786P1876q3052K0711J4422k8959l3696n694
7399F7368j4471M9195p112L004K2211k0608j668J02206o4045j8714K1386l2121
7387A06631J4289O6488R0614j02130k1784r6545j2991o180m8979O6712p390L314
7375E2049j1616P9349K4332n8013J1787j1441o8207K6192l8937o244Q830R3659
$$ plain form
7363 101740 87523 92059 118361 131671 114001 63166 -10739 40831 43585 110312 108929 114534
7351 114534 82863 88637 101169 69337 64171 63816 120212 95127 78634 42861 58453 28650
7339 28650 21727 29885 8945 45393 39039 71374 141334 43914 29636 6714 -7515 9054
7327 9054 59443 45431 29325 80297 61662 105417 127186 46512 56270 -70823 -15057 25089
7315 25089 -13874 -108241 -110113 -85270 -68578 -90812 -105331 -54840 14022 26873 2473 19143
7303 19143 -2155 21686 -10850 -32944 -17035 -25076 -51665 -57341 -64114 -114971 -37206 9859
7291 9859 -12760 -55187 -385 -84911 -29076 -61232 -73711 -42453 -6955 -19943 8079 -25723
7279 -25723 -53445 -44589 -68734 -83336 -73564 -68143 -46635 -23140 30364 30410 -43274 -35798 1835
$$ packed form
7363A01740j4217M536K6302J3310j7670n0835p3905N1570K754O6727j383N605
7351A14534l1671N774J2532l1832n166l55N6396k5085j6493l5773J5592k9803
7339B8650o923Q158k0940L6448o354L2335O9960r7420j4278k2922j4229J6569
7327I054N0389j4012j6106N0972j8635M3755K1769q0674R758j27093N5766M0146
7315B5089l8963r4367j872K4843J6692k2234j4519N0491O8862J2851k4400J6670
7303A9143k1298K3841l2536k2094J5909q041k6589n676o773n0857P7765M7065
7291I859k2619m2427N4802q4526N5835l2156j2479L1258L5498j2988K8022l3802
7279b5723k7722Q856k4145j4602R772N421K1508K3495N3504M6p3684P476L7633
$$ plain form
7266 1835 70774 20543 9528 -58309 -53583 -55408 -58577 -58442 -89906 -114397 -58502 -74436 -70338
7253 -70338 -21664 -101125 -59039 29428 50207 -27170 -116224 -32920 -25878 -45122 -69662 -12227
7241 -12227 -39195 -25656 22366 -40007 -2410 6032 42366 81550 17497 23554 62342 -9581
7229 -9581 -50823 -10534 9984 111407 140426 126680 45604 58046 47197 122240 160938 132438
7217 132438 103041 102158 181745 110644 -15194 2316 53472 55296 73250 147474 103323 107883
7205 107883 38534 40503 71126 53494 -35944 35471 148339 122447 84801 72620 134455 78981
7193 78981 120365 146055 118987 94508 133665 136245 109289 101777 75243 100035 99867 130302 94136
7180 94136 10271 40025 88595 104156 117492 93644 67897 126902 147316 67252 155853 182982
$$ packed form
7266A835O8939n0231j1015o7837M726j825l169J35l1464k4491N5895j5934M098
7253g0338M8674p9461M2086Q8467K0779p7377q9054Q3304P042j9244k4540N7435
7241a2227k6968J3539M8022o2373L7597Q442L6334L9184o4053O057L8788p1923
7229i581m1242M0289K0518J01423K9019j3746q1076J2442j0849P5043L8698k8500
7217A32438k9397q83P9587p1101j25838J7510N1156J824J7954P4224m4151M560
7205A07883o9349J969L0623j7632q9438P1415J12868k5892l7646j2181O1835n5474
7193G8981M1384K5690k7068k4479L9157K580k6956p512k6534K4792j68L0435l6166
7180I4136q3865K9754M8570J5561J3336k3848k5747N9005K0414q0064Q8601K7129
$$ plain form
7168 182982 137737 162731 121135 169065 171579 176019 148461 96984 67216 67454 150120 104470
7156 104470 66586 104274 212962 188826 137739 150055 105634 156319 219200 236935 244406 258746
7144 258746 265073 298083 275169 251617 208172 213508 177061 147347 182785 201918 233237 315370
7132 315370 266421 222896 251028 299883 295654 286192 294443 289952 257809 237835 236171 256262 312300
7119 312300 300177 270271 221804 178800 242566 201539 246706 290506 273557 260464 250726 202187
7107 202187 223565 352705 359646 305591 307799 332651 316523 269296 264034 314235 356621 316089
7095 316089 257983 265159 296218 278440 259019 268045 258057 274914 232753 255113 270753 218301
7083 218301 236371 245249 249912 193174 150960 117590 95424 134715 139829 135277 127017 183009 139608
$$ packed form
7168A82982m5245K4994m1596M7930K514M440k7558n1477k9768K38Q2666m5650
7156A04470l7884L7688J08688k4136n1087J2316m4421N0685O2881J7735P471J4340
7144B58746O327L3010k2914k3552m3445N336l6447k9714L5438J9133L1319Q2133
7132C15370m8949m3525K8132M8855m229r462Q251m491l2143j9974j664K0091N6038
7119C12300j2123k9906m8467m3004O3766m1027M5167M3800j6949j3093r738m8539
7107B02187K1378J29140O941n4055K208K4852j6128m7227n262N0201M2386m0532
7095C16089n8106P176L1059j7778j9421R026r988J6857m2161K2360J5640n2452
7083B18301J8070Q878M663n6738m2214l3370k2166L9291N114m552q260N5992m3401
$$ plain form
7070 139608 113877 148899 194655 174615 158215 187419 174105 175781 169816 158413 122876 104039
7058 104039 99642 147315 200899 205988 215613 189165 217895 165625 66130 49749 61829 101937
7046 101937 99129 92953 54501 67832 22543 30767 112433 90497 23774 5856 66146 122269
7034 122269 99632 126338 149549 109735 78408 129446 127529 48250 95050 162519 163310 84030
7022 84030 52014 32819 115563 129147 171548 98695 55506 65941 55702 64017 35487 51964
7010 51964 1570 84595 88991 138150 126834 50620 75810 28397 -5297 45193 113908 96676
6998 96676 89831 99600 64705 49155 81087 108122 107584 219231 245464 210649 218989 256125 242840
6985 242840 157887 126097 203073 265571 192494 179426 179037 216084 166382 250202 299897 249053
$$ packed form
7070A39608k5731L5022M5756k0040j6400K9204j3314J676n965j1403l5537j8837
7058A04039m397M7673N3584N089R625k6448K8730n2270r9495j6381J2080M0108
7046A01937k808o176l8452J3331m5289Q224Q1666k1936o6723j7918O0290N6123
7034A22269k2637K6706K3211l9814l1327N1038j917p9279M6800O7469P91p9280
7022H4030l2016j9195Q2744J3584M2401p2853m3189J0435j0239Q315k8530J6477
7010E1964n0394Q3025M396M9159j1316p6214K5190m7413l3694N0490O8715j7232
6998I6676o845R769l4895j5550L1932K7035n38J11647K6233l4815Q340L7136j3285
6985B42840q4953l1790P6976O2498p3077j3068l89L7047m9702Q3820M9695n0844
$$ plain form
6973 249053 144631 133274 156940 216740 128862 71962 111183 103258 83634 95738 170699 175965
6961 175965 202576 214715 271037 223687 222382 174460 178468 192085 209466 251989 214202 210346
6949 210346 193107 135848 151252 216183 209486 242032 186462 160592 187967 189538 171052 208316
6937 208316 208997 142202 209901 175131 177240 203471 144527 158982 132856 186888 194352 196967 212142
6924 212142 143299 172337 206686 234092 215569 227088 327775 310067 293055 333622 345872
6913 345872 361500 396395 370301 312252 332502 320022 326128 321468 313431 342498 297828 304773
6901 304773 280189 241075 299555 298224 251904 290699 313535 343320 340949 282636 318363 370977
6889 370977 376605 331326 413956 431007 381918 395997 376888 365222 410013 443050 550557 530195
$$ packed form
6973B49053j04422j1357K3666N9800q7878n6900L9221p925j9624J2104P4961N266
6961A75965K6611J2139N6322m7350j305m7922M008J3617J7381M2523l7787l856
6949B10346j7239n7259J5404O4931o697L2546n5570k5870K7375J571j8486L7264
6937B08316O81o6795O7699l4770K109K6231n8944J4455k6126N4032P464K615J5175
6924B12142o8843K9038L4349K7406j8523J1519J00687j7708j7012M0567J2250
6913C45872J5628L4895k6094n8049K0250j2480O106m660q037K9067m4670O945
6901C04773k4584l9114N8480j331m6320L8795K2836K9785k371n8313L5727N2614
6889C70977N628m5279Q2630J7051m9089J4079j9109j1666M4791L3037J07507k0362
$$ plain form
6877 530195 497729 504516 526512 553190 655559 613462 611231 659931 647247 614305 598301 628169
6865 628169 706061 750722 774353 777738 775250 759571 856314 923647 918237 879088 932754 966206
6853 966206 992246 981133 952929 947890 1054031 1148351 1095557 1149632 1192383 1198117 1231552 1352846
6841 1352846 1390623 1445167 1481934 1516240 1594649 1669286 1736291 1863605 2017218 2119435 2147699
6830 2147699 2277669 2469004 2594967 2713020 2975350 3142270 3319369 3505625 3672811 3737127
6820 3737127 3818655 3948546 4095909 4073712 4064660 4071764 4036337 3913920 3836407 3787814 3729608
6809 3729608 3741896 3717851 3710201 3733816 3752812 3809380 3832653 3926751 4072781 4289507 4403523
6798 4403523 4633167 4937313 5178397 5479996 5858969 6133774 6367954 6603808 6710104 6764234
$$ packed form
6877E30195l2466O787K1996K6678J02369m2097k231M8700j2684l2942j6004K9868
6865F28169P7892M4661K3631L385k488j5679R6743O7333n410l9149N3666L3452
6853I66206K6040j1113k8204n039J06141R4320n2794N4075M2751N734L3435J21294
6841A352846L7777N4544L6767L4306P8409P4637O7005J27314J53613J02217K8264
6830B147699J29970J91335J25963J18053K62330J66920J77099J86256J67186O4316
6820C737127Q1528J29891J47363k2197r052P104l5427j22417p7513m8593n8206
6809C729608J2288k4045p650K3615J8996N6568K3273R4098J46030K16726J14016
6798D403523K29644L04146K41084L01599L78973K74805K34180K35854J06296N4130
$$ plain form
6788 6764234 6766938 6729164 6508840 6320667 6077058 5766585 5405931 5192101 4924988 4626852
6778 4626852 4298334 4113301 4022629 3848310 3738547 3589785 3565986 3592108 3485848 3490385
6768 3490385 3553899 3624559 3710067 3760674 3836982 3879751 3936388 3971330 3947255 3945265 3857497 3729162
6756 3729162 3649572 3520357 3323763 3097933 2924672 2745059 2612829 2421139 2262956 2078404
6746 2078404 1967810 1863757 1732814 1619886 1502619 1388504 1285892 1212782 1180960 1217406
6736 1217406 1252817 1217775 1143909 1133657 1072947 1014543 1019985 982909 888082 892482 911318 923817
6724 923817 838788 854272 868547 776884 792841 843042 808478 834759 852250 819747 808078 792331
6712 792331 652635 627592 598824 606412 530372 512757 495301 440627 478440 469573 495002 501576
$$ packed form
6788F764234K704l7774k20324j88173k43609l10473l60654k13830k67113k98136
6778D626852l28518j85033r0672j74319j09763j48762k3799K6122j06260M537
6768C490385O3514P0660Q5508N0607P6308M2769N6637L4942k4075j990q7768j28335
6756C729162p9590j29215j96594k25830j73261j79613j32230j91690j58183j84552
6746B078404j10594j04053j30943j12928j17267j14115j02612p3110l1822L6446
6736A217406L5411l5042p3866j0252o0710n8404N442l7076r4827M400J8836J2499
6724I23817q5029J5484J4275r1663J5957N0201l4564K6281J7491l2503j1669j5747
6712G92331j39696k5043k8768P588p6040j7615j7456n4674L7813q867K5429O574
$$ plain form
6700 501576 416954 424426 442398 466203 445791 412308 468531 444040 416992 497226 480500 482896
6688 482896 523593 501637 526889 495902 469056 416354 401896 384767 358228 372270 352934 405568
6676 405568 348620 353115 384278 379841 404588 401424 444089 356338 371510 353579 401576 361014
6664 361014 343163 324409 352688 332223 360609 369437 400140 357502 337731 417592 430496 441833
6652 441833 395940 395135 436377 496604 408984 450482 470160 455984 449832 472703 447140 451100
6640 451100 455568 496787 468779 418278 433125 411891 418168 445449 494176 453540 479693 458413
6628 458413 465261 463339 467061 495049 485834 508372 523926 483153 455615 444062 497621 511341
6616 511341 514966 488682 552860 557329 502953 526930 530945 615657 605510 531791 522818 574258
$$ packed form
6700E01576q4622P472J7972K3805k0412l3483N6223k4491k7048Q0234j6726K396
6688D82896M0697k1956K5252l0987k6846n2702j4458j7129k6539J4042j9336N2634
6676D05568n6948M495L1163m437K4747l164M2665q7751J5172j7931M7997m0562
6664C61014j7851j8754K8279k0465K8386Q828L0703m2638j9771P9861J2904J1337
6652D41833m5893q05M1242O0227q7620M1498J9678j4176o152K2871k5563L960
6640D51100M468M1219k8008n0501J4847k1234O277K7281M8727m0636K6153k1280
6628D58413O848j922L722K7988r215K2538J5554m0773k7538j1553N3559J3720
6616E11341L625k6284O4178M469n4376K3977M015Q4712j0147p3719q973N1440
$$ plain form
6604 574258 627025 610451 619073 628790 632297 662559 694935 654243 633505 704456 748786 713957
6592 713957 748597 704411 773864 845957 913876 933606 909059 911221 938112 1014417 1020849 1019995
6580 1019995 974740 998968 1017498 1050617 1005423 1033164 1042937 1009335 1048927 1016558 993959 1012394
6568 1012394 1034520 1062522 1082412 1138897 1183385 1186698 1224575 1351969 1385287 1374794 1414525
6557 1414525 1519519 1534420 1574995 1605525 1640527 1609799 1628455 1608057 1589500 1562918 1594493
6546 1594493 1494648 1362200 1292676 1272632 1238542 1198995 1273405 1217125 1146128 1105177 1182894
6535 1182894 1245651 1160956 1183053 1201162 1224773 1303588 1273158 1258452 1299955 1345941 1305805
6524 1305805 1279916 1363490 1408513 1339996 1301424 1336798 1396045 1416027 1369544 1337394 1260435
$$ packed form
6604E74258N2767j6574Q622R717L507L0262L2376m0692k0738P0951M4330l4829
6592G13957L4640m4186O9453P2093O7919J9730k4547K162K6891P6305O432q54
6580A019995m5255K4228J8530L3119m5194K7741R773l3602L9592l2369k2599J8435
6568A012394K2126K8002J9890N6485M4488L313L7877J27394L3318j0493L9731
6557A414525J04994J4901M0575L0530L5002l0728J8656k0398j8557k6582L1575
6546A594493r9845j32448o9524k0044l4090l9547P4410n6280p0997m0951P7717
6535A182894O2757q4695K2097J8109K3611P8815l0430j4706M1503M5986m0136
6524A305805k5889Q3574M5023o8517l8572L5374N9247J9982m6483l2150p6959
$$ plain form
6513 1260435 1276072 1255565 1259468 1265468 1258898 1325082 1300055 1336523 1280091 1268331 1286021 1335842
6501 1335842 1318552 1283023 1319866 1365799 1346583 1394330 1427563 1473873 1513899 1492033 1442939
6490 1442939 1520734 1605116 1642787 1689896 1676848 1757381 1758012 1778658 1802247 1878540 1938730 1940123
6478 1940123 1972425 2020694 2097473 2084591 2079394 2141103 2172843 2231399 2346298 2354257 2386560 2414562
6466 2414562 2471033 2552897 2655790 2726696 2759818 2877574 2972315 2958351 3105789 3257068 3327525
6455 3327525 3439156 3593955 3744718 3878798 4032713 4170745 4271346 4411463 4502987 4707197
6445 4707197 4835728 4922850 5153661 5331842 5463856 5662030 5869797 6111561 6370349 6574073
6435 6574073 6827940 7060264 7255812 7514328 7792445 8005689 8265329 8418724 8562343 8711208
$$ packed form
6513A260435J5637k0507L903O000o570O6184k5027L6468n6432j1760J7690M9821
6501A335842j7290l5529L6843M5933j9216M7747L3233M6310M0026k1866m9094
6490A442939P7795Q4382L7671M7109j3048Q0533O31K0646K3589P6293O0190J393
6478A940123L2302M8269P6779j2882n197O1709L1740N8556J14899P959L2303K8002
6466B414562N6471Q1864J02893P0906L3122J17756R4741j3964J47438J51279P0457
6455C327525J11631J54799J50763J34080J53915J38032J00601J40117R1524K04210
6445D707197J28531Q7122K30811J78181J32014J98174K07767K41764K58788K03724
6435F574073K53867K32324J95548K58516K78117K13244K59640J53395J43619J48865
$$ plain form
6425 8711208 8866412 8933444 9022098 9046030 9087074 9010783 8974011 8975878 8833417 8686792 8636466
6414 8636466 8470202 8211675 7978333 7736131 7542063 7287534 7021393 6840924 6596545 6329183
6404 6329183 6148721 5922396 5683094 5486898 5344689 5129153 4856330 4757754 4656232 4458581
6394 4458581 4378948 4276186 4187692 4042598 3983977 3812321 3709671 3651165 3568980 3544071 3405639
6383 3405639 3293280 3187803 3179193 3138801 3021669 2906045 2967847 2977550 2878738 2799173 2810055
6372 2810055 2706155 2698448 2672746 2623355 2609586 2584967 2648644 2644767 2678113 2674405 2629891 2590639
6360 2590639 2637305 2598590 2720518 2793191 2754328 2845912 2966213 2975169 3009874 3073855 3141815
6349 3141815 3323588 3403055 3523616 3635908 3670744 3717049 3753034 3853832 3885141 3858988 3846258
$$ packed form
6425H711208J55204O7032Q8654K3932M1044p6291l6772J867j42461j46625n0326
6414H636466j66264k58527k33342k42202j94068k54529k66141j80469k44379k67362
6404F329183j80462k26325k39302j96196j42209k15536k72823r8576j01522j97651
6394D458581p9633j02762q8494j45094n8621j71656j02650n8506q2185k4909j38432
6383C405639j12359j05477q610m0392j17132j15624O1802R703r8812p9565J0882
6372B810055j03900p707k5702m9391j3769k4619O3677l877L3346l708m4514l9252
6360B590639M6666l8715J21928P2673l8863R1584J20301Q956L4705O3981O7960
6349C141815J81773P9467J20561J12292L4836M6305L5985J00798L1309k6153j2730
$$ plain form
6338 3846258 3853284 3797191 3682696 3672552 3631012 3665567 3673926 3668209 3739048 3813086 3828149 3981831
6326 3981831 4155051 4330697 4561874 4720309 4882878 5044491 5190924 5311482 5408933 5461899
6316 5461899 5425740 5400796 5301758 5164086 4998308 4825330 4625711 4476443 4339610 4125509
6306 4125509 3950469 3830866 3735318 3599351 3564570 3542476 3495992 3433621 3444664 3521367 3575244
6295 3575244 3609662 3639625 3635618 3686310 3675720 3605757 3545415 3473052 3370728 3289182 3191083
6284 3191083 3102686 2924312 2819307 2762892 2641655 2493928 2436246 2366035 2317757 2214838
6274 2214838 2118299 2063317 2007972 1970959 1975489 1956628 1863975 1857570 1877616 1822637 1887133 1941199
6262 1941199 1870272 1809446 1799978 1815750 1768386 1732900 1713086 1723771 1636146 1609048 1590025 1572471
$$ packed form
6338C846258P026n6093j14495j0144m1540L4555Q359n717P0839P4038J5063J53682
6326C981831J73220J75646K31177J58435J62569J61613J46433J20558R7451N2966
6316E461899l6159k4944r9038j37672j65778j72978j99619j49268j36833k14101
6306D125509j75040j19603r5548j35967l4781k2094m6484o2371J1043P6703N3877
6295C575244L4418K9963m007N0692j0590o9963o0342p2363j02324q1546r8099
6284C191083q8397j78374j05005n6415j21237j47727n7682p0211m8278j02919
6274B214838r6539n4982n5345l7013M530j8861r2653o405K0046n4979O4496N4066
6262A941199p0927o0826r468J5772m7364l5486j9814J0685q7625k7098j9023j7554
$$ plain form
6250 1572471 1571460 1550460 1544836 1509570 1488693 1488200 1466791 1464913 1498650 1439743 1372173 1469808
6238 1469808 1473164 1460133 1463181 1421288 1447418 1387143 1359162 1415771 1370856 1333863 1308980 1343920
6226 1343920 1363438 1359275 1300809 1261866 1201209 1150970 1233238 1252430 1235713 1166006 1126462 1188866
6214 1188866 1168907 1173994 1237820 1288960 1251922 1279965 1238596 1188172 1218637 1283465 1293269 1264273
6202 1264273 1339636 1383685 1331973 1295348 1349741 1358282 1361622 1374938 1336419 1328950 1412890 1399359
6190 1399359 1464481 1486334 1463951 1389290 1334895 1399779 1417768 1447381 1396443 1411429 1485330
6179 1485330 1564283 1579486 1579946 1650914 1690380 1718256 1709839 1750753 1789151 1793862 1790206 1816499
6167 1816499 1916724 1924950 1897948 1961797 2010057 2028697 2108211 2180006 2170344 2129950 2150184 2122884
$$ packed form
6250A572471j011k1000n624l5266k0877m93k1409j878L3737n8907o7570R7635
6238A469808L356j3031L048m1893K6130o0275k7981N6609m4915l6993k4883L4940
6226A343920J9518m163n8466l8943o0657n0239Q2268J9192j6717o9707l9544O2404
6214A188866j9959N087O3826N1140l7038K8043m1369n0424L0465O4828R804k8996
6202A264273P5363M4049n1712l6625N4393Q541L340J3316l8519p469Q3940j3531
6190A399359O5122K1853k2383p4661n4395O4884J7989K9613n0938J4986P3901
6179A485330P8953J5203M60P0968L9466K7876q417M0914L8398M711l656K6293
6167A816499J00225Q226k7002O3849M8260J8640P9514P1795r662m0394K0234k7300
$$ plain form
6155 2122884 2083970 2123562 2200239 2283012 2289194 2335294 2381444 2425926 2409539 2390432 2473466 2529916
6143 2529916 2586743 2611671 2635394 2635800 2649673 2657404 2651238 2698316 2675676 2665713 2615219 2591730
6131 2591730 2568170 2614351 2598673 2601018 2619135 2610582 2661176 2662512 2742243 2764510 2766365 2801608
6119 2801608 2688483 2664286 2714975 2696114 2608004 2586849 2596326 2597192 2534852 2495855 2515238 2400116
6107 2400116 2420921 2592339 2605597 2598373 2585113 2568739 2618039 2706300 2834616 2789995 2784959
6096 2784959 2748850 2774184 3005557 3087864 3106523 3195636 3194285 3253666 3229844 3192805 3112978
6085 3112978 3075104 3100925 3065751 2983272 2965261 2929226 2919856 2914194 3023175 3040637 3137847 3173751
6073 3173751 3115111 3178421 3218213 3188184 3250683 3390682 3415556 3501182 3509865 3553003 3591616
$$ packed form
6155B122884l8914L9592P6677Q2773O182M6100M6150M4482j6387j9107Q3034N6450
6143B529916N6827K4928K3723M06J3873P731o166M7078k2640r963n0494k3489
6131B591730k3560M6181j5678K345J8117q553N0594J336P9731K2267J855L5243
6119B801608j13125k4197N0689j8861q8110k1155R477Q66o2340l8997J9383j15122
6107B400116K0805J71418J3258p224j3260j6374M9300Q8261J28316m4621n036
6096B784959l6109K5334K31373Q2307J8659Q9113j351N9381k3822l7039p9827
6085C112978l7874K5821l5174q2479j8011l6035r370n662J08981J7462R7210L5904
6073C173751n8640O3310L9792l0029O2499J39999K4874Q5626Q683M3138L8613
$$ plain form
6062 3591616 3633555 3802858 3869600 3938812 4045872 4073287 4070965 4163422 4268622 4337752 4508202
6051 4508202 4609261 4635912 4735456 4893732 5003619 5139569 5242117 5417071 5525946 5640358
6041 5640358 5758182 5915757 6072907 6240288 6406820 6570109 6796890 7032397 7219659 7428712
6031 7428712 7646601 7948436 8176321 8417619 8773083 8984307 9052131 9141719 9176056 9284893
6021 9284893 9434432 9651422 9823378 10037917 10327511 10590729 10908460 11217344 11515574 11892296
6011 11892296 12189812 12469602 12883607 13278512 13742353 14150903 14394537 14743439 15069229
6002 15069229 15365653 15699730 16012320 16379831 16731480 17080013 17443435 17783844 18234483
5993 18234483 18785058 19385565 20086858 20795195 21716147 22646167 23663541 24734661 25878372
$$ packed form
6062C591616M1939J69303O6742O9212J07060K7415k322R2457J05200O9130J70450
6051D508202J01059K6651R9544J58276J09887J35950J02548J74954J08875J14412
6041E640358J17824J57575J57150J67381J66532J63289K26781K35507J87262K09053
6031G428712K17889L01835K27885K41298L55464K11224O7824Q9588L4337J08837
6021I284893J49539K16990J71956K14539K89594K63218L17731L08884K98230L76722
6011A1892296K97516K79790M14005L94905M63841M08550K43634L48902L25790
6002A5069229K96424L34077L12590L67511L51649L48533L63422L40409M50639
5993A8234483N50575O00507P01293P08337R20952R30020J017374J071120J143711
$$ plain form
5984 25878372 27188154 28540000 29943956 31602404 33501881 35430651 37424971 39518378
5976 39518378 41642187 43704613 45569305 47211816 48528734 49467489 49901840 50035928 49849159
5967 49849159 49381155 48793219 48214506 47754469 47547873 47721123 48217813 48957354 50124081
5958 50124081 51766829 53778461 56182530 58904868 62062734 65501187 69060240 72670453
5950 72670453 76140193 79101893 81291144 82640710 83003721 82298967 80572495 77841135
5942 77841135 74436677 70738083 66939791 63262886 59883745 57033799 54651431 52828085
5934 52828085 51483650 50614788 50216680 50071402 50358683 50912710 51590295 52383187 53185966
5925 53185966 54001284 54539393 54758247 54474338 53741687 52477211 50689647 48460709 45922860
$$ packed form
5984B5878372J309782J351846J403956J658448J899477J928770J994320K093407
5976C9518378K123809K062426J864692J642511J316918R38755M34351J34088j86769
5967D9849159m68004n87936n78713m60037k06596J73250M96690P39541J166727
5958E0124081J642748K011632K404069K722338L157866L438453L559053L610213
5950G2670453L469740K961700K189251J349566L63011p04754j726472k731360
5942G7841135l404458l698594l798292l676905l379141k849946k382368j823346
5934E2828085j344435q68862l98108j45278K87281N54027O77585P92892Q02779
5925E3185966Q15318N38109K18854k83909p32651j264476j787564k228938k537849
$$ plain form
5916 45922860 43319354 40750430 38230993 35860068 33740873 31906582 30249980 28761302
5908 28761302 27522993 26476609 25602169 24753405 24041170 23417552 22879323 22495667 22243837
5899 22243837 22009524 21922346 21899580 21948200 21841680 21582969 21061929 20437801 19952159 19571933
5889 19571933 19261923 19129356 19138724 19253139 19483457 19724984 19979374 20217550 20327497 20311688
5879 20311688 20417956 20573115 20871331 21179181 21447998 21553997 21395603 21202773 21149874 21229994
5869 21229994 21500959 21942756 22380504 22645036 22595979 22284322 22022183 21843866 21776251 21963808
5859 21963808 22320587 22833885 23384836 24118398 24712814 25086188 25167640 25016728 24740858 24603653
5849 24603653 24617798 24707425 24946378 25294176 25444488 25581404 25821581 26156039 26581081 27139498
$$ packed form
5916D5922860k603506k568924k519437k370925k119195j834291j656602j488678
5908B8761302j238309j046384q74440q48764p12235o23618n38229l83656k51830
5899B2243837k34313q7178k2766M8620j06520k58711n21040o24128m85642l80226
5889A9571933l10010j32567R368J14415K30318K41527K54390K38176J09947j5809
5879B0311688J06268J55159K98216L07850K68817J05999j58394j92830n2899Q0120
5869B1229994K70965M41797M37748K64532m9057l11657k62139j78317o7615J87557
5859B1963808L56779N13298N50951P33562N94416L73374Q1452j50912k75870j37205
5849B4603653J4145Q9627K38953L47798J50312J36916K40177L34458M25042N58417
$$ plain form
5839 27139498 27927601 28713399 29590637 30485304 31456215 32628663 34173438 36086335 38295379
5830 38295379 40873672 43984637 47655814 51972188 56644371 61394380 65568322 67991909
5822 67991909 68041037 65788333 62505604 59382142 57179937 56075346 56015494 57080204 59104645
5813 59104645 61982444 65157836 68068535 70133001 71093941 71339383 71943067 73405664 75605649
5804 75605649 77789271 78870864 78028046 75441136 72053338 69008899 67092567 66421907
5796 66421907 66629357 66960116 66582575 64976801 62477915 59953322 58060222 57178276 57360460
5787 57360460 58617656 60813897 63683954 66558857 68375895 67800403 64335278 58635032
5779 58635032 52353239 46542137 41675503 37880665 34907974 32515790 30411318 28775318
$$ packed form
5839B7139498P88103P85798Q77238Q94667R70911J172448J544775J912897K209044
5830C8295379K578293L110965L671177M316374M672183M750009M173942K423587
5822F7991909M9128k252704l282729l123462k202205j104591n9852J064710K024441
5813E9104645K877799L175392K910699K064466R60940K45442O03684J462597K199985
5804G5605649K183622J081593q42818k586910l387798l044439j916332o70660
5796F6421907K07450L30759l77541j605774k498886k524593j893100q81946J82184
5787E7360460J257196K196241K870057K874903J817038n75492l465125n700246
5779E8635032o281793n811102m866634l794838k972691k392184k104472j636000
$$ plain form
5771 28775318 27395394 26204657 25132297 24200438 23395593 22632472 21938558 21302021 20667080
5762 20667080 20149044 19641904 19101403 18617094 18211420 17884006 17492642 17239097 16886680
5753 16886680 16567705 16224021 15886808 15620898 15380865 15198517 15139532 15238908 15236516 15405566
5743 15405566 15628013 15858432 16041663 16210735 16330399 16403938 16416528 16329590 16077544 15762131
5733 15762131 15331953 14936373 14462651 13981078 13555295 13078647 12658838 12317523 11993335
5724 11993335 11786518 11631526 11514300 11441275 11382590 11281789 11255217 11223152 11164505 11141388
5714 11141388 11063511 10933024 10737173 10494210 10208438 9856835 9524717 9201399 8840944 8595712
5704 8595712 8354871 8090800 7782347 7549340 7389719 7150728 6978265 6822783 6693651 6513482
$$ packed form
5771B8775318j379924j190737j072360r31859q04845p63121o93914o36537o34941
5762B0667080n18036n07140n40501m84309m05674l27414l91364k53545l52417
5753A6886680l18975l43684l37213k65910k40033j82348n8985R9376k392J69050
5743A5405566K22447K30419J83231J69072J19664P3539J2590q6938k52046l15413
5733A5762131m30178l95580m73722m81573m25783m76648m19809l41315l24188
5724A1993335k06817j54992j17226p3025n8685j00801k6572l2065n8647k3117
5714A1141388p7877j30487j95851k42963k85772l51603l32118l23318l60455k45232
5704H595712k40841k64071l08453k33007j59621k38991j72463j55482j29132j80169
$$ plain form
5694 6513482 6329085 6163769 6007111 5873692 5710933 5607302 5429690 5270413 5082683 4994891
5684 4994891 4917797 4907467 4819767 4705070 4679433 4599273 4527465 4484606 4448955 4418010 4354138
5673 4354138 4283643 4223569 4220816 4121046 4089222 4070457 4007506 4049604 3988463 3959168 3928316 3919171
5661 3919171 3862186 3892824 3889060 3891485 3855252 3745740 3753502 3757387 3670324 3585330 3578758 3557744
5649 3557744 3520363 3463971 3447144 3399415 3433811 3424128 3425319 3410752 3398045 3367089 3413361 3441157
5637 3441157 3453633 3579820 3582292 3537325 3566271 3554761 3514173 3422128 3417927 3421330 3395738 3407650
5625 3407650 3360148 3441892 3394493 3339636 3326754 3346349 3373851 3430134 3492464 3447625 3485558
5614 3485558 3459961 3467134 3502601 3558606 3624832 3598896 3623181 3676973 3614212 3554467 3595482 3638770
$$ packed form
5694F513482j84397j65316j56658j33419j62759j03631j77612j59277j87730q7792
5684D994891p7094j0330q7700j14697k5637q0160p1808m2859l5651l0945o3872
5673D354138p0495o0074k753r9770l1824j8765o2951M2098o1141k9295l0852r145
5661C919171n6985L0638l764K425l6233j09512P762L885q7063q4994o572k1014
5649C557744l7381n6392j6827m7729L4396r683J191j4567j2707l0956M6272K7796
5637C441157J2476J26187K472m4967K8946j1510m0588r2045m201L403k5592J1912
5625C407650m7502Q1744m7399n4857j2882J9595K7502N6283O2330m4839L7933
5614C485558k5597P173L5467N6005O6226k5936K4285N3792o2761n9745M1015M3288
$$ plain form
5602 3638770 3610361 3625722 3639454 3670611 3669828 3724356 3706748 3783204 3800870 3881937 3889298 3941928
5590 3941928 4053289 4083424 4193599 4219469 4271919 4346197 4417625 4464062 4542798 4581297 4577927
5579 4577927 4638449 4778707 4835210 4967571 5094550 5143209 5188899 5314553 5377695 5504101
5569 5504101 5578465 5653108 5712976 5866346 5969566 6115059 6202665 6315406 6390684 6489716 6619134
5558 6619134 6734162 6939078 7134231 7238059 7415185 7602697 7725304 7949052 8208390 8425725
5548 8425725 8570363 8681589 8884938 9146268 9443981 9721502 9970370 10198775 10444617 10705339
5538 10705339 11012554 11289625 11510259 11799322 12058369 12230367 12324559 12489949 12635790 12827880
5528 12827880 12984594 13168164 13374287 13616722 13913207 14197999 14462886 14768254 15087293
$$ packed form
5602C638770k8409J5361J3732L1157p83N4528j7608P6456J7666Q1067P361N2630
5590C941928J11361L0135J10175K5870N2450P4278P1428M6437P8736L8499l370
5579D577927O0522J40258N6503J32361J26979M8659M5690J25654O3142J26406
5569E504101P4364P4643N9868J53370J03220J45493Q7606J12741P5278R9032J29418
5558F619134J15028K04916J95153J03828J77126J87512J22607K23748K59338K17335
5548H425725J44638J11226K03349K61330K97713K77521K48868K28405K45842K60722
5538A0705339L07215K77071K20634K89063K59047J71998R4192J65390J45841J92090
5528A2827880J56714J83570K06123K42435K96485K84792K64887L05368L19039
$$ plain form
5519 15087293 15543298 15986156 16433771 16969135 17561499 18264431 18887888 19473818 20053326
5510 20053326 20631176 21090913 21407169 21687557 21866808 22108369 22347249 22611928 23010830
5501 23010830 23522969 24057543 24562505 25273967 26004742 26851525 27793856 28749636 29891836
5492 29891836 31036634 32243870 33522817 34823464 36280798 37882681 39520201 41339944
5484 41339944 43418966 45723872 48199632 50827476 53546650 56254444 58807481 61131892
5476 61131892 62867385 63975238 64449410 64219783 63543662 62647664 61657087 60856094 60158619
5467 60158619 59673843 59379469 59262583 59417932 59810338 60636719 62001619 63798856 66123874
5458 66123874 69055647 72503300 76438444 80654720 84981554 88766162 91672250 93033843
$$ packed form
5519A5087293M56005M42858M47615N35364N92364P02932O23457N85930N79508
5510B0053326N77850M59737L16256K80388J79251K41561K38880K64679L98902
5501B3010830N12139N34574N04962P11462P30775Q46783R42331R55780J142200
5492B9891836J144798J207236J278947J300647J457334J601883J637520J819743
5484D1339944K079022K304906K475760K627844K719174K707794K553037K324411
5476F1131892J735493J107853M74172k29627o76121q95998r90577q00993o97475
5467F0158619m84776k94374j16886J55349L92406Q26381J364900J797237K325018
5458F6123874K931773L447653L935144M216276M326834L784608K906088J361593
$$ plain form
5450 93033843 92588142 90255764 86473375 81805924 76769477 71961229 67615625 63933162
5442 63933162 60804954 58167648 55926760 54012402 52324209 51150446 50341426 49982712
5434 49982712 49940977 50277258 50842940 51533386 52188338 52887310 53467219 53557139 53066404 51979450
5424 51979450 50325273 48225540 45827588 43303078 40707522 38242868 36034207 33950913
5416 33950913 32159938 30548723 29075354 27827654 26839601 25920647 25083354 24313875 23686030
5407 23686030 23105597 22505205 21953265 21441368 20931190 20531887 20236657 20078803 19975092
5398 19975092 19975037 20051534 20277512 20518859 20772093 20990343 21083794 21106364 20899240 20570838 20078997
5387 20078997 19551074 19092922 18652036 18460329 18356674 18292290 18070674 17865816 17568032 17181249
$$ packed form
5450I3033843m45701k332378l782389m667451n036447m808248m345604l682463
5442F3933162l128208k637306k240888j914358j688193j173763q09020l58714
5434D9982712m1735L36281N65682O90446O54952O98972N79909Q9920m90735j086954
5424E1979450j654177k099733k397952k524510k595556k464654k208661k083294
5416C3950913j790975j611215j473369j247700r88053r18954q37293p69479o27845
5407B3686030n80433o00392n51940n11897n10178l99303k95230j57854j03711
5398A9975092n5P6497K25978K41347K53234K18250R3451K2570k07124l28402m91841
5387B0078997n27923m58152m40886j91707j03655o4384k21616k04858k97784l86783
$$ plain form
5377 17181249 16985977 16881254 16875452 17011931 17183656 17489756 17868033 18343357 19029236 19869807
5367 19869807 20801663 21488500 21738113 21421678 20732400 19788160 18894653 18199038 17678022
5358 17678022 17216023 16886421 16520184 16056613 15651983 15283665 14993838 14654220 14397956
5349 14397956 14113745 13907318 13643391 13398258 13265080 13199302 13124601 13099561 13116502 13105350
5339 13105350 13098235 13073899 13196125 13286509 13331462 13330306 13324220 13244572 13220470 13127937 12994099
5328 12994099 12903772 12768896 12644203 12539476 12458130 12413749 12411166 12377960 12424292 12520740 12524354
5317 12524354 12503910 12523359 12552889 12643196 12668544 12740602 12813477 12934342 12988093 13073630 13132914
5306 13132914 13166138 13154935 13246313 13393761 13477250 13580798 13628924 13804509 13950258 14117614
$$ packed form
5377A7181249j95272j04723n802J36479J71725L06100L78277M75324O85879Q40571
5367A9869807R31856O86837K49613l16435o89278r44240q93507o95615n21016
5358A7678022m61999l29602l66237m63571m04630l68318k89827l39618k56264
5349A4397956k84211k06427k63927k45133j33178o5778p4701k5040J6941j1152
5339A3105350p115k4336J22226R0384M4953j156o086p9648k4102r2533j33838
5328A2994099r0327j34876j24693j04727q1346m4381k583l3206M6332R6448L614
5317A2524354k0444J9449K9530R0307K5348P2058P2875J20865N3751Q5537N9284
5306A3132914L3224j1203R1378J47448Q3489J03548M8126J75585J45749J67356
$$ plain form
5296 14117614 14288147 14469421 14695824 14892944 15098833 15386403 15608612 15910305 16245074
5287 16245074 16462960 16604416 16793385 17002964 17178070 17381286 17553753 17735965 18088245
5278 18088245 18330570 18599107 18902921 19280218 19679951 20056044 20421595 20669180 20991980
5269 20991980 21438602 21869238 22262269 22638068 23108899 23634203 24284454 24985570 25656907
5260 25656907 26363169 27022425 27529631 28083527 28601358 29053249 29594922 30207721 30819765
5251 30819765 31470142 32090413 32745569 33489300 34355631 35271562 36268676 37420806 38686203
5242 38686203 40110738 41681755 43315976 44850641 46298666 47570095 48573067 49433627
5234 49433627 50362381 51275663 52241220 53487562 54910022 56551055 58302039 60075916 61891572
$$ packed form
5296A4117614J70533J81274K26403J97120K05889K87570K22209L01693L34769
5287A6245074K17886J41456J88969K09579J75106K03216J72467J82212L52280
5278A8088245K42325K68537L03814L77297L99733L76093L65551K47585L22800
5269B0991980M46622M30636L93031L75799M70831N25304O50251P01116O71337
5260B5656907P06262O59256N07206N53896N17831M51891N41673O12799O12044
5251C0819765O50377O20271O55156P43731Q66331R15931R97114J152130J265397
5242C8686203J424535J571017J634221J534665J448025J271429J002972Q60560
5234D9433627R28754R13282R65557J246342J422460J641033J750984J773877J815656
$$ plain form
5225 61891572 63502134 65067224 66799773 68744889 70694679 72537646 74273652 75829119
5217 75829119 77038653 78162132 79469578 81191850 83514627 86478295 89980493 93985271
5209 93985271 98097294 102314059 106764640 111649650 116973969 122383261 127524640 131327451
5201 131327451 132939019 132732714 131587947 130620229 130457136 131366506 133377229 136441449 140331125
5192 140331125 144398492 147673046 149228080 148869674 147504723 146388611 146367175 147903130
5184 147903130 150940917 154763851 158430495 160979860 162153753 162645093 163551872 165610638
5176 165610638 168840971 172385100 174670353 174708497 173168631 171454110 170934629 172613208
5168 172613208 176970382 184312875 194706391 208077162 223868821 241629033 260937545
$$ packed form
5225F1891572J610562J565090J732549J945116J949790J842967J736006J555467
5217G5829119J209534J123479J307446J722272K322777K963668L502198M004778
5209I3985271M112023M216765M450581M885010N324319N409292N141379L802811
5201A31327451J611568k06305j144767r67718j63093R09370K010723L064220L889676
5192A40331125M067367L274554J555034l58406j364951j116112k1436J535955
5184A47903130L037787L822934L666644K549365J173893M91340R06779K058766
5176A65610638L230333L544129K285253L8144j539866j714521n19481J678579
5168A72613208M357174P342493J0393516J3370771J5791659J7760212J9308512
$$ plain form
5161 260937545 281383149 303095904 326429344 350437955 372080395 386020083 386477961
5154 386477961 370957169 342051009 306087953 269540063 236357377 208188793 184971089
5147 184971089 165804817 149757935 136113316 124406841 114422883 105839629 98503736
5140 98503736 92116641 86371080 81132789 76254994 71587193 67334647 63674407 60363186
5132 60363186 57453256 54749709 52168057 49807308 47607630 45564470 43751595 42104521
5124 42104521 40529908 39252513 38031192 36847717 35716615 34600539 33512884 32488396
5116 32488396 31578322 30571062 29576398 28652751 27643528 26726519 25871501 25126224 24406607
5107 24406607 23695360 23019447 22325071 21698167 21185137 20684095 20234243 19801676 19302063
$$ packed form
5161B60937545K0445604K1712755K3333440K4008611K1642440J3939688M57878
5154C86477961j5520792k8906160l5963056l6547890l3182686k8168584k3217704
5147A84971089j9166272j6046882j3644619j1706475r983958q583254p335893
5140I8503736o387095n745561n238291m877795m667801m252546l660240l311221
5132F0363186k909930k703547k581652k360749k199678k043160j812875j647074
5124D2104521j574613j277395j221321j183475j131102j116076j087655j024488
5116C2488396r10074j007260r94664r23647j009223r17009q55018p45277p19617
5107B4406607p11247o75913o94376o26904n13030n01042m49852m32567m99613
$$ plain form
5098 19302063 18868884 18475420 18175790 17819440 17500340 17179793 16793790 16491456 16117124
5089 16117124 15837577 15627893 15447243 15229832 14951400 14782322 14498840 14294540 14092158
5080 14092158 13910484 13718708 13472689 13336238 13153110 13042489 12880331 12729322 12570397
5071 12570397 12488232 12470927 12418934 12361697 12209047 12086002 11981321 11905808 11780869 11764084
5061 11764084 11614963 11607992 11609841 11607430 11719730 11879742 12125765 12408782 12642114 12820558
5051 12820558 12802520 12683455 12506544 12274853 12101717 11867570 11711367 11584686 11532680 11543213
5041 11543213 11548097 11575711 11666127 11770288 11803362 11877140 12054843 12238151 12569383 12856801
5031 12856801 13184051 13614768 13896347 14169006 14576394 14943229 15440867 16112440 16860137
$$ packed form
5098A9302063m33179l93464k99630l56350l19100l20547l86003l02334l74332
5089A6117124k79547k09684j80650k17411k78432j69078k83482k04300k02382
5080A4092158j81674j91776k46019j36451j83128j10621j62158j51009j58925
5071A2570397q2165j7305n1993n7237j52650j23045j04681p5513j24939j6785
5061A1764084j49121o971J849k411J12300J60012K46023K83017K33332J78444
5051A2820558j8038j19065j76911k31691j73136k34147j56203j26681n2006J0533
5041A1543213M884K7614R0416J04161L3074P3778J77703J83308L31232K87418
5031A2856801L27250M30717K81579K72659M07388L66835M97638O71573P47697
$$ plain form
5022 16860137 17796314 18797989 19798330 20376479 20464107 20239995 19726804 19124144 18694077
5013 18694077 18371645 18179428 18092580 17889119 17559948 17104155 16560858 16039479 15566828 15090127
5003 15090127 14779084 14484316 14273914 14063539 13886253 13879994 13972515 14069449 14241685 14631497
4993 14631497 15029687 15456347 16035067 16662775 17424310 18078119 18342058 18203350 17597228
4984 17597228 16625218 15591148 14665267 13961167 13456102 13129543 12823111 12679566 12623175
4975 12623175 12595988 12653361 12782698 12980359 13305376 13701049 14136237 14495750 14833908 15213903
4965 15213903 15642531 16123478 16859413 17774166 18754221 19961055 21327979 22826776 24406664
4956 24406664 25974883 27111140 27644812 27361030 26267782 24591709 22722473 20977063
$$ packed form
5022A6860137R36177J001675J000341N78149Q7628k24112n13191o02660m30067
5013A8694077l22432j92217q6848k03461l29171m55793n43297n21379m72651m76701
5003A5090127l11043k94768k10402k10375j77286o259R2521R6934J72236L89812
4993A4631497L98190M26660N78720O27708P61535O53809K63939j38708o06122
4984A7597228r72010j034070r25881p04100n05065l26559l06432j43545n6391
4975A2623175k7187N7373J29337J97661L25017L95673M35188L59513L38158L79995
4965A5213903M28628M80947P35935R14753R80055J206834J366924J498797J579888
4956B4406664J568219J136257N33672k83782j093248j676073j869236j745410
$$ plain form
4948 20977063 19450162 18049338 16898546 15706533 14678229 13759613 12802439 12009501 11299028
4939 11299028 10756633 10268181 9772190 9304725 8984108 8738047 8495377 8287099 8093191
4930 8093191 7907780 7694395 7557293 7470563 7364165 7341707 7397566 7370641 7322497 7319874 7361816
4919 7361816 7400833 7551583 7650925 7885738 8028026 8063211 8068515 7990474 7881791 7758658 7666504
4908 7666504 7436380 7296001 7167836 6958617 6801432 6767153 6734847 6671502 6580151 6504998
4898 6504998 6442643 6332220 6203059 6137024 6082146 6000350 6030011 6092529 6035420 6055042 6142021
4887 6142021 6179549 6356179 6493646 6591253 6775115 6862764 6960307 7106797 7325356 7556046
4877 7556046 7590358 7482844 7214165 6976957 6797590 6661828 6576032 6490709 6500207 6515930 6384935
$$ packed form
4948B0977063j526901j400824j150792j192013j028304r18616r57174p92938p10473
4939A1299028n42395m88452m95991m67465l20617k46061k42670k08278j93908
4930H093191j85411k13385j37102q6730j06398k2458N5859k6925m8144k623M1942
4919G361816L9017J50750R9342K34813J42288L5185N304p8041j08683j23133r2154
4908G666504k30124j40379j28165k09219j57185l4279l2306o3345r1351p5153
4898F504998o2355j10423j29161o6035n4878q1796K9661O2518n7109J9622Q6979
4887F142021L7528J76630J37467R7607J83862Q7649R7543J46490K18559K30690
4877G556046L4312j07514k68679k37208j79367j35762q5796q5323R498J5723j30995
$$ plain form
4866 6384935 6241508 6178707 6214141 6231329 6259246 6318293 6360082 6420395 6380870 6364553 6406935
4855 6406935 6516183 6524218 6518986 6519880 6598632 6592783 6673905 6814917 6908589 6996257 7099270 7066435
4843 7066435 7089105 7192616 7173865 7210083 7380476 7601763 7763194 7895939 8105197 8171776
4833 8171776 8415921 8854352 9256979 9723043 10373194 11066034 11562405 11866476 11653025 11003886
4823 11003886 10320223 9781313 9289013 8898710 8610918 8468637 8362007 8322582 8261317 8156430
4813 8156430 8000428 7780146 7715161 7701567 7695721 7723381 7680206 7629663 7639397 7664508 7712757
4802 7712757 7824511 7968861 8128825 8239301 8448228 8612194 8709626 8840987 8984245 9104082
4792 9104082 9187353 9136979 9211680 9285389 9503543 9863835 10049611 10393589 10657566 10900179
$$ packed form
4866F384935j43427o2801L5434J7188K7917N9047M1789O0313l9525j6317M2382
4855F406935J09248Q035n232Q94P8752n849Q1122J41012R3672Q7668J03013l2835
4843G066435K2670J03511j8751L6218J70393K21287J61431J32745K09258O6579
4833H171776K44145M38431M02627M66064O50151O92840M96371L04071k13451o49139
4823A1003886o83663n38910m92300l90303k87792j42281j06630l9425o1265j04887
4813H156430j56002k20282o4985j3594n846K7660m3175n0543R734K5111M8249
4802G712757J11754J44350J59964J10476K08927J63966R7432J31361J43258J19837
4792I104082Q3271n0374P4701P3709K18154L60292J85776L43978K63977K42613
$$ plain form
4782 10900179 11115135 11292347 11566184 11821981 12089039 12471988 12740303 13038733 13340727
4773 13340727 13600035 13958589 14376547 14911731 15459529 16038287 16594437 17173921 17963169
4764 17963169 18969774 20174925 21500767 22880315 24370371 25867289 27584452 29749579
4756 29749579 32657041 36096606 39651991 42175908 42722925 40384065 36621130 33359060
4748 33359060 31048966 29509609 28612209 28108192 27764699 27497445 27266485 27291242 27452748
4739 27452748 27710879 28060350 28590298 29128244 29758297 30525805 31564435 32939057 34476612
4730 34476612 36338801 38536476 40964115 43531705 45647560 46726036 46313395 44870809
4722 44870809 43475015 42609578 42181033 42344369 43044037 44303059 46066251 48100803 50184563
$$ packed form
4782A0900179K14956J77212K73837K55797K67058L82949K68315K98430L01994
4773A3340727K59308L58554M17958N35184N47798N78758N56150N79484P89248
4764A7963169J006605J205151J325842J379548J490056J496918J717163K165127
4756B9749579K907462L439565L555385K523917N47017k338860l762935l262070
4748C3359060k310094j539357q97400n04017l43493k67254k30960K4757J61506
4739B7452748K58131L49471N29948N37946O30053P67508J038630J374622J537555
4730C4476612J862189K197675K427639K567590K115855J078476m12641j442586
4722D4870809j395794q65437m28545J63336O99668J259022J763192K034552K083760
$$ plain form
4713 50184563 52592192 55440376 59003003 63512902 69315997 76462961 85215821 95183563
4705 95183563 106273851 118990577 134414045 153023755 177627929 207966502 242803200
4698 242803200 275170165 293213119 285132930 251279777 208231054 170259724 141576627
4691 141576627 120577674 105723071 94293841 85337582 77764877 71022398 64987620 59712857
4683 59712857 54956677 51080959 47628979 44470577 41712229 39255007 37010778 34997750
4675 34997750 33162823 31714482 30408730 29285906 28277393 27439379 26774409 26217193 25476785
4666 25476785 24345886 22945648 21634834 20468301 19333053 18425509 17697584 17062302 16520810
4657 16520810 16018689 15611960 15140692 14688302 14220294 13976006 13819613 13693828 13551891
$$ packed form
4713E0184563K407629K848184L562627M509899N803095P146964Q752860R967742
4705I5183563J1090288J2716726J5423468J8609710K4604174L0338573L4836698
4698B42803200L2366965J8042954q080189l3853153m3048723l7971330k8683097
4691A41576627k0998953j4854603j1429230q956259p572705o742479o034778n274763
4683E9712857m756180l875718l451980l158402k758348k457222k244229k013028
4675C4997750j834927j448341j305752j122824j008513q38014o64970n57216p40408
4666B5476785j130899j400238j310814j166533j135248r07544p27925o35282n41492
4657A6520810n02121m06729m71268m52390m68008k44288j56393j25785j41937
$$ plain form
4648 13551891 13395891 13379019 13231784 13047421 12927889 12896313 12694080 12412783 12036188 11712818
4638 11712818 11375795 11134087 11001297 10819854 10750441 10634975 10467445 10300335 10214916 10223657
4628 10223657 10244337 10248584 10231065 10282106 10268564 10170049 10145011 10160394 10233351 10350026 10478573
4617 10478573 10576265 10597007 10503364 10512576 10546224 10631466 10753392 11055411 11413241 11769926 12168577
4606 12168577 12531468 12894202 13279410 13788042 14343978 15039160 15801001 16899512 18442053
4597 18442053 20490274 23027579 26012337 28469656 29491011 28191282 24949534 21338884
4589 21338884 18389373 16217430 14546826 13350466 12411246 11587511 10987070 10412581 9966620
4580 9966620 9603676 9313863 9067065 8805787 8623716 8530277 8433328 8391760 8318814 8253416
$$ packed form
4648A3551891j56000j6872j47235j84363j19532l1576k02233k81297l76595l23370
4638A1712818l37023k41708j32790j81443o9413j15466j67530j67110q5419Q741
4628A0223657K0680M247j7519N1041j3542r8515k5038J5383P2957J16675J28547
4617A0478573R7692K0742r3643R212L3648Q5242J21926L02019L57830L56685L98651
4606A2168577L62891L62734L85208N08632N55936O95182P61841J098511J542541
4597A8442053K048221K537305K984758K457319J021355j299729l241748l610650
4589B1338884k949511k171943j670604j196360r39220q23735o00441n74489m45961
4580I966620l62944k89813k46798k61278j82071r3439r6949m1568p2946o5398
$$ plain form
4570 8253416 8198152 8209255 8194801 8047246 7884373 7725876 7615994 7434738 7268312 7096115
4560 7096115 6974162 6973637 6962298 6966874 6906000 6922918 6999923 6956458 6883412 6873797 6841799 6755081
4548 6755081 6684264 6675974 6618633 6620958 6605967 6581686 6513358 6496116 6540269 6520086 6496343 6488757
4536 6488757 6587175 6586608 6627631 6637766 6570621 6588112 6589617 6587392 6614832 6670079 6666924 6667204 6727479
4523 6727479 6748496 6892602 6884284 6888762 6980120 6982747 7087710 7188797 7263778 7376211 7513267
4512 7513267 7704416 7868538 8100909 8418086 8759414 9189358 9671351 10103943 10689186 11433683
4502 11433683 12271752 13313417 14565683 15675371 16283735 16081019 15044667 13742030 12647404
4493 12647404 11920830 11380472 11044857 10938025 10889357 10893372 10921120 10855319 10841336 10926193 11091627
$$ packed form
4570H253416n5264J1103j4454j47555j62873j58497j09882j81256j66426j72197
4560G096115j21953n25j1339M576o0874J6918P7005m3465p3046r615l1998q6718
4548F755081p0817q290n7341K325j4991k4281o8328j7242M4153k0183k3743p586
4536F488757R8418n67M1023J0135o7145J7491J505k225K7440N5247l155K80O0275
4523F727479K1017J44106q318M478R1358K627J04963J01087P4981J12433J37056
4512G513267J91149J64122K32371L17177L41328M29944M81993M32592N85243P44497
4502A1433683Q38069J041665J252266J109688O08364k02716j036352j302637j094626
4493A2647404p26574n40358l35615j06832m8668M015K7748o5801j3983Q4857J65434
$$ plain form
4482 11091627 11254428 11362680 11439371 11504343 11629276 11661052 11715373 11822911 11859744 11998893
4472 11998893 12185447 12233309 12331338 12384408 12434043 12494614 12640480 12769697 12890866 13024726
4462 13024726 13194496 13332189 13562710 13734635 13955234 14191646 14327024 14441626 14536018 14674825
4452 14674825 14689186 14590842 14465528 14238953 13977190 13727357 13459664 13233593 12994035 12840835
4442 12840835 12651918 12517484 12343995 12160480 12074112 11898353 11773292 11587631 11378111 11224502
4432 11224502 11089857 11012323 10893599 10742227 10603473 10464717 10289297 10058246 9810813 9468449
4422 9468449 9160540 8903146 8582853 8315926 8036376 7774535 7487783 7270735 7081253 6908279
4412 6908279 6801488 6656523 6453128 6327679 6276038 6200638 6159831 6020029 5976710 5976739 5875385
$$ packed form
4482A1091627J62801J08252P6691O4972J24933L1776N4321J07538L6833J39149
4472A1998893J86554M7862R8029N3070M9635O0571J45866J29217J21169J33860
4462A3024726J69770J37693K30521J71925K20599K36412J35378J14602R4392J38807
4452A4674825J4361r8344j25314k26575k61763k49833k67693k26071k39558j53200
4442A2840835j88917j34434j73489j83515q6368j75759j25061j85661k09520j53609
4432A1224502j34645p7534j18724j51372j38754j38756j75420k31051k47433l42364
4422I468449l07909k57394l20293k66927k79550k61841k86752k17048j89482j72974
4412F908279j06791j44965k03395j25449n1641p5400m0807j39802m3319K9j01354
$$ plain form
4401 5875385 5816420 5792095 5806782 5805831 5807118 5801411 5803477 5805328 5758595 5739517 5770398 5782407 5808746
4388 5808746 5814500 5814777 5900566 5917633 6039895 6141112 6347931 6527808 6503037 6415930 6215443
4377 6215443 5997459 5749313 5607426 5491664 5436415 5327872 5292716 5306896 5301098 5235045 5252885
4366 5252885 5259078 5224500 5207646 5228758 5229828 5199975 5158077 5280359 5364829 5347238 5399883 5443615
4354 5443615 5420192 5487433 5554634 5604621 5674157 5732565 5783049 5920503 5932457 6004815 6115093
4343 6115093 6199358 6283770 6340480 6431580 6498971 6639483 6742531 6952461 7163058 7402976
4333 7402976 7558357 7723485 7936118 8169685 8496153 8805879 9109031 9358700 9615671 9839914
4323 9839914 10056575 10243817 10346283 10381091 10301824 10206696 9960144 9693377 9444970 9209123
$$ packed form
4401E875385n8965k4325J4687r51J287n707K066J851m6733j9078L0881J2009K6339
4388E808746N754K77Q5789J7067J22262J01217K06819J79877k4771q7107k00487
4377F215443k17984k48146j41887j15762n5249j08543l5156J4180n798o6053J7840
4366E252885O193l4578j6854K1112J070k9853m1898J22282Q4470j7591N2645M3732
4354E443615k3423O7241O7201M9987O9536N8408N0484J37454J1954P2358J10278
4343F115093Q4265Q4412N6710R1100O7391J40512J03048K09930K10597K39918
4333G402976J55381J65128K12633K33567L26468L09726L03152K49669K56971K24243
4323I839914K16661J87242J02466L4808p9267r5128k46552k66767k48407k35847
$$ plain form
4313 9209123 9025682 8911787 8829946 8743702 8767498 8793376 8739508 8760497 8832521 8938225 9040866
4302 9040866 9238822 9490748 9570041 9692244 9918253 10087087 10226514 10303655 10367543 10332118
4292 10332118 10185359 10080304 9979638 9872992 9821559 9723257 9749602 9809288 9849946 9944535
4282 9944535 10113139 10278455 10444996 10591696 10716443 10945827 11117201 11315109 11642339 11981267
4272 11981267 12389555 12797065 13065382 13520239 14020592 14644128 15421906 16189534 16979097
4263 16979097 17812649 18704674 19519470 20417116 21385488 22393727 23430413 24627549 26074644
4254 26074644 27601205 28994023 29973759 30400246 30168049 29221859 27657532 25636732 23559603
4245 23559603 21558883 19836502 18591449 17672165 17014833 16476508 15947648 15475695 15063343
$$ packed form
4313I209123j83441j13895q1841q6244K3796K5878n3868K0989P2024J05704J02641
4302I040866J97956K51926P9293J22203K26009J68834J39427P7141O3888l5425
4292A0332118j46759j05055j00666j06646n1433r8302K6345N9686M0658R4589
4282I944535J68604J65316J66541J46700J24747K29384J71374J97908L27230L38928
4272A1981267M08288M07510K68317M54857N00353O23536P77778P67628P89563
4263A6979097Q33552Q92025Q14796Q97646R68372J008239J036686J197136J447095
4254B6074644J526561J392818R79736M26487k32197r46190j564327k020800k077129
4245B3559603k000720j722381j245053r19284o57332n38325n28860m71953m12352
$$ plain form
4236 15063343 14695770 14265625 13836489 13321606 12734068 12222717 11740121 11309126 10908516
4227 10908516 10577557 10293517 10022401 9726682 9527497 9403444 9198267 9121269 9049904 8945142
4217 8945142 8916988 8801580 8760813 8689303 8652646 8705906 8753720 8784550 8807554 8840611 8740862
4206 8740862 8733288 8797231 8845149 8777235 8722441 8637110 8569377 8578173 8617882 8720609 8773416 8817932
4194 8817932 8896797 8903310 8939892 8995680 9073772 9188145 9356882 9417212 9410487 9495891 9583357
4183 9583357 9682681 9775063 9821184 9830898 9834047 9822028 9797131 9853487 9936621 10079793 10263798
4172 10263798 10410326 10558850 10676630 10787333 10918246 11085975 11320991 11615750 11861688
4163 11861688 12053043 12183957 12387718 12659879 12836151 13043602 13171400 13244538 13262013 13280656
$$ packed form
4236A5063343l67573m30145m29136n14883n87538n11351m82596m30995m00610
4227A0908516l30959k84040k71116k95719j99185j24053k05177p6998p1365j04762
4217H945142k8154j15408m0767p1510l6657N3260M7814L0830K3004L3057r9749
4206H740862p574O3943M7918o7914n4794q5331o7733Q796L9709J02727N2807M4516
4194H817932P8865O513L6582N5788P8092J14373J68737O0330o725Q5404Q7466
4183I583357R9324R2382M6121R714L149j2019k4897N6356Q3134J43172J84005
4172A0263798J46528J48524J17780J10703J30913J67729K35016K94759K45938
4163A1861688J91355J30914K03761K72161J76272K07451J27798P3138J7475J8643
$$ plain form
4153 13280656 13287283 13381117 13529064 13622604 13771860 13801753 13915605 14048748 14230454 14370946
4143 14370946 14630665 14870905 15069294 15251135 15532165 15773113 16051854 16402872 16705105
4134 16705105 17139596 17604731 18055142 18504124 18945179 19604983 20418507 21286012 22142105
4125 22142105 23110909 24094642 25279788 26743539 28403464 30362816 32584179 35225298
4117 35225298 38393371 41981508 46354922 51690476 57898639 64576809 71211977 76769398
4109 76769398 80444242 81897615 80940095 77568174 72376371 65863195 58695520 51746273
4101 51746273 45786843 41076690 37468930 34838674 32767054 31122426 29681040 28454911
4093 28454911 27273008 26210749 25350444 24686826 24195619 23620241 23116833 22696832 22314815
$$ packed form
4153A3280656O627R3834J47947R3540J49256K9893J13852J33143J81706J40492
4143A4370946K59719K40240J98389J81841K81030K40948K78741L51018L02233
4134A6705105M34491M65135M50411M48982M41055O59804Q13524Q67505Q56093
4125B2142105R68804R83733J185146J463751J659925J959352K221363K641119
4117C5225298L168073L588137M373414N335554O208163O678170O635168N557421
4109G6769398L674844J453373r57520l371921n191803o513176p167675o949247
4101E1746273n959430m710153l607760k630256k071620j644628j441386j226129
4093B8454911j181903j062259q60305o63618m91207n75378n03408m20001l82017
$$ plain form
4084 22314815 22070720 21988776 21961728 21893527 21843752 21540059 21198363 20971468 20679962 20555183
4074 20555183 20609187 20638548 20756018 20770992 20768501 20802479 20882268 21121960 21447607 21923218 22380470
4063 22380470 22697652 22920374 23065986 23256933 23539521 23930833 24391053 24727550 25002116
4054 25002116 25214244 25403958 25771247 26321673 26838954 27431998 27939134 28301800 28649286
4045 28649286 29018044 29567601 30239403 31100183 31800038 32400336 32937426 33443639 34036015
4036 34036015 34905765 36011871 37347304 38557821 39627872 40609684 41806165 43301165
4028 43301165 45331969 47785757 50694666 53554027 56448737 59644693 63770477 68695492
4020 68695492 75087642 83111608 93008067 104114369 116323650 129832282 146656044 166706403
$$ packed form
4084B2314815k44095q1944k7048o8201m9775l03693l41696k26895k91506j24779
4074B0555183N4004K9361J17470J4974k491L3978P9789K39692L25647M75611M57252
4063B2380470L17182K22722J45612J90947K82588L91312M60220L36497K74566
4054B5002116K12128J89714L67289N50426N17281N93044N07136L62666L47486
4045B8649286L68758N49557O71802Q60780O99855O00298N37090N06213N92376
4036C4036015Q69750J106106J335433J210517J070051R81812J196481J495000
4028D3301165K030804K453788K908909K859361K894710L195956M125784M925015
4020F8695492O392150Q023966R896459J1106302J2209281J3508632J6823762K0050359
$$ plain form
4012 166706403 194158407 229580384 273222932 317277594 345801766 341314357 294598476
4005 294598476 234175195 186595095 152492023 128327200 112399551 100077930 90428072
3998 90428072 82443325 75227184 68503750 62808790 57947739 54302584 50939595 47862630
3990 47862630 44644753 41631341 38993755 36647237 34840861 33565958 32581318 31669959
3982 31669959 30597361 29467545 28350990 27476704 26919920 26492021 26158341 25698228 25150042
3973 25150042 24503857 23873479 23343445 23119221 23036945 22953670 22847376 22608334 22201104 21850134
3963 21850134 21735097 21772362 21805878 21922757 21920308 21722801 21508559 21293881 21206119 21364593
3953 21364593 21468686 21660237 21678257 21587822 21489177 21544403 21629611 21714635 21930171 22071296
$$ packed form
4012A66706403K7452004L5421977M3642548M4054662K8524172m487409m6715881
4005B94598476o0423281m7580100l4103072k4164823j5927649j2321621r649858
3998I0428072p984747p216141o723434n694960m861051l645155l362989l076965
3990D7862630l217877l013412k637586k346518j806376j274903r84640r11359
3982C1669959j072598j129816j116555q74286n56784m27899l33680m60113n48186
3973B5150042o46185o30378n30034k24224q2276q3275j06294k39042m07230l50970
3963B1850134j15037L7265L3516J16879k449j97507k14242k14678q7762J58474
3953B1364593J04093J91551J8020r0435r8645N5226Q5208Q5024K15536J41125
$$ plain form
3943 22071296 22252325 22232848 22126107 22102823 22014194 21983013 21884345 21751205 21563449 21362704
3933 21362704 21153955 20994043 20925043 20878569 20840689 20708153 20643244 20539481 20537111 20678369
3923 20678369 20737172 20938289 21111898 21354360 21521597 21697176 21793775 22150039 22557787 22850304
3913 22850304 22960321 22879728 22821935 22755423 22617544 22598145 22579100 22530382 22421426 22247330
3903 22247330 22070098 21872223 21612660 21367146 21210086 20966231 20747139 20555657 20367972
3894 20367972 20287526 20247212 20300490 20316733 20386855 20400495 20423615 20472451 20551197 20640629 20766350
3883 20766350 20960772 21025612 21174770 21202869 21238642 21376275 21553900 21768446 21910081 22041042
3873 22041042 22133816 22185870 22208612 22313651 22449082 22557637 22664656 22757714 22821180 22911658
$$ packed form
3943B2071296J81029j9477j06741k3284q8629l1181r8668j33140j87756k00745
3933B1362704k08749j59912o9000m6474l7880j32536o4909j03763k370J41258
3923B0678369N8803K01117J73609K42462J67237J75579R6599L56264M07748K92517
3913B2850304J10017q0593n7793o6512j37879j9399j9045m8718j08956j74096
3903B2247330j77232j97875k59563k45514j57060k43855k19092j91482j87685
3894B0367972q0446m0314N3278J6243P0122J3640K3120M8836P8746Q9432J25721
3883B0766350J94422O4840J49158K8099L5773J37633J77625K14546J41635J30961
3873B2041042R2774N2054K2742J05039J35431J08555J07019R3058O3466R0478
$$ plain form
3863 22911658 23040833 23242426 23546926 23752212 23854389 24010693 23996436 23850425 23667793 23586761
3853 23586761 23553579 23465456 23433927 23408863 23407404 23451496 23478480 23459557 23354148 23132630 22769542
3842 22769542 22174957 21601815 21140034 20805999 20533282 20287496 20033108 19820726 19651037
3833 19651037 19491676 19347758 19275260 19398471 19571989 19739983 19858040 19933063 20045903 20142017
3823 20142017 20402702 20672864 20943189 21316292 21591629 21782870 21973543 22175682 22390249
3814 22390249 22561850 22681309 22672354 22537732 22321548 22196410 22090320 22153907 22269225 22350662
3804 22350662 22384731 22405439 22337486 22342322 22324714 22278022 22181588 22093854 22070392 22097968 22152070
3793 22152070 22247986 22414171 22631685 22745772 22761940 22667938 22509587 22474876 22520601 22649786
$$ packed form
3863B2911658J29175K01593L04500K05286J02177J56304j4257j46011j82632q1032
3853B3586761l3182q8123l1529k5064j459M4092K6984j8923j05409k21518l63088
3842B2769542n94585n73142m61781l34035k72717k45786k54388k12382j69689
3833A9651037j59361j43918p2498J23211J73518J67994J18057P5023J12840R6114
3823B0142017K60685K70162K70325L73103K75337J91241J90673K02139K14567
3814B2390249J71601J19459q955j34622k16184j25138j06090O3587J15318Q1437
3804B2350662L4069K0708o7953M836j7608m6692r6434q7734k3462K7576N4102
3793B2152070R5916J66185K17514J14087J6168r4002j58351l4711M5725J29185
$$ plain form
3783 22649786 22792252 22998082 23236051 23291444 23286372 23248229 23223920 23136037 23127601 23073102 23032020
3772 23032020 22967097 22770205 22722897 22702046 22804189 22813469 22798255 22716277 22642333 22627356 22611475
3761 22611475 22525628 22538265 22501092 22500472 22525108 22579454 22636474 22688727 22903211 23033469 23163240
3750 23163240 23335363 23369288 23452580 23521790 23611992 23650001 23734083 23868517 24058284 24347156
3740 24347156 24636125 25046404 25494973 25853574 26184660 26467653 26676576 26860341 27177250
3731 27177250 27519086 27860822 28161328 28702910 29197137 29636782 30084523 30458085 30661515
3722 30661515 30670827 30647646 30370216 29989345 29561958 29144553 28735081 28396581 28048534 27825325
3712 27825325 27613221 27403344 27236147 26967872 26672291 26243329 25748970 25336406 24947859
$$ packed form
3783B2649786J42466K05830K37969N5393n072l8143k4309q7883q436n4499m1082
3772B3032020o4923j96892m7308k0851J02143R280j5214q1978p3944j4977j5881
3761B2611475q5847J2637l7173o20K4636N4346N7020N2253K14484J30258J29771
3750B3163240J72123L3925Q3292O9210R0202L8009Q4082J34434J89767K88872
3740B4347156K88969M10279M48569L58601L31086K82993K08923J83765L16909
3731B7177250L41836L41736L00506N41582M94227M39645M47741L73562K03430
3722C0661515R312k3181k77430l80871m27387m17405m09472l38500l48047k23209
3712B7825325k12104k09877j67197k68275k95581m28962m94359m12564l88547
$$ plain form
3703 24947859 24594246 24341296 24183865 23986329 23795804 23740435 23578103 23354077 23175357 22922025
3693 22922025 22720888 22514191 22327363 22119988 21898962 21676382 21318037 20994891 20773227
3684 20773227 20556505 20404319 20238220 20091509 19923583 19655451 19577630 19545101 19462873 19324462
3674 19324462 19186451 19062057 18923285 18829050 18568556 18302193 18119626 17985517 17699658 17557490
3664 17557490 17479028 17422143 17462382 17533643 17559736 17602425 17731868 17652169 17433697 17288685 17177314
3653 17177314 17025026 16954422 16972372 16974173 16970236 16968008 16945853 16942776 16991471 17079003 17155011 17235154
3641 17235154 17386467 17399674 17459826 17527594 17556006 17599144 17711584 17730717 17669302 17675259 17730857
3630 17730857 17828101 17807335 17957844 18201178 18461735 18673325 18876332 19139735 19423072 19773656
$$ packed form
3703B4947859l53613k52950j57431j97536j90525n5369j62332k24026j78720k53332
3693B2922025k01137k06697j86828k07375k21026k22580l58345l23146k21664
3684B0773227k16722j52186j66099j46711j67926k68132p7821l2529q2228j38411
3674A9324462j38011j24394j38772r4235k60494k66363j82567j34109k85859j42168
3664A7557490p8462n6885M0239P1261K6093M2689J29443p9699k18472j45012j11371
3653A7177314j52288p0604J7950J801l937k228k2155l077M8695Q7532P6008Q0143
3641A7235154J51313J3207O0152O7768K8412M3138J12440J9133o1415N957N5598
3630A7730857R7244k0766J50509K43334K60557K11590K03007K63403K83337L50584
$$ plain form
3620 19773656 20143584 20611320 21092522 21442944 21772360 22065220 22358417 22616929 22665539 22698648
3610 22698648 22772701 22825466 22868735 22761102 22706888 22599389 22362773 22002686 21482450 21034637
3600 21034637 20489501 20093789 19819312 19521096 19276422 19092828 18899076 18728063 18692390 18698214
3590 18698214 18773928 18722745 18736607 18834285 18794043 18767657 18805332 18828663 18858842 18896317 18950163
3579 18950163 18999155 19086243 19299602 19403788 19462043 19591320 19753994 19867540 20010243 20330201
3569 20330201 20528287 20814773 21007022 21121050 21089618 20939988 20760995 20502053 20216089 19854685
3559 19854685 19411335 19013307 18600314 18151315 17875301 17639621 17427875 17259558 17124893
3550 17124893 17113773 17128009 17283276 17544915 17740806 17928920 18129323 18230274 18241255 18142558
$$ packed form
3620A9773656L69928M67736M81202L50422L29416K92860K93197K58512M8610L3109
3610B2698648P4053N2765M3269j07633n4214j07499k36616l60087n20236m47813
3600B1034637n45136l95712k74477k98216k44674j83594j93752j71013l5673N824
3590A8698214P5714n1183J3862R7678m0242k6386L7675K3331L0179L7475N3846
3579A8950163M8992Q7088K13359J04186N8255J29277J62674J13546J42703L19958
3569B0330201J98086K86486J92249J14028l1432j49630j78993k58942k85964l61404
3559A9854685m43350l98028m12993m48999k76014k35680k11746j68317j34665
3550A7124893j1120J4236J55267K61639J95891J88114K00403J00951J0981r8697
$$ plain form
3540 18142558 17884885 17663677 17424928 17166281 16840492 16620162 16508218 16310216 16112131
3531 16112131 16017353 15910088 15771134 15641068 15323240 15057671 14729054 14474288 14367087 14252883
3521 14252883 14130510 14077591 13899240 13750677 13592695 13397709 13304609 13222074 13148305 13098460
3511 13098460 12995515 12911204 12784174 12594735 12464365 12381441 12335870 12317216 12324829 12229026 12284523
3500 12284523 12315483 12353205 12319477 12285573 12305396 12341502 12308415 12284488 12185281 12100094 12089201
3489 12089201 12066248 12037222 12092630 12216126 12246867 12247889 12361222 12351509 12458832 12555945 12545250
3478 12545250 12589989 12665092 12686565 12848530 12896308 12882640 12929699 12930994 12863968 12812125 12879774
3467 12879774 12752661 12744758 12805515 12793593 12794423 12801569 12737634 12850668 12835093 12777425 12741562 12767475
$$ packed form
3540A8142558k57673k21208k38749k58647l25789k20330j11944j98002j98085
3531A6112131r4778j07265j38954j30066l17828k65569l28617k54766j07201j14204
3521A4252883j22373n2919j78351j48563j57982j94986r3100q2535p3769m9845
3511A3098460j02945q4311j27030j89439j30370q2924m5571j8654P613r5803N5497
3500A2284523L0960L7722l3728l3904J9823L6106l3087k3927r9207q5187j0893
3489A2089201k2953k9026N5408J23496L0741J022J13333r713J07323R7113j0695
3478A2545250M4739P5103K1473J61965M7778j3668M7059J295o7026n1843O7649
3467A2879774j27113p903O0757j1922Q30P146o3935J13034j5575n7668l5863K5913
$$ plain form
3455 12767475 12760983 12693278 12781014 12862851 12959340 12965046 13072233 13209782 13275569 13334288 13389645
3444 13389645 13393521 13460797 13497597 13586457 13562649 13550179 13428964 13417377 13352130 13262060 13272752
3433 13272752 13271199 13221788 13119205 13112451 13087383 13150030 13117493 13059740 13030977 13004380 12998744 13032397
3421 13032397 13011869 13084223 13118705 13120264 13122644 13088395 13109254 13165204 13184714 13311038 13379311
3410 13379311 13439903 13556240 13549017 13570841 13546842 13546096 13466109 13402754 13403821 13350228 13359404 13296941
3398 13296941 13292217 13264746 13326306 13388925 13396833 13388949 13429139 13484421 13608539 13591274 13658129 13765913
3386 13765913 13733287 13809526 13885456 13919912 13999992 14017596 14112983 14147535 14198940 14287104 14308464
3375 14308464 14379892 14408724 14466755 14499441 14520088 14600891 14575982 14686640 14730004 14863142 15019252
$$ packed form
3455A2767475o492o7705Q7736Q1837R6489N706J07187J37549O5787N8719N5357
3444A3389645L876O7276L6800Q8860k3808j2470j21215j1587o5247r0070J0692
3433A3272752j553m9411j02583o754k5068O2647l2537n7753k8763k6597n636L3653
3421A3032397k0528P2354L4482J559K380l4249K0859N5950J9510J26324O8273
3410A3379311O0592J16337p223K1824k3999p46p9987o3355J067n3593R176o2463
3398A3296941m724k7471O1560O2619P908p884M0190N5282J24118j7265O6855J07784
3386A3765913l2626P6239P5930L4456Q0080J7604R5387L4552N1405Q8164K1360
3375A4308464P1428K8832N8031L2686K0647Q0803k4909J10658M3364J33138J56110
$$ plain form
3364 15019252 15017389 15052346 15120520 15205096 15298546 15414636 15569566 15737371 15843177 16038910
3354 16038910 16147257 16209180 16326215 16439856 16585747 16765085 16926776 17089540 17218755 17437404
3344 17437404 17554468 17646400 17752599 17914039 17962073 18153766 18348761 18547863 18702654 18820215
3334 18820215 19045668 19212219 19420918 19554111 19726448 20010374 20260808 20515107 20794418
3325 20794418 20962910 21194352 21437355 21623871 21788471 22035344 22307985 22597098 22873230
3316 22873230 23155710 23531919 23846572 24078118 24333507 24536740 24754325 24940515 25189832
3307 25189832 25457724 25680236 25976267 26266280 26673410 27052228 27417291 27739333 28115927
3298 28115927 28472741 28912943 29358609 29779432 30252093 30742999 31216911 31688957 32221282
$$ packed form
3364A5019252j863L4957O8174Q4576R3450J16090J54930J67805J05806J95733
3354A6038910J08347O1923J17035J13641J45891J79338J61691J62764J29215K18649
3344A7437404J17064R1932J06199J61440M8034J91693J94995J99102J54791J17561
3334A8820215K25453J66551K08699J33193J72337K83926K50434K54299K79311
3325B0794418J68492K31442K43003J86516J64600K46873K72641K89113K76132
3316B2873230K82480L76209L14653K31546K55389K03233K17585J86190K49317
3307B5189832K67892K22512K96031K90013M07130L78818L65063L22042L76594
3298B8115927L56814M40202M45666M20823M72661M90906M73912M72046N32325
$$ plain form
3289 32221282 32796162 33393783 33997437 34608604 35191029 35753008 36331233 36951889 37541934
3280 37541934 38214080 38776473 39311074 39900495 40387580 40938943 41615924 42245736 42861684
3271 42861684 43499611 44125214 44765077 45434206 46165161 46974613 47775879 48599836 49534524
3262 49534524 50463457 51378557 52372797 53308101 54290540 55342013 56443282 57517867 58655998
3253 58655998 59829286 60901768 62029422 63050537 64218287 65346224 66511706 67562501
3245 67562501 68599371 69708183 70761335 71797290 72923306 74114760 75307559 76559179
3237 76559179 77894450 79271452 80685521 82146053 83750960 85375610 86971344 88690014
3229 88690014 90472577 92409419 94551646 96785085 99167462 101815251 104587239 107509609
$$ packed form
3289C2221282N74880N97621O03654O11167N82425N61979N78225O20656N90045
3280C7541934O72146N62393N34601N89421M87085N51363O76981O29812O15948
3271D2861684O37927O25603O39863O69129P30955Q09452Q01266Q23957R34688
3262D9534524R28933R15100R94240R35304R82439J051473J101269J074585J138131
3253E8655998J173288J072482J127654J021115J167750J127937J165482J050795
3245F7562501J036870J108812J053152J035955J126016J191454J192799J251620
3237G6559179J335271J377002J414069J460532J604907J624650J595734J718670
3229H8690014J782563J936842K142227K233439K382377K647789K771988K922370
$$ plain form
3221 107509609 110723044 114168319 117922616 122004232 126422859 131142726 136169762 141602971
3213 141602971 147457035 153663114 160191554 167087470 174231110 181580225 189053568 196636071
3205 196636071 204161690 211533587 218519352 224813675 229828466 233527750 235431653 235171197
3197 235171197 232579236 227691316 220847045 212504708 203484322 194529952 186043289 178212768
3189 178212768 171115463 164646805 158600940 153054611 147968046 143341326 139180745 135391396
3181 135391396 131888285 128623690 125610649 122771327 120012504 117385439 114710795 112166261
3173 112166261 109843843 107707005 105795127 104083266 102548980 101172945 99708310 97815098
3165 97815098 95416073 92574258 89501139 86434032 83523226 80825817 78421639 76149944
$$ packed form
3221A07509609L213435L445275L754297M081616M418627M719867N027036N433209
3213A41602971N854064O206079O528440O895916P143640P349115P473343P582503
3205A96636071P525619P371897O985765O294323N014791L699284J903903k60456
3197B35171197k591961m887920o844271q342337r020386q954370q486663p830521
3189A78212768p097305o468658o045865n546329n086565m626720m160581l789349
3181A35391396l503111l264595l013041k839322k758823k627065k674644k544534
3173A12166261k322418k136838j911878j711861j534286j376035j464635j893212
3165I7815098k399025k841815l073119l067107k910806k697409k404178k271695
$$ plain form
3157 76149944 74147532 72316916 70598030 69071263 67573140 66198129 64936258 63842568
3149 63842568 62844974 61953885 61212023 60606325 60157422 59715699 59418238 59233377 59171690 59244183
3139 59244183 59457243 59886367 60827345 61978597 63079273 63605022 62970260 61029595 58213077
3130 58213077 55354235 52732638 50577657 48935288 47647479 46557200 45584077 44665815
3122 44665815 43813385 43092223 42387790 41793862 41275827 40787153 40382878 39945199 39634579
3113 39634579 39479447 39357447 39229992 39204278 39180931 39077072 39109893 39261107 39501933 39876205
3103 39876205 40310026 40608581 40468350 39631274 38335281 37025104 35782412 34707625 33889757
3094 33889757 33292195 32696993 32171122 31684067 31225854 30744045 30307690 29938388 29676323
$$ packed form
3157G6149944k002412j830616j718886j526767j498123j375011j261871j093690
3149F3842568r97594q91089p41862o05698m48903m41723k97461j84861o1687P2493
3139E9244183K13060M29124R40978J151252J100676N25749o34762j940665k816518
3130E8213077k858842k621597k154981j642369j287809j090279r73123r18262
3122D4665815q52430p21162p04433n93928n18035m88674m04275m37679l10620
3113C9634579j55132j22000j27455k5714k3347j03859L2821J51214K40826L74272
3103C9876205M33821K98555j40231q37076j295993j310177j242692j074787q17868
3094C3889757n97562n95202n25871m87055m58213m81809m36355l69302k62065
$$ plain form
3085 29676323 29352622 28979830 28735263 28473851 28254932 27997584 27735510 27498482 27336608
3076 27336608 27190605 27009919 26759858 26569221 26374341 26145221 25961856 25726690 25512582
3067 25512582 25361391 25153404 25033742 24951222 24825742 24697645 24525297 24352296 24332921 24217817
3057 24217817 24098187 23965736 23963965 23860069 23691186 23599003 23524461 23366065 23304125 23261551
3047 23261551 23108396 23013269 22860694 22800551 22687185 22572638 22436296 22373049 22257635 22106739
3037 22106739 21957431 21749540 21604377 21482524 21344398 21218346 21110523 20935475 20805772
3028 20805772 20638532 20497548 20327183 20206328 20080656 19919546 19798496 19572290 19492947 19405507
3018 19405507 19269317 19113545 19018812 18886212 18747440 18656930 18584620 18508531 18428815 18326296
$$ packed form
3085B9676323l23701l72792k44567k61412k18919k57348k62074k37028j61874
3076B7336608j46003j80686k50061j90637j94880k29120j83365k35166k14108
3067B5512582j51191k07987j19662q2520j25480j28097j72348j73001j9375j15104
3057B4217817j19630j32451j771j03896j68883r2183p4542j58396o1940m2574
3047B3261551j53155r5127j52575o0143j13366j14547j36342o3247j15414j50896
3037B2106739j49308k07891j45163j21853j38126j26052j07823j75048j29703
3028B0805772j67240j40984j70365j20855j25672j61110j21050k26206p9343q7440
3018A9405507j36190j55772r4733j32600j38772r0510p2310p6089p9716j02519
$$ plain form
3008 18326296 18167407 18065434 17964335 17862616 17706205 17599864 17443537 17329348 17216159
2999 17216159 17020267 16892295 16781615 16648188 16561708 16451652 16334558 16343090 16262458 16124750
2989 16124750 16024273 15990486 15964844 15908895 15810302 15788012 15821469 15764777 15740073 15791398 15779282
2978 15779282 15774986 15786187 15784756 15771426 15859313 15939078 16009147 16011218 16031368 16026325 16096128 16092895
2966 16092895 16134533 16178054 16221702 16319356 16441017 16545952 16662170 16770701 16866692 17032411
2956 17032411 17210060 17429834 17623351 17767711 17970534 18124836 18350728 18595186 18820264
2947 18820264 19050186 19216482 19499850 19781891 20113620 20401061 20784451 21211683 21681793
2938 21681793 22103627 22597651 23046782 23424063 23789704 24080370 24205468 24253205 24229053 24291253
$$ packed form
3008A8326296j58889j01973j01099j01719j56411j06341j56327j14189j13189
2999A7216159j95892j27972j10680j33427q6480j10056j17094Q532q0632j37708
2989A6124750j00477l3787k5642n5949r8593k2290L3457n6692k4704N1325j2116
2978A5779282m296J1201j431j3330Q7887P9765P0069K071K0150n043O9803l233
2966A6092895M1638M3521M3648R7654J21661J04935J16218J08531R5991J65719
2956A7032411J77649K19774J93517J44360K02823J54302K25892K44458K25078
2947A8820264K29922J66296K83368K82041L31729K87441L83390M27232M70110
2938B1681793M21834M94024M49131L77281L65641K90666J25098M7737k4152O2200
$$ plain form
2928 24291253 24358265 24436607 24666657 24886161 25248505 25690862 26085546 26609547 27072532 27453373
2918 27453373 27762120 28134511 28433026 28836273 29283426 29744897 30321535 30852873 31596002
2909 31596002 32407596 33326163 34251332 35189261 36244238 37338837 38545099 39743545 40884975
2900 40884975 41815213 42476712 43133048 43830107 44481539 45158104 46015813 46905423 47789289
2891 47789289 48635066 49452500 50256851 51092534 51799807 52460856 53027955 53510763 53989764
2882 53989764 54556895 55272976 56079915 57108974 58199956 59393691 60861297 62374464 64049728
2873 64049728 65815350 67639822 69648385 71754380 73845405 75910148 77919367 79809264
2865 79809264 81423652 82824779 83998180 84844995 85202324 84861234 83756647 82124011 80213437
$$ packed form
2928B4291253O7012P8342K30050K19504L62344M42357L94684N24001M62985L80841
2918B7453373L08747L72391K98515M03247M47153M61471N76638N31338P43129
2909C1596002Q11594R18567R25169R37929J054977J094599J206262J198446J141430
2900D0884975R30238O61499O56336O97059O51432O76565Q57709Q89610Q83866
2891D7789289Q45777Q17434Q04351Q35683P07273O61049N67099M82808M79001
2882E3989764N67131P16081Q06939J029059J090982J193735J467606J513167J675264
2873F4049728J765622J824472K008563K105995K091025K064743K009219J889897
2865G9809264J614388J401127J173401Q46815L57329l41090j104587j632636j910574
$$ plain form
2856 80213437 78543706 77379787 76645964 76276252 76151420 76320454 76733591 77300721 78038686
2847 78038686 78886431 79818809 80789255 81769522 82822435 83872779 84892305 85954235 86824941
2838 86824941 87393299 87638510 87423795 86746067 85450349 83949755 82228149 80407774 78521749
2829 78521749 76360847 74062558 71914454 70069139 68591229 67260525 66254881 65341326
2821 65341326 64579627 63942844 63299694 62763057 62298081 61806617 61163142 60392460 59555771
2812 59555771 58671446 57598045 56374701 55070835 53535173 51701804 49679777 47546031
2804 47546031 45390267 43290652 41367711 39575126 37951209 36510332 35117693 33895235
2796 33895235 32865797 31954822 31090211 30181322 29418111 28677935 27917373 27251462 26554796
$$ packed form
2856H0213437j669731j163919p33823l69712j24832J69034M13137N67130P37965
2847G8038686Q47745R32378R70446R80267J052913J050344J019526J061930Q70706
2838H6824941N68358K45211k14715o77728j295718j500594j721606j820375j886025
2829G8521749k160902k298289k148104j845315j477910j330704j005644r13555
2821F5341326p61699o36783o43150n36637m64976m91464o43475p70682q36689
2812E9555771q84325j073401j223344j303866j535662j833369k022027k133746
2804D7546031k155764k099615j922941j792585j623917j440877j392639j222458
2796C3895235j029438r10975q64611r08889p63211p40176p60562o65911o96666
$$ plain form
2787 26554796 25901679 25282544 24668644 24069494 23441333 22810662 22194640 21633736 21041926
2778 21041926 20451568 20024812 19494454 18994900 18489400 18019590 17584507 17126705 16722204
2769 16722204 16312410 15922588 15522867 15191911 14965507 14656407 14263769 13956109 13731109
2760 13731109 13489166 13224789 13030333 12842166 12666233 12550076 12361434 12192677 12038659
2751 12038659 11827380 11708366 11558768 11364321 11173158 11066186 10831573 10617869 10490097
2742 10490097 10337790 10067842 9812575 9679360 9470728 9273223 9092821 8865146 8679557
2733 8679557 8465903 8365678 8270882 8201045 8068440 7934715 7768782 7721977 7622218 7517925
2723 7517925 7464065 7389318 7357564 7209668 7059767 6993083 6900107 6800380 6664146 6532148 6410693
$$ packed form
2787B6554796o53117o19135o13900n99150o28161o30671o16022n60904n91810
2778B1041926n90358m26756n30358m99554n05500m69810m35083m57802m04501
2769A6722204m09794l89822l99721l30956k26404l09100l92638l07660k25000
2760A3731109k41943k64377j94456j88167j75933j16157j88642j68757j54018
2751A2038659k11279j19014j49598j94447j91163j06972k34613k13704j27772
2742A0490097j52307k69948k55267j33215k08632j97505j80402k27675j85589
2733H679557k13654j00225r4796o9837j32605j33725j65933m6805r9759j04293
2723G517925n3860p4747l1754j47896j49901o6684r2976r9727j36234j31998j21455
$$ plain form
2712 6410693 6274565 6117963 5990642 5931204 5896911 5764660 5585187 5483487 5396650 5229243
2702 5229243 5140883 5093372 5031212 4968407 4961120 4877230 4796059 4724339 4670330 4658858 4567567 4459044
2690 4459044 4410022 4293068 4224793 4183256 4130838 4073222 4060993 4012457 3930608 3922721 3825667
2679 3825667 3809578 3751785 3755177 3714036 3682387 3632546 3535118 3474997 3495316 3440298 3407504 3383174
2667 3383174 3312234 3266112 3274297 3221046 3205925 3222641 3213242 3208794 3182445 3089338 3061944 3074523
2655 3074523 3055207 3023776 2975209 2921047 2918554 2885108 2878358 2846443 2862165 2915897 2862188 2838496
2643 2838496 2723304 2725013 2773265 2679866 2642532 2595949 2644886 2559796 2562949 2581768 2630267 2599110
2631 2599110 2570908 2530786 2530122 2550001 2426183 2398081 2474673 2498341 2526135 2456014 2462159 2421565
$$ packed form
2712F410693j36128j56602j27321n9438l4293j32251j79473j01700q6837j67407
2702E229243q8360m7511o2160o2805p287q3890q1171p1720n4009j1472r1291j08523
2690D459044m9022j16954o8275m1537n2418n7616j2229m8536q1849p887r7054
2679C825667j6089n7793L392m1141l1649m9841r7428o0121K0319n5018l2794k4330
2667C383174p0940m6122Q185n3251j5121J6716r399m448k6349r3107k7394J2579
2655C074523j9316l1431m8567n4162k493l3446o750l1915J5722N3732n3709k3692
2643B838496j15192J709M8252r3399l7334m6583M8937q5090L153J8819M8499l1157
2631B599110k8202m0122o64J9879j23818k8102P6592K3668K7794p0121O145m0594
$$ plain form
2619 2421565 2394271 2456286 2478453 2470758 2420820 2397030 2401462 2357232 2318225 2352591 2311716 2313848
2607 2313848 2339399 2275675 2304817 2368069 2254308 2239009 2250410 2258552 2251711 2251344 2239154 2230113
2595 2230113 2092136 2135643 2190358 2201325 2281653 2245164 2200803 2181288 2169036 2189661 2198060
2584 2198060 2250624 2299948 2244210 2208353 2217044 2157081 2132905 2144242 2211759 2216547 2209315 2206502
2572 2206502 2137995 2077560 2075054 2102738 2101665 2046151 2036398 2018803 1962662 1963208 2062959 2028325
2560 2028325 1939815 1991940 1965927 1942345 1959129 1900869 1943917 1970149 1989273 2005863 1904958
2549 1904958 1840478 1843816 1836403 1904836 1909339 1902339 1795796 1758691 1765859 1710736 1692617 1724706
2537 1724706 1759986 1710630 1726525 1714107 1598722 1599931 1593864 1569115 1570636 1600915 1580466 1556473
$$ packed form
2619B421565k7294O2015K2167p695m9938k3790M432m4230l9007L4366m0875K132
2607B313848K5551o3724K9142O3252j13761j5299J1401Q142o841l67j2190r041
2595B230113j37977M3507N4715J0967Q0328l6489m4361j9515j2252K0625Q399
2584B198060N2564M9324n5738l5857Q691n9963k4176J1337O7517M788p232k813
2572B206502o8507o0435k506K7684j073n5514r753j7595n6141N46R9751l4634
2560B028325q8510N2125k6013k3582J6784n8260M3048K6232J9124J6590j00905
2549A904958o4480L338p413O8433M503p000j06543l7105P168n5123j8119L2089
2537A724706L5280m9356J5895j2418j15385J209o067k4749J521L0279k0449k3993
$$ plain form
2525 1556473 1571908 1505272 1511205 1517498 1452021 1440372 1444693 1477591 1509101 1432823 1424856 1440268
2513 1440268 1457402 1443187 1325987 1310735 1342811 1268634 1255796 1242211 1234628 1235287 1251923 1294465
2501 1294465 1277044 1273866 1296242 1224417 1235829 1245336 1192815 1194251 1167040 1094290 1118308 1136229
2489 1136229 1148085 1136793 1142118 1105175 1064343 1101636 1162328 1140134 1078600 1124045 1106904 1035961
2477 1035961 961416 964400 994959 996470 1029174 1034344 1011706 975185 1011588 1011771 1041434 1087020
2465 1087020 978213 925035 940124 979441 973049 946383 908758 838242 841809 813696 831362 820057
2453 820057 899264 942071 897287 829774 782395 770234 750024 714006 717734 792525 809048 816662
2441 816662 814696 832466 749673 741430 741412 712169 782017 826185 777728 741073 739589 703162 699088
$$ packed form
2525A556473J5435o6636N933O293o5477j1649M321L2898L1510p6278p967J5412
2513A440268J7134j4215j17200j5252L2076p4177j2838j3585p583O59J6636M2542
2501A294465j7421l178K2376p1825J1412R507n2521J436k7211p2750K4018J7921
2489A136229J1856j1292N325l6943m0832L7293O0692k2194o1534M5445j7141p0943
2477A035961p4545K984L0559J511L2704N170k2638l6521L6403J83K9663M5586
2465A087020j08807n3178J5089L9317o392k6666l7625p0516L567k8113J7666j1305
2453H20057P9207M2807m4784o7513m7379j2161k0210l6018L728P4791J6523P614
2441H16662j966J7770q2793q243j8k9243O9848M4168m8457l6655j484l6427m074
$$ plain form
2428 699088 683255 718251 707267 681989 659313 631060 661409 670737 711050 811587 733503 709152
2416 709152 755663 696680 669104 626012 669430 696826 664842 629176 569249 587184 597183 631611
2404 631611 608147 629966 618339 587331 548326 515009 554077 571679 526668 491633 510376 518620
$$ packed form
2428F99088j5833L4996j0984k5278k2676k8253L0349R328M0313J00537p8084k4351
2416G09152M6511n8983k7576m3092M3418K7396l1984l5666n9927J7935R999L4428
2404F31611k3464K1819j1627l1008l9005l3317L9068J7602m5011l5035J8743Q244
$$ [...]
##END NTUPLES=NMR SPECTRUM
##END=
