##TITLE=1H_EC-3321(2)XY
 DMSO
 8 sc, 
 1.4.2024
##JCAMPDX= 6.0         $$ Bruker NMR JCAMP-DX V2.0
##DATA TYPE= NMR SPECTRUM
##DATA CLASS= NTUPLES
##ORIGIN= UXNMR, Bruker Analytische Messtechnik GmbH
##OWNER= root
$$ XWIN-NMR		Version 3.5
$$ Mon Apr  1 16:03:58 2024 Russian Standard Time (UT+4h)  she@DPX200
##.OBSERVE FREQUENCY= 200.1312
##.OBSERVE NUCLEUS= ^1H
##.ACQUISITION MODE= SIMULTANEOUS
##.ACQUISITION SCHEME= undefined
##.AVERAGES= 8
##.DIGITISER RES= 18
##SPECTROMETER/DATA SYSTEM= spect
##.PULSE SEQUENCE= zg30
##.SOLVENT NAME= D2O
##.SHIFT REFERENCE= (INTERNAL, D2O, 0, 16.7672)
##AUDIT TRAIL= $$ (NUMBER, WHEN, WHO, WHERE, WHAT)
$$ ##TITLE= Audit trail, XWIN-NMR		Version 3.5
$$ ##JCAMPDX= 5.01
$$ ##ORIGIN= Bruker BioSpin GmbH
$$ ##OWNER= she
$$ F:/spectra/data/she/nmr/H-F/1/pdata/1/auditp.txt
$$ ##AUDIT TRAIL=  $$ (NUMBER, WHEN, WHO, WHERE, WHAT)
(   1,<2024-04-01 16:02:19.71 +0400>,<she>,<DPX200>,
      <created by zg, POWCHK disabled, PULCHK disabled
       configuration hash MD5:
       00 E9 B6 7A A2 85 ED C7 34 08 36 98 17 FE 4E 26
       data hash MD5: 16K
       F4 54 AB 23 F6 04 4C 5F 48 2D EB F8 70 33 32 62>)
(   2,<2024-04-01 16:02:55.17 +0400>,<she>,<DPX200>,
      <Start of raw data processing
       efp BC_mod = 2 LB = 0.24 FT_mod = 6 PKNL = 1 PHC0 = -25377.82 PHC1 = 7.387311 SI = 16K 
       data hash MD5: 16K
       E1 60 EE 3C C8 A9 18 C3 C5 FC 4E 38 62 59 DF 74>)
(   3,<2024-04-01 16:03:09.73 +0400>,<she>,<DPX200>,
      <pk PHC0 = 83.77464 PHC1 = -8.199999 
       data hash MD5: 16K
       93 8F 06 57 EF 73 4F 4F B1 17 21 86 E7 B4 A5 10>)
(   4,<2024-04-01 16:03:12.95 +0400>,<she>,<DPX200>,
      <abs ABSG = 5 
       data hash MD5: 16K
       30 C8 F2 5C 62 25 A1 63 12 31 06 1D 42 A7 C7 0D>)
$$ ##END=
$$ 
$$ hash MD5
$$ 0A 28 19 D5 08 50 18 32 DD F1 5C 6C E5 74 18 AC
##$RELAX= 
##$RELAX= 
##$RELAX= 
##$RELAX= 
##$RELAX= 
##$RELAX= 
$$ Bruker specific parameters
$$ --------------------------
##$DU= <F:/spectra>
##$EXPNO= 1
##$NAME= <H-F>
##$PROCNO= 1
##$TYPE= <nmr>
##$USER= <she>
##$AMP= (0..31)
100 100 100 100 100 100 100 100 100 100 100 100 100 100 100 100 100 100 
100 100 100 100 100 100 100 100 100 100 100 100 100 100 
##$AQSEQ= 0
##$AQ_mod= 1
##$AUNM= <au_zg>
##$AUTOPOS= <>
##$BF1= 200.13
##$BF2= 200.13
##$BF3= 200.13
##$BF4= 200.13
##$BF5= 200.13
##$BF6= 200.13
##$BF7= 200.13
##$BF8= 200.13
##$BYTORDA= 1
##$CFDGTYP= 0
##$CFRGTYP= 5
##$CHEMSTR= <none>
##$CNST= (0..31)
1 1 145 1 1 1 1 1 1 1 1 1 1 1 1 1 1 1 1 1 1 1 1 1 1 1 1 1 1 1 1 1 
##$CPDPRG= <>
##$CPDPRG1= <>
##$CPDPRG2= <>
##$CPDPRG3= <>
##$CPDPRG4= <mlev>
##$CPDPRG5= <mlev>
##$CPDPRG6= <mlev>
##$CPDPRG7= <mlev>
##$CPDPRG8= <mlev>
##$CPDPRGB= <>
##$CPDPRGT= <>
##$D= (0..31)
0 1.2 0 0 0 0 0 0 0 0.06 0 0.03 0 0 0 0 0.0002 0 0 0 0 0 0 0 0 0 0 0 0 
0 0 0 
##$DATE= 1711972939
##$DBL= (0..7)
120 120 120 120 120 120 120 120 
##$DBP= (0..7)
150 150 150 150 150 150 150 150 
##$DBP07= 0
##$DBPNAM0= <>
##$DBPNAM1= <>
##$DBPNAM2= <>
##$DBPNAM3= <>
##$DBPNAM4= <>
$$ [...]
##$SUBNAM3= <"">
##$SUBNAM4= <"">
##$SUBNAM5= <"">
##$SUBNAM6= <"">
##$SUBNAM7= <"">
##$SUBNAM8= <"">
##$SUBNAM9= <"">
##$SW= 18.0517418723606
##$SWIBOX= (0..15)
0 0 2 0 0 0 0 0 0 0 0 0 0 0 0 0 
##$SW_h= 3612.71676300578
##$TD= 16384
##$TD0= 1
##$TE= 0
##$TE2= 300
##$TE3= 300
##$TEG= 300
##$TL= (0..7)
0 120 120 120 120 120 120 120 
##$TP= (0..7)
150 150 150 150 150 150 150 150 
##$TP07= 0
##$TPNAME0= <>
##$TPNAME1= <>
##$TPNAME2= <>
##$TPNAME3= <>
##$TPNAME4= <>
##$TPNAME5= <>
##$TPNAME6= <>
##$TPNAME7= <>
##$TPOAL= (0..7)
0.5 0.5 0.5 0.5 0.5 0.5 0.5 0.5 
##$TPOFFS= (0..7)
0 0 0 0 0 0 0 0 
##$TUNHIN= 0
##$TUNHOUT= 0
##$TUNXOUT= 0
##$USERA1= <user>
##$USERA2= <user>
##$USERA3= <user>
##$USERA4= <user>
##$USERA5= <user>
##$V9= 5
##$VALIST= <valist>
##$VCLIST= <CCCCCCCCCCCCCCC>
##$VD= 0
##$VDLIST= <DDDDDDDDDDDDDDD>
##$VPLIST= <PPPPPPPPPPPPPPP>
##$VTLIST= <TTTTTTTTTTTTTTT>
##$WBST= 1024
##$WBSW= 4
##$XGAIN= (0..3)
0 0 0 0 
##$XL= 0
##$YL= 0
##$YMAX_a= 188671
##$YMIN_a= -310666
##$ZGOPTNS= <>
##$ZL1= 120
##$ZL2= 120
##$ZL3= 120
##$ZL4= 120
##$ABSF1= 17.07239
##$ABSF2= -0.9794979
##$ABSG= 5
##$ABSL= 3
##$ALPHA= 0
##$AQORDER= 0
##$ASSFAC= 0
##$ASSFACI= 0
##$ASSFACX= 0
##$ASSWID= 0
##$AUNMP= <proc_1d>
##$AZFE= 0.1
##$AZFW= 0.1
##$BCFW= 0
##$BC_mod= 2
##$BYTORDP= 0
##$COROFFS= 0
##$CY= -3
##$DATMOD= 1
##$DC= 0
##$DFILT= <>
##$DTYPP= 0
##$F1P= 0
##$F2P= 0
##$FCOR= 1
##$FTSIZE= 16384
##$FT_mod= 6
##$GAMMA= 0
##$GB= 0
##$INTBC= 1
##$INTSCL= 3.70164e-10
##$ISEN= 128
##$LB= 0.24
##$LEV0= 0
##$LPBIN= 0
##$MAXI= 10000
##$MC2= 0
##$MEAN= 0
##$ME_mod= 0
##$MI= 1.114404
##$NCOEF= 0
##$NC_proc= -7
##$NLEV= 6
##$NOISF1= 3.799351
##$NOISF2= 2.8
##$NSP= 0
##$NTH_PI= 0
##$NZP= 0
##$OFFSET= 16.76718
##$PC= 1
##$PHC0= -25294.04
##$PHC1= -0.8126879
##$PH_mod= 1
##$PKNL= yes
##$PPARMOD= 0
##$PSCAL= 0
##$PSIGN= 0
##$REVERSE= no
##$SF= 200.129650747943
##$SI= 16384
##$SIGF1= 3
##$SIGF2= 2
##$SINO= 5.538805
##$SIOLD= 16384
##$SREGLST= <1H.CDCl3>
##$SSB= 0
##$STSI= 16384
##$STSR= 0
##$SW_p= 3612.71676300577
##$SYMM= 0
##$S_DEV= 0
##$TDeff= 16384
##$TDoff= 0
##$TI= <>
##$TILT= no
##$TM1= 0
##$TM2= 0
##$TOPLEV= 0
##$USERP1= <user>
##$USERP2= <user>
##$USERP3= <user>
##$USERP4= <user>
##$USERP5= <user>
##$WDW= 1
##$XDIM= 16384
##$YMAX_p= 345302610
##$YMIN_p= -1043445
$$ End of Bruker specific parameters
$$ ---------------------------------
##NTUPLES= NMR SPECTRUM
##VAR_NAME=  FREQUENCY,     SPECTRUM/REAL,   SPECTRUM/IMAG
##SYMBOL=    X,             R,               I
##VAR_TYPE=  INDEPENDENT,   DEPENDENT,       DEPENDENT
##VAR_FORM=  AFFN,          ASDF,            ASDF
##VAR_DIM=   16384,         16384,           16384
##UNITS=     HZ,            ARBITRARY UNITS, ARBITRARY UNITS
##FACTOR=    0.220516191357247, 1,           1
##FIRST=     3355.60977518881, 0,            0
##LAST=      -257.106987816961, 0,           0
##MIN=       -257.106987816961, -1043445,    0
##MAX=       3355.60977518881, 345302610,    0
$$ Real data points
##PAGE= N=1
##DATA TABLE= (X++(R..R)), XYDATA
$$ [...]
11387D51855j55676k09936J85905M6272j76353j75384M58658l0738k13060j24499
11377E7044J97942l07429L68089L73431j30907P3997j84023n259K69322l50591
11367C61616K09547l6806j38771j03667p8348L20796j75519r2036L27980K67081
11357H61873Q6427j09474l66829J05763J36712Q125j52563J50874p0146J17075
11347G67837p3474j18571J73713j42652o801j5991O324M53709O2914k48622r0761
11336G67625L71653M7679j59843p5143O6424m3111j09123P7516J53313o6223k40624
11325G90143p6636p9293R1184K30683K5633Q2749n0450j18432j33176K40554k26579
11314G76380J08027J20321j12762l85976K75789K32650j01729j31954J97269K16636
$$ plain form
11387 451855 296179 86243 272148 318420 142067 -33317 425341 394603 181543 57044
11377 57044 254986 -52443 315646 689077 558170 632167 448144 442885 712207 361616
11367 361616 571163 534357 395586 291919 213571 534367 358848 266812 594792 861873
11357 861873 948300 838826 471997 577760 714472 722597 570034 720908 650762 767837
11347 767837 694363 575792 749505 606853 600052 584061 590385 1044094 1107008 858386 767625
11336 767625 1139278 1186957 1027114 951971 1018395 975284 866161 943677 1096990 1030767 790143
11325 790143 713507 634214 725398 956081 981714 1064463 1014013 895581 762405 1002959 776380
11314 776380 884407 1004728 891966 505990 781779 1014429 912700 780746 978015 1194651
11304A194651j67346m0547n1329K69087J52734J70281j22849J59393K61902k01499
11294A624478l3348O7952K5251p4637K1807K12786q0499m5212K08309j7425l8430
11283A871032J19386J1173j88358l9435J23254J1219M42591K81420j57467r4766
11273B380049l29704j12377K72298j15816J86444K7483J66417L33613L5141m69061
11263B374487J44533J81828k5540P1488K15743l04953q9264J42911K24257K11964
11253C147454J05959j41876j25165J63613j9988Q2051K42089M05975j90654K06477
11243C875935j7372m24122J06165L03360J36052J41628J66040o2879J37740N04262
11233D866809j28812j02554M1530O1894j8024M58803K42503j81871K52596J55675
$$ plain form
11304 1194651 1027305 986758 935429 1204516 1357250 1527531 1404682 1564075 1825977 1624478
11294 1624478 1591130 1659082 1684333 1609696 1631503 1844289 1763790 1718578 1926887 1909462 1871032
11283 1871032 1990418 2001591 1813233 1773798 1897052 1908271 2350862 2632282 2474815 2380049
11273 2380049 2050345 1937968 2210266 2094450 2280894 2308377 2474794 2808407 2843548 2374487
11263 2374487 2519020 2700848 2675308 2746796 2962539 2657586 2568322 2711233 2935490 3147454
11253 3147454 3253413 3111537 2986372 3149985 3129997 3212048 3454137 3860112 3669458 3875935
11243 3875935 3858563 3434441 3540606 3843966 3980018 4121646 4287686 4224807 4362547 4866809
11233 4866809 4737997 4635443 4676973 4738867 4720843 5179646 5422149 5240278 5492874 5648549
11223E648549K10584p7592L20776L40862N655L67699K22555K76282L4510l89391
11213F960489J39882J63700K609M54924K97650K47560M16677J50039J68975Q3930
11203I086435M40596K56564J02256R160K07747M2319M22081J45820j12166N63099
11193A1163911L99356j64338o9754L16726N17752N80846M1698j20501J00351M25946
11183A3191993J19835Q0219J12668L23950R1141K71205L32281k64874J03221J28431
11173A4490070N60782j73402J75841L41015R2227K44846j98802L1807J83533L44111
11163A6092028p6573O4235O5336J2696K80167j8172J31957K3102m09200j06602
11153A6058974J24358L05105j39387M8507j4284k17338R2668P1675k19584k61949
$$ plain form
11223 5648549 5859133 5781541 6102317 6443179 6448834 6816533 7039088 7315370 7349880 6960489
11213 6960489 7100371 7264071 7266680 7721604 8019254 8266814 8683491 8833530 9002505 9086435
11203 9086435 9527031 9783595 9885851 9895011 10102758 10145077 10567158 10712978 10600812 11163911
11193 11163911 11563267 11398929 11329175 11645901 12163653 12744499 12786197 12665696 12766047 13191993
11183 13191993 13311828 13392047 13504715 13828665 13919806 14191011 14523292 14258418 14361639 14490070
11173 14490070 15050852 14877450 15053291 15394306 15486533 15731379 15532577 15564384 15747917 16092028
11163 16092028 16015455 16079690 16145026 16157722 16437889 16419717 16551674 16574776 16165576 16058974
11153 16058974 16183332 16488437 16349050 16397557 16383273 16165935 16258603 16330278 16110694 15848745
11143A5848745J17030L86797M3407n94248j58529j65833j02693J59196m15426
11134A5118446m16782J34861j60797q4057l3835k11046k49331k02391q5937j00704
11124A3708427m8101p67668k09549l855j91712L0356k45370n66063j04128n91900
11114A1010437n2288P7619k42596J9616J27006m55230N997l96764j50578k4777
11104I918442k18579j40336n18556j08953j21949r1337l24143K9789j10675j96090
11094H117613k15063k50595l26343j69646N5091J6835l61470k47381o6445n17830
11084F034766M5122J49648l0964L5848k85596j58512k693K6845l24621j64580
11074E325263r194r0473k37393m82859l5160K06756J13831j00355j39099j38522
$$ plain form
11143 15848745 15965775 16352572 16395979 15801731 15643202 15477369 15374676 15533872 15118446
11134 15118446 14701664 14836525 14675728 14591671 14557836 14346790 14097459 13895068 13809131 13708427
11124 13708427 13660326 12892658 12683109 12679254 12487542 12517898 12272528 11706465 11602337 11010437
11114 11010437 10958149 11035768 10793172 10812788 10939794 10484564 10490561 10093797 9943219 9918442
11104 9918442 9699863 9559527 9040971 8932018 8810069 8718732 8394589 8424378 8313703 8117613
11094 8117613 7902550 7651955 7325612 7155966 7211057 7227892 6866422 6619041 6552596 6034766
11084 6034766 6079888 6229536 6198572 6234420 5948824 5790312 5787619 5814464 5489843 5325263
11074 5325263 5316069 5225596 4988203 4505344 4470184 4676940 4790771 4690416 4551317 4412795
11064D412795j56543M21990j20159p37109j4356o8888k73718J72298m9934j56870
11054C429506J78241J07742j57809J02558j56351k65335n479O0363K21133k48979
11044C265590m99332J50113o0289J08835j51231K95355J58032j66133k59632q4717
11034B756591l92211q0151K63011J67097J3473q1383k26728r3310l6877J32498
11024B422010J90577k26460m25991L43716J43372j83111K81220j09586p5308J24340
11014B484779J84339j86982m21430J1972L10705l88166q6792J38577j73333k1494
11004A852175M12769j43684n04690j96818J70097P8606j32185j17998J32439Q3510
10994A634221j19828j7867k19348j49486K04392L50363n8986l27142j98972R2367
$$ plain form
11064 4412795 4256252 4678242 4558083 3820974 3806618 3737730 3464012 3636310 3586376 3429506
11054 3429506 3607747 3715489 3557680 3660238 3503887 3238552 3233073 3293436 3514569 3265590
11044 3265590 2766258 2916371 2856082 2964917 2813686 3109041 3267073 3100940 2841308 2756591
11034 2756591 2364380 2284229 2547240 2714337 2727810 2646427 2419699 2326389 2289512 2422010
11024 2422010 2612587 2386127 1960136 2303852 2447224 2264113 2545333 2435747 2360439 2484779
11014 2484779 2669118 2482136 2060706 2072678 2383383 1995217 1908425 2047002 1873669 1852175
11004 1852175 2264944 2121260 1616570 1419752 1589849 1668455 1536270 1418272 1550711 1634221
10994 1634221 1514393 1496526 1277178 1127692 1332084 1682447 1623461 1296319 1097347 1189714
10984A189714J4112J74486J04975K09309Q5730n57937m3184N008L40203j25355
10974A397061j32932j86730P0067k67997O4036L52626J77305K54191l32315o0799
10964A334513p1641j98996j797j22825K27305L24203k28829l39958j04544k38951
10954E78480J55529R724r9797k26046j9686M08896M36951j78444j23724k0590
10944I21293m7309j38815l88892K07455P823j06005K25902J85779k63661r7207
10934E06363K0645K49958P6096l7364q7627Q9606J01577k24276j69157m2937j67088
10923C15796J57733L8013l64925m0313R5642J34500J15018P4625n5105l8220o5236
10912C67528K31409j38507m5358l4209j66316r827k22716K20921K06354q0415
$$ plain form
10984 1189714 1203826 1378312 1483287 1692596 1778326 1220389 1177205 1182213 1522416 1397061
10974 1397061 1264129 1077399 1147466 879469 943505 1296131 1473436 1727627 1395312 1334513
10964 1334513 1262872 1063876 1062079 939254 1166559 1490762 1261933 921975 817431 578480
10954 578480 734009 743733 643936 417890 398204 807100 1244051 1065607 941883 921293
10944 921293 873984 735169 346277 553732 561555 455550 681452 867231 603570 506363
10934 506363 527008 776966 853062 815698 728071 817677 919254 694978 525821 482884 315796
10923 315796 473529 511542 146617 106304 201946 336446 451464 526089 470984 432764 367528
10912 367528 598937 460430 415072 380863 214547 204720 -17996 202925 409279 328864
10902C28864l37308J56069J88696J94112J95105j15278l60793K39208j5137J8515
10892D92053p5979k34208J218j06813j20816k1515o677J23837o1655M00924K13793
10881F04162l33223J65023k34549J10633N6856k52967J07765K29268l6490J85130
10871F01608M0661k20559q9872j90540M14358Q9406k24518m25523J84994m1513
10861A38502o1248L41593J52336Q5210k91312J72225l50892o7485M13983l87770
10851A45142k88238L97534l091m21743L02907J11493j82785M7023L82261k01592
10841B88911R6030M79844n12032l35869K04296k80995k731L65666J69010j09451
10831C62679j51961M8208l91804j64146K06608K86581k31653j65392J37011M11837
$$ plain form
10902 328864 -8444 147625 336321 530433 725538 610260 249467 488675 473538 492053
10892 492053 416074 181866 183084 76271 -44545 -66060 -72737 51100 -10555 390369 604162
10881 604162 270939 435962 201413 312046 368902 115935 223700 452968 416478 601608
10871 601608 642269 421710 331838 141298 555656 645062 420544 -4979 180015 138502
10861 138502 77254 418847 571183 656393 365081 537306 186414 118929 532912 145142
10851 145142 -143096 254438 251347 -170396 132511 244004 61219 108242 490503 288911
10841 288911 384941 864785 352753 16884 221180 -59815 -62546 303120 472130 362679
10831 362679 210718 258926 -132878 -297024 -90416 196165 -35488 -200880 -63869 347968
10821C47968J51462j61224l9596J5883l8471K02800j17342j5991j49437l77685
10811a81633J03664M36459O6996o0362l27211m5343R6161K00397k12592k38447
10801a61911J17346J24482j51176n8363l03711l03903M22685n9306J90105L16159
10791A32407J53578k16784J6042M40981j60213j05992l6009k24328J11316j13770
10781b772J38882K70227m12013J51697L3676k63210j22630J82628M1458L50455
10771C68398j96786r0422K04315K57858J05354m99025J565J97590M2920k53484
10761A38283M9042q70J03601m37047k28862N11595o1871k98352R0702K88645J81779
10750C36645j91476K90089q8714p1728M85436k02178j13018j14849j83687j9416
$$ plain form
10821 347968 499430 338206 298610 314493 276022 478822 361480 345489 196052 -181633
10811 -181633 -77969 358490 425486 365124 37913 -7430 88731 289128 76536 -161911
10801 -161911 -44565 79917 -71259 -129622 -433333 -737236 -314551 -373857 -183752 132407
10791 132407 285985 69201 85243 526224 366011 260019 224010 -318 110998 -2772
10781 -2772 136110 406337 -5676 146021 179697 -83513 -206143 -23515 17943 368398
10771 368398 171612 81190 285505 543363 648717 149692 151257 348847 391767 138283
10761 138283 187325 186455 290056 -146991 -375853 135742 73871 -224481 -133779 154866 336645
10750 336645 145169 435258 346544 274816 760252 558074 445056 330207 146520 127104
10740A27104l2018J36535N9311j2425j30924L61845m90246j99636m2304R6244
10730a26514P9405L63634r6589m04228k2487P0762K44451K10550K732p6728j53484
10719I1504j79438K63123j41170j94375J83138J96613J07285k3999j76082l23679
10709a97080M7174l9724O7348K29429L05129M9557l90334j33269M10557J01384
10699D50171m2091k67580j34358Q2216J74295n0322J18090J2537l02224k10545
10689a69811j54785K58319J30715J72739k21238J35962k28171K05403r9518p5973
10679d6358K7578J06670k53690m7107j15186O4721n3247k3176j49023J96348L39177
10668D6707p6887J05142o7098k29368k63478L4034J67197M07562J4467J92937
$$ plain form
10740 127104 95086 231621 290932 278507 147583 509428 19182 -180454 -222758 -126514
10730 -126514 -47109 316525 219936 -184292 -206779 -136017 108434 318984 321716 244988 91504
10719 91504 -87934 175189 34019 -160356 22782 219395 326680 302681 126599 -197080
10709 -197080 -149906 -189630 -122282 107147 412276 461833 71499 -61770 348787 450171
10699 450171 408080 140500 6142 88358 262653 212331 330421 342958 40734 -169811
10689 -169811 -324596 -66277 64438 237177 15939 151901 -76270 129133 29615 -46358
10679 -46358 -18780 87890 -165800 -212907 -328093 -263372 -316619 -339795 -488818 -292470 46707
10668 46707 -30180 74962 7864 -221504 -484982 -450948 -283751 123811 138278 331215
10658C31215m03082k14529J82347J00448P3736K8294J15749m1988l48330j65305
10648c41445K71865j1421J29043p7580o552J4582r6692m058k4913J14095J9908
10637a3168J19571p1562j55220k36739K58289r0094l2728J00508L7091l7324k08487
10626c29863L73315r4474J52233L3591l96333O2986J67453k1698j43565K0710
10616a75645J81935k06176L04795K5883k40253M15266j96261k38267J99415k29984
10606a59292N5637K92704l0232k9344K8519J98831N014j98959l19289O6715J08721
10595A9025j13995r0431J98289J97379k58861J50228J52376Q3079j25142K3768
10585B35715n8558J25576j62668k53609J08248L32365j97424k64846K33542J46513
$$ plain form
10658 331215 -71867 -286396 -104049 -3601 70135 98429 214178 172190 -176140 -341445
10648 -341445 -69580 -81001 48042 -29538 -36090 -21508 -118200 -122258 -147171 -33076 -13168
10637 -13168 106403 34841 -120379 -357118 -98829 -188923 -221651 -121143 -84052 -121376 -329863
10626 -329863 43452 -51022 101211 134802 -261531 -198545 -31092 -52790 -196355 -175645
10616 -175645 6290 -199886 104909 130792 -109461 305805 109544 -128723 70692 -159292
10606 -159292 -103655 189049 158817 129473 157992 356823 361837 162878 -156411 -89696 19025
10595 19025 -94970 -185401 12888 210267 -48594 101634 254010 337089 211947 235715
10585 235715 177157 302733 140065 -113544 -5296 327069 129645 -135201 98341 244854
10575B44854o8186p8216j97891M4532J5576K77715m5226K3090j21816j85370J77479
10564H6541k27138m7783J61257q704j61464L36436K10859l6889l67387p1709k6506
10553a52487N32264k04713k50341k3958L57816K68729j85546m45599K6304j92205
10543b69736R2947L51052J69542k09083j84064j51737j27915J30825n617R9221
10533a04565r3335J1379M06544o2223j69374n03296j31054P5731J57030J16421
10523b96742L3178L48980j07852j20584n4080J96086m9367k1693R8659k05694
10513a79109k44661J56764K6783l65472N62507K91002q9557j5669O0811j76771
10503B6628k4006O0716P5528l3652m67395K57938J95495P1760J50946r5884k79302
$$ plain form
10575 244854 176668 98452 -99439 -54907 -39331 238384 193158 216248 94432 -90938 86541
10564 86541 -140597 -188380 -27123 -35827 -197291 139145 350004 313115 -54272 -125981 -152487
10553 -152487 379777 175064 -75277 -99235 258581 527310 341764 -103835 -77531 -269736
10543 -269736 -176789 174263 343805 134722 -49342 -201079 -328994 -198169 -203786 -104565
10533 -104565 -197900 -186521 220023 157800 -11574 -514870 -645924 -570193 -413163 -296742
10523 -296742 -263564 85416 -22436 -143020 -197100 -1014 -50381 -72074 26585 -179109
10513 -179109 -423770 -267006 -240223 -605695 -43188 247814 158257 142588 203399 26628
10503 26628 2622 63338 138866 105214 -362181 -104243 91252 163012 313958 218074 -61228
10492f1228J61326k2864J37692j17414J39223n611k00934l6595L7465j55693J50095
10481B5462J57649m0625q1268m0905k2484J88206l9988j18503o9219J87647l1941
10470A14031J2009j21041o2508j2877K22812P7513l53369M8424m623J11046J0094
10459D1511j86334J71449M1536j79666o2556n076j87315n6906J6954L47021P2111
10448A2729o8181R7942L2462l4831m2939K07330l80108R0334J21515k36884K30696
10437C0065Q0185o5469m28154j32656J53064J69413K07406k74533L35035K66562
10427C40918m36858j81485j5802p2549N7792J69657K54613M2338k56760j35799
10417b33935R2729O2634J22329k76734l30040P948K73133k12877j2256J90098
$$ plain form
10492 -61228 100098 77234 214926 97512 236735 231124 30190 -6405 31060 -124633 25462
10481 25462 183111 142486 61218 20313 -2171 186035 146047 27544 -41675 145972 114031
10470 114031 126040 4999 -57509 -70386 152426 229939 -123430 -75006 -79629 31417 41511
10459 41511 -144823 26626 68162 -111504 -174060 -179136 -366451 -423357 -406403 -59382 12729
10448 12729 -55452 42490 74952 40121 -2818 204512 -175596 -85262 36253 -200631 30065
10437 30065 110250 44781 -383373 -516029 -362965 -193552 13854 -260679 74356 340918
10427 340918 -95940 -277425 -293227 -365776 -307984 -138327 116286 158624 -98136 -233935
10417 -233935 -141206 -78572 43757 -232977 -563017 -555069 -281936 -494813 -507069 -316971
10407c16971L1716K41709o6892J02944J08516j69713o7095q465k26896j02536
10397d73683N9591J02735L49541r1878r8305K4238J15196n55948j20694P7227
10387f11980L7516r9428K35505J84378n3700O4685j01831J43648J52130J94931
10377A45854m2457l24601j98621M59293k18595k58378j09458J21636k50214J77066
10367d98475M27870k92101K20604K7629m1201Q0252J17393r5216J88674j31500
10357C929k13074J40745j78794J5555k39726l0880n6582P9211J92186j48225N0533
10346c85122Q5076J81452K85182K12698k01768k46904q9927O5654j65586L8123
10336b21122Q2125R7014j40786q2501j48554k3201J2067m9692o6626J98174K49807
$$ plain form
10407 -316971 -285255 -43546 -110438 -7494 101022 -68691 -135786 -144251 -371147 -473683
10397 -473683 -414092 -311357 38184 -53694 -151999 -127761 -12565 -568513 -689207 -611980
10387 -611980 -574464 -673892 -438387 -254009 -307709 -243024 -344855 -201207 -49077 145854
10377 145854 103397 -221204 -419825 39468 -179127 -437505 -546963 -425327 -675541 -498475
10367 -498475 -70605 -362706 -142102 -114473 -155674 -75422 41971 -53245 135429 3929
10357 3929 -209145 -68400 -247194 -231639 -471365 -502245 -558827 -479616 -287430 -435655 -385122
10346 -385122 -300046 -118594 166588 379286 177518 -69386 -159313 -93659 -259245 -221122
10336 -221122 -138997 -41983 -182769 -265270 -413824 -437025 -424958 -474650 -541276 -343102 -93295
10325i3295j02000J43683k12846r6398K48541j56570J28666M471j27283J42928
10315a20103k7679J23626Q8648J72155l31065q5029J1342j69664J86376K66898
10305A15505J0961o9238j10912r4303j65213j06221K11718m730k00647m5592M42122
10294a6550j86950J15388M8680j10694M9190j04181j53983k59336K68258K60476
10284h9702j31854p1504J0682K31931J82887l86066J14613j7603J03833J27443
10274G4660j42170k38443K71584j90530J79426j4181k25502j507O1539J85035
10264d0089P2097J32768k33246j47833j30551J50561J49493l3508L4576m7049
10254i2781n1985k07214J93629Q9717J5012k95585J28743L2649J26279J80087
$$ plain form
10325 -93295 -195295 -51612 -264458 -360856 -112315 -268885 -140219 -135748 -263031 -120103
10315 -120103 -147782 -24156 64492 236647 -94418 -179447 -168105 -337769 -151393 115505
10305 115505 126466 57228 -53684 -147987 -313200 -419421 -207703 -212433 -413080 -458672 -16550
10294 -16550 -203500 -88112 -39432 -150126 -100936 -205117 -359100 -618436 -350178 -89702
10284 -89702 -221556 -293060 -282378 -50447 132440 -253626 -139013 -156616 -52783 74660
10274 74660 -67510 -305953 -34369 -224899 -45473 -59654 -285156 -286663 -225124 -40089
10264 -40089 32008 164776 -68470 -216303 -346854 -196293 -46800 -80308 -45732 -92781
10254 -92781 -144766 -351980 -158351 -68634 -53622 -349207 -220464 -187815 -61536 118551
10244A18551J29782k97900J33621m400j50123m5470L3061n698j70747J922k04765
10233d62166K80832k32154J49877o2139J56949k6892m4031N1149r674q4344j91707
10222d74300J00281j83760K04755k37457J62963N14116l50854L50399j05998R7515
10212G7660m9880q1712J12402k41967Q7574l21375R5174J15654r8771J40082j74069
10201c39228n1582k00463J29631K66621l4011O4177L6814r5765L1877k49489j94343
10190f35761j37585m5091j7097K54842K98697Q0224k43570K91875k1820K64236
10180H8950k0872l04347N7895n13742o0291K49777J29152j5620k33500K45708
10170c76890L93467Q5233j18211R9997j34821l5407l36583j46401K43088L39866
$$ plain form
10244 118551 248333 -49567 84054 79654 -70469 -115939 -82878 -88576 -259323 -257401 -462166
10233 -462166 -181334 -413488 -263611 -325750 -168801 -195693 -239724 -188575 -198249 -282593 -474300
10222 -474300 -374019 -557779 -353024 -590481 -427518 86598 -264256 86143 -19855 77660
10212 77660 27780 -53932 58470 -183497 -95923 -417298 -322124 -206470 -305241 -165159 -339228
10201 -339228 -390810 -591273 -461642 -195021 -229032 -164855 -128041 -223806 -191929 -441418 -635761
10190 -635761 -773346 -818437 -835534 -580692 -281995 -201771 -445341 -153466 -175286 88950
10180 88950 68078 -236269 -178374 -692116 -752407 -502630 -373478 -389098 -622598 -376890
10170 -376890 16577 101810 -16401 83596 -51225 -86632 -423215 -569616 -326528 13338
10160A3338n4775m11788K90234K81607P9470k62086j45942K31118K80234k40088
10150F1322J49053j96576j3367j93552K7954J01708j05398j44121K59607k6376
10140g9746k53418J01723K9859q4118J73788q926J07318j32560j77894P1365L6687
10129b15922j7970O0837j21611k74680K65597N5030J74681J91270k986m49417
10119c35171r3533m9522L33429N2050q0062K10656j12853k48966N6689K06918
10109f0365J25145K13033m089j28400n8132m32661r337J69570j3843M9743j20904
10098b70240L86693P7963j70829J48614L4927o7850j89895j18953j76509K21828
10088a24251j28205L6971J61724J76998l55820k39419M0112K42091L03753j46801
$$ plain form
10160 13338 -41437 -453225 -162991 118616 198086 -64000 -209942 21176 301410 61322
10150 61322 210375 13799 432 -193120 -165166 -63458 -168856 -312977 -53370 -79746
10140 -79746 -333164 -231441 -201582 -285700 -111912 -120838 -13520 -146080 -323974 -252609 -215922
10129 -215922 -233892 -173055 -294666 -569346 -303749 -248719 -74038 117232 114246 -335171
10119 -335171 -428704 -478226 -144797 -92747 -172809 37847 -75006 -323972 -267283 -60365
10109 -60365 64780 277813 273724 145324 87192 -345469 -354806 -185236 -199079 -149336 -270240
10098 -270240 116453 194416 23587 172201 207128 139278 -50617 -169570 -346079 -124251
10088 -124251 -252456 -215485 -53761 123237 -232583 -472002 -431890 -189799 113954 -32847
10078c2847J30169j45743l6918k23053K7284j78932J42190K59711K66782l66390
10068a57747P182R4143j8391m6706j33439r7124L29150L5209l713O7370O4734
10057A40668J07517j96817k05823j93438J75130J18609J85850m66971J93489M75706
10047C33920n60822j49545j06678j31186j01072M65310K25374m3778j72577k55665
10037d96719J90862L97044l00264Q5134K82426l40377k58343M3421K85043Q213
10027a03560k20820K94682R4784j13630K6249j71025J67643Q14J90429l50202
10017a84636J13212J1963L8319K661j34148l4433O8429n9753l11727J90706L46281
10006D6874P5542k84573J14546L9894N237j81157l43427L97274K92475p9733k77497
$$ plain form
10078 -32847 97322 -48421 -85339 -308392 -281108 -460040 -317850 -58139 208643 -157747
10068 -157747 -150565 -56422 -74813 -121519 -254958 -352082 -22932 12277 8564 75934 140668
10057 140668 248185 51368 -154455 -347893 -172763 -54154 131696 -335275 -141786 333920
10047 333920 -226902 -376447 -483125 -614311 -715383 -250073 -24699 -68477 -241054 -496719
10037 -496719 -305857 91187 -209077 -123943 158483 -181894 -440237 -396816 -111773 -103560
10027 -103560 -324380 -29698 65086 -48544 -22295 -193320 -25677 -24863 165566 -184636
10017 -184636 -71424 -59461 -21142 -18481 -152629 -187062 -118633 -178386 -490113 -299407 46874
10006 46874 122416 -162157 -47611 -7717 -2480 -183637 -527064 -129790 162685 82952 -194545
9995a94545j22820L18717P7767q4575J15856o2288J16174o4167j47099j67290
9985b14270J46523l1214j74383O672L11773K2303l61238l7382M63489j91216p7863
9974a36806j23601L45299M2225l97203j18563J36109J62290Q2755j33765n1960
9964a93220k8782R466J16305R645j83628J32859L18431m68101J06608l49827P4999
9953d55245M46446j43446k02493R0388K20771j19194l70706J95629J27219l1857
9943b42488m5205P846r7972J92299K38440K9237j83004j35538l4812L345J04450
9932a63402l834O6426P9887r0911k74489J93056Q5431J20454K869k98694k74708
9921e57915K91406K17567Q1662j56911J25080k90689m42540K30366M09365k9151
$$ plain form
9995 -194545 -317365 1352 79119 -5456 110400 48112 164286 100119 -46980 -214270
9985 -214270 -67747 -98961 -273344 -266672 45101 67404 -293834 -331216 132273 -58943 -136806
9974 -136806 -260407 84892 127117 -270086 -388649 -252540 -90250 -7495 -141260 -193220
9964 -193220 -222002 -212536 -96231 -86586 -270214 -137355 181076 -287025 -180417 -530244 -455245
9953 -455245 -8799 -152245 -354738 -264350 -43579 -162773 -533479 -337850 -210631 -242488
9943 -242488 -287693 -279847 -377819 -185520 52920 82157 -100847 -236385 -271197 -267852 -163402
9932 -163402 -167236 -100810 -20923 -111834 -386323 -193267 -107836 12618 15487 -283207 -557915
9921 -557915 -266509 -48942 32720 -124191 889 -289800 -732340 -501974 -92609 -121760
9911a21760j11599O7121j73147J12527N0212K24083l28702N8514j82895Q9043
9901c16603L85268n22838K10134R5120o5112j2500j07431J49022q6605m339l6439
9890c12323L27705j1258m276J64945l25268j26952J23930R6571l03531l00696
9880f71153J59566l2108m5290k87205K22507K98144j4037j52839K26283k14290
9870e10422L06731K11499j89166n5092J22414k44173K32778j71571p7191P3615
9860c00578J04937J00893k23421P2299L2081R8025K01198k23639J03012j14931
9850a50124k21600k016l78982M3607L98863L24243l21280J41160j37285Q7032
9840b16382J34581p9107k45684K76566l62171J0269K09970m7587r164K6257K16604
$$ plain form
9911 -121760 -233359 -166238 -339385 -226858 -176646 47437 -281265 -222751 -405646 -316603
9901 -316603 68665 -454173 -244039 -148919 -214031 -226531 -333962 -184940 -271545 -275884 -312323
9890 -312323 15382 4124 -152 164793 -160475 -287427 -163497 -66926 -370457 -671153
9880 -671153 -511587 -543695 -588985 -876190 -653683 -355539 -369576 -522415 -296132 -510422
9870 -510422 -203691 7808 -181358 -236450 -114036 -358209 -125431 -297002 -374193 -300578
9860 -300578 -195641 -94748 -318169 -245870 -213789 -115764 85434 -138205 -35193 -150124
9850 -150124 -371724 -373740 -752722 -709115 -310252 13991 -307289 -166129 -303414 -216382
9840 -216382 -81801 -160908 -406592 -130026 -492197 -481928 -271958 -319545 -328709 -302452 -85848
9829h5848j3248k21410j41381J1439J9213J20940j08192p110L52657J11331J18839
9818A57230m12027R773Q2320J05512n7734l97038K21797J21105P8311k2294k38482
9807c51527l97369J82190M17988l18530j98136j6643L88623K5435J44188N97k14363
9796c37547L3338K77518J3013K22672p7492l7973j16703l4958l5017l46721K59362
9785a80508L8244q7788N229j39145P1185O0341j15888L03297M2158r9938J90423
9774H7610j3683j66076Q608k978j86741p8221K29715k72989j71906j30507J29264
9763e67904K19442J65917J29523k60607n9583J21584j71745j89402J87877K25523
9753a99375J35918L35976l29595k66759k46792J36828P2662J92492K3663k6115
$$ plain form
9829 -85848 -99096 -320506 -461887 -450448 -431235 -310295 -418487 -425597 -72940 38391 157230
9818 157230 -254797 -245024 -162704 -57192 -114926 -511964 -290167 -169062 -90751 -113045 -351527
9807 -351527 -748896 -566706 -148718 -467248 -665384 -682027 -293404 -267969 -123781 -123184 -337547
9796 -337547 -304209 -26691 -13678 208994 131502 93529 -23174 -58132 -93149 -439870 -180508
9785 -180508 -142264 -230052 -224823 -363968 -292783 -232442 -348330 -45033 -2875 -102813 87610
9774 87610 73927 -92149 -83541 -86519 -273260 -351481 -121766 -394755 -566661 -697168 -567904
9763 -567904 -348462 -182545 -53022 -313629 -373212 -251628 -423373 -612775 -424898 -199375
9753 -199375 -63457 272519 -57076 -323835 -570627 -433799 -361137 -168645 -144982 -171097
9743a71097L69587O9665m13030O7929j01568j37919M618K12739J7684j75148J57547
9732i8993l34695K54160J43777l46126k24946J80315o2188J70958L6292r6483
9722c77929L11446j82621j87186M8772K12113J52088j77002k65746P8567K64969
9712a22529K6192j63054r8760K87180n1434j81416j36261K07988q5566J53657
9702a64003n1631j65093j26960q2908K25841p5627J90043K7759K20871j61541
9692a63249j55046k16591P2822L29752j18707o0402j28176N796m0836l5869K54292
9681b56214n2877j44957J89844l4924M2805j31647l27447K72553J30963K99023
9671a2878J15124k06569m2333o9625M7432p2455j48884K09897N8243K76550R7896
$$ plain form
9743 -171097 198490 268155 -144875 -76946 -178514 -316433 -311815 -99076 -81392 -256540 -98993
9732 -98993 -433688 -179528 -35751 -381877 -606823 -426508 -488696 -317738 -281446 -377929
9722 -377929 -66483 -249104 -436290 -387518 -175405 -23317 -200319 -466065 -387498 -122529
9712 -122529 -96337 -259391 -358151 -70971 -122405 -303821 -440082 -232094 -317660 -164003
9702 -164003 -215634 -380727 -507687 -590595 -364754 -440381 -250338 -222579 -1708 -163249
9692 -163249 -318295 -534886 -462064 -132312 -251019 -311421 -439597 -433801 -474637 -510506 -256214
9681 -256214 -309091 -454048 -264204 -299128 -256323 -387970 -715417 -442864 -311901 -12878
9671 -12878 102246 -104323 -146656 -216281 -168849 -241304 -390188 -180291 -122048 154502 252398
9660B52398l59405k4414k71322P3817j11469k6877l8992j02993J67349M01431
9650d0477J09627j76438j45042K9263O9157J46674q876l52356K0156j58314Q9781
9639d16845K71617K74835o5198M5950l86410j54617J507k5166j15146p848K34511
9628c42810k56169J49384M28477J89424k71354o7480J31563r2858L36559J76124
9618C80860j30999J62263k12040j47454L6422l64210L4261p1106l06204K84587
9608c33620O02441N6598k38906k57095m4631J23839q1331M3254J60663m0178n7127
9597f6093r665j20533J12277l33825K83242j2140o9190J93702r3385J93326j02495
9586b4779k92078l7695J97895K0642J84818N7495l05455m0650J2718M7490l27653
$$ plain form
9660 252398 -107007 -131421 -402743 -328926 -440395 -467272 -506264 -609257 -441908 -40477
9650 -40477 69150 -107288 -252330 -223067 -153910 -7236 -16112 -368468 -348312 -506626 -416845
9639 -416845 -145228 129607 64409 110359 -276051 -430668 -429161 -454327 -569473 -577321 -342810
9628 -342810 -598979 -449595 -21118 168306 -103048 -170528 -38965 -131823 204736 380860
9618 380860 249861 412124 200084 52630 89052 -275158 -240897 -312003 -618207 -333620
9608 -333620 268821 325419 86513 -170582 -215213 -91374 -172705 -129451 31212 -8966 -66093
9597 -66093 -75758 -196291 -84014 -417839 -134597 -146737 -215927 -22225 -115610 77716 -24779
9586 -24779 -316857 -354552 -156657 -136015 48803 106298 -199157 -239807 -227089 -179599 -507252
9575e07252K44541Q0914m4022n1091J33054R9053j90044K8354O13527J87605m80197
9564A14442o5396J50047k1178m13828K32380j31940K21951j44020M1621j17841
9554a33762o1627K16209j27310Q1997k52966p85J41426j34535j95995J21878J06912
9543b38558J14029K05015k00502j69682L8640m0199J01093l1056J07598J59750
9533D6128j09337r2014J17228l21321K71426K48192K37202Q8453m969o6662j22851
9522B91475J49577o379J6402j0006J29875k96855k20817N1103O7035K1968k36031
9511d2653R1251K40985j86411j34492J65540j46539m07694M81858J78136M6419
9501B86400p0426m64077q0419j26908K4768M35746J63280j8644j15114k22137
$$ plain form
9575 -507252 -262711 -181797 -225819 -276910 -143856 -44803 -234847 -206493 407034 594639 114442
9564 114442 49046 199093 177915 -235913 -3533 -135473 86478 -57542 -15921 -133762
9554 -133762 -195389 20820 -106490 -24493 -277459 -278244 -136818 -271353 -467348 -345470 -238558
9543 -238558 -124529 80486 -120016 -289698 -251058 -291257 -190164 -221220 -113622 46128
9533 46128 -63209 -155223 -37995 -359316 -87890 160302 397504 485957 480988 414326 291475
9522 291475 441052 434673 451075 441069 570944 274089 53272 104375 171410 193378 -42653
9511 -42653 48598 289583 103172 -31320 134220 -12319 -420013 61845 239981 286400
9501 286400 215974 -248103 -328522 -455430 -430662 5084 168364 149720 34606 -187531
9491a87531O69n1531J63703K68723J70499j88632R4334r1011Q1299K4000N529
9480B90051m5434l55083m78448J47838M16632k76030r372K05354L10349j37465
9470F8392k77929j68503R514N4829J31236j52325L18165L29214j02234j40124
9460G0235p2533n3294K7719j75210k97685J0972K83505p3317n5982O3323K01373
9449g0894J0501k6161J78736k0172k1780L15879j41217l8791L46166l85580J51389
9438B98076n09458l16429K367J04461L78911k9527r0833R7276K15333j0415L57083
9427D96845J71221k12561j07494l0032m18652j21879K9682N5123r3932P4581q020
9416a65118R2838j7177J49829j40375p8045j06830o1023J81336j48602J4161l1537
$$ plain form
9491 -187531 -186862 -238393 -74690 194033 364532 175900 270234 179223 260522 284522 290051
9480 290051 244617 -110466 -588914 -441076 -24444 -300474 -309846 -104492 205857 68392
9470 68392 -209537 -378040 -368526 -313697 -182461 -334786 -16621 312593 210359 70235
9460 70235 -2298 -55592 -27873 -203083 -500768 -489796 -206291 -279608 -335590 -272267 -70894
9449 -70894 -60393 -86554 92182 72010 50230 366109 224892 186101 532267 146687 298076
9438 298076 -211382 -527811 -525444 -420983 -42072 -71599 -162432 -65156 150177 139762 496845
9427 496845 668066 455505 348011 317979 -100673 -222552 -192870 -137747 -231679 -157098 -165118
9416 -165118 -72280 -89457 60372 -80003 -158048 -264878 -325901 -144565 -293167 -279006 -310543
9405c10543K06127O576j11482J30545r425L2663k49291J64937J26070k80398J14054
9394a80167k37748J5570J7250J39421L00859k43827k61057J26579K28544L03016
9384B08440K7454N2287j50480k57064J39244L3593j03332J33826k24737l5934
9374a76703N1296o5237l6535M8899n2724j24356J53545J62243K38216k5627k59154
9363h6137L0424K17032K9362l87177p3279l3236j4904r8966K11927k45001K36437
9352b13518K9619l0280K52120K28278m61543J9825J32504J31193Q8259j96669
9342b0212j28182k26025J39652K60217q9822l10703P7930J3076K12787j95574
9332b66856K5246K20450J20029P5334m0507k79638k1328P3268L60980j01050r6125
$$ plain form
9405 -310543 -104416 -97840 -209322 -78777 -88202 -55539 -304830 -139893 -13823 -294221 -180167
9394 -180167 -417915 -402345 -385095 -245674 55185 -188642 -449699 -323120 -94576 208440
9384 208440 235894 288181 137701 -119363 19881 53474 -49858 83968 -140769 -176703
9374 -176703 -125407 -190644 -227179 -178280 -231004 -355360 -201815 -39572 198644 173017 -86137
9363 -86137 -55713 161319 190681 -196496 -269775 -303011 -317915 -416881 -204954 -449955 -213518
9352 -213518 -183899 -214179 37941 266219 -195324 -175499 -42995 88198 176457 -20212
9342 -20212 -148394 -374419 -234767 25450 -64372 -375075 -297145 -284069 -71282 -266856
9332 -266856 -241610 -21160 98869 174203 133696 -145942 -167270 -94002 266978 165928 69803
9321F9803k79341L38866j09221k83594K2169K71792q8509q826K70479l6138j62744
9310D736k42136K04474j96134Q2469j48748K24140J54114K58172m48434J2321
9300i5026J45966l60561J72296J48388q0942j72090J36161j56689K61207q0017
9290h1307m8059K73196p6341j22342Q4141O6411K55822O766m01101J22660R8360
9279A78206M3072M8619j70592J03849k3462j77193j15349k2185J89483j09711
9269e5263k34468J59870K46028J27661m21809J64799K61597r1137q4903o6091
9259F284M1218m2208j65431k69K56585K31987P5629j6134m45740j35768K36441
9248D2594j52878P604p8933K10281M85781j99323M6590q9436k38507k6232j46859
$$ plain form
9321 69803 -209538 129328 20107 -263487 -241318 30474 -58035 -66861 203618 167480 4736
9310 4736 -237400 -32926 -229060 -146591 -295339 -71199 82915 341087 -107347 -95026
9300 -95026 50940 -309621 -137325 11063 -69879 -241969 -105808 -262497 -1290 -81307
9290 -81307 -129366 143830 67489 -54853 29288 95699 351521 358287 -42814 79846 178206
9279 178206 221278 269897 99305 203154 179692 2499 -112850 -135035 54448 -55263
9269 -55263 -289731 -129861 116167 243828 -177981 -13182 248415 157278 72375 6284
9259 6284 47502 5294 -160137 -160406 96179 328166 403795 387661 -58079 -193847 42594
9248 42594 -110284 -102680 -181613 28668 514449 315126 361716 272280 33773 7541 -139318
9237a39318J97526Q3622n5168J8589J32722j85133o0409J36447k4099Q9062k6522
9226A67319L39026p2563P8884p5614m32220o2904k4354K85772J35538j43014K0138
9215B16008k55500k68959K76412J24683j98265j11043M00857m53299j29390J17893
9205b80603J72418M9391P9482L3070j34221J01920j31757J48971L4502R0690l22556
9194a58693L13277J00494j56402R0038O5504k27422k25242M45257k16425k15446
9184a85060J5136K83244k68542j08860Q4399P0988K85948R2791k38902j70807
9174a39665Q2288L4753P4992J79346j0225j02475q1929P9781K12829l18893l0378
9163a9576Q3718J9457L0199q6714J57779O7782l77879K15347M23582o1645l99332
$$ plain form
9237 -139318 58208 141830 86662 105251 237973 52840 -7569 128878 104779 193841 167319
9226 167319 506345 433782 512666 437052 4832 -58072 -82426 203346 338884 195870 216008
9215 216008 -39492 -308451 -32039 92644 -105621 -216664 184193 -269106 -398496 -280603
9205 -280603 -108185 -58794 20688 53758 -80463 21457 -110300 38671 73173 163863 -158693
9194 -158693 154584 255078 98676 188714 254218 26796 -198446 246811 30386 -185060
9184 -185060 -169924 113320 -155222 -264082 -179683 -108695 177253 270044 31142 -139665
9174 -139665 -57377 -22624 52368 231714 221489 119014 37085 116866 329695 10802 -19576
9163 -19576 64142 83599 113798 27084 184863 252645 -125234 90113 513695 452050 52718
9152E2718j70405K67484j34620K1881j17388M5348L7365l7695O3860R8266k13835
9141h7021O391j247k70900M92718j81398L26469P4320j35070j01808l01550K48542
9130F9446L4129K6907q8969K68378r526j29564j79650O11518j56832k08171k57269
9119a9603K71241J46178p28336Q3469l19846K79144K22984O9011L35402J24248
9109D63892k54596L19126J4606o4346K23208k41869k85315j2990L06154k008k05936
9098B59926J45107j89565k06909j07624k49058K26969J82964k1777j93665R54
9088a52678N1978L09382L6762N8802L45063k54686j44182J42508k3199q212J59724
9077E21262o7533k77832O2628L29682l20039M1342O3914M05572k75309m16329
$$ plain form
9152 52718 -117687 149797 15177 37058 -80330 -34982 2383 -35312 28548 126814 -87021
9141 -87021 -80630 -81877 -352777 139941 -41457 285012 359332 224262 122454 -179096 69446
9130 69446 103575 130482 41513 309891 300365 170801 -8849 602669 445837 237666 -19603
9119 -19603 251638 397816 -330520 -247051 -566897 -287753 -64769 4242 339644 463892
9109 463892 209296 528422 543028 478682 701890 460021 174706 161716 467870 465862 259926
9098 259926 405033 215468 8559 -99065 -348123 -121154 61810 40033 -153632 -152678
9088 -152678 -100700 208682 245444 304246 649309 394623 250441 392949 369750 361538 521262
9077 521262 453729 175897 238525 568207 248168 289510 353424 758996 483687 67358
9067F7358J07243K2423j71634j30909M38687m39489m840j58089K82211J61732
9057A74693m3048m1038L72115j33083j56349M51123l51551k88841l8286O57850
9047F03585l5793k77880L8312J88226j6443k24836J40115M0512L007P9324r5367
9036D42762J5967m3266K93460p3142J64333J16956k13910J06139r1296j47110
9026E70893l9175q3895L959l9470O975k3980K74942j34123J08279J76050k77278
9015E43177k18954N6730J40154O9500J6249o126l7664J90159P4021j59923M75928
9004A143251o9898j90043l1880j59328m3863K16836J94916j53007l21119l96472
8994A89393K72029Q8839K44325J37745l29963k07964j87036L26205L15166j05719
$$ plain form
9067 67358 174601 197024 25390 -105519 333168 -106321 -111161 -269250 12961 174693
9057 174693 131645 90607 462722 329639 173290 624413 272862 -15979 -54265 603585
9047 603585 567792 289912 328224 516450 500007 275171 415286 455798 458805 538129 442762
9036 442762 458729 415463 708923 635781 800114 917070 703160 809299 718003 570893
9026 570893 531718 447823 451782 412312 419287 395307 670249 536126 644405 820455 543177
9015 543177 324223 380953 521107 590607 606856 600730 563066 753225 827246 667323 1143251
9004 1143251 1073353 883310 851430 692102 648239 865075 1059991 906984 585865 189393
8994 189393 461422 550261 794586 932331 602368 394404 207368 533573 848739 743020
8984G43020j87183J52573N6332k65239k05168L86758K94024m15460j83966J04464
8974D80155j75495J17193l5970J53792r7302k4071L21441m6018j63698p7565j41793
8963C10669K27445L32462o2728k13866k91509J98983L14269K29781k51022j20709
8953F73775J49220l5215J14260Q429r6464m51407J40741j2011K92037q0742j07737
8942E94886J25636l57768n5910L56345k25926l6862K36467J75963K12509N402
8932A030742j10816Q0664q0165m46821R0408L52595l02880o9815J34933J02182
8922G81027k31382k51706O3662P0494L72984J49493k02779k8630K33201O9812
8912A026176p3945p1789J57162j33421j43671J77201M19289o2511l88010M5073
$$ plain form
8984 743020 555837 708410 764742 499503 294335 681093 975117 559657 375691 480155
8974 480155 304660 421853 385883 539675 442373 418302 739743 693725 530027 452462 310669
8963 310669 538114 870576 807848 593982 302473 501456 815725 1045506 794484 673775
8953 673775 822995 787780 902040 910469 814005 362598 503339 491328 783365 702623 594886
8942 594886 720522 362754 306844 663189 437263 400401 636868 812831 1025340 1030742
8932 1030742 919926 1000590 920425 473604 564012 916607 613727 543912 678845 781027
8922 781027 549645 297939 361601 432095 805079 954572 751793 723163 956364 1026176
8912 1026176 952231 880442 1037604 904183 760512 937713 1357002 1294491 906481 951554
8902I51554J85314O5602r5475l60453P701m0558R6778k6896L5691M3053n7223
8891H05088J88227J21766m22795J10262M6194O72324L44019q69390P3661K47279
8881A316635j23850j57910o1709J75318L07150J03679k43513j64761J92723O8156
8871A411918q384j10804L46121o1394L7967j32712k66273J29565J28988j32396
8861A342596l97957J39557L43625j172K45661j23951k81723J98813N5757j17652
8851A403554j54353K49520r9916M4936j35982K86933q6511P2759K39628k7795
8841A792773o1836K90911n7370k05751j75477K28914o9178J8586j32787o3248
8831A565537q2072k22024L62968K33546L4611j34546J76068k52443K63348j9120
$$ plain form
8902 951554 1136868 1202470 1106995 746542 754243 713685 810463 783567 819258 862311 805088
8891 805088 993315 1115081 692286 802548 848742 1521066 1865085 995695 1069356 1316635
8881 1316635 1192785 1034875 973166 1148484 1455634 1559313 1315800 1151039 1343762 1411918
8871 1411918 1403534 1292730 1638851 1577457 1615424 1482712 1216439 1346004 1474992 1342596
8861 1342596 944639 1084196 1427821 1426649 1672310 1548359 1266636 1465449 1521206 1403554
8851 1403554 1249201 1498721 1398805 1443741 1307759 1594692 1508181 1580940 1820568 1792773
8841 1792773 1730937 2021848 1964478 1758727 1583250 1812164 1742986 1761572 1628785 1565537
8831 1565537 1483465 1261441 1624409 1857955 1892566 1758020 1934088 1681645 1944993 1925873
8821A925873N3093J4488l44083q4928j41800k4853L6924Q2981r9825M03637K15347
8810B036854k02664k5041m9817K5022K78261j02448p6792M65437M7667m13773
8800A982706n1735K52245j03391J37779m3432J05549J91495k049L8683j04058
8790B403792m41710n82K69518J19990J47513K56742L866j52622k36625k51095
8780B118787J10820P4239K10826P4229L9758Q4673n2079J82015j03705p4171k48107
8769B417285R2940j34516N8843J11220K93444l2627J29078j68231k04833Q1606
8759B644209R4553M31502K25145l75009j68750k04889J30112M20861k40261r6054
8749B861419K14406j11378J20680J56722l0589K19292J15186J40080K78883j00877
$$ plain form
8821 1925873 1978966 1993454 1649371 1564443 1422643 1397790 1434714 1517695 1417870 1821507 2036854
8810 2036854 1834190 1809149 1759332 1784354 2062615 1960167 1883375 2348812 2396479 1982706
8800 1982706 1930971 2183216 2079825 2217604 2174172 2279721 2471216 2469167 2507850 2403792
8790 2403792 1962082 1961500 2231018 2351008 2498521 2755263 2759129 2606507 2369882 2118787
8780 2118787 2229607 2303846 2514672 2588901 2628659 2713332 2661253 2843268 2739563 2665392 2417285
8769 2417285 2510225 2375709 2434552 2545772 2839216 2806589 2935667 2767436 2562603 2644209
8759 2644209 2738762 3170264 3395409 3020400 2851650 2646761 2776873 3197734 2957473 2861419
8749 2861419 3075825 2964447 3085127 3241849 3211260 3430552 3545738 3685818 3964701 3863824
8739C863824l65146L116J81835M8690j16934j72093j04470J28017R5832K83734
8729C846405j83196J15572J67036O4909k81780R945k49516J15324K91250k58416
8719C637533J31584K20563R5623l634J66493j41350O2643J95771L84952M2320
8709D792498j52377P676j71028q5887K8398p1235J74516j27205k33312M24131
8699D586175L04938J93345k28059k38446j31684L66741j39610K66379r6812k8294
8689D854673m0103L77562J48239j83018K42593J3079k59537R640L10416L11368
8679E784912l00138j29436L65065O74549L1138m43086M9172k1114k24390j34012
8669E652660M48640K79567J59448k66034J07070N7881R1223J76323K35817j9639
$$ plain form
8739 3863824 3498678 3501794 3683629 3732319 3615385 3443292 3338822 3466839 3562671 3846405
8729 3846405 3663209 3778781 3945817 4010726 3728946 3738891 3489375 3604699 3895949 3637533
8719 3637533 3769117 3989680 4085303 4081669 4248162 4106812 4169455 4365226 4750178 4792498
8709 4792498 4640121 4647797 4476769 4390882 4419280 4348045 4522561 4395356 4162044 4586175
8699 4586175 4891113 5084458 4856399 4617953 4486269 4853010 4713400 4979779 4882967 4854673
8689 4854673 4814570 5192132 5340371 5157353 5399946 5413025 5153488 5163128 5473544 5784912
8679 5784912 5484774 5355338 5720403 6394952 6426090 5983004 6032176 6011062 5786672 5652660
8669 5652660 6101300 6380867 6540315 6274281 6381351 6439232 6530455 6706778 6942595 6922956
8659F922956m4437j07157j84925J15913R4803L975J44435n4519L3200k7944J10076
8648G006376q3253K22481K1265N924L58127J15218L59195K30315j61109r5058
8638G979481k55527M1601M08610j5540L5158O2511J01641M63334o7889k82966
8628H470414J88724K35805J05523N6503j31524J81395K21761j51630j31641L13045
8618I358375K23517K04282L94100J91251K23739j07622P8753J73531M1337j73552
8608A0607711J14663M13304R2322L4261J75664j31299K05671M31288L40631j37592
8598A2146624r9809K00282N4330J98786K67798P353J9424J03515L32061P4688
8588A3305052L44814J9932n870K59976k6523L01105M95061M75329m1570k1953
$$ plain form
8659 6922956 6878519 6771362 6586437 6702350 6797153 6801128 6945563 6891044 6924244 6896300 7006376
8648 7006376 6923123 7145604 7166869 7172793 7530920 7646138 8005333 8235648 8074539 7979481
8638 7979481 7723954 7765555 8174165 8158625 8193783 8256294 8357935 8821269 8753380 8470414
8628 8470414 8659138 8894943 9000466 9056969 8925445 9106840 9328601 9176971 9045330 9358375
8618 9358375 9581892 9786174 10180274 10371525 10595264 10487642 10566395 10739926 10781263 10607711
8608 10607711 10722374 11135678 11228000 11262261 11437925 11306626 11512297 11943585 12284216 12146624
8598 12146624 12046815 12247097 12301427 12500213 12768011 12775364 12794788 12898303 13230364 13305052
8588 13305052 13649866 13669798 13663928 13923904 13897381 14198486 14693547 15168876 15127306 15105353
8578A5105353P1426K32061j22117M8173L46182j66745L44839N40807J3897K72035
8568A6685911K09772M07097L02312Q4809n4737M02485K52073O9306K85128J23582
8558A8767738K6017j18909N44051O09166j4999K96612N20608J80381J51938L29171
8548B1291774J7420K48050M68604L15602J54411J58345N60158L39735L49568k3753
8538B3879914P3504N03954N11843J72208L50417Q24357L51052N17104j70360N35648
8528B7549641N57218N83349L98890O56555N81154j35254N01462N09493K81620
8519C1484128P06343J054324M66994K83781O17100P46574M91619M80726L76933
8510C6708522M22449O87438N04179P44522P58760N45510R59116Q00515P79472
$$ plain form
8578 15105353 15176779 15408840 15286723 15334896 15681078 15514333 15859172 16399979 16413876 16685911
8568 16685911 16895683 17302780 17605092 17689901 17635164 18037649 18289722 18359028 18644156 18767738
8558 18767738 18793755 18674846 19218897 19828063 19813064 20109676 20630284 20810665 20962603 21291774
8548 21291774 21309194 21557244 22025848 22341450 22495861 22654206 23214364 23554099 23903667 23879914
8538 23879914 23953418 24457372 24969215 25141423 25491840 26316197 26667249 27184353 27013993 27549641
8528 27549641 28106859 28690208 29089098 29745653 30326807 30191553 30693015 31202508 31484128
8519 31484128 32190471 33244795 33711789 33995570 34612670 35359244 35850863 36331589 36708522
8510 36708522 37130971 37818409 38322588 39067110 39825870 40371380 41330496 42131011 42910483
8501D2910483O21794N54063N19537Q99062R80425R65669J122544J037869O27507
8492E0238953J144409J049468J097604P26777R75130J358770Q78855P89515J210269
8483E9469750J636737R61074J096542J170120J071260J593590J804936J642946
8475G0446955J293313J678783J543507J438565J913679J425683J639997K011841
8467H3392323J970718K138835J638627K354569J932418K247211K110090K203728
8459I9988519K220800J951725K596529K614657K566387K877935K718773K583680
8451A20119005L044518K691657L256636K861729L178062L163670L181423L689818
8443A45186518L620351L375020L406578L696520L522149L858431L837500L778338
$$ plain form
8501 42910483 43532277 44086340 44605877 45504939 46485364 47451033 48573577 49611446 50238953
8492 50238953 51383362 52432830 53530434 54257211 55232341 56591111 57469966 58259481 59469750
8483 59469750 61106487 62067561 63164103 64334223 65405483 66999073 68804009 70446955
8475 70446955 71740268 73419051 74962558 76401123 78314802 79740485 81380482 83392323
8467 83392323 85363041 87501876 89140503 91495072 93427490 95674701 97784791 99988519
8459 99988519 102209319 104161044 106757573 109372230 111938617 114816552 117535325 120119005
8451 120119005 123163523 125855180 129111816 131973545 135151607 138315277 141496700 145186518
8443 145186518 148806869 152181889 155588467 159284987 162807136 166665567 170503067 174281405
8435A74281405M256800M040906M073652M026868M412763M751685M100358M586663
8427B08531100M784288M815866M988190M446461M535295N150903N218424M565348
8419B47035875N104974M939867M652207N041758M858124M820764M417093M636070
8411B85506732M674919M408047L901457M217985M080590M022887L691711L476015
8403C17980343L259791L143496K982706L006516K515024K337363K099327K069115
8395C39393681J724163J226774J175859N00489P65403K07235L09006j88519p80184
8386C44333907r74737n63686j324601j376388j974026k319168k714562k686358
8378C30400381k592452l106443l252059l910004m190316l889972m142245m187117
$$ plain form
8435 174281405 178538205 182579111 186652763 190679631 195092394 199844079 203944437 208531100
8427 208531100 213315388 218131254 223119444 227565905 232101200 237252103 242470527 247035875
8419 247035875 252140849 257080716 261732923 266774681 271632805 276453569 280870662 285506732
8411 285506732 290181651 294589698 298491155 302709140 306789730 310812617 314504328 317980343
8403 317980343 321240134 324383630 327366336 330372852 332887876 335225239 337324566 339393681
8395 339393681 341117844 342344618 343520477 344020966 344786369 344993604 345302610 345114091 344333907
8386 344333907 343359170 342795484 341470883 340094495 338120469 335801301 333086739 330400381
8378 330400381 327807929 324701486 321449427 317539423 313349107 309459135 305316890 301129773
8370C01129773m397604m420697m884039n056473n316866n014820n326596n218763
8362B61493915n347296n476287n232669n408361n421674n132266m858651n178543
8354B19438168n212956n034812m952189m709788m954351m779991m795188m505647
8346A80493246m132223m207650m164610m179941l713241m000433l686502l896326
8338A48512320l591338l692752l284892l185946k945853l401579l398361k578464
8330A22433135k605885k982919l017463k574241k207193k807619k047408k098991
8322A02091416k275141k419761k454482k082905j811475j681822j865974k045011
8314H5454845j764786j258192j952210j751053j126055k049264j321279j282374
$$ plain form
8370 301129773 296732169 292311472 287427433 282370960 277054094 272039274 266712678 261493915
8362 261493915 256146619 250670332 245437663 240029302 234607628 229475362 224616711 219438168
8354 219438168 214225212 209190400 204238211 199528423 194574072 189794081 184998893 180493246
8346 180493246 176361023 172153373 167988763 163808822 160095581 156095148 152408646 148512320
8338 148512320 144920982 141228230 137943338 134757392 131811539 128409960 125011599 122433135
8330 122433135 119827250 116844331 113826868 111252627 109045434 106237815 104190407 102091416
8322 102091416 99816275 97396514 94942032 92859127 91047652 89365830 87499856 85454845
8314 85454845 83690059 82431867 80479657 78728604 77602549 75553285 74232006 72949632
8306G2949632j383758j366781j608447j254002j240940j702981j409728p60909
8298F2222086j320521j040019r18242q91332j150880j240148q06916j171182o94965
8289E2987881p47291j479351r62049o35832p46725p38476n59898r52330n92617
8280D5573312j057867o71114p66839p92721o47118n26688p21577q12463m68608
8271C9108317p27921n38378m83731m98388l64971l31200q53665m78780m44385
8262C4386898l14409o03949l78497o82365k94415o34887o17602k87093m89765
8253C0083916n94449n39100o1698j75915j51204p08396m23923m67354l59819l93925
8243B6208133k21715o15661k21847j75006k03200j13419o39844M9247k28849k80194
$$ plain form
8306 72949632 71565874 70199093 68590646 67336644 66095704 64392723 62982995 62222086
8298 62222086 60901565 59861546 58943304 58051972 56901092 55660944 54854028 53682846 52987881
8289 52987881 52240590 50761239 49799190 49163358 48416633 47678157 47118259 46165929 45573312
8280 45573312 44515445 43844331 43077492 42284771 41637653 41110965 40389388 39576925 39108317
8271 39108317 38380396 37842018 37358287 36859899 36494928 36163728 35310063 34831283 34386898
8262 34386898 34072489 33468540 33090043 32407678 32113263 31478376 30860774 30573681 30083916
8253 30083916 29489467 28950367 28888669 28712754 28561550 27853154 27429231 26961877 26602058 26208133
8243 26208133 25986418 25370757 25148910 24973904 24770704 24657285 24017441 24066688 23837839 23557645
8233B3557645l75204m57416j16616k45408k23180n74518J23682l92663j19754
8224B1176568p534n62637k03979j64898k77137l90541k10174o8326j07530j75171
8214A9008641j14227j46148k26850k31801l09838k43672k37433m95075j83478
8205A6820119k05327J13030o2654k54403l14063j74081k28552l2719k84248k3610
8195A5353492K09050m25533j2268j82475l8401j84880l30180J29594r0207m20839
8185A4007353n9200l43612K0572L5211m64493j90136l8866k17226q6994J28761
8175A2791370j37099P0676j62591l62627L77391P1875m96964j52816l57887j142
8165A1640186j95317k9615K37831k63618L9061m40894k02296j29011j44289N6292
$$ plain form
8233 23557645 23182441 22725025 22608409 22363001 22139821 21565303 21688985 21296322 21176568
8224 21176568 21169034 20606397 20402418 20237520 19960383 19569842 19359668 19291342 19183812 19008641
8214 19008641 18894414 18748266 18521416 18289615 17979777 17736105 17498672 17003597 16820119
8205 16820119 16614792 16727822 16665168 16410765 16096702 15922621 15694069 15661350 15377102 15353492
8195 15353492 15562542 15137009 15124741 14942266 14903865 14718985 14388805 14518399 14428192 14007353
8185 14007353 13948153 13604541 13625113 13660324 13195831 13005695 12966829 12749603 12662609 12791370
8175 12791370 12654271 12724947 12562356 12199729 12577120 12648995 12152031 11999215 11641328 11640186
8165 11640186 11444869 11415254 11653085 11389467 11428528 10987634 10785338 10656327 10512038 10568330
8155A0568330P9802L08231j28113n39903J8861j95292l62488N21018Q8776k56887
8145A0102335j43910Q3041k38000k23509N9552L09746O1591l61538l01325l76116
8135H971867J36709M3158Q1391l21203Q4714q1982k52118K90007K59765o55877
8125H556431n02238Q8266L32617m6809k66280K01380J5590j89714j67963j70314
8115G850966o4797M0331p2973K0624Q0852L36919r6484l79798j26340J03384j77292
8104G515392r3229m0145N7957l45165K16625Q8112j45472k23681j85797J22406
8094F967003J55759m1520J41236j39445j50904j391K13565J87770j20246J09056
8084G320883k67704j99100K84441J86015k31289k34586K40933K72332O9468l76891
$$ plain form
8155 10568330 10648132 10956363 10828250 10288347 10307208 10111916 9749428 10270446 10359222 10102335
8145 10102335 9958425 10041466 9803466 9579957 9639509 9949255 10010846 9649308 9347983 8971867
8135 8971867 9108576 9151734 9233125 8911922 8996636 8914654 8662536 8952543 9212308 8556431
8125 8556431 8054193 8142459 8475076 8428267 8161987 8363367 8378957 8189243 8021280 7850966
8115 7850966 7786169 7826500 7753527 7774151 7855003 8191922 8095438 7715640 7589300 7692684 7515392
8104 7515392 7422163 7382018 7439975 7094810 7311435 7399547 7254075 7030394 6844597 6967003
8094 6967003 7122762 7081242 7222478 7083033 6932129 6930738 7144303 7332073 7211827 7320883
8084 7320883 7053179 6854079 7138520 7324535 7093246 6858660 7099593 7371925 7441393 7064502
8074G064502j48785j83939J62945m3242l14385l5539o1194P8607M74386j42222
8064F851134k81240j57325k13224P0621j59774k84455n4613R2488n0905O2801
8054E875508l02695j91424o6267J76656P1230K66376M0381l65874J20789J62307
8044E786987K5060o8714J11401j00226k70065k0655N0625M189m63679M73585j9446
8033E509062r7826K04063J91975j88824P4616J45783l24783J33756k0099J63236
8023E790959j45880l86974j44482K96010J74627l51608j35315K11908l083k76303
8013E029859k30571k07174o0411j13150K77528J99014O03986j81648m74430O5974
8003D908977O5598O7014j06752j06445j77126j83823k2077K29679R3692J13591
$$ plain form
8074 7064502 6915717 6731778 6894723 6851481 6537096 6501557 6440363 6518970 6993356 6851134
8064 6851134 6569894 6412569 6199345 6269966 6110192 5825737 5771124 5863612 5812707 5875508
8054 5875508 5572813 5381389 5315122 5491778 5563008 5829384 5869765 5503891 5624680 5786987
8044 5786987 5812047 5743333 5854734 5754508 5484443 5463788 5514413 5518602 5054923 5528508 5509062
8033 5509062 5411236 5615299 5807274 5618450 5693066 5838849 5514066 5647822 5627723 5790959
8023 5790959 5645079 5258105 5113623 5409633 5584260 5232652 5097337 5309245 5306162 5029859
8013 5029859 4799288 4592114 4531703 4418553 4696081 4895095 5499081 5317433 4843003 4908977
8003 4908977 4974575 5041589 4934837 4828392 4651266 4467443 4445366 4675045 4768737 4882328
7993D882328K39394j06042R7118P2888L9179k43703k88348K7829J80686j74206
7983D727123j00356P6850J81720J7830m40101J62234J19587P6694q6665n1329
7973D683587j59943m8201j50593p6571Q7786L29132Q2235m55236k2159m0099K58503
7962D488441M16465K13107K03619k49976l79712k5339M92183K97942j50955k83892
7952E021883L2011j65444J46069O9815o7863P6320J8813k0227m7558k03642J49148
7941E009325J18684j68741k9119n5649k05515Q8377L59131k64629k50090N0131
7931D651905N1127J33444K94607q6980M6940l35999j08440N62010j782l1326J5355
7920E190861J01625K29289J3205M501K32346k35084J29105K37210r3698K24094
$$ plain form
7993 4882328 5121722 5015680 5112798 5185686 5224865 4981162 4692814 4720643 4901329 4727123
7983 4727123 4626767 4703617 4885337 4903167 4463066 4625300 4744887 4821581 4734916 4683587
7973 4683587 4523644 4475443 4324850 4248279 4336065 4665197 4747432 4292196 4270037 4229938 4488441
7962 4488441 4904906 5118013 5321632 5071656 4691944 4666605 5158788 5456730 5305775 5021883
7952 5021883 5053894 4888450 5034519 5104334 5036471 5112791 5131604 5111377 5063819 4860177 5009325
7941 5009325 5128009 4959268 4930149 4874500 4668985 4757362 5116493 4851864 4601774 4651905
7931 4651905 4703032 4836476 5131083 5044103 5091043 4755044 4646604 5208614 5206832 5175506 5190861
7920 5190861 5292486 5521775 5534980 5539481 5771827 5536743 5665848 5903058 5809360 6033454
7910F033454J75285j8481Q9997K70084r6313j17930J44012j16010J33264j83186
7900F314176k4665M78057j29297l4784K60111J28511L05627K58115M8750K17442
7890G822043O1909M19707O55494L1703J36711O77596M53844J34423L87035M15352
7880A1195817K97418j60688j2820n1720l5854k73095k53613M80717K35338m9320
7870A1372180k4464P7570j68682M1463j75480N9804K53761L64125N5539M8923
7860A1904739R2105L46060L41882K97491K20397J11667Q05935P45415O39437M97599
7850A6002727Q21509R71918N88749O99974J234326R03166Q94733J435015J362946
7841B4915063J299032J471364J466365J980413K711729K629997K308133J731899
$$ plain form
7910 6033454 6208739 6190258 6280255 6550339 6454026 6336096 6480108 6364098 6497362 6314176
7900 6314176 6289511 6767568 6638271 6603487 6863598 6992109 7297736 7555851 7604601 7822043
7890 7822043 7883952 8303659 8959153 8990856 9127567 9805163 10259007 10393430 10780465 11195817
7880 11195817 11493235 11332547 11319727 11268007 11232153 10959058 10705445 11186162 11421500 11372180
7870 11372180 11347716 11425286 11256604 11298067 11122587 11182391 11436152 11800277 11855816 11904739
7860 11904739 11996844 12342904 12684786 12982277 13202674 13314341 14120276 14865691 15505128 16002727
7850 16002727 16824236 17796154 18384903 19084877 20319203 21222369 22117102 23552117 24915063
7841 24915063 26214095 27685459 29151824 31132237 33843966 36473963 38782096 40513995
7833D0513995J033469L2465q53602j877348k357999k396212k608198k581036k068347
7824B6837187j367945j006540j085060p51987l99431n09597n27634k68853n6095
7815B0864045n9759M22566L62501M49905L50904K04720O18357Q78437J151322
7806B5242998Q47067O96399J010807J776360J983338J787401K310255K589393
7798C8244018L299972K887800J882062J032348l9771j120694k271586l021423
7790D0892726l319855l334720l241609k659910k203520j933710j516811j368526
7782B1314065j182987q87844p17906l14451p17833l24337m97228o62730o48548
7773A5360201m33024k61970k47364K78404k76070k55379L0278K6463k17682k2764
$$ plain form
7833 40513995 41547464 41579929 40726327 38848979 36490980 34094768 31486570 28905534 26837187
7824 26837187 25469242 24462702 23377642 22625655 22226224 21716627 21188993 20920140 20864045
7815 20864045 20804286 21226852 21589353 22039258 22390162 22594882 23213239 24091676 25242998
7806 25242998 26090065 26786464 27797271 29573631 31556969 33344370 35654625 38244018
7798 38244018 41543990 44431790 46313852 47346200 47306429 46185735 43914149 40892726
7790 40892726 37572871 34238151 30996542 28336632 26133112 24199402 22682591 21314065
7782 21314065 20131078 19243234 18525328 18210877 17493044 17168707 16671479 16008749 15360201
7773 15360201 14927177 14665207 14417843 14696247 14420177 14164798 14195076 14221539 14003857 13981093
7763A3981093j035K60358k11429k38487K19473r3869k86265l14701J21834J23565
7753A3560537M3613M56844J02078j57759L75021L07632J82039K70981K00915J99724
7743A5541625K19038K34645L27812M43209Q85208O21468L57326R52697J255588
7734B0838616P80031J436652J732293J629841K033216K181568K128168K954892
7726C5715277L802426L231422M094050M079809L729468M015405K835272K640892
7718F4144021K356383J893523L95327Q437r56530j713731j982743k844685l382090
7709E7917912l757406l788816m510041l933183l561403l212363k931686k682382
7701B9540632k008042k012334j569629j305405j606607j133840q54205r39367
$$ plain form
7763 13981093 13980058 14240416 14028987 13790500 14009973 13916104 13629839 13315138 13436972 13560537
7753 13560537 13604150 14060994 14163072 14005313 14380334 14687966 14870005 15140986 15341901 15541625
7743 15541625 15760663 15995308 16323120 16766329 17651537 18273005 18630331 19583028 20838616
7734 20838616 21618647 23055299 24787592 26417433 28450649 30632217 32760385 35715277
7726 35715277 39517703 42749125 46843175 50922984 54652452 58667857 61503129 64144021
7718 64144021 66500404 68393927 68789254 68797691 67841161 66127430 64144687 61300002 57917912
7709 57917912 54160506 50371690 45861649 41928466 38367063 35154700 32223014 29540632
7701 29540632 27532590 25520256 23950627 22645222 21038615 19904775 19050570 18111203
7693A8111203j089334j090713p71103n30531p77341l56923r36853o05708n33090
7684A1419607n42601n72894j83617l47231l22780k07246o96260k81196k1199l14570
7674G930013J11270k84267j54070j2361l32112m26320L18668k01279k16229J11864
7664F845177k77391l5751p2634k40886p3922l34948j51005J45532j55426k65955
7654E382791l04572J10168o3491k9552k79047j76060K62434L11007l11020j8621
7644D884037k18165l20258m7968L0335l03329j61987J47005j43292J30693k31397
7634C765674j7967L84957r589j20481j49761K29004j24733j22909n55446J97393
7624C476142J4482L07842N5644j88974K90910N1160m60338j67233j7816K83447
$$ plain form
7693 18111203 17021869 15931156 15160053 14629522 13852181 13495258 12558405 11952697 11419607
7684 11419607 10877006 10304112 10120495 9773264 9450484 9243238 8546978 8265782 8244583 7930013
7674 7930013 8041283 7757016 7602946 7590585 7258473 6832153 7150821 6949542 6733313 6845177
7664 6845177 6567786 6532035 6459401 6218515 6144593 5809645 5658640 5804172 5648746 5382791
7654 5382791 5078219 5188387 5124896 5095344 4816297 4640237 4902671 5213678 4902658 4884037
7644 4884037 4665872 4345614 4297646 4327981 4024652 3862665 4009670 3866378 3997071 3765674
7634 3765674 3747707 4132664 4123075 4002594 3852833 4081837 3957104 3834195 3278749 3476142
7624 3476142 3490624 3798466 3854110 3665136 3956046 4007206 3546868 3379635 3361819 3645266
7614C645266j18605P0832m571O2776k40888O348J64091j41008K34797J90332M76352
7603D345722L763n78148k83633M1794K09123J28786L3263J46815K71071n21j96720
7592D121315J90562n9177K12823m0967k50998M386j73358K94288L5273Q1563O6468
7581D482178o6213L39746m5639J20999K25131J97482l52293p4957K56987R4222
7571E177643O469K65203j7252j06173K80512K01017L92607j2739J2262k10459
7561E989090k66380M46834p4120P2074K85463J19596P1082J95641J68948J89576
7551G197804K69063K13436M25376K45412k4052M20268K26625j0312J82911Q67598
7541A0014129J02095K39935M60348M79252L21374M51436M91546N89333R46298
$$ plain form
7614 3645266 3526661 3597493 3592922 3655698 3414810 3421158 3585249 3444241 3679038 3869370 4345722
7603 4345722 4349485 3771337 3487704 3529498 3738621 3867407 3900670 4047485 4318556 4318035 4121315
7592 4121315 4311877 4252700 4465523 4424556 4173558 4177944 4004586 4298874 4334147 4415710 4482178
7581 4482178 4415965 4755711 4710072 4831071 5056202 5253684 4901391 4826434 5083421 5177643
7571 5177643 5184112 5449315 5432063 5325890 5606402 5807419 6200026 6187287 6199549 5989090
7561 5989090 5722710 6169544 6095424 6167498 6452961 6572557 6643639 6839280 7008228 7197804
7551 7197804 7466867 7680303 8105679 8351091 8327039 8747307 8973932 8963620 9146531 10014129
7541 10014129 10116224 10356159 10816507 11295759 11617133 12068569 12560115 13149448 14095746
7532A4095746J178102P71636M88892P07586J274269Q08038J249362J266096J803900
7523B3643627J432792J891975K380403K517216K433159J789485J539472M55295
7515C8083424J89819M35978j66542k65685m83187k77624j490304j625152j768193
7506C2632534k211866k048316j800455j564539j217751r19350j086124p04730
7498B1079403n46544J68046l96164R9067l4457K20870P6848M57415L07527M47466
7488B1879477M19464J021861K61616J381942J312122J275468J249858J371336
7480C0173144J493948P72765L00958M02141l59323p93317k56465m63222q02653
7471C0467976j032097j716289k274847k006416k045333k021856j338997j103985
$$ plain form
7532 14095746 15273848 16045484 16534376 17241962 18516231 19324269 20573631 21839727 23643627
7523 23643627 25076419 26968394 29348797 31866013 34299172 36088657 37628129 38083424
7515 38083424 38273243 38709221 38542679 38276994 37793807 37516183 36025879 34400727 32632534
7506 32632534 30420668 28372352 26571897 25007358 23789607 22870257 21784133 21079403
7498 21079403 20532859 20700905 20304741 20403808 20369351 20590221 20667069 21124484 21432011 21879477
7488 21879477 22298941 23320802 23582418 24964360 26276482 27551950 28801808 30173144
7480 30173144 31667092 32439857 32740815 33142956 32783633 31990316 31733851 31270629 30467976
7471 30467976 29435879 27719590 25444743 23438327 21392994 19371138 18032141 16928156
7463A6928156j371212j040514j160487o51385l14716p50069o96347o30932n30712
7454I781782m24872n72291l48430J13209m63845k28263k03304j50384l1152n23884
7444F948566l21080j81178K63865p4959o91179P1270J37658l1222m799Q4453r0321
7433F111074j31099q5834l73009m030m42773l64431j97273R251j08576o0773K23614
7422D576141j94384K1082J51621n3884k86062j14478k77948j20364j0157M09111
7412D100678J45265l04191P2388k27128L39130l55356l27322j01776J12199J36364
7402C590251j56913k57011K2692j39172l06631O3973L2045k9133K1887l5071j96552
7391B610365o1074L02893o1263M712l06832q7765j52442J07841K30473j53887
$$ plain form
7463 16928156 15556944 14516430 13355943 12704558 12389842 11639773 10943426 10312494 9781782
7454 9781782 9356910 8784619 8436189 8549398 8085553 7857290 7653986 7503602 7472450 6948566
7444 6948566 6627486 6446308 6710173 6635214 5944035 6015305 6152963 6121741 6116942 6201395 6111074
7433 6111074 5979975 5894141 5521132 5517102 5074329 4709898 4512625 4521876 4413300 4352527 4576141
7422 4576141 4381757 4402839 4554460 4500576 4214514 4100036 3822088 3701724 3691567 4100678
7412 4100678 4245943 3941752 4014140 3787012 4126142 3770786 3443464 3341688 3453887 3590251
7402 3590251 3433338 3176327 3199019 3059847 2753216 2817189 2849234 2820101 2841988 2806917 2610365
7391 2610365 2549291 2852184 2790921 2795633 2488801 2401036 2248594 2356435 2586908 2433021
7381B433021l28608J67227K99927M130M5590J71812K5475j99619J72727l35263
7371B456419L77R7752J05576J24035k24347j56312j69054j94206j51869Q0807
7361A969178J79444m8571j33977L31561m76108k42189K16249J3619J21884l39062
7351A592028l94289J91199j10961O701J23230K17526J97638j91500m9319n4177
7341A528076K4835O2262j17197N2587k50807k02771j06756K06811Q9249r6476
7331A189813N2167j40218k55819k23588L24072J57366M3575j97865Q1563j73218
7321H57848l8862J5551K3518j65674R4128J94349M2652N9098j57174J3585J78609
7310A117628J40262j09708j9807l8402k65651j22221K65408j3170K04375j19648
$$ plain form
7381 2433021 2104413 2271640 2571567 2575697 2621287 2793099 2818574 2618955 2791682 2456419
7371 2456419 2456796 2554548 2660124 2784159 2559812 2403500 2234446 2040240 1888371 1969178
7361 1969178 2148622 2100051 1966074 2297635 1821527 1579338 1795587 1809206 1931090 1592028
7351 1592028 1197739 1388938 1277977 1284678 1407908 1625434 1823072 1631572 1582253 1528076
7341 1528076 1552911 1615173 1497976 1550563 1299756 1096985 990229 1197040 1286289 1189813
7331 1189813 1241980 1101762 845943 622355 946427 1103793 1147368 949503 1031066 857848
7321 857848 818986 834537 858055 692381 786509 980858 1023510 1082608 925434 939019 1117628
7310 1117628 1257890 1148182 1128375 1089973 824322 702101 967509 954339 1158714 1039066
7300A039066k05837K37067J70463K548j30613j16949k3791J50786j08700N8303
7290A072343P151j32776o22935J35555j7604L430R4788K6632O709j56880K28900
7279F45313L54585l68359j78801j3660q420L06392J83373j03638N1665l42399
7269E26051J36640j62614m6309L82302l77015J43848K3353l3278O7112j17195
7259E42895L15496J83823l02399P9024J34731l16385k38706K24021j84932L12944
7249G50512j77341M3229L10554k57100m29250J77744L73723o4335j37355j25256
7239D65125K93231n0137j83814N2421j27317n6774J44512K35650k28141l27914
7229B16842k2685M77747J50257J31978K28951L4637m97331m93866K10290K35791
$$ plain form
7300 1039066 833229 1070296 1240759 1243307 1112694 995745 971954 1122740 1014040 1072343
7290 1072343 1079494 946718 323783 459338 441734 445164 539952 566584 573293 416413 645313
7279 645313 999898 631539 452738 439078 430658 737050 920423 816785 868450 526051
7269 526051 662691 500077 453768 836070 459055 602903 626256 592978 660090 542895
7259 542895 858391 1042214 739815 818839 953570 637185 398479 622500 437568 750512
7249 750512 573171 616400 926954 669854 240604 418348 792071 727736 590381 465125
7239 465125 758356 708219 524405 576826 449509 392735 537247 772897 544756 216842
7229 216842 194157 671904 822161 954139 1183090 1217727 720396 226530 436820 672611
7219F72611n054l00840K48247J15472P6539k53035K6095J62257n0086J84322j8373
7208H58155j09711k08859k64264k22854L90047L16846k16012j98159J29781j379
7198D73591P9119L82279N5412l51087p4425j25899m6040J91877r3817M7063n4807
7187D83266K3910k50875J42329N3476Q9207J55604l08169j42473r6515L0543K7887
7176B08190K67633K0926K4168L75217k81523j32564M701j48715J33482l3798p376
7165D30341l25482K27276J08352J32773k14735j08581K53886r6148N3167j82570
7155B78279J60743k689J1788J6153j04112J55392n6424j1664O7785J63312J56522
7144H35085j6538l24409j63141K4910L05869J13258k38325j1393j06044m6643
$$ plain form
7219 672611 667557 366717 614964 730436 806975 553940 580035 742292 692206 876528 858155
7208 858155 748444 539585 275321 52467 442514 759360 543348 345189 474970 473591
7198 473591 552710 934989 990401 639314 564889 438990 392950 584827 491010 538073 483266
7187 483266 507176 256301 398630 452106 541313 696917 388748 246275 149760 180303 208190
7176 208190 475823 496749 520917 896134 614611 482047 486748 338033 471515 437717 430341
7165 430341 104859 332135 440487 573260 358525 249944 503830 407682 460849 278279
7155 278279 439022 436333 448121 464274 360162 515554 459130 447466 515251 678563 835085
7144 835085 818547 494138 330997 355907 661776 775034 536709 525316 419272 372629
7134C72629j06993j39951k3692j20510M54641L7374k88512j31466J23440M20885
7124E97845k13078r6958o9378p2529N0159J37287P6732j66929k45045K00135M06106
7113F04347l25748q5037K6423R3088P5048l94853K56070J16794J1261k2389j5548
7102C39456j94177J84470P1817J21226k5625k43512j39858k07759K02520K09138
7092C17696j43081k58640L78823r0359l17014L8423K23937K19540J81779j88640
7082C62464o1245J43906j2744m73050R306O0590K37817k37349o5573K76160k83437
7071d3155K95985J84460k72772j79354J65274j94268O4788J06903l28519K22779
7061B2121K15736j67197L2484J32511p4243j82893L77150J26580o6099J29829
$$ plain form
7134 372629 265636 125685 101993 -18517 436124 473498 184986 53520 176960 597845
7124 597845 384767 287809 218431 145902 196061 333348 410080 243151 -1894 198241 604347
7113 604347 278599 193562 219985 313073 388121 -6732 249338 366132 377393 355004 339456
7102 339456 145279 329749 401566 522792 497167 253655 113797 -93962 108558 317696
7092 317696 174615 -84025 294798 204439 -112575 -74152 149785 369325 551104 362464
7082 362464 301219 445125 432381 -40669 -31363 29227 267044 29695 -35878 240282 -43155
7071 -43155 252830 437290 164518 -14836 150438 -43830 20958 127861 -200658 22121
7061 22121 237857 70660 103144 235655 161412 -21481 355669 482249 416150 545979
7051E45979k60846r2384J58499R8278l94167j87428J99590Q4687J70158k09506
7041A12860N4403K25357L3400j82209p5030k97175P5860K72880j7583R4955K34760
7030E32478k10942j57905k20377m1979J90190K16891k72218j64601K3972R5234
7020i257J31622K82740J1697l94723m51054m4394K32350J0224K26790J67896r098
7009A54793k4302K22102p1749K5426M7908K71369k35604j15087j70221l63068
6999b58433j37455M78533K42564J5111J58483l93366p9600j46968M09113K24138
6989E12120N432j04503o9480k8050k02712j2236J56101Q7864p674k27997J89109
6978B97974Q7098o9810J32628k3776k56029J43079j92002q8094J30543l39912
$$ plain form
7051 545979 285133 192749 351248 449526 55359 -132069 67521 152208 322366 112860
7041 112860 167263 392620 426020 243811 168781 -128394 -52534 220346 202763 297718 532478
7030 532478 321536 163631 -56746 -98725 91465 308356 36138 -128463 -104491 -9257
7020 -9257 122365 405105 416802 22079 -428975 -473369 -241019 -230795 -4005 163891 154793
7009 154793 130491 352593 280844 306270 354178 625547 389943 274856 104635 -258433
6999 -258433 -395888 82645 325209 340320 498803 105437 25837 -121131 287982 512120
6989 512120 517552 413049 343569 315519 112807 100571 256672 344536 336862 108865 297974
6978 297974 385072 315262 447890 424114 168085 311164 119162 31068 161611 -178301
6968a78301J79084R8291O7789M6430J45852J57623j56219j61567j34536J97667
6958B62113L0211k49698L98552p6479J52209q7116J77987m43347n7803k58346
6948a51717O9713J3002K4631K04959P7025l731o0667p2672J87966j08458k99855
6937a19804L81732k48694j23055K10612j4176L2481J34870j99862L9105k20778
6927a27569o110K75604K23786j78275o7528L29952j35976l89455L03041K16399
6917D43869J68787R4846m37751J16425k68682R596N63421j11508k26555Q9018
6907D41466j85372q0925K00360P538J14493n04733K37388Q730K458j02419k76714
6896a37730J8403M57836o4062J10244J9832k01847K32310n4771J51032j24364
$$ plain form
6968 -178301 783 99074 166863 213293 359145 516768 360549 198982 64446 262113
6958 262113 292324 42626 441178 364699 516908 429792 607779 164432 106629 -151717
6948 -151717 -82004 -69002 -44371 160588 237613 233882 173215 100543 288509 180051 -119804
6937 -119804 261928 13234 -109821 100791 86615 119096 253966 54104 93209 -127569
6927 -127569 -133679 141925 365711 187436 119908 449860 313884 -75571 227470 443869
6917 443869 612656 707502 269751 386176 117494 127090 690511 579003 352448 441466
6907 441466 256094 175169 375529 383067 497560 -7173 230215 238945 241403 138984 -137730
6896 -137730 -119327 338509 274447 384691 404523 202676 434986 380215 531247 406883
6886D06883k81715l36693P4528Q4578K4592J56300j27409q6405L79677J81304
6876D75640j82386M6515n42886j55242M11294o3248M8849Q8218j22773j27213
6866a23232K54396K1320J27893j29725j2645j61063J86480J15361l6022m28831
6856a86068L11396k1760l5494K06325j96597J22055q0206J13062k52791K90163
6846B70085J7160l6180J5686N5862k24712K21815j85076k90974l6331O3665K74310
6835A45310J94J70961l18670p3009O00291k37631n44775L47157k90380N7695L80624
6824B37767j32888K84932j24573j51225m9695q9770J02125j25411k6056p2001
6814a46795J68382l0703l325J21889P1132K01208m11480p2952K83184K03582j22587
$$ plain form
6886 406883 125168 -211525 -136997 -52419 -27827 128473 1064 -85341 294336 475640
6876 475640 293254 339769 -203117 -358359 52935 -10313 38536 126754 3981 -123232
6866 -123232 131164 152484 280377 150652 138007 -23056 163424 278785 242763 -186068
6856 -186068 125328 103568 68074 274399 77802 199857 119651 232713 -20078 270085
6846 270085 287245 251065 266751 322613 97901 319716 134640 -156334 -192665 -129000 145310
6835 145310 145504 316465 -2205 -75214 525077 287446 -257329 89828 -200552 -142857 237767
6824 237767 104879 389811 265238 114013 64318 -25452 76673 -48738 -74794 -146795
6814 -146795 21587 -9116 -12441 109448 180580 381788 -29692 -102644 180540 384122 261535
6803B61535k38371J05005o0724j08685l5161J01071M67936K9196r1562J32330
6793E62570l34321j98677p8041o1059k15728K48894N45510K4507L0670l65439
6783A58886O688j46094j6909l2274j58746J8056O1316L63233J71194k8457J1595
6772D08488j21985J80652k16469R2280J13845J86140l46071K0638K00169n25226
6762g539K81890K21186L5622N6397J9123K99777j69657q1128K25683k825Q0218
6751I58747L58035J9764j25965K81775j3013k45344l00308J52310M93361J08723
6741A688085l01522M7679k40693j72262M2171L67955j20722m5864j27863p5771
6731A061193k71387k6206M16277l7621p18564J82406k07735l18409J80053K87279
$$ plain form
6803 261535 23164 128169 67445 -41240 -76401 24670 492606 521802 430240 562570
6793 562570 228249 29572 -48469 -109528 -325256 -76362 469148 493655 524325 158886
6783 158886 165574 19480 2571 -29703 -188449 -170393 -109077 254156 425350 396893 408488
6772 408488 286503 467155 250686 342966 456811 642951 296880 317518 517687 -7539
6762 -7539 274351 495537 531159 587556 606679 906456 736799 655671 881354 878529 958747
6751 958747 1316782 1336546 1210581 1492356 1479343 1233999 933691 1086001 1579362 1688085
6741 1688085 1386563 1434242 1193549 1021287 1063458 1431413 1310691 1264827 1136964 1061193
6731 1061193 789806 763600 1179877 1142256 423692 606098 398363 79954 260007 547286
6721E47286J07640l43020O9496q6701p658J33639k20318k77074K12299N34780
6711F70369k1385n1559m98289j65059j58467k30978K60813k3829K74671J165o6680
6700i228o8747O9700J55032R1053P1332l89646k5244L2754K37766j18713j46106
6689a00047J80085J0772R1213p1006k35674p2992J79341j7316n4582K12015k0352
6678A01457j12446L36551M4706m25561k03547L02104m0039J80767j14690J76044
6668B45346j77222J10563J40854k7787k0435j26921j406O751J14196k91657l42473
6657c70191K07411N4817N68213k88628j79401K71994K28961j59152j43366J48962
6647C39620j73742k46863j51044K87650L8586O058K7768K5352l08826R8032k89746
$$ plain form
6721 547286 654926 311906 381402 294701 287043 420682 200364 -76710 135589 670369
6711 670369 648984 597425 99136 -65923 -224390 -455368 -194555 -218384 56287 57452 -9228
6700 -9228 -77975 -8275 146757 237810 309142 -80504 -105748 -72994 164772 46059 -100047
6689 -100047 80038 90810 182023 111017 -124657 -197649 -18308 -35624 -90206 121809 101457
6678 101457 -10989 325562 370268 -55293 -258840 43264 3225 183992 69302 245346
6668 245346 68124 178687 319541 291754 271319 144398 142992 149743 263939 -27718 -370191
6657 -370191 -162780 -107963 460250 171622 -7779 264215 493176 334024 190658 339620
6647 339620 165878 -80985 -232029 55621 94207 100265 128033 153385 -155441 -57409 -347155
6636c47155k05279l2210J97870N2164j0803K5062J12375M7801J19328o3120K9553
6625g4414J1779J25056l9257L7548k32532j64598j50530J25615L24318m5996J04076
6614B1065r633p6171L1188j8388m14909J78856K40050p8094k5243K48020n6610
6603D0131P737O2252j9033Q6089J36095k26694Q7644k44247J38246q2258Q2664
6592F8626l26784J51631r4318Q1515m5214m8516O4190K7424K06866K0088k23946
6581a18438j3882O0773O4606j16020j14990j38354k04317M36407j23669j09385
6571c77269m8131L60945L84974k4915k47648j16684N8973O2771m3961n5319p0508
6560a16772M38043l76151m9111K9460m512l237L68328l51332J0095K48172m3490
$$ plain form
6636 -347155 -552434 -584644 -386774 -334610 -345413 -320351 -207976 -160175 -40847 -103967 -74414
6625 -74414 -62635 62421 23164 60712 -171820 -336418 -486948 -361333 -37015 -83011 21065
6614 21065 11432 -64739 -33551 -51939 -466848 -287992 -47942 -126036 -151279 96741 40131
6603 40131 47868 110120 91087 177176 313271 86577 174221 -70026 68220 -14038 68626
6592 68626 -258158 -106527 -200845 -119330 -164544 -213060 -148870 -121446 85420 105508 -118438
6581 -118438 -132320 -71547 -6941 -122961 -237951 -376305 -580622 -144215 -267884 -377269
6571 -377269 -425400 -64455 320519 295604 47956 -68728 -9755 53016 9055 -46264 -116772
6560 -116772 321271 -54880 -103991 -74531 -79043 -82280 286048 -65284 -55189 192983 149493
6549A49493j20205J27424L0596R3957k42403l11610M45392K57835N2252K06450
6539F89181j42064l94024l53169n9923K44843N3433P8037j29455k25354M8735
6529a89760j02815N7984M7848K4442J45182l5124J51933j31186o6965J2843n6673
6518a42291R9776l63935k7210L67807j20890m1372K08124K2456J84226J29980
6508C16671k78352O9559K9854P6211q9435J98234l73315k44241J84761j42876
6498b52929J32074R5877n6105J04228J9761R6150j63923m1850J96180K03463j96245
6487A36681j74701j38820k03650J95742J61706k4236K07274N0944j86670l86050
6477c61780J37014L68203J11619K55440m30224k77415N2434P0001P2673J15730
$$ plain form
6549 149493 29288 156712 187308 281265 38862 -272748 172644 430479 482731 689181
6539 689181 547117 153093 -200076 -259999 -15156 38277 116314 -13141 -238495 -189760
6529 -189760 -292575 -234591 -186743 -162301 -17119 -52243 99690 -31496 -98461 -85618 -142291
6518 -142291 -42515 -406450 -433660 -65853 -186743 -228115 -19991 2465 186691 316671
6508 316671 38319 107878 137732 213943 124508 322742 -50573 -294814 -110053 -252929
6498 -252929 -120855 -24978 -81083 23145 42906 139056 -24867 -66717 129463 332926 136681
6487 136681 -38020 -176840 -380490 -184748 -23042 -47278 159996 210940 24270 -361780
6477 -361780 -224766 143437 255056 510496 80272 -197143 -144709 -74708 -2035 113695
6467A13695o1125J12339J90211R1923k1093r4242k49953j49345J88015j87397
6457f6972l56118N1565K43017L50151j82239m12764P8519K46313K17881j31711
6447C7642k43643k253K1292J994L90521M2125j67385n5565j75212K27529j1502
6436F5543o1080l72163J42297L67367r6631n9882k51190j50531J261K90651Q1206
6425d3152j8047L379J38430n1590j29386J24207j84436j22991J38555k8804k12883
6414c86718P9629J06117j4175J45126Q2455l62859J84708J66842N5353Q9060m8130
6403I7408K34289j49711K0600j80372j58256j24464R2026K30371J08869k59166
6393h8406K0166J07405M71546o8148j26253j67918q4048p1158j31481j99207L86168
$$ plain form
6467 113695 52570 164909 355120 447043 425950 331708 81755 -67590 120425 -66972
6457 -66972 -423090 -371525 -128508 221643 39404 -373360 -294841 -48528 169353 37642
6447 37642 -206001 -208254 -186962 -184968 205553 247678 80293 24728 -150484 77045 65543
6436 65543 4463 -367700 -225403 141964 45333 -14549 -265739 -416270 -415009 -124358 -43152
6425 -43152 -61199 -57820 80610 29020 -100366 23841 -160595 -283586 -145031 -173835 -386718
6414 -386718 -307089 -200972 -215147 -70021 12434 -350425 -165717 1125 56478 145538 97408
6403 97408 331697 181986 202586 22214 -136042 -260506 -168480 61891 170760 -88406
6393 -88406 -68240 39165 510711 442563 316310 148392 64344 -6814 -138295 -337502 48666
6382D8666L3244k71215K77115j08257k47322J69725o6318J01284J28729j19461
6372e3810J05213n4095K6940r1416R2976J47914k51836j04324J14958K2923L5419
6361i138l7782K70529R8422j03052k46616j53010l45853J0279J87721O9411K1308
6350b37781j55024m0196P7210K3915L00115j57017j2794k6881J86186J39938O4945
6339A62616k27134j04164J450Q4347J72722M0002j41534m7357k86656O413P493
6328c31802M6846j06140j15333L91580J42415N7958R241k00120L22805M4845J33492
6317C95787J06172l42611n17094j69976M26249o795j60063K24842n02907J28218
6307d18178N94850N3428J42780j23396l27018k49294K35695M8906K70524l23003
$$ plain form
6382 48666 81910 -189305 87810 -20447 -267769 -98044 -164362 -63078 65651 -53810
6372 -53810 51403 -2692 24248 -67168 25808 173722 -78114 -182438 -67480 -44557 -9138
6361 -9138 -46920 223609 322031 218979 -27637 -180647 -526500 -516221 -328500 -259089 -237781
6350 -237781 -392805 -433001 -355791 -331876 -31761 -188778 -201572 -228453 -42267 97671 162616
6339 162616 -64518 -168682 -167232 -82885 89837 129839 -11695 -59052 -345708 -339295 -331802
6328 -331802 -284956 -391096 -506429 -114849 27566 85524 94765 -105355 217450 262295 395787
6317 395787 501959 159348 -357746 -527722 -101473 -108268 -268331 -43489 -546396 -418178
6307 -418178 176672 230100 372880 249484 -77534 -326828 -91133 -42227 228297 -94706
6297i4706K0970j7674r6237L15083L7137j25907N4691k60278J94935p4537j7809
6286f4332K28490j02691o5745j93657j32995K85049K90602M6761j22115L07750
6276D77117k86898q511j21106m66703K50502L75028N0527j40294j34395j3544
6266a8277J21338k35276J67345J62856k39957o5574k03295k55116R1990J79575
6256b94391j4670o845J89564N9403M6087K1366J18577p7733p3910p3393J3485
6245i2460j0967J15371q7382j53247M62808O9917j22647k46034L01301M33438
6235F70098n90520j54578p8651R4745K66636J62470j58513M9739Q5728l29965
6225A7189j00277r5851K7461K96626j81387r63K01165J95668K0441m64678L59544
$$ plain form
6297 -94706 -73736 -91410 -187647 127436 164573 38666 93357 -166921 28014 -46523 -64332
6286 -64332 164158 61467 -4278 -197935 -330930 -45881 244721 291482 169367 477117
6276 477117 190219 181708 60602 -406101 -155599 219429 269956 129662 -4733 -18277
6266 -18277 103061 -132215 35130 197986 -41971 -107545 -310840 -565956 -473966 -294391
6256 -294391 -309061 -315906 -126342 -66939 -20852 514 119091 41358 -32552 -105945 -92460
6245 -92460 -103427 11944 -75438 -228685 234123 304040 181393 -64641 236660 670098
6235 670098 79578 -75000 -153651 -58906 207730 370200 211687 261426 347154 17189
6225 17189 -83088 -178939 -151478 145148 -36239 -37202 163963 359631 380072 -84606 274938
6214B74938M5433l86230j41925J46765Q6343j44820K31411j63455J43468J62206
6204B54134k56811K860K42891l2530j5842l18749n2673L34542j31926j42592k21193
6193c37889M53361p7485J37258K2653j25995k53641j59882K48169J465J32372
6183D0386k32439J74114m1369K97312R6558l07445o9156m8779J57244k38076J12527
6172e9123m0541j4412J89527j14756j04079j34915Q6841K45011J5404J83821n3843
6161A98935k15310L11150J9273k68730j12352M3017J6983J4871N6622J3824j10090
6150c1807q2215K99326q5734Q1241M9638p8869J16006l11083n7976J14740j42068
6139a28801k34886L57026M6819K33465R4422l16897j13066P7854J50576k6440
$$ plain form
6214 274938 320371 -65859 -207784 -61019 25324 -119496 111915 -51540 91928 254134
6204 254134 -2677 183 243074 210544 194702 -124047 -176720 157822 25896 -116696 -337889
6193 -337889 115472 37987 175245 197898 71903 -181738 -341620 -93451 -91986 40386
6183 40386 -192053 -17939 -59308 238004 334562 27117 -42039 -90818 66426 -171650 -59123
6172 -59123 -99664 -114076 75451 -39305 -143384 -278299 -191458 53553 68957 252778 198935
6161 198935 -16375 294775 314048 45318 -67034 -24017 -7034 7837 64459 78283 -31807
6150 -31807 -114022 185304 99570 180811 230449 151580 267586 -43497 -101473 13267 -128801
6139 -128801 -363687 -6661 40158 273623 368045 51148 -61918 15936 166512 140072
6129A40072J26069j4800k28399j42108N9943Q7634k31123N8687L31141j99528
6119a2412L6576j44737K00016R689k15677L13032k26091m1181p56k94281J27789
6108b48033J78250k3120J03398R09k5141J82931k64800j60807K7964j10670O3631
6097b75488K86217K15386j5006k96840J57670j80170k33510j45103M54408K68861
6087B36425j82638j29904J79609m6095K79037p0714k09257j192p2108K02559l3096
6076A52626j9546Q4276k655j19084K0464l1695K59526l55251m1087J01484k8495
6065B0563n9783J13490K25183K1679m75502J09870o1058J70863j13821K1679J23254
6054I6417k54400l98061M35184j09549K00845N5803J10501m31295P635L00384
$$ plain form
6129 140072 266141 251341 22942 -119166 -59223 28411 -202712 -144025 187116 -12412
6119 -12412 24164 -120573 79443 89132 -126545 186487 -39604 -80785 -81541 -375822 -248033
6108 -248033 -69783 -92903 10495 11404 -13737 169194 -95606 -256413 -228449 -339119 -275488
6097 -275488 10729 226115 211109 -85731 71939 -108231 -341741 -486844 -32436 236425
6087 236425 53787 -76117 103492 57397 336434 265720 56463 55271 -16837 185722 152626
6076 152626 133080 217356 214701 95617 116081 84386 343912 -11339 -52426 49058 20563
6065 20563 -39220 74270 299453 321132 -154370 -44500 -105558 65305 -48516 -26837 96417
6054 96417 -157983 -556044 -120860 -230409 -29564 26239 136740 -294555 -286920 13464
6044A3464Q7477j61786k26772L77136N1519k49579K21727r4531l52041K51406
6034h1980j93065K0838m1440j53460j8362J32154R4774K16034J57533j25561p7022
6023f9557j82848O6984M00654O0626K64309j94296j94894n2034J35052k08430
6013B5566j5420m29396M05302J13158p5991k6283j27631p4356K99192J07027R7895
6002B99063j42068m7697L20523O219m13320j47747J00603L23483k65041p5837
5992d1819J82586J36776J15656l09702k65163j20722J0852K03911n0908J96663
5982E8130J6158J33617J15k91275o8177q3892J44269j26879j30475L53290J13994
5971A18875l3431j80316j05581K29686j14668K32121k05550M184J68236k67459
$$ plain form
6044 13464 100941 -60845 -287617 89519 141038 -108541 113186 18655 -333386 -81980
6034 -81980 -275045 -254207 -295647 -449107 -467469 -335315 -240541 -24507 133026 7465 -69557
6023 -69557 -252405 -185421 215233 275859 540168 345872 150978 98944 233996 25566
6013 25566 10146 -419250 -13948 99210 23219 -3064 -130695 -205051 94141 201168 299063
6002 299063 156995 109298 429821 436040 22720 -125027 -24424 299059 34018 -41819
5992 -41819 140767 277543 393199 83497 -181666 -302388 -291536 -87625 -138533 58130
5982 58130 74288 207905 208020 -83255 -151432 -235324 -91055 -217934 -348409 4881 118875
5971 118875 85444 -94872 -200453 29233 -85435 146686 -58864 -54680 113556 -153903
5961a53903j37497R9824j6143j3364J98142r4280j16966L40791l05874j33976
5951c33246J15571K8984l46130N1165L52976k52852k61J28690P8958j83759m8550
5940d08454L90612K71479J73113m98752l1263J40037R8789j33816q0248P2453
5930f050p9294J061K65770J30475K12798j58339k21888M3891n9603r6207j16324
5919h3710k15434L75640n7235k79008K85577k7688K46193j44444m79542K89605
5909i0046J99721k01114J70040j24654n5185P4616l19915M65377Q0116j50590
5899D8366J82896J59602k33670j9032K80770l10382k123M4249j05313N1650o4867
5888C2146o7437N8152k46797J30202K23193j33179l64444J4861k821J26831K65739
$$ plain form
5961 -153903 -291400 -191576 -207719 -221083 -22941 -117221 -234187 106604 -199270 -333246
5951 -333246 -217675 -188691 -534821 -483656 -130680 -383532 -383793 -255103 -176145 -359904 -408454
5940 -408454 -17842 253637 426750 -72002 -103265 36772 135561 1745 -78503 -6050
5930 -6050 -85344 -84283 181487 311962 524760 366421 144533 188424 128821 32614 -83710
5919 -83710 -299144 76496 19261 -259747 25830 -1858 244335 99891 -379651 -90046
5909 -90046 109675 -91439 78601 -46053 -101238 -26622 -346537 118840 198956 48366
5899 48366 231262 390864 157194 138162 418932 108550 106427 150676 45363 97013 32146
5888 32146 -35291 22861 -223936 -93734 129459 -3720 -368164 -353303 -356124 -229293 36446
5877C6446J03336j1834O4076J57325K51264m6603n2242k46128k6658J9887k35644
5866A3225k33693M3312J76956O9363k69625J94153n5730j35644M20532j6668k38472
5855c2291m83081r0186L11530K10457k24757l0623n8975K29138K09919k7497r1732
5844g8098M8231q1478l9147J51790n2446K67335P7501m30623M37000J19050l84421
5833C4694m6014M0853O4653O4655j70120k65581j27348K19769k76052k65464K74464
5822d51491O377o8582L81995J77119l98542J45278J77862K520n3443n8016L2227
5811a06696j10955l7803K05892m2153J59683J31005M9241n7497l43811L1097L51796
5800B29799m1031L7210m5072j37184K36879j46117l88192K57477N3042k91580
$$ plain form
5877 36446 139782 127948 192024 349349 600613 554010 501768 255640 228982 248869 13225
5866 13225 -220468 -177156 -200 69163 -200462 -6309 -62039 -197683 222849 206181 -32291
5855 -32291 -515372 -605558 -294028 -83571 -308328 -338951 -397926 -168788 41131 13634 -78098
5844 -78098 -29867 -111345 -150492 1298 -51148 216187 293688 -136935 300065 419115 34694
5833 34694 -11320 29533 94186 158841 -11279 -276860 -404208 -184439 -460491 -725955 -451491
5822 -451491 -445114 -513696 -131701 45418 -353124 -207846 -29984 -27464 -80907 -138923 -106696
5811 -106696 -217651 -255454 -49562 -91715 67968 198973 248214 190717 -153094 -121997 229799
5800 229799 188768 225978 180906 43722 280601 134484 -253708 3769 56811 -234769
5790b34769K54674J07805j13465j0240K37077K54324n17857k70818J13817N36415
5780C56963M1826j09506l8264J21116l7425P6059k56107n6123L8379m3156J00446
5769A94208j20587P7262k46558j73248J46523K20272q834O0296j5732o9465R40
5758F5077J84147J30220j24609k14965j64644k95425l18626J4740L17498M82997
5748G6410L3097j6849k0867L69811p4869n92398j7667N26023p9549l34106J16398
5737a4566k21273K31339m3612L29373l23402j04529M79164K02715q1029K0547
5727D74727O8348k86543j25204k8384l3899k57642n308R4953j65315r0567K22641
5716a32193L74601j07693l5275k07634L0770J09416j49380M04696j58315n8887
$$ plain form
5790 -234769 19905 127710 14245 4005 241082 495406 -22451 -293269 -179452 356963
5780 356963 398789 289283 251019 372135 334710 410769 154662 98539 136918 93762 194208
5769 194208 73621 150883 -95675 -268923 -122400 97872 89038 149334 133602 64137 65077
5758 65077 249224 379444 254835 39870 -124774 -420199 -738825 -724085 -406587 76410
5748 76410 109507 92658 71791 441602 366733 -225665 -243332 282691 203142 -130964 -14566
5737 -14566 -235839 -4500 -48112 281261 -42141 -146670 332494 535209 454180 474727
5727 474727 543075 256532 131328 102944 69045 -188597 -193905 -98952 -264267 -354834 -132193
5716 -132193 242408 134715 99440 -108194 -77424 31992 -117388 287308 128993 70106
5706G0106K2001K571Q8962j78440N67364J84322l22674l39704k37574k14688K15692
5695a42062K61502n6537j21475k02981K86560M8830J62909M06453k33766J4574
5685D24007J01543R8985p653m0519j87570j05858N0359j0410j11645j07166K13765
5674C17838r684J65463j80951j33985J04640K60129j80328j79910N11477p4612
5664F00077j44070O633k08009K3007j70361J59156N8091J50670r8056m40949N1425
5653a2386q1301J60071k02539q2587N13997K54576j34677l3971p3416k09416J12452
5642B10803l61656K3795O95093j27916k01276Q889n5029R582k49326J49081J77149
5631B79189q086M1692L33607r6816l08820L47903j00747j50414j93121j1009O4085
$$ plain form
5706 70106 92107 94678 183640 5200 572564 756886 434212 94508 -143066 -357754 -142062
5695 -142062 119440 62903 -58572 -261553 25007 73837 236746 643199 409433 424007
5685 424007 525550 624535 616882 576363 388793 282935 333294 322884 211239 104073 317838
5674 317838 308154 473617 292666 158681 263321 523450 343122 163212 674689 600077
5664 600077 456007 462640 254631 277638 107277 266433 324524 475194 377138 -63811 -12386
5653 -12386 -93687 66384 -136155 -218742 295255 549831 415154 381183 307767 98351 210803
5642 210803 -150853 -127058 568035 440119 238843 247732 192703 202285 -47041 102040 279189
5631 279189 271103 312795 646402 549586 240766 588669 487922 337508 144387 133378 197463
5620A97463J53984K92747k7116l57478j56712L28164j41354N4485N4769P5211
5610D74163Q0036l62796k08149J64609K56969j66228M04087j86818J9405L5054
5600E10332k78886J24463K39549J16002j53656O9735l43035m19186J26921M08690
5590D00929J55227O6614j35818j79935K87258j94901j79840J64805m4215J93302
5580E33426R0276K33601l48739K6849J32150j49552j90372P4968m8837L3531J42181
5569E29482L11960k9305j94358O0484J9440j12805K55545o2582k07083M3490j72368
5558D41900j91689K65315L18364j99344j28776J02909Q720J1245k16766L7220
5548D49098J64726M2776K37716o6383n3696j98123K8807j93808K44917j88892
$$ plain form
5620 197463 351447 644194 617078 259600 102888 431052 289698 344183 398952 474163
5610 474163 554199 191403 -16746 147863 404832 238604 642691 455873 475278 510332
5600 510332 231446 355909 595458 711460 557804 627539 284504 -134682 -7761 400929
5590 400929 556156 622770 486952 307017 594275 399374 219534 384339 340124 533426
5580 533426 623702 857303 508564 535413 667563 518011 327639 402607 353770 387301 529482
5569 529482 841442 812137 617779 678263 697703 584898 840443 777861 570778 614268 441900
5558 441900 250211 515526 833890 634546 505770 608679 617399 628644 411878 449098
5548 449098 613824 656600 894316 827933 774237 576114 604921 411113 656030 467138
5538D67138K16638J4979L2697L62027l21332q9003J09994l32483n8899K5306k57286
5527A69776j83383J84233K89821J60477K12895k42571J05305L07838j52253k17693
5517F34445K21941J41841j08297q845o3904Q449N9470j11073j76714J82888J48100
5506I28301r4807l03180N3767J03762p9448J19128K11982P7950l86338K45706
5496H76823J05364O5668r1382k6968k51142J89422K41643j56749l0379J81678
5486A103978p2486L5294L51550q6454p789j45692k95530P2016r1184j84210j05
5475F79388J31351L72218j01504j16726j81342m7158L38579N9516o7008J53488
5465A220802r3693l53010K18909M09538J05969Q4287j43741k74484K0827M00031
$$ plain form
5538 467138 683776 698755 731452 1093479 772147 683144 793138 460655 401756 427062 169776
5527 169776 -13607 170626 460447 620924 833819 591248 696553 1004391 852138 634445
5517 634445 856386 998227 889930 881085 817181 825630 885100 774027 597313 780201 928301
5506 928301 833494 530314 584081 687843 608395 727523 939505 1017455 631117 876823
5496 876823 982187 1047855 956473 929505 678363 867785 1109428 952679 922300 1103978
5486 1103978 1031492 1066786 1418336 1331882 1324093 1178401 882871 954887 863703 679493 679388
5475 679388 810739 1182957 1081453 964727 783385 736227 1074806 1134322 1067314 1220802
5465 1220802 1127109 774099 993008 1402546 1508515 1592802 1449061 1174577 1195404 1595435
5455A595435k85039q796k99054L79634j35235j20895j90645j02534P09745k25881
5445A316735J49477j83605K08524j27894k74839k106J92677K03445P8326k2899
5435A537841Q7277l1124l37764K67851Q207J36650o0266M0209K35476k4916k92425
5424A567016K35473J42979K78054j32986l11132Q48l7071n0415j80018L22469
5414A835217L75052j49037k24788R2950K40153N2225R4881l2363l09337k7510
5404A947443J73739L0239K04753k66639K15868J23376j33893O9779K05524O2048
$$ plain form
5455 1595435 1310396 1301600 1002546 1382180 1246945 1126050 935405 832871 1542616 1316735
5445 1316735 1466212 1282607 1491131 1363237 1088398 1086292 1278969 1482414 1560740 1537841
5435 1537841 1625118 1593994 1256230 1524081 1532288 1668938 1608672 1648881 1884357 1859441 1567016
5424 1567016 1802489 1945468 2223522 2090536 1779404 1780252 1743181 1692766 1512748 1835217
5414 1835217 2210269 2061232 1836444 1929394 2169547 2221772 2316653 2284290 1974953 1947443
5404 1947443 2121182 2151421 2356174 2089535 2305403 2428779 2294886 2364665 2570189 2632237
$$ [...]
##END NTUPLES=NMR SPECTRUM
##END=
