##TITLE=1H_EC-3319(2)
 CDCl3
 8 sc, 
 6.3.2024
##JCAMPDX= 6.0         $$ Bruker NMR JCAMP-DX V2.0
##DATA TYPE= NMR SPECTRUM
##DATA CLASS= NTUPLES
##ORIGIN= UXNMR, Bruker Analytische Messtechnik GmbH
##OWNER= root
$$ XWIN-NMR		Version 3.5
$$ Wed Mar  6 17:04:10 2024 Russian Standard Time (UT+4h)  she@DPX200
##.OBSERVE FREQUENCY= 200.1313
##.OBSERVE NUCLEUS= ^1H
##.ACQUISITION MODE= SIMULTANEOUS
##.ACQUISITION SCHEME= undefined
##.AVERAGES= 9
##.DIGITISER RES= 18
##SPECTROMETER/DATA SYSTEM= spect
##.PULSE SEQUENCE= zg30
##.SOLVENT NAME= CDCl3
##.SHIFT REFERENCE= (INTERNAL, CDCl3, 0, 15.467)
##AUDIT TRAIL= $$ (NUMBER, WHEN, WHO, WHERE, WHAT)
$$ ##TITLE= Audit trail, XWIN-NMR		Version 3.5
$$ ##JCAMPDX= 5.01
$$ ##ORIGIN= Bruker BioSpin GmbH
$$ ##OWNER= she
$$ F:/spectra/data/she/nmr/H-F/1/pdata/1/auditp.txt
$$ ##AUDIT TRAIL=  $$ (NUMBER, WHEN, WHO, WHERE, WHAT)
(   1,<2024-03-06 17:03:01.29 +0400>,<she>,<DPX200>,
      <created by zg, POWCHK disabled, PULCHK disabled
       terminated by command 'halt'
       configuration hash MD5:
       00 E9 B6 7A A2 85 ED C7 34 08 36 98 17 FE 4E 26
       data hash MD5: 16K
       75 3B 9E 52 16 EA D3 A0 F0 B1 D7 6A F0 7A AC 6B>)
(   2,<2024-03-06 17:03:06.53 +0400>,<she>,<DPX200>,
      <Start of raw data processing
       efp BC_mod = 2 LB = 0.24 FT_mod = 6 PKNL = 1 PHC0 = -24948.69 PHC1 = 22.58731 SI = 16K 
       data hash MD5: 16K
       44 D4 B2 93 C0 3D 70 F6 90 9C BD F5 59 FF ED C9>)
(   3,<2024-03-06 17:03:21.12 +0400>,<she>,<DPX200>,
      <pk PHC0 = -0.6515201 PHC1 = -2.199999 
       data hash MD5: 16K
       37 68 0A 6F A4 31 A2 E6 74 F4 34 97 B7 2B 1C 1F>)
(   4,<2024-03-06 17:03:24.50 +0400>,<she>,<DPX200>,
      <abs ABSG = 5 
       data hash MD5: 16K
       F7 3F 03 7D 17 DE 87 50 CF 78 F8 47 A0 3D 80 DE>)
$$ ##END=
$$ 
$$ hash MD5
$$ 16 82 B1 EA C1 1B 96 F7 AF 78 6D FE 22 2A 27 90
##$RELAX= 
##$RELAX= 
##$RELAX= 
##$RELAX= 
##$RELAX= 
##$RELAX= 
$$ Bruker specific parameters
$$ --------------------------
##$DU= <F:/spectra>
##$EXPNO= 1
##$NAME= <H-F>
##$PROCNO= 1
##$TYPE= <nmr>
##$USER= <she>
##$AMP= (0..31)
100 100 100 100 100 100 100 100 100 100 100 100 100 100 100 100 100 100 
100 100 100 100 100 100 100 100 100 100 100 100 100 100 
##$AQSEQ= 0
##$AQ_mod= 1
##$AUNM= <au_zg>
##$AUTOPOS= <>
##$BF1= 200.13
##$BF2= 200.13
##$BF3= 200.13
##$BF4= 200.13
##$BF5= 200.13
##$BF6= 200.13
##$BF7= 200.13
##$BF8= 200.13
##$BYTORDA= 1
##$CFDGTYP= 0
##$CFRGTYP= 5
##$CHEMSTR= <none>
##$CNST= (0..31)
1 1 145 1 1 1 1 1 1 1 1 1 1 1 1 1 1 1 1 1 1 1 1 1 1 1 1 1 1 1 1 1 
##$CPDPRG= <>
##$CPDPRG1= <>
##$CPDPRG2= <>
##$CPDPRG3= <>
##$CPDPRG4= <mlev>
##$CPDPRG5= <mlev>
##$CPDPRG6= <mlev>
##$CPDPRG7= <mlev>
##$CPDPRG8= <mlev>
##$CPDPRGB= <>
##$CPDPRGT= <>
##$D= (0..31)
0 1.2 0 0 0 0 0 0 0 0.06 0 0.03 0 0 0 0 0.0002 0 0 0 0 0 0 0 0 0 0 0 0 
0 0 0 
##$DATE= 1709730180
##$DBL= (0..7)
120 120 120 120 120 120 120 120 
##$DBP= (0..7)
150 150 150 150 150 150 150 150 
##$DBP07= 0
##$DBPNAM0= <>
##$DBPNAM1= <>
##$DBPNAM2= <>
$$ [...]
##$SUBNAM3= <"">
##$SUBNAM4= <"">
##$SUBNAM5= <"">
##$SUBNAM6= <"">
##$SUBNAM7= <"">
##$SUBNAM8= <"">
##$SUBNAM9= <"">
##$SW= 18.0517328524113
##$SWIBOX= (0..15)
0 0 2 0 0 0 0 0 0 0 0 0 0 0 0 0 
##$SW_h= 3612.71676300578
##$TD= 16384
##$TD0= 1
##$TE= 0
##$TE2= 300
##$TE3= 300
##$TEG= 300
##$TL= (0..7)
0 120 120 120 120 120 120 120 
##$TP= (0..7)
150 150 150 150 150 150 150 150 
##$TP07= 0
##$TPNAME0= <>
##$TPNAME1= <>
##$TPNAME2= <>
##$TPNAME3= <>
##$TPNAME4= <>
##$TPNAME5= <>
##$TPNAME6= <>
##$TPNAME7= <>
##$TPOAL= (0..7)
0.5 0.5 0.5 0.5 0.5 0.5 0.5 0.5 
##$TPOFFS= (0..7)
0 0 0 0 0 0 0 0 
##$TUNHIN= 0
##$TUNHOUT= 0
##$TUNXOUT= 0
##$USERA1= <user>
##$USERA2= <user>
##$USERA3= <user>
##$USERA4= <user>
##$USERA5= <user>
##$V9= 5
##$VALIST= <valist>
##$VCLIST= <CCCCCCCCCCCCCCC>
##$VD= 0
##$VDLIST= <DDDDDDDDDDDDDDD>
##$VPLIST= <PPPPPPPPPPPPPPP>
##$VTLIST= <TTTTTTTTTTTTTTT>
##$WBST= 1024
##$WBSW= 4
##$XGAIN= (0..3)
0 0 0 0 
##$XL= 0
##$YL= 0
##$YMAX_a= 476627
##$YMIN_a= -565948
##$ZGOPTNS= <>
##$ZL1= 120
##$ZL2= 120
##$ZL3= 120
##$ZL4= 120
##$ABSF1= 15.53204
##$ABSF2= -2.51981
##$ABSG= 5
##$ABSL= 3
##$ALPHA= 0
##$AQORDER= 0
##$ASSFAC= 0
##$ASSFACI= 0
##$ASSFACX= 0
##$ASSWID= 0
##$AUNMP= <proc_1d>
##$AZFE= 0.1
##$AZFW= 0.1
##$BCFW= 0
##$BC_mod= 2
##$BYTORDP= 0
##$COROFFS= 0
##$CY= -3
##$DATMOD= 1
##$DC= 0
##$DFILT= <>
##$DTYPP= 0
##$F1P= 0
##$F2P= 0
##$FCOR= 1
##$FTSIZE= 16384
##$FT_mod= 6
##$GAMMA= 0
##$GB= 0
##$INTBC= 1
##$INTSCL= 3.70164e-10
##$ISEN= 128
##$LB= 0.24
##$LEV0= 0
##$LPBIN= 0
##$MAXI= 10000
##$MC2= 0
##$MEAN= 0
##$ME_mod= 0
##$MI= 1.114404
##$NCOEF= 0
##$NC_proc= -6
##$NLEV= 6
##$NOISF1= 3.799351
##$NOISF2= 2.8
##$NSP= 0
##$NTH_PI= 0
##$NZP= 0
##$OFFSET= 15.46703
##$PC= 1
##$PHC0= -24949.34
##$PHC1= 20.38731
##$PH_mod= 1
##$PKNL= yes
##$PPARMOD= 0
##$PSCAL= 0
##$PSIGN= 0
##$REVERSE= no
##$SF= 200.130010941821
##$SI= 16384
##$SIGF1= 3
##$SIGF2= 2
##$SINO= 5.538805
##$SIOLD= 16384
##$SREGLST= <1H.CDCl3>
##$SSB= 0
##$STSI= 16384
##$STSR= 0
##$SW_p= 3612.71676300578
##$SYMM= 0
##$S_DEV= 0
##$TDeff= 16384
##$TDoff= 0
##$TI= <>
##$TILT= no
##$TM1= 0
##$TM2= 0
##$TOPLEV= 0
##$USERP1= <user>
##$USERP2= <user>
##$USERP3= <user>
##$USERP4= <user>
##$USERP5= <user>
##$WDW= 1
##$XDIM= 16384
##$YMAX_p= 284240835
##$YMIN_p= -718315
$$ End of Bruker specific parameters
$$ ---------------------------------
##NTUPLES= NMR SPECTRUM
##VAR_NAME=  FREQUENCY,     SPECTRUM/REAL,   SPECTRUM/IMAG
##SYMBOL=    X,             R,               I
##VAR_TYPE=  INDEPENDENT,   DEPENDENT,       DEPENDENT
##VAR_FORM=  AFFN,          ASDF,            ASDF
##VAR_DIM=   16384,         16384,           16384
##UNITS=     HZ,            ARBITRARY UNITS, ARBITRARY UNITS
##FACTOR=    0.220516191357247, 1,           1
##FIRST=     3095.41679738841, 0,            0
##LAST=      -517.299965617371, 0,           0
##MIN=       -517.299965617371, -718315,     0
##MAX=       3095.41679738841, 284240835,    0
$$ Real data points
##PAGE= N=1
##DATA TABLE= (X++(R..R)), XYDATA
$$ [...]
8507C234310j6417j579j18089N0347Q3467N1354k3209O4506m825q9633j63489
$$ 3234310 3217893 3216314 3098225 3148572 3232039 3283393 3260184 3324690 3319865 3230232 3066743
8496C066743j8975L0097m8436o3674J23171J2049m0950K0599n7932P2906r5523
$$ 3066743 3047768 3077865 3029429 2965755 3088926 3100975 3060025 3080624 3022692 3095598 3000075
8485C000075r4539j27174L5845J00021J7130k3814j35512P8906P8528J716j16193
$$ 3000075 2905536 2778362 2814207 2914228 2931358 2907544 2772032 2850938 2929466 2931182 2814989
8474B814989k5235P505n0398Q0752J14335r7506K1124L7127j03986N8728J02025
$$ 2814989 2789754 2797259 2746861 2827613 2941948 2844442 2865566 2902693 2798707 2857435 2959460
8463B959460j2454P139K698o4225L5327l4336J82531K6099K8919Q2697L1171J13321
$$ 2959460 2947006 2954145 2956843 2892618 2927945 2893609 3076140 3102239 3131158 3213855 3245026 3358347
8451C358347J98335N2923M9900q6080Q0666j91957j28064j73006j21260q9842
$$ 3358347 3556682 3609605 3659505 3573425 3654091 3462134 3334070 3161064 3039804 2949962
8441B949962k16808J9660n9922K2358j03100q5382Q8196k9225j36264Q6753O5736
$$ 2949962 2733154 2752814 2692892 2715250 2612150 2526768 2614964 2585739 2449475 2536228 2601964
8430B601964p3542J7734j22608P477R7928j71928N6888O3413n6581o0333l1685
$$ 2601964 2528422 2546156 2423548 2431025 2528953 2357025 2413913 2477326 2420745 2360412 2328727
8419B328727p463j0675M5568R8299J9573q6078l4095p7562m2488N3377l8441r1036
$$ 2328727 2321264 2310589 2356157 2454456 2474029 2387951 2353856 2276294 2233806 2287183 2248742 2157706
8407B157706J3371J04553p1663m3321m4386n5419Q0316M2090q5119o227l1720
$$ 2157706 2171077 2275630 2203967 2160646 2116260 2060841 2141157 2183247 2098128 2091901 2060181
8396B060181n0983j353k4952L713O3728L102N845k6864l8472M8901J4919n8346
$$ 2060181 2009198 2007845 1982893 1986606 2050334 2053436 2059281 2032417 1993945 2042846 2057765 1999419
8384A999419k6076j30636J04441J12473j30402L8443o3683p0198J2884N1020m2619
$$ 1999419 1973343 1842707 1947148 2059621 1929219 1967662 1903979 1833781 1846665 1897685 1855066
8373A855066J3930l4054J01955L3821m2680j09082l1397n8617J4960N3935J03677
$$ 1855066 1868996 1834942 1936897 1970718 1928038 1818956 1787559 1728942 1743902 1797837 1901514
8362A901514m3122o5009J22625M5595j22261o1974j1758k9296R760P3725j35625
$$ 1901514 1858392 1793383 1916008 1961603 1839342 1777368 1765610 1736314 1746074 1819799 1684174
8351A684174j15844P5805L1461R7583j50559K8798J00890o5226k0700K0051k2980
$$ 1684174 1568330 1644135 1675596 1773179 1622620 1651418 1752308 1687082 1666382 1686433 1663453
8340A663453o5998K6076m2473o7878J90931j08765K4829o4051m837j8343K1185
$$ 1663453 1597455 1623531 1581058 1513180 1704111 1595346 1620175 1556124 1551287 1532944 1554129
8329A554129M8818o1039o734O3470k9241L5569l2927o7412j6063q1019K0180O3544
$$ 1554129 1602947 1541908 1535174 1598644 1569403 1604972 1572045 1504633 1488570 1407551 1427731 1491275
8317A491275n519j1546R9754p4203j42961M5646P4378o4623R7724p744k2217J1925
$$ 1491275 1485756 1474210 1573964 1499761 1356800 1402446 1476824 1412201 1509925 1502181 1479964 1491889
8305A491889k937l9074q5981K2252K5303N3615n5310K2734K4520l9854q6742L8596
$$ 1491889 1488952 1449878 1363897 1386149 1411452 1465067 1409757 1432491 1457011 1417157 1330415 1369011
8293A369011N0769j28803J3391L4835Q5301j8490l8245j9549R2030o4047m554
$$ 1369011 1419780 1290977 1304368 1339203 1424504 1406014 1367769 1348220 1440250 1376203 1371649
8282A371649Q0816J0758K0879j5670K425r9857k4606p5080j17029N3898P2020
$$ 1371649 1452465 1463223 1484102 1468432 1470857 1371000 1346394 1271314 1154285 1208183 1280203
8271A280203O1608n976J3534L5152J9664n3252q8138N1197p7199J2638N599Q2297
$$ 1280203 1341811 1335835 1349369 1384521 1404185 1350933 1262795 1313992 1236793 1249431 1255030 1337327
8259A337327L2530j84977o9448k126J8272K5375P0631k4311p519j0691M7840O5946
$$ 1337327 1369857 1184880 1115432 1113306 1131578 1156953 1227584 1203273 1195754 1185063 1232903 1298849
8247A298849n399R644j31564q6601Q2565k2964j33693M8755l4855R4564N8873
$$ 1298849 1293450 1303094 1171530 1084929 1167494 1144530 1010837 1059592 1024737 1119301 1178174
8236A178174n531n6465k6693N2810m8647j9457k6642R3633r469M0665L1032n1811
$$ 1178174 1172643 1116178 1089485 1142295 1093648 1074191 1047549 1141182 1131713 1172378 1203410 1151599
8224A151599l449j08475j1598l3958j8950J11607L986m4977o8310J9378J9207
$$ 1151599 1148150 1039675 1028077 994119 975169 1086776 1090762 1045785 977475 996853 1016060
8213A016060J0909j0271P1111m8742J6407L5632j5562L8070p8664m9685k160Q5429
$$ 1016060 1026969 1016698 1087809 1039067 1055474 1091106 1075544 1113614 1034950 985265 983105 1068534
8201A068534J4442q7946P243l2117M3190m2109K9911N2906K33483l14007m66955
$$ 1068534 1082976 995030 1002273 970156 1013346 971237 1001148 1054054 1287537 973530 506575
8190E06575J92140R1937J2108q277m9489J15713M0884n8602M3435j36398Q1200
$$ 506575 698715 790652 802760 794483 744994 860707 901591 842989 886424 750026 831226
8179H31226N869k0431L370N7372N8883q2640n0630J8063J7700M7461P4139j0974
$$ 831226 837095 816664 820034 877406 936289 853649 803019 821082 838782 886243 960382 949408
8167I49408j18471J2771P3230N3172j7266p4491M5366m239K1511m3328L2151q495
$$ 949408 830937 843708 916938 970110 952844 878353 923719 919480 940991 897663 929814 921319
8155I21319n8766m748q0784m2332R510K7348P4525l5528k2479K109m3825M5173
$$ 921319 862553 857805 777021 734689 744199 771547 846072 810544 788065 790174 746349 791522
8143G91522r2330K606M7621R7466n2490j68525O4310j0071j4951N8616o9193N7882
$$ 791522 699192 701798 749419 846885 794395 625870 690180 680109 665158 723774 654581 712463
8131G12463M9101o6182q6374N0212j9953o8327K3268Q7653J5955L3961L3935m5202
$$ 712463 761564 695382 609008 659220 639267 570940 594208 681861 697816 731777 765712 720510
8119G20510r713M3570j9788J3029J4253p6020j6035K6883p8828r3541k1619M6519
$$ 720510 710797 754367 734579 747608 761861 685841 669806 696689 617861 524320 502701 549220
8107E49220J42333m5959L8963j13731O3098r772J933J4065L9386M0575j9215K7380
$$ 549220 691553 645594 684557 570826 633924 624152 626085 640150 679536 720111 700896 728276
8095G28276n405m3160L1636k25J15518j15571N0841p5823j28106M0257q9929J96777
$$ 728276 722871 679711 711347 711122 826640 711069 761910 686087 557981 598238 508309 705086
8083G05086M2431n2976r9602K5833l6876J17316K5987o5539q2700l9847O1834
$$ 705086 747517 694541 594939 620772 583896 701212 727199 661660 578960 539113 600947
8072F00947J06366m3816j9958P9583o696q6079J0940N6852j1402L1814O0079j5300
$$ 600947 707313 663497 643539 723122 716426 630347 641287 698139 686737 718551 778630 763330
8060G63330q0483k62k7452L1524J79253K4541m8722K6192p2809k9138N0327M4521
$$ 763330 682847 682585 655133 686657 865910 890451 841729 867921 795112 765974 816301 860822
8048H60822m0901n0821M9227R079l7481K5559M3664J8828Q0730J2103L1916m8882
$$ 860822 819921 769100 818327 827406 789925 815484 859148 877976 958706 970809 1002725 953843
8036I53843M7027J45015o4844K9772J02295K9026Q4566K03242P2039J80009Q4953
$$ 953843 1000870 1145885 1081041 1110813 1213108 1242134 1326700 1529942 1601981 1781990 1866943
8025A866943J06449K22917K59216M68254K93249L66080L87815L07595p6950j64722
$$ 1866943 1973392 2196309 2455525 2923779 3217028 3583108 3970923 4278518 4201568 4036846
8015D036846j55811l22775m19911k61554l45297k88874k11181l49207j22155j83469
$$ 4036846 3881035 3558260 3138349 2876795 2531498 2242624 2031443 1682236 1560081 1376612
8005A376612j08014q6442l0067j21826l0763N833j7058q5647r7929m0686k8462
$$ 1376612 1268598 1182156 1152089 1030263 999500 1005333 988275 902628 804699 764013 735551
7994G35551M7396n682l6993r9746k5332k1192M715J75440k242j23635l5181m714
$$ 735551 782947 777265 740272 640526 615194 594002 598717 774157 771915 648280 613099 608385
7982F08385J4718o6222j04870O4865Q97N3001K2454O5227r1687j10995N2041k6841
$$ 608385 623103 556881 452011 516876 517773 570774 593228 658455 566768 455773 507814 480973
7970D80973N2274n740n9375n7166Q9005k9150p3736L3475P2793K2696j22196l1648
$$ 480973 533247 527507 468132 410966 499971 470821 397085 430560 503353 526049 403853 372205
7958C72205j8238L9369O0481k7081l6314o756L0170L5165P265q2473R95L1847
$$ 372205 353967 393336 453817 426736 390422 383666 413836 449001 456266 373793 374788 406635
7946D06635K8691O3849o903j51533L5034o4328M947l7391O2720P9712r1607o3089
$$ 406635 435326 499175 492272 340739 375773 311445 316392 279001 341721 421433 329826 266737
7934B66737P877N5186l567o7757k403K9484k9002P2112J1797K7007Q7171P693
$$ 266737 274614 329800 326233 258476 256073 285557 256555 328667 340464 367471 454642 462335
7922D62335p7084o916O7605M5414j19221j6915P372J48361r0913j13363J3314
$$ 462335 385251 378335 445940 491354 372133 355218 362590 510951 420038 306675 319989
7911C19989o4510j7966K0365M8232K0768j7470j0777J7002k7437K0806l9929l4569
$$ 319989 255479 237513 257878 306110 326878 309408 298631 315633 288196 309002 269073 234504
7899B34504J6655l2978n1745L1611j5669n9950Q0721M0680N2321P4181m7033L9971
$$ 234504 251159 218181 166436 198047 182378 122428 203149 243829 296150 370331 323298 363269
7887C63269Q99m3154m022j20055K5984M671O1562L6224o563J4113M640M1480j19278
$$ 363269 364168 321014 316992 196937 222921 227592 289154 325378 318815 332928 337568 379048 259770
7874B59770q2459n8686M7366L2046K8878J4591K4477K0359J9681n8032K0358p8530
$$ 259770 177311 118625 165991 198037 226915 241506 265983 286342 306023 247991 268349 189819
7862A89819k5958M9522J4875k1492L8178m6572q7285J59367j4785O094J08169
$$ 189819 163861 213383 228258 206766 244944 198372 111087 270454 255669 261763 369932
7851C69932k8531m2604q2843n3951J19713k7553j4933r466n2528M2770M5835L0654
$$ 369932 341401 298797 215954 162003 281716 254163 239230 229764 177236 220006 265841 296495
7839B96495j6685K2767N9442j7927l6899j27622J17547n8412l072r927m31M2170
$$ 296495 279810 302577 362019 344092 307193 179571 297118 238706 235634 225707 225276 267446
7827B67446K5709r5741p0545J44556p9259L2163N2031n84n8940L9154m2365o3925
$$ 267446 293155 197414 126869 271425 192166 224329 276360 275776 216836 255990 213625 149700
7815A49700J0962k8603Q6171n2151K4181k8842K3545M2742q6078n2858P8355O9324
$$ 149700 160662 132059 218230 166079 190260 161418 184963 227705 141627 88769 167124 236448
7803B36448O4083l783P407L5249p5176j87810O2947J99849j46083R964k5973P8415
$$ 236448 300531 296748 304155 339404 264228 76418 139365 339214 193131 203095 177122 255537
7791B55537J1074n4152j8296k2891p406J6100K3227m8656j01331J2320J16380
$$ 255537 266611 212459 194163 171272 163866 179966 203193 154537 53206 65526 181906
7780A81906l946m6411J21944K3487l1514m9138j2076K0219q9022p134J6579M0096
$$ 181906 177960 131549 253493 276980 245466 196328 184252 204471 115449 108315 124894 164990
7768A64990Q5038N555j9234j22182r1088n7508J74565J12745N5713j29816p8525
$$ 164990 250028 255583 236349 114167 23079 -34429 140136 252881 308594 178778 100253
7757A00253N5815R357k2723K2721l0307m1525O5509P6223j17024j03222R1707
$$ 100253 156068 165425 142702 165423 135116 93591 159100 235323 118299 15077 106784
7746A06784L2108N498m6929n105O828M9403o1651J8614K6192k9976m171N8024
$$ 106784 138892 144390 97461 92356 99184 148587 86936 105550 131742 101766 97595 155619
7734A55619J1079l1228N3363P758n9276O7944k4246o8956N3129r985l1699Q2294
$$ 155619 166698 135470 188833 196591 137315 205259 181013 112057 165186 155201 123502 205796
7722B05796j3737K8043m5634L1377q5268O0580L9369n1840m4787j6765M3731p0046
$$ 205796 192059 220102 174468 205845 120577 181157 220526 168686 123899 107134 150865 80819
7710H0819J86931J3738j29393j09696j220P4224N2028l0672n5211k9003m8690
$$ 80819 267750 281488 152095 42399 41179 115403 167431 136759 81548 52545 3855
7699C855J25167k2057p7808Q6416q9902n3500j3858K3012O6207K0132m8652m0980
$$ 3855 129022 106965 29157 115573 25671 -27829 -41687 -18675 47532 67664 19012 -21968
7687b1968Q9763m0012l2996M2531N6821L6674n9960J4059l7044R788N9967o1329
$$ -21968 67795 27783 -5213 37318 94139 130813 70853 84912 47868 57656 117623 56294
7675E6294L5476N0167r7013j9449l8435O557Q7133K5536J03862n6236J6787N4679
$$ 56294 91770 141937 44924 25475 -12960 -6403 80730 106266 210128 153892 170679 225358
7663B25358j10120p4542J9384j05308M9779p202K1204N856j8103L9559Q205P8338
$$ 225358 115238 40696 60080 -45228 4551 -2651 18553 24409 6306 45865 54070 132408
7651A32408k3437j4543p5327l1266K7888J4223r045O6508R3348q0203M6415q0414
$$ 132408 108971 94428 19101 -12165 15723 29946 20901 87409 180757 100554 146969 66555
7639F6555m9426K9762K0254K8423n8886k5893k0080p1859j7829N0016M1437p496
$$ 66555 17129 46891 67145 95568 36682 10789 -9291 -81150 -98979 -48963 -7526 -15022
7627a5022P7058j6399J0071M461P8415K0027j63481J1898p8750J1127J13195J4341
$$ -15022 62036 45637 55708 60169 138584 158611 -4870 7028 -71722 -60595 52600 66941
7615F6941n569l0492Q5022j12884q2903J25494k9698P4318l3690O1406j5423k1582
$$ 66941 61372 30880 115902 3018 -79885 45609 15911 90229 56539 117945 102522 80940
7603H0940j18280m9831Q5043o91M1570L1377j0495l6385j286K0330q7854k9501
$$ 80940 -37340 -87171 -2128 -2819 38751 70128 59633 23248 21962 42292 -45562 -75063
7591g5063J23132r996k604K4067q4352Q4573m7094l1431j9844J91851m7953j06258
$$ -75063 48069 38073 35469 59536 -24816 59757 12663 -18768 -38612 153239 105286 -972
7579i72O9214J6771l4535q6138l1478N0395l3734l6562J57492J19743j15250k4023
$$ -972 68242 85013 50478 -35660 -67138 -16743 -50477 -87039 70453 190196 74946 50923
7567E0923k5262M394l1367M2662M7727q4977j6488O9160J02151n7259J0611n7482
$$ 50923 25661 30055 -1312 41350 89077 4100 -12388 56772 158923 101664 112275 54793
7555E4793k2959m225n1362M7178O293l3228M3302J2365r5095K8792L1809j62486
$$ 54793 31834 27609 -23753 23425 29718 -3510 39792 52157 -42938 -14146 17663 -144823
7543a44823R6452j0372l1646J13555n4372p5906k1324K1978J84855R6j02658p1855
$$ -144823 -48371 -58743 -90389 23166 -31206 -107112 -128436 -106458 78397 78493 -24165 -96020
7531i6020k8652J01828M2924k6080o2001m3590q937K5724Q0666P9160J10585j12283
$$ -96020 -124672 -22844 20080 -6000 -68001 -111591 -120528 -94804 -14138 65022 175607 63324
7519F3324q4253K5774J594k7819K1821M7354o161j7782k2673j7906M074P6986
$$ 63324 -20929 4845 6439 -21380 441 47795 41634 23852 1179 -16727 -12653 64333
7507F4333J1796r3499R4157l1555o8063L3937j2907L0598M7401M5076o8175k925
$$ 64333 76129 -17370 76787 45232 -22831 11106 -1801 28797 76198 121274 53099 50174
7495E0174J25906l0696k07410M5733J02915p0023k3227j04360J24858p7149L446
$$ 50174 176080 145384 -62026 -16293 86622 16599 -6628 -110988 13870 -63279 -59833
7484e9833q0283N2177R4107L9170Q06m4939J0845n0542n5395K2690J20204O430
$$ -59833 -140116 -87939 6168 45338 46144 1205 12050 -38492 -93887 -71197 49007 55437
7472E5437K8270n9589M4663l6239m1036n3723J11300M4800j00660Q7068N3433
$$ 55437 83707 24118 68781 32542 -8494 -62217 49083 93883 -6777 80291 133724
7461A33724K1463K2323j32222k2456M7540K4273n0510m063J1479n4206o2920J41027
$$ 133724 155187 177510 45288 22832 70372 94645 44135 40072 51551 -2655 -65575 75452
7449G5452j5731o9167j12264Q5049P4454n4341m2865O936J4631J6034P3175k5173
$$ 75452 59721 -9446 -121710 -36661 37793 -16548 -59413 -52477 -37846 -21812 51363 26190
7437B6190O3168K1741j6742O3359j23003O617O517l6021M8071J886P756j23954
$$ 26190 89358 111099 94357 157716 34713 41330 47847 11826 59897 61783 69539 -54415
7425e4415m9842N4282R7725j03546k5246l3242M0316L0340k4341P3164M9461n0323
$$ -54415 -104257 -49975 47750 -55796 -81042 -114284 -73968 -43628 -67969 5195 54656 4333
7413D333o8351L2511J194k0856k2551k8254P8418J31840p513j42659K324j7888
$$ 4333 -64018 -31507 -30313 -51169 -73720 -101974 -23556 108284 100771 -41888 -39564 -57452
7401e7452n5085K0512j7299N2289m0072r806O9548l7864k6024k7764k0056L6614
$$ -57452 -112537 -92025 -109324 -57035 -97107 -106913 -37365 -75229 -101253 -129017 -149073 -112459
7389a12459l1985M3903J6039N8468J2578l9259j399j0279o4158m0955l7678P8789
$$ -112459 -144444 -100541 -84502 -26034 -13456 -52715 -54114 -64393 -128551 -169506 -207184 -128395
7377a28395J13145n5102K4579J402L5973k198m7534L2039R3200k5905j7248j21405
$$ -128395 -15250 -70352 -45773 -44371 -8398 -10596 -58130 -26091 67109 41204 23956 -97449
7365i7449j5255L7788l6416l2133q0443M7120J6746m7083J02877K5413J57999
$$ -97449 -112704 -74916 -111332 -143465 -223908 -176788 -160042 -207125 -104248 -78835 79164
7354G9164m0709q3451j2135L9873Q7962K9003k12936M1494p730q8722J66965l0577
$$ 79164 38455 -44996 -57131 -17258 70704 99707 -113229 -71735 -79465 -168187 -1222 -31799
7342c1799m9472l693N9420j4288L619p4176K6788N2505r530Q3128P7630j05150
$$ -31799 -81271 -84964 -25544 -39832 -36213 -110389 -83601 -31096 -40626 42502 120132 14982
7330A4982n7645r5010j0533O1927R124j8846O2591p0464K3876L722P8204M8116
$$ 14982 -42663 -137673 -148206 -86279 -77155 -96001 -33410 -103874 -79998 -76276 1928 50044
7318E0044j9155l651m5072j15713J27829K7931r5189M5638M175m9006q836o5399
$$ 50044 30889 27238 -17834 -133547 -5718 22213 -72976 -27338 -23163 -72169 -81005 -146404
7306a46404O2121J07680m0314K6361M5960o2363P355j05742o2908J3289K5563
$$ -146404 -84283 23397 -16917 9444 55404 -6959 396 -105346 -168254 -154965 -129402
7295a29402M3243m23P7321j9579L4800l6287l3552O4975l3213n265P0628j7239
$$ -129402 -86159 -86582 -9261 -28840 5960 -30327 -63879 1096 -32117 -37382 33246 16007
7283A6007j20943k7618J01207L0069P7463j33392p2348P6869J47885K9449n2328
$$ 16007 -104936 -132554 -31347 -1278 76185 -57207 -129555 -52686 95199 124648 72320
7272G2320N097K3869n1240l7397q334O6506K3052l9928q873J13158j2030m8366
$$ 72320 77417 101286 50046 12649 4315 70821 93873 53945 45072 158230 146200 97834
7260I7834p8709o388m4923k7813o35k6801n7531M4538R7042R027n0482L0110n180
$$ 97834 19125 12737 -32186 -59999 -60634 -87435 -144966 -100428 -3386 5641 -44841 -14731 -19911
7247a9911J68015P3672j16406l0579L953P1997M8018Q45q2175M4776j16114M930
$$ -19911 148104 221776 105370 74791 78744 150741 198759 199604 117429 162205 46091 51021
7235E1021m7145M9074N2996p355j3190l6777o5540Q9040M6518m7594M0096M369
$$ 51021 3876 52950 105946 98591 85401 48624 -16916 72124 118642 71048 111144 115513
7223A15513J719R802Q9452j7710J13697n5370j21289O0248J9321K1492j32263
$$ 115513 117232 127034 216486 198776 312473 257103 135814 196062 215383 236875 104612
7212A04612O4003j8602m8877J23169J21083j08991m7220Q350K6063m9139l0267
$$ 104612 168615 150013 101136 224305 345388 236397 189177 197527 223590 174451 144184
7201A44184P9466n8645J16233o6645o0283N7967n3632K0641O7970j4731J3421
$$ 144184 223650 165005 281238 214593 154310 212277 158645 179286 247256 232525 245946
7190B45946l979l0288j2228n7576K9183J19848l2164q9404P0320N3955K1364k3820
$$ 245946 241967 211679 199451 141875 171058 290906 258742 169338 239658 293613 314977 291157
7178B91157m6961J855J7543j0993J4314j27397m1733P0656L906J69006j15677
$$ 291157 244196 246051 263594 252601 266915 139518 97785 168441 172347 341353 225676
7167B25676O51J6545N5852p5908N499l7693J14658L8156j12918o6669L3848P4462
$$ 225676 226327 242872 298724 222816 228315 190622 305280 343436 230518 163849 197697 272159
7155B72159Q4709o2760P431L1311p174K2033m9422n8421k016N7067M5043n3145
$$ 272159 356868 294108 301539 332850 325676 347709 298287 239866 237850 294917 339960 286815
7143B86815J0073J4790J6282J13428j45342o0205l2819J16731j41080M7094N3621
$$ 286815 296888 311678 327960 441388 296046 235841 203022 319753 178673 225767 279388
7132B79388K0636M9377m8617j3244q0897J2469J7642p9543J336J82455O2223k88800
$$ 279388 300024 349401 300784 287540 206643 219112 236754 157211 158547 341002 403225 114425
7120A14425q020O8035N4946l7663L7127l9046J05614q4431r1972J3703k5549L7339
$$ 114425 106405 174440 229386 191723 228850 189804 295418 210987 119015 132718 107169 144508
7108A44508N4065K485K7313j27063P4626J07494j28926J3380J7435L1211o8825
$$ 144508 198573 201058 228371 101308 175934 283428 154502 167882 185317 216528 147703
7097A47703L8279l2112m1533k0266k5590o1981J18498K8018p1885N4787k9530
$$ 147703 185982 153870 112337 92071 66481 4500 122998 151016 79131 133918 104388
7086A04388O4524n525q0364k795J11474O2549P408o7740p5852q0755l1732k2888
$$ 104388 168912 163387 83023 80228 191702 254251 261659 193919 118067 37312 5580 -17308
7074a7308L3029Q5317l0077O4863J9331L3149j20290l5822p0088O6951J6571r4698
$$ -17308 15721 101038 70961 135824 155155 188304 68014 32192 -37896 29055 45626 -49072
7062d9072J01419j4659j15719q8426J03161N9448P3550J01713l6499j6096r720
$$ -49072 52347 37688 -78031 -166457 -63296 -3848 69702 171415 134916 118820 109100
7051A09100p7534m358J20060j56456K1243O1859J7660M2907n0394J197n6703r117
$$ 109100 31566 27208 147268 -9188 12055 73914 91574 134481 84087 85284 28581 19464
7039A9464N0661l2229k6334L3593m5336l3884R8034n7931M7570J50629l4597r7641
$$ 19464 70125 37896 11562 45155 -181 -34065 63969 6038 53608 204237 169640 71999
7027G1999L7532J3909l4724j01494J4913Q9017M3381K1900l8582L5403k2107m656
$$ 71999 109531 123440 88716 -12778 2135 91152 134533 156433 117851 153254 131147 126491
7015A26491J2705Q2892q8297M3082J03134J7320j10832J687P8955L0617o8090
$$ 126491 139196 222088 133791 176873 280007 297327 186495 188182 267137 297754 229664
7004B29664j49423J01676n4136J6762j2460n8362o247K3495J0374o1953K5349
$$ 229664 80241 181917 127781 144543 132083 73721 67474 90969 101343 39390 64739
6993F4739O8950p0481N4688K5193m9278k0827N4987M1333o3241l0364L6697q8687
$$ 64739 133689 63208 117896 143089 93811 72984 127971 169304 106063 75699 112396 23709
6981B3709J05588M5486p443K7738q6095J4725l827K3653L668K09M8376j0640l28
$$ 23709 129297 174783 167340 195078 108983 123708 119881 143534 147202 147411 195787 185147 184819
6968A84819m3773o5417p1166P5026M1222k3761J8085k9278k6740O6812L1814O155
$$ 184819 141046 75629 4463 79489 120711 96950 115035 85757 59017 125829 157643 163798
6956A63798j2965k1287K8317n2701O3742j00027m239L3500k6781K745P4428k5408
$$ 163798 150833 129546 157863 105162 168904 68877 64638 98138 71357 74102 148530 123122
6944A23122k4613l0229J2275O4048L6707j05645N1761J39598j43545j0619Q4785
$$ 123122 98509 68280 80555 144603 181310 75665 127426 267024 123479 112860 197645
6933A97645q0591n2066n3987N9323P38L1214J7012J6636O1917q8454m8806N3340
$$ 197645 117054 64988 11001 70324 71062 102276 119288 135924 197841 109387 60581 113921
6921A13921j0267p457P4939M6798m9004m2966O1730L5834r955L7058K6918j20474
$$ 113921 103654 96197 171136 217934 168930 125964 187694 223528 213573 250631 277549 157075
6909A57075m5101j5089N4505L8554J34654N7970j50581n1858q3383O2067o138
$$ 157075 111974 96885 151390 189944 324598 382568 231987 180129 96746 158813 152675
6898A52675J8223n6790j12795R4612M2039R1702l2072j0450J17201J3297p4741
$$ 152675 170898 114108 1313 95925 137964 229666 197594 187144 304345 317642 242901
6887B42901j04318M4193J5248K4462r2970k6794j7539M0941L0535K0974J6234
$$ 242901 138583 182776 198024 222486 129516 102722 85183 126124 156659 177633 193867
6876A93867Q0523o9081j11158K5409l8205j6916O6736M9071j22697L4233J22317
$$ 193867 274390 205309 94151 119560 81355 64439 131175 180246 57549 91782 214099
6865B14099N4770j33682L222P7229K3107n3945k4464O583P0897J7728n5013L1080
$$ 214099 268869 135187 138409 215638 238745 184800 160336 166919 237816 255544 200531 231611
6853B31611q6918O7566L7151O855P7728n5831j19399o6327Q0731K2732M9545j4037
$$ 231611 144693 212259 249410 256265 333993 278162 158763 92436 173167 195899 245444 231407
6841B31407J9210O6208j3233l1677m275q4407K2122J44394J1912L0298l2035q0809
$$ 231407 250617 316825 303592 271915 267640 183233 205355 349749 361661 391959 359924 279115
6829B79115m6514j2752L7020J20507j10037p3666J58751p727n6743P1328K6562
$$ 279115 232601 219849 256869 377376 267339 193673 352424 344697 287954 359282 385844
6818C85844p5197p6370M8536Q9665q0455K6253o5474J3198N7020N5480K6484L1381
$$ 385844 310647 234277 282813 372478 292023 318276 252802 266000 323020 378500 404984 436365
6806D36365p66j48348J32352J68954q9175l2399N95o2464o3035L8723P8042M9817
$$ 436365 435599 287251 419603 588557 499382 466983 467578 405114 342079 380802 458844 508661
6794E08661j10072n6647J11462J09367j25779n3412j0913l1462J67823l2307j20110
$$ 508661 398589 341942 453404 562771 436992 383580 372667 341205 509028 476721 356611
6783C56611O7508P1257L5390j12165r0010O2844n201r7683L353J45985J13393
$$ 356611 424119 495376 530766 418601 328591 391435 386234 288551 291904 437889 551282
6772E51282n8574n1379K0816Q173P4972l8530j5143J03061j6582l000K7447m3254
$$ 551282 492708 441329 462145 470318 545290 506760 491617 594678 578096 575096 602543 559289
6760E59289N269Q711R2617K9929j85547J11965N7665q2662o20K1305K3135N0003
$$ 559289 564558 573269 665886 695815 510268 622233 679898 597236 596616 617921 641056 691059
6748F91059o0121J1439N1770N7380P4894l2113j4484Q7366L0583N352K0868o7780
$$ 691059 630938 642377 694147 751527 826421 794308 779824 867190 897773 903125 923993 856213
6736H56213j22604J1806K7355o8882N2800R7456R2678j4482J16298o0878j10180
$$ 856213 733609 745415 772770 703888 756688 854144 946822 932340 1048638 987760 877580
6725H77580q8917K4917P4021Q6351r661J40836J7065l2443j0690k2349k5446n280
$$ 877580 788663 813580 887601 973952 964291 1105127 1122192 1089749 1079059 1056710 1031264 1025984
6713A025984K4110L6260j2557N6475R427n1503K4104R7720k5560L6545P9881m083
$$ 1025984 1050094 1086354 1073797 1130272 1139699 1088196 1112300 1210020 1184460 1221005 1300886 1296803
6701A296803j05478L4903J8241R7536J07698P2003n5810n4729O8862P999K6185
$$ 1296803 1191325 1226228 1244469 1342005 1449703 1521706 1465896 1411167 1480029 1488028 1514213
6690A514213N0775O6919n4582J32016R7556n6161o9776K4728P9275M0728L3314
$$ 1514213 1564988 1631907 1577325 1709341 1806897 1750736 1680960 1705688 1784963 1825691 1859005
6679A859005N5368p5436l2304P513L0165J04572J80721j07909P7051m4389P198
$$ 1859005 1914373 1838937 1806633 1814146 1844311 1948883 2129604 2021695 2098746 2054357 2061555
6668B061555J25664o3401k2882J2642o235L1528Q4924k174p0121p1966O8525O2034
$$ 2061555 2187219 2123818 2100936 2113578 2107343 2138871 2223795 2221621 2151500 2079534 2148059 2210093
6656B210093Q511o6826n3853K1785M6828L1055p466p4805k5550L5283n5499o987
$$ 2210093 2218604 2151778 2097925 2119710 2166538 2197593 2190127 2115322 2089772 2125055 2069556 2062569
6644B062569J5930M2788O4029q2213p8682M4509n0276q575o0674L6188l8877n4448
$$ 2062569 2078499 2121287 2185316 2103103 2024421 2068930 2018654 2010079 1949405 1985593 1946716 1892268
6632A892268k9400J2810k7459m907Q1799L428k6907l9165k0499m2772k2942J35004
$$ 1892268 1862868 1875678 1848219 1843312 1925111 1928539 1901632 1862467 1841968 1799196 1776254 1911258
6620A911258o051j05282k9822O8563O9199p7456l4054n6239j1069J4396k8723
$$ 1911258 1905207 1799925 1770103 1838666 1907865 1830409 1796355 1740116 1729047 1743443 1714720
6609A714720k347Q3260J0660k3281m580o811M4905J08434o3042r138l4883K2028
$$ 1714720 1712373 1795633 1806293 1783012 1778432 1771621 1816526 1924960 1861918 1852780 1817897 1839925
6597A839925o8485m258K4606K0128O5130o497l3341k5759K81k5092M3181K7019
$$ 1839925 1771440 1767182 1791788 1811916 1877046 1870549 1837208 1811449 1811730 1786638 1829819 1856838
6585A856838l2002N2189L2719o9886p9904O1523p0370j11970J53816r350M6177
$$ 1856838 1824836 1877025 1909744 1839858 1759954 1821477 1751107 1639137 1792953 1783603 1829780
6574A829780O6336m2780P705M3953p160j7302J7221n8938N8904o048p0752j6815
$$ 1829780 1896116 1853336 1861041 1904994 1897834 1880532 1897753 1838815 1897719 1891671 1820919 1804104
6562A804104J0602N0731l3596K5594L7526k5861l9050o2331j17653R0239Q6545
$$ 1804104 1814706 1865437 1831841 1857435 1894961 1869100 1830050 1767719 1650066 1740305 1826850
6551A826850p6712J5535O1391J4736l3723j04477M0386J04706o6681K3440M2655
$$ 1826850 1750138 1765673 1827064 1841800 1808077 1703600 1743986 1848692 1782011 1805451 1848106
6540A848106n9866O909M3602N5374l5496l1368K2507J00003J18353J8486o0061
$$ 1848106 1788240 1795149 1838751 1894125 1858629 1827261 1849768 1949771 2068124 2086610 2026549
6529B026549K7473K5745l7672O2683q058p4864J8913o8676m4196N9889L7483R227
$$ 2026549 2054022 2079767 2042095 2104778 2096720 2021856 2040769 1972093 1927897 1987786 2025269 2034496
6517B034496l0141J02065P9465L358j0166M2540j1529p4186L9531J8064j10849
$$ 2034496 2004355 2106420 2185885 2189243 2179077 2221617 2210088 2135902 2175433 2193497 2082648
6506B082648J29044J40428k3886j6972R1959n0450M1186M3982j0377J15037O877
$$ 2082648 2211692 2352120 2328234 2311262 2403221 2352771 2393957 2437939 2427562 2542599 2549476
6495B549476R9254M1427L3610k2052K4918m2660r2440l6156J18021m878k116Q4301
$$ 2549476 2648730 2690157 2723767 2701715 2726633 2683973 2591533 2555377 2673398 2668520 2666404 2750705
6483B750705q9817k0488R6405K1365J4102P4380J3969K4509N7932q5438O6095
$$ 2750705 2660888 2640400 2736805 2758170 2772272 2846652 2860621 2885130 2943062 2857624 2923719
6472B923719Q6370j0974O8592K6111M7321m0538J13370J36741J3167j3683J11048
$$ 2923719 3010089 2999115 3067707 3093818 3141139 3100601 3213971 3350712 3363879 3350196 3461244
6461C461244m9467K3034L7188k3478J57213J01572P7250o2411P952J75267M5712
$$ 3461244 3411777 3434811 3471999 3448521 3605734 3707306 3784556 3722145 3730097 3905364 3951076
6450C951076n3778n5111M4955P7239J2734J51932Q0757J1809l027K3490J31398
$$ 3951076 3897298 3842187 3887142 3964381 3977115 4129047 4209804 4221613 4218586 4242076 4373474
6439D373474N0183k7905L4659K17184O9497k6399P0434l4777R9873J48323L2613
$$ 4373474 4423657 4395752 4430411 4647595 4717092 4690693 4761127 4726350 4826223 4974546 5007159
6428E007159J077J47550K5456O8286j938M4026R8377P2621N4568J29514J16002
$$ 5007159 5008236 5155786 5181242 5249528 5247590 5291616 5389993 5462614 5517182 5646696 5762698
6417E762698N9435K77871J15443N3561P5191O8719J32936J14471Q6801J50233
$$ 5762698 5822133 6100004 6215447 6269008 6344199 6412918 6545854 6660325 6747126 6897359
6407F897359Q2697J00626N8914J76689J36660P2459J49065K17652P0525P2438
$$ 6897359 6980056 7080682 7139596 7316285 7452945 7525404 7674469 7892121 7962646 8035084
6397H035084J47053R8438Q0256J97281J83743P9667R2162J41268K83340J18461
$$ 8035084 8182137 8280575 8360831 8558112 8741855 8821522 8913684 9054952 9338292 9456753
6387I456753J94349K50243J81397J29433K09563J64662o1626O6670J81452J86743
$$ 9456753 9651102 9901345 10082742 10212175 10421738 10586400 10524774 10591444 10772896 10959639
6377A0959639J04631K55581K19547J59786P9421J43830J18979K75826K70485K07465
$$ 10959639 11064270 11319851 11539398 11699184 11778605 11922435 12041414 12317240 12587725 12795190
6367A2795190K19250Q9146J97097K58121J81025L39067K07153K01202L06155K24333
$$ 12795190 13014440 13103586 13300683 13558804 13739829 14078896 14286049 14487251 14793406 15017739
6357A5017739K50659K36657K25993J95015K48055K75210K41294L13449M38625
$$ 15017739 15268398 15505055 15731048 15926063 16174118 16449328 16690622 17004071 17442696
6348A7442696L53573L01697L81194L63721M12828L21826M35806M90151M12938
$$ 17442696 17796269 18097966 18479160 18842881 19255709 19577535 20013341 20503492 20916430
6339B0916430N19230M96053M95971L35416N94723N93528O19129N97043N64535
$$ 20916430 21435660 21931713 22427684 22763100 23357823 23951351 24570480 25167523 25732058
6330B5732058N95671O36554O77060O53247O55561P53613Q25848Q27849P65175
$$ 25732058 26327729 26964283 27641343 28294590 28950151 29703764 30529612 31357461 32122636
6321C2122636Q22180Q64045Q25542Q51553Q80966Q69671J050948R38327R07901
$$ 32122636 32944816 33808861 34634403 35485956 36366922 37236593 38287541 39225868 40133769
6312D0133769Q89519R08559J015401R84727Q94228Q93214R93804R31977R76885
$$ 40133769 41023288 41931847 42947248 43931975 44826203 45719417 46713221 47645198 48622083
6303D8622083R30874R68845Q35546Q20487Q45211P27992Q56074O91934P23727
$$ 48622083 49552957 50521802 51357348 52177835 53023046 53751038 54607112 55299046 56022773
6294E6022773P22955N26697O30533N30041M82783M65910K08319K41930K57233
$$ 56022773 56745728 57272425 57902958 58432999 58915782 59381692 59590011 59831941 60089174
6285F0089174J51565L4057l9463k19j41684k33008k13800k70528l21534l76674
$$ 60089174 60240739 60274796 60235333 60235114 60093430 59860422 59646622 59376094 59054560 58677886
6275E8677886m09034m73081m45952o06055p29686n83777o84704o47281o11566
$$ 58677886 58268852 57795771 57349819 56743764 56014078 55430301 54745597 54098316 53486750
6266E3486750p91809p53207p12125q01737p91386p95866r16796p96229q41518
$$ 53486750 52694941 51941734 51229609 50427872 49636486 48840620 47923824 47127595 46286077
6257D6286077r38930r20749q52015p10262p97375q60024r29941q77793p12353
$$ 46286077 45347147 44426398 43574383 42864121 42066746 41206722 40276781 39398988 38686635
6248C8686635q21315q20853o65853o69019p15621q27431o83585o50220o47851
$$ 38686635 37865320 37044467 36378614 35709595 34993974 34166543 33482958 32832738 32184887
6239C2184887n98004o07030p84840o87587m31314n55482n65594n90993n44781
$$ 32184887 31586883 30979853 30195013 29507426 29076112 28520630 27955036 27364043 26819262
6230B6819262n14701l96510n03500m91975m54402l68972m78664m29402k18939
$$ 26819262 26304561 25908051 25404551 24912576 24458174 24089202 23610538 23181136 22962197
6221B2962197m30394l15382k64855l52427m03333m02022k13170r9361k82154l06857
$$ 22962197 22531803 22216421 21951566 21599139 21195806 20793784 20580614 20481253 20199099 19892242
6211A9892242k99513j69909j93507k75822j16599j52079j81780N5529k21890j60086
$$ 19892242 19592729 19422820 19229313 18953491 18836892 18684813 18503033 18558562 18336672 18176586
6201A8176586k3009j55177r9863n267j07890o5102p2258j7895k6530o4010k700
$$ 18176586 18153577 17998400 17898537 17893270 17785380 17720278 17648020 17630125 17603595 17539585 17536885
6190A7536885M4485J06505M1624k1396j5970j15389M4446J12689J29945R4916
$$ 17536885 17581370 17687875 17729499 17708103 17692133 17576744 17621190 17733879 17863824 17958740
6180A7958740J30079J00309M5224R2175J59548J09378K48255J40357M1067J37067
$$ 17958740 18088819 18189128 18234352 18326527 18486075 18595453 18843708 18984065 19025132 19162199
6170A9162199K09237L27146J35409K61721K92271K29722K31622K22693L28432
$$ 19162199 19371436 19698582 19833991 20095712 20387983 20617705 20849327 21072020 21400452
6161B1400452K62286K18641L55651L50118M09236L07068L39211M99479M21472
$$ 21400452 21662738 21881379 22237030 22587148 22996384 23303452 23642663 24142142 24563614
6152B4563614N64684M53542L65554N74092N47662N90182P17319P27342P52804
$$ 24563614 25128298 25581840 25947394 26521486 27069148 27659330 28376649 29103991 29856795
6143B9856795Q38613P76710Q99112Q55638R32305R67398J045398J125720J085210
$$ 29856795 30695408 31472118 32371230 33226868 34159173 35126571 36171969 37297689 38382899
6134C8382899J120313J177612J323272J369900J293288J370849J284159J231644
$$ 38382899 39503212 40680824 42004096 43373996 44667284 46038133 47322292 48553936
6126D8553936J365519J330976J142735J238029J069363J187886J125095R56223
$$ 48553936 49919455 51250431 52393166 53631195 54700558 55888444 57013539 57969762
6118E7969762R85514P88194P91692P11898P51830N37666M12661M18860N09345
$$ 57969762 58955276 59743470 60535162 61247060 61998890 62536556 62949217 63368077 63877422
6109F3877422L34636K35789J94092O9048P5832Q1512p3791l84019k41620l91585
$$ 63877422 64212058 64447847 64641939 64710987 64786819 64868331 64794540 64410521 64168901 63777316
6099F3777316l99290n61025o56260o79477p07618q88892r25567r77106r98555
$$ 63777316 63378026 62817001 62160741 61481264 60773646 59884754 58959187 57982081 56983526
6090E6983526j183161j348931j197460j290313j109207j316517j475136j405378
$$ 56983526 55800365 54451434 53253974 51963661 50854454 49537937 48062801 46657423
6082D6657423j329496j381869j472313j310874j200364j277662j305767j060898
$$ 46657423 45327927 43946058 42473745 41162871 39962507 38684845 37379078 36318180
6074C6318180j060521j085173j033843q62097r57727j002193q98019p74720o44952
$$ 36318180 35257659 34172486 33138643 32276546 31318819 30316626 29418607 28643887 27998935
6065B7998935o92833o91798o53792o34395o69777n36755n71125n17763m92212
$$ 27998935 27306102 26614304 25960512 25326117 24656340 24119585 23548460 23030697 22538485
6056B2538485n61183m76477m91761m11613m36572m71747k70679m10520m35737
$$ 22538485 21977302 21500825 21009064 20597451 20160879 19689132 19418453 19007933 18572196
6047A8572196k35381j95687k95069k32021k75517k80647j86674j37277j20274
$$ 18572196 18336815 18141128 17846059 17614038 17338521 17057874 16871200 16733923 16613649
6038A6613649j63569n2409r233k3634K4950P0011j4259j30522l42001m75199n21202
$$ 16613649 16450080 16397671 16388438 16364804 16389754 16459765 16445506 16314984 15972983 15497784 14976582
6027A4976582n45434l98736m07337m10995l00738l01684l15494l25987j60664
$$ 14976582 14431148 14032412 13625075 13214080 12913342 12611658 12296164 11970177 11809513
6018A1809513k20287l03314j88229j15231q5660k04027k13265m1296j64229j47823
$$ 11809513 11589226 11285912 11097683 10982452 10896792 10692765 10479500 10438204 10273975 10126152
6008A0126152q6609j48867r6520j00937j48413K2993k18483j10855l1555q4575
$$ 10126152 10039543 9890676 9794156 9693219 9544806 9567799 9349316 9238461 9206906 9122331
5998I122331n6461j65844o7647j87271l2452o1727j06074n4162k697p3672L6424
$$ 9122331 9065870 8900026 8832379 8645108 8612656 8550929 8444855 8390693 8387996 8314324 8350748
5987H350748q3597j45570m9537p6332j9200n0703k3405J24216k4292o0907o0047
$$ 8350748 8267151 8121581 8072044 7995712 7976512 7925809 7902404 8026620 8002328 7941421 7881374
5976G881374J6191k04654k5532k3034K650m8510L7592j31508k8391P2731k6671
$$ 7881374 7897565 7692911 7667379 7644345 7646995 7598485 7636077 7504569 7476178 7548909 7522238
5965G522238L2411J5300p2170o3096o0673l1729L6650N9010L054j1831l5800l6384
$$ 7522238 7554649 7569949 7497779 7434683 7374010 7342281 7378931 7437941 7440995 7429164 7393364 7356980
5953G356980l0305j53838J22263P9093l072m1886L1057P349p0898o8268o755O9123
$$ 7356980 7326675 7172837 7295100 7374193 7371121 7329235 7360292 7367641 7296743 7228475 7221720 7290843
5941G290843j1145q944L2131j538N3296k8915Q4994J33004j1493J2090P5507n6721
$$ 7290843 7279698 7270754 7302885 7301347 7354643 7325728 7410722 7543726 7532233 7544323 7619830 7563109
5929G563109N4809P6002j2543J3503M9110J2377l7354j295P1047O5066J15119
$$ 7563109 7617918 7693920 7681377 7694880 7743990 7756367 7719013 7717718 7788765 7853831 7968950
5918G968950M422j6916P4492O0640l7047K646N444J39234Q1486L9338M4664J43886
$$ 7968950 7973372 7956456 8030948 8091588 8054541 8057187 8062631 8201865 8283351 8322689 8367353 8511239
5906H511239L7798k1522N4351J7970M6742J52683j6864P9271J32243J09018M2336
$$ 8511239 8549037 8527515 8581866 8599836 8646578 8799261 8782397 8861668 8993911 9102929 9145265
5895I145265J23766J42878p723J79453J99517K4716r609R5674J21288J09057R2970
$$ 9145265 9269031 9411909 9404186 9583639 9783156 9807872 9798263 9893937 10015225 10124282 10217252
5884A0217252K12151M6670P0800R0028J71596K38099P9113J67449J51950J51301
$$ 10217252 10429403 10476073 10546873 10636901 10808497 11046596 11125709 11293158 11445108 11596409
5874A1596409J20541K37686J25219J71022L27540J93115J74537J33799K23817
$$ 11596409 11716950 11954636 12079855 12250877 12578417 12771532 12946069 13079868 13303685
5865A3303685K76727J29624J93251L14607J78355L23607K71618L04015K65438
$$ 13303685 13580412 13710036 13903287 14217894 14396249 14719856 14991474 15295489 15560927
5856A5560927K03684L09073J84016K76897K36562K80702M15381K05446L50356
$$ 15560927 15764611 16073684 16257700 16534597 16771159 17051861 17467242 17672688 18023044
5847A8023044L74503L34602L22233L39239K90260L45045L90371M10745L02476
$$ 18023044 18397547 18732149 19054382 19393621 19683881 20028926 20419297 20830042 21132518
5838B1132518L82224N93412M80927M30416K87731O32746O15656M32411M86030
$$ 21132518 21514742 22108154 22589081 23019497 23307228 23939974 24555630 24988041 25474071
5829B5474071M41671N41527N59793M99719M55957L67750O03532O42744O10544
$$ 25474071 25915742 26457269 27017062 27516781 27972738 28340488 28944020 29586764 30197308
5820C0197308N97916O00539N47279N63528N49114P43581Q01211O94236Q06995
$$ 30197308 30795224 31395763 31943042 32506570 33055684 33799265 34600476 35294712 36101707
5811C6101707P42485P76859Q97361Q65885Q69914Q83061Q58287Q09460P94828
$$ 36101707 36844192 37621051 38518412 39384297 40254211 41137272 41995559 42805019 43599847
5802D3599847R40865R38501Q34480P52716R56338R60228Q76530P59014R31994
$$ 43599847 44540712 45479213 46313693 47066409 48022747 48982975 49859505 50618519 51550513
5793E1550513Q57390P89920Q05932Q82803R22507R43542R21758Q28092Q42631
$$ 51550513 52407903 53197823 54003755 54886558 55809065 56752607 57674365 58502457 59345088
5784E9345088R05691J008571J037008R12531R77388J015519R37123P90560N27276
$$ 59345088 60250779 61259350 62296358 63208889 64186277 65201796 66138919 66929479 67456755
5775F7456755K09568j67271k69340l87134k87061k21365l22426l06199k40733
$$ 67456755 67666323 67499052 67229712 66842578 66555517 66334152 66011726 65705527 65464794
5766F5464794l31600k36268k46646l05885m42447o19276l81388n36084n43021
$$ 65464794 65133194 64896926 64650280 64344395 63901948 63282672 62901284 62365200 61822179
5757F1822179o31645m88271n37981n01540m90666o67393o59397p51677o74369
$$ 61822179 61190534 60702263 60164282 59662742 59172076 58504683 57845286 57093609 56419240
5748E6419240p09510p75095q82114q38132p01476p24745q28231p13044o47797
$$ 56419240 55709730 54934635 54052521 53214389 52512913 51788168 50959937 50246893 49599096
5739D9599096p06884o66091n75274m81142o32102o80923p38285q74825p58308
$$ 49599096 48892212 48226121 47650847 47169705 46537603 45856680 45118395 44243570 43485262
5730D3485262q81231r69430q55411q76609q96662q12176p10678p50464p21235
$$ 43485262 42604031 41634601 40779190 39902581 39005919 38193743 37483065 36732601 36011366
5721C6011366o69660o86256o72661o17971n46372n15167n65405n05786l95354
$$ 36011366 35341706 34655450 33982789 33364818 32818446 32303279 31737874 31232088 30836734
5712C0836734m96421m57108m26363m48841m69264m25703l46392k94971l07649
$$ 30836734 30340313 29883205 29456842 29008001 28538737 28113034 27766642 27471671 27164022
5703B7164022m47436n39914m65167m26398m55075n48275l68883l94364l71766
$$ 27164022 26716586 26176672 25711505 25285107 24830032 24281757 23912874 23518510 23146744
5694B3146744k70200l82946k53560k63000k81867k74529l16006j82674j63605
$$ 23146744 22876544 22493598 22240038 21977038 21695171 21420642 21104636 20921962 20758357
5685B0758357q7561j64168j85228j67419j53247o4009r2118q6648q8647m0657
$$ 20758357 20670796 20506628 20321400 20153981 20000734 19936725 19844607 19757959 19669312 19628655
5675A9628655j12454j16130k6649O4530J26444N5164Q6625M8870J71519J73146
$$ 19628655 19516201 19400071 19373422 19437952 19564396 19619560 19706185 19755055 19926574 20099720
5665B0099720j965r9397j47064l11491l91538k24180l52992k14188k73754r0950
$$ 20099720 20097755 19998358 19851294 19539803 19148265 18924085 18571093 18356905 18083151 17992201
5655A7992201j00136o3684j53954l11599k9113m3356o6372l9466L6658j00002
$$ 17992201 17892065 17828381 17674427 17362828 17333715 17290359 17223987 17184521 17221179 17121177
5645A7121177m2242k7913p441o2102j00825m9434n2716j5021J05109l6119M6058
$$ 17121177 17078935 17051022 17043581 16981479 16880654 16831220 16778504 16763483 16868592 16832473 16878531
5634A6878531J3050m707L2873j2983K1879L3180P4474j488J3652p6869L0627J35903
$$ 16878531 16891581 16886874 16919747 16906764 16928643 16961823 17036297 17034809 17048461 16971592 17002219 17138122
5622A7138122J33288n4061M2720Q4190o669J12239N0285K0336M8975Q7447j2510
$$ 17138122 17271410 17217349 17260069 17344259 17337590 17449829 17500114 17520450 17569425 17656872 17644362
5611A7644362K37227Q7738J7488J53290P5497K02337L6096L2858J16016k283K11867
$$ 17644362 17881589 17969327 17986815 18140105 18215602 18417939 18454035 18486893 18602909 18600626 18812493
5600A8812493R0031J52399M2712J59783N4593O711J42322J99320J73252J50192
$$ 18812493 18902524 19054923 19097635 19257418 19312011 19318722 19461044 19660364 19833616 19983808
5590A9983808J26911K2898K29938P3400J71052K32417K14697K10637J39992J14524
$$ 19983808 20110719 20133617 20363555 20436955 20608007 20840424 21055121 21265758 21405750 21520274
5580B1520274K17121K11203K80032L56576J72961K75236L13860K79850M07175
$$ 21520274 21737395 21948598 22228630 22585206 22758167 23033403 23347263 23627113 24034288
5571B4034288K61443L67265L30593L01842K50427M19261M43758L22828L98642
$$ 24034288 24295731 24662996 24993589 25295431 25545858 25965119 26408877 26731705 27130347
5562B7130347M33053M48791M76072M51784M14599N73668L83879N20268N83898
$$ 27130347 27563400 28012191 28488263 28940047 29354646 29928314 30312193 30832461 31416359
5553C1416359N13360O08464O41677O63298N95231O30340N54020P45042O60316
$$ 31416359 31929719 32538183 33179860 33843158 34438389 35068729 35622749 36367791 37028107
5544C7028107Q32487P91891P74294Q52580Q32889Q85377Q32029R60144R31503
$$ 37028107 37860594 38652485 39426779 40279359 41112248 41997625 42829654 43789798 44721301
5535D4721301J021862J045443J093712J157471J064202J142062J111367J271369
$$ 44721301 45743163 46788606 47882318 49039789 50103991 51246053 52357420 53628789
5527E3628789J435923J489993J419434J483442J685606J729946J632684J800451
$$ 53628789 55064712 56554705 57974139 59457581 61143187 62873133 64505817 66306268
5519F6306268J770588J938577K138138K113078K149673K213425K267882K318045
$$ 66306268 68076856 70015433 72153571 74266649 76416322 78629747 80897629 83215674
5511H3215674K393832K544103K392013K456120K631427K584501K638657K742195
$$ 83215674 85609506 88153609 90545622 93001742 95633169 98217670 100856327 103598522
5503A03598522K610594K772665K842889K708124K812312K843994K909618K825546
$$ 103598522 106209116 108981781 111824670 114532794 117345106 120189100 123098718 125924264
5495A25924264K755550K764331K822663K822267K891222K856932K752895K749149
$$ 125924264 128679814 131444145 134266808 137089075 139980297 142837229 145590124 148339273
5487A48339273K910093K759589K727416K790024K587982K782679K957021L215528
$$ 148339273 151249366 154008955 156736371 159526395 162114377 164897056 167854077 171069605
5479A71069605L498342L832262M175747M532248M888247N234532N748623N947232
$$ 171069605 174567947 178400209 182575956 187108204 191996451 197230983 202979606 208926838
5471B08926838O403137O733932O895331O982908P135350O974468O741881O015756
$$ 208926838 215329975 222063907 228959238 235942146 243077496 250051964 256793845 262809601
5463B62809601N115901M086159K722824J135866n76354k370225l885415n088820
$$ 262809601 267925502 272011661 274734485 275870351 275293997 272923772 269038357 263949537
5455B63949537o090440o911788p524068p891776q126787q098801q189184q165306
$$ 263949537 257859097 250947309 243423241 235531465 227404678 219305877 211116693 202951387
5447B02951387q015873q004802p689886p441723p368653p190304o721391o586332
$$ 202951387 194935514 186930712 179240826 171799103 164430450 157240146 150518755 143932423
5439A43932423o238451n886748n643932n100062m956038m698306m386462m086536
$$ 143932423 137693972 131807224 126163292 121063230 116107192 111408886 107022424 102935888
5431A02935888l831927l651003l438665l223629l041482k734453k526618k564922
$$ 102935888 99103961 95452958 92014293 88790664 85749182 83014729 80488111 77923189
5423G7923189k407744k295840k030125j878407j899632j916413j748050j552070
$$ 77923189 75515445 73219605 71189480 69311073 67411441 65495028 63746978 62194908
5415F2194908j648927j632935j647834j485825j292525j386260j318594j337839
$$ 62194908 60545981 58913046 57265212 55779387 54486862 53100602 51782008 50444169
5407E0444169j217443j166114j118682j128139j072248j083296j056743q95842
$$ 50444169 49226726 48060612 46941930 45813791 44741543 43658247 42601504 41705662
5399D1705662q45430q71342p77657q97048q87374p63792o76876p11224n98793
$$ 41705662 40860232 39988890 39211233 38314185 37426811 36663019 35986143 35274919 34676126
5390C4676126o47307o87923o54284p00430o31366o23207m91919n05310n83998
$$ 34676126 34028819 33340896 32686612 31986182 31354816 30731609 30239690 29734380 29150382
5381B9150382n23908l95434m49638m47921m16285m69720k92531k70854m96346
$$ 29150382 28626474 28231040 27781402 27333481 26917196 26447476 26154945 25884091 25387745
5372B5387745l44405l65154l57706l42071k05188l07608k34716k92203k23882
$$ 25387745 25043340 24678186 24320480 23978409 23773221 23465613 23230897 22938694 22714812
5363B2714812k23946j26615k01926j22963j91624j85593j54968j52514j03368
$$ 22714812 22490866 22364251 22162325 22039362 21847738 21662145 21507177 21354663 21251295
5354B1251295m60p193j23805j0790L5239N7195j01576p2637j96296l63186l63196
$$ 21251295 21250835 21243642 21119837 21109047 21144286 21201481 21099905 21027268 20830972 20467786 20104590
5343B0104590l14654j11472k08192j31336j54135j63744j18837j65913p122k2948
$$ 20104590 19789936 19678464 19470272 19338936 19184801 19021057 18902220 18736307 18729185 18706237
5333A8706237K5090j2042k2928n496O751m1148n6416J30963k9880K8403P7119
$$ 18706237 18731327 18719285 18696357 18690861 18697612 18656464 18600048 18731011 18701131 18729534 18806653
5322A8806653J92932M16820K16458K99435M25146L00507J30610L0050k64051m75573
$$ 18806653 18999585 19416405 19632863 19932298 20357444 20657951 20788561 20818611 20554560 20078987
5312B0078987n72530o91131n90202n54157o02145l88852m13998l59780j88476
$$ 20078987 19506457 18815326 18225124 17670967 17068822 16679970 16265972 15906192 15717716
5303A5717716k32891j91730o5918j82122q6337r5711J2570L5906m1614l9171O0061
$$ 15717716 15484825 15293095 15227177 15045055 14958718 14863007 14875577 14911483 14869869 14830698 14890759
5292A4890759J77035K4776L49242K95829L34426L67780N46069M81667J00513J23732
$$ 14890759 15067794 15092570 15441812 15737641 16072067 16439847 16985916 17467583 17568096 17691828
5282A7691828j04808l44576n59374p41044o74968n52875n36998n38455n04193
$$ 17691828 17587020 17242444 16683070 15942026 15267058 14714183 14177185 13638730 13134537
5273A3134537k65312m13312k94301j81601k36638j50339j60222j41996j39633
$$ 13134537 12869225 12455913 12161612 11980011 11743373 11593034 11432812 11290816 11151183
5264A1151183J9837q4824j00228J6977l2532j4097J28481q2302p1291J95656O9241
$$ 11151183 11171020 11086196 10985968 11002945 10970413 10956316 11084797 11002495 10931204 11126860 11196101
5253A1196101M9198P8716q4989o2551j33905n7858j23041k65489l12515j45738
$$ 11196101 11245299 11324015 11239026 11176475 11042570 10984712 10861671 10596182 10283667 10137929
5243A0137929q4669j72208j30390r1112j1434p1053j55899j33820j25715q1833
$$ 10137929 10053260 9881052 9750662 9659550 9648116 9577063 9421164 9287344 9161629 9079796
5233I079796j47037j92320j53547j07356n6333J7941p2354n1143k6874j55007
$$ 9079796 8932759 8740439 8586892 8479536 8423203 8441144 8368790 8317647 8290773 8135766
5223H135766l0271m7078O495k8341m6973j51348J1747Q4986P7437o4844N0484
$$ 8135766 8105495 8058417 8064912 8036571 7989598 7838250 7849997 7934983 8012420 7947576 7998060
5212G998060K0858M5248J05924J5642r5984K7901O1382j33436j39554j3089R789
$$ 7998060 8018918 8064166 8170090 8185732 8089748 8117649 8179031 8045595 7906041 7892952 7902741
5201G902741J1629j07371Q674Q2932n4322n0688k5970K8706r2294j01127J02546
$$ 7902741 7914370 7806999 7815673 7898605 7844283 7793595 7767625 7796331 7704037 7602910 7705456
5190G705456p6557k2097l9039M4306P6275m0315j40113J27537O8017k2415M693
$$ 7705456 7628899 7606802 7567763 7612069 7688344 7648029 7507916 7635453 7703470 7681055 7685748
5179G685748l2013P4082R5617j9434o452N3144J133J47133J9539N5408p8262j93638
$$ 7685748 7653735 7727817 7823434 7804000 7797548 7850692 7851825 7998958 8018497 8073905 7995643 7802005
5167G802005n7529J46755j2449P4779P2227K7777K6945O2891p7269n516J05944
$$ 7802005 7744476 7891231 7878782 7953561 8025788 8053565 8080510 8143401 8066132 8060616 8166560
5156H166560K9461n6533J4827l5928O3245M1765R1713L3780m8820N4694J68571
$$ 8166560 8196021 8139488 8154315 8118387 8181632 8223397 8315110 8348890 8300070 8354764 8523335
5145H523335m1702m0690M7445K7483J00642N2129K1973L8451J31306R4254P2120
$$ 8523335 8481633 8440943 8488388 8515871 8616513 8668642 8690615 8729066 8860372 8954626 9026746
5134I026746M7094j9364L2263R0425k1679J50014J48285O9440M2276J41641J17576
$$ 9026746 9073840 9054476 9086739 9177164 9155485 9305499 9453784 9523224 9565500 9707141 9824717
5123I824717N2289Q9711J70018K2805m4590l6914L9511K1099j39714K1155r4616
$$ 9824717 9877006 9966717 10136735 10159540 10114950 10078036 10117547 10138646 9998932 10020087 9925471
5112I925471j40854j0386p7142k8410j2031R6366M3881l0798O5651j01793J1156
$$ 9925471 9784617 9774231 9697089 9668679 9656648 9753014 9796895 9766097 9831748 9729955 9741111
5101I741111J22231j27794r5476J17470J15960J16310Q9792J27755k1962K9980
$$ 9741111 9863342 9735548 9640072 9757542 9873502 9989812 10079604 10207359 10185397 10215377
5091A0215377N8920M0814J02308J25509R2523K7898P8594J15065J37414J34867
$$ 10215377 10274297 10315111 10417419 10542928 10635451 10663349 10741943 10857008 10994422 11129289
5081A1129289O1283N2686J50353K62400J03700K22008N6732K04457K15684J38203
$$ 11129289 11190572 11243258 11393611 11656011 11759711 11981719 12038451 12242908 12458592 12596795
5071A2596795J76955J64634K36616K07031K53176J35579K47351K07864K89155
$$ 12596795 12773750 12938384 13175000 13382031 13635207 13770786 14018137 14226001 14515156
5062A4515156L49274K72333J36561J75004K82082L34107L92776K34532K58410
$$ 14515156 14864430 15136763 15273324 15448328 15730410 16064517 16457293 16691825 16950235
5053A6950235L00572M22374L62545M36478L83046L21441N21222L66462L19661
$$ 16950235 17250807 17673181 18035726 18472204 18855250 19176691 19697913 20064375 20384036
5044B0384036M53124N10541M30834O13597O30878N91159N53033O36630O62851
$$ 20384036 20837160 21347701 21778535 22392132 23023010 23614169 24167202 24803832 25466683
5035B5466683O70759Q07699Q24628Q71007Q39468P97890R49565R57755R87494
$$ 25466683 26137442 26945141 27769769 28640776 29480244 30278134 31227699 32185454 33172948
5026C3172948J016570J100385J092638J101340J283137J295474J386147J607343
$$ 33172948 34189518 35289903 36382541 37483881 38767018 40062492 41448639 43055982
5018D3055982J644407J752414J828534K043645K293296K396203K701241K878337
$$ 43055982 44700389 46452803 48281337 50324982 52618278 55014481 57715722 60594059
5010F0594059K996031L275868L663432L852818L924828M137976M178971M081259
$$ 60594059 63590090 66865958 70529390 74382208 78307036 82445012 86623983 90705242
5002I0705242M085204L948029L462149K854875K037670J541814M57031l40405
$$ 90705242 94790446 98738475 102200624 105055499 107093169 108634983 109092014 108751609
4994A08751609j067666j814160k198795k599228k894800k949702l058338l063939
$$ 108751609 107683943 105869783 103670988 101071760 98176960 95227258 92168920 89104981
4986H9104981k884922k943443k781164k674216k561940k484204k498010k258552
$$ 89104981 86220059 83276616 80495452 77821236 75259296 72775092 70277082 68018530
4978F8018530k300558k205848k050490k068262j980503j974271j800579j800920
$$ 68018530 65717972 63512124 61461634 59393372 57412869 55438598 53638019 51837099
4970E1837099j825178j695479j705785j663649j521118j626270j462464j395980
$$ 51837099 50011921 48316442 46610657 44947008 43425890 41799620 40337156 38941176
4962C8941176j458406j294684j243602j241172j182880j083478j021303q26900
$$ 38941176 37482770 36188086 34944484 33703312 32520432 31436954 30415651 29588751
4954B9588751r64747q57037p61046o85630o78277o05187n76054o75318m03746
$$ 29588751 28624004 27766967 27005921 26320291 25642014 25036827 24460773 23785455 23381709
4945B3381709l44371n28818m24165k55923l39215l36631k90734k36757l28187
$$ 23381709 23037338 22508520 22084355 21828432 21489217 21152586 20861852 20625095 20296908
4936B0296908l45326m32520k68569m02101l97280m84978m40771l78328k98618
$$ 20296908 19951582 19519062 19250493 18848392 18451112 17966134 17525363 17147035 16848417
4927A6848417l88385k19435k21136l41872k07424k05294k60464k19623j28942
$$ 16848417 16460032 16240597 16019461 15677589 15470165 15264871 15004407 14784784 14655842
4918A4655842k04642k34707j32115k00760j59722r2338J5751q4082j24224j56346
$$ 14655842 14451200 14216493 14084378 13883618 13723896 13631558 13647309 13563227 13439003 13282657
4908A3282657k4541P5367q9471m0569o0185J38916M9359P8605j8546Q8013K38923
$$ 13282657 13258116 13333483 13244012 13203443 13143258 13282174 13331533 13410138 13391592 13479605 13718528
4897A3718528J88671J31508J34514K05103L11186K00672J76432j6767r4206r8383
$$ 13718528 13907199 14038707 14173221 14378324 14689510 14890182 15066614 15049847 14955641 14857258
4887A4857258k83866m24616n24778l07545m90709l28115l53821m44750k33641
$$ 14857258 14573392 14148776 13623998 13316453 12825744 12497629 12143808 11699058 11465417
4878A1465417l05737k84296l35469j84631j61910k62640j48084k41623j30557
$$ 11465417 11159680 10875384 10539915 10355284 10193374 9930734 9782650 9541027 9410470
4869I410470j69386k54049j94473k36711m8988j57558j36025q9798j51733j02688
$$ 9410470 9241084 8987035 8792562 8555851 8506863 8349305 8213280 8123482 7971749 7869061
4859G869061j46950k2368j19978j463k27600j75599k3933L1952n2462r068J1097
$$ 7869061 7722111 7699743 7579765 7578302 7350702 7175103 7151170 7183122 7130660 7121592 7132689
4848G132689r5698r781l0613O5532j14354q926J3657j91314j34473o3160j15372
$$ 7132689 7036991 7027210 6996597 7062129 6947775 6938849 6952506 6761192 6626719 6563559 6448187
4837F448187m1959K3248M7992m6756j59126j14155n1615m0149J7260j23385Q986
$$ 6448187 6406228 6429476 6477468 6430712 6271586 6157431 6105816 6065667 6082927 5959542 5968528
4826E968528k6055j25762j20516p6446j8773j3065j31759j27539l4539N5335j14875
$$ 5968528 5942473 5816711 5696195 5619749 5600976 5587911 5456152 5328613 5294074 5349409 5234534
4815E234534j13968j01142N4043J15716j24041q1549Q9616M9105m3700J9704j8493
$$ 5234534 5120566 5019424 5073467 5189183 5065142 4983593 5073209 5122314 5078614 5098318 5079825
4804E079825N7992m1984q0725R0066J5608m9715r3938n403K3434m3136O5618J1805
$$ 5079825 5137817 5095833 5015108 5105174 5120782 5071067 4977129 4971726 4995160 4952024 5017642 5029447
4792E029447j09591j85825N2678l060q4523l6429j9527P361j82542l5847p5362
$$ 5029447 4919856 4734031 4786709 4783649 4699126 4662697 4643170 4650531 4467989 4432142 4356780
4781D356780p4213J1749j12133k5974P163M34j12258p988n2586n4502j05626j11615
$$ 4356780 4282567 4294316 4182183 4156209 4163372 4163806 4051548 4043560 3990974 3936472 3830846 3719231
4769C719231K3941n4513m7080M4789J2160l2263l8320k857r2328p1137O8756J12961
$$ 3719231 3743172 3688659 3641579 3686368 3698528 3666265 3627945 3625088 3532760 3461623 3530379 3643340
4757C643340j21904j02105J23381l8696m7647J288R095r713Q2911j59651m7563
$$ 3643340 3521436 3419331 3542712 3504016 3456369 3457657 3466752 3457039 3539950 3380299 3332736
4746C332736Q7898Q1085p4017K198o4496M5151l0599K087K8876j59115N7813l
$$ 3332736 3420634 3501719 3427702 3429900 3365404 3410555 3379956 3382043 3410919 3251804 3309617 3309614
4734C309614M9676p560k7085J7614k3889l5020m4156k5657J21261l2982j8700
$$ 3309614 3359290 3351730 3324645 3342259 3318370 3283350 3239194 3213537 3334798 3301816 3283116
4723C283116R7571l4511j34093j7295n3127l1833l0397K5459M9266o259O4801
$$ 3283116 3380687 3346176 3212083 3194788 3141661 3109828 3079431 3104890 3154156 3147897 3212698
4712C212698J31922p9485m3335n7212J3882J00930N6408Q8468q7456j17488J40091
$$ 3212698 3344620 3265135 3221800 3164588 3178470 3279400 3335808 3424276 3336820 3219332 3359423
4701C359423J02161j70360R4624K8841K5933n1097n8079J21720m7236j8573m9776
$$ 3359423 3461584 3291224 3385848 3414689 3440622 3389525 3331446 3453166 3405930 3387357 3337581
4690C337581R2584R080Q30J11016O1187m3594k462L7826R739k7620j01290J0714
$$ 3337581 3430165 3439245 3440075 3551091 3612278 3568684 3566222 3604048 3613787 3586167 3484877 3495591
4678C495591J01022k8279p1879K1818K5091n3518o3019l7425r727l0831j8615
$$ 3495591 3596613 3568334 3496455 3518273 3543364 3489846 3426827 3389402 3379675 3348844 3330229
4667C330229q4227m3642R4305k2339P1325l3948n8132l8747j13477N7953J31309
$$ 3330229 3246002 3202360 3296665 3274326 3345651 3311703 3253571 3214824 3101347 3159300 3290609
4656C290609l2792r2565n3400n0058k3410l2662n8094j5114j4398J1483m262q6156
$$ 3290609 3257817 3165252 3111852 3061794 3038384 3005722 2947628 2932514 2918116 2929599 2925337 2839181
4644B839181J06785l1109m474Q204n2209N8767p7924n4804o5414m6739j6041l1659
$$ 2839181 2945966 2914857 2910383 2918587 2866378 2925145 2847221 2792417 2727003 2680264 2664223 2632564
4632B632564K8543Q6680q1064Q8530N0514O7557k5267j15818J16732m6510q253
$$ 2632564 2661107 2747787 2666723 2755253 2805767 2873324 2848057 2732239 2848971 2802461 2794208
4621B794208K2148M761m2405q8690P7829M1010j5599j3401M1952O505r5443j21794
$$ 2794208 2816356 2821117 2778712 2690022 2767851 2808861 2793262 2779861 2821813 2828318 2732875 2611081
4609B611081L7516o2348j2578J3626m9199M293O4694k4616l4241R7889o8727k7032
$$ 2611081 2648597 2586249 2573671 2587297 2538098 2542391 2607085 2582469 2548228 2646117 2577390 2550358
4597B550358L251Q4076p819p8909Q260P1760q0463j9237J17364P4883J7272o4984
$$ 2550358 2553609 2637685 2629866 2550957 2559217 2630977 2550514 2531277 2648641 2723524 2740796 2675812
4585B675812m6232j7599l5541K4494q4756M7086O421J1227J9469k1942P6269k2961
$$ 2675812 2629580 2611981 2576440 2600934 2516178 2563264 2569685 2580912 2600381 2578439 2654708 2631747
4573B631747j70759j9084N2235j0198P6355q2287j7037R2740R9038M4428J1941
$$ 2631747 2460988 2441904 2494139 2483941 2560296 2478009 2460972 2553712 2652750 2697178 2709119
4562B709119R390J5664l6633k7694O8400l8519p0388M9121J19327n8042j48729
$$ 2709119 2718509 2734173 2697540 2669846 2738246 2699727 2629339 2678460 2797787 2739745 2591016
4551B591016Q1843K3372o4962l0737q249l6921M349l1313J30156J6338r7597K7369
$$ 2591016 2672859 2696231 2631269 2600532 2592283 2555362 2559711 2528398 2658554 2674892 2577295 2604664
4539B604664L3345k8593P6194Q4445p3154o691L8667k1619k4057K0536n2971j07120
$$ 2604664 2638009 2609416 2685610 2770055 2696901 2690210 2728877 2707258 2683201 2703737 2650766 2543646
4527B543646J776Q6361n986q5531P1617n7402q6106P532j6720j07673m5268L8180
$$ 2543646 2545422 2631783 2625797 2540266 2611883 2554481 2468375 2475907 2459187 2351514 2306246 2344426
4515B344426K7034N1822j45084L2062J01947o2708k3108P25P7407L6875m7107
$$ 2344426 2371460 2423282 2278198 2310260 2412207 2349499 2326391 2327116 2404523 2441398 2394291
4504B394291r057L0817R4569j32859j09272P0891J20117k3934j2757M9854n1603
$$ 2394291 2385234 2416051 2510620 2377761 2268489 2339380 2459497 2435563 2422806 2472660 2421057
4493B421057q9540J17232M1636m7700p7986o5483N5430N7992j05886k0050J46358
$$ 2421057 2331517 2448749 2490385 2442685 2364699 2299216 2354646 2412638 2306752 2286702 2433060
4482B433060Q146j03350P6273M3464K2039j2671O8422P4280j4494J022j42527
$$ 2433060 2441206 2337856 2414129 2457593 2479632 2466961 2535383 2609663 2595169 2596191 2453664
4471B453664J06276l003N5476n8944L238j07787j9196J91972N7262n8862o4654
$$ 2453664 2559940 2556937 2612413 2553469 2556707 2448920 2429724 2621696 2678958 2620096 2555442
4460B555442n7213r5052J41907o8724m1590P9246l6049K0999j532K8241j1985
$$ 2555442 2498229 2403177 2545084 2476360 2434770 2514016 2477967 2498966 2497434 2525675 2513690
4449B513690j6588P699j175N8490p9231l1137j3501M8347k3407J12335l7521J8407
$$ 2513690 2497102 2504801 2503626 2562116 2482885 2451748 2438247 2486594 2463187 2575522 2538001 2556408
4437B556408O7555l2802J02336M4133P2002K6591j26465K0260k4631l894k9110
$$ 2556408 2623963 2591161 2693497 2737630 2809632 2836223 2709758 2730018 2705387 2701493 2672383
4426B672383l8305Q8625o2631N0817r3352M4401P2595o624O5874K4490p3026P7410
$$ 2672383 2634078 2722703 2660072 2710889 2617537 2661938 2734533 2727909 2793783 2818273 2745247 2822657
4414B822657l4769p6988J37744N1672q9372q713o5270K1626O0089L9728P5182
$$ 2822657 2787888 2710900 2848644 2900316 2810944 2802231 2736961 2758587 2818676 2858404 2933586
4403B933586L0909J5162k6519J1291J07452M3154j17882m6297J2317N6727M6542
$$ 2933586 2964495 2979657 2953138 2964429 3071881 3115035 2997153 2950856 2963173 3019900 3066442
4392C066442O4096n8154M748o6791j06497J34791o3800J18015J3368j10733L7143
$$ 3066442 3130538 3072384 3077132 3010341 2903844 3038635 2974835 3092850 3106218 2995485 3032628
4381C032628P7069j41378j19185R4511p1296r2880o4826n1927N6869Q1581p4098
$$ 3032628 3109697 2968319 2849134 2943645 2872349 2779469 2714643 2662716 2719585 2801166 2727068
4370B727068m9697j1199J86596l4514j65227l216J30556o5900r1784Q9144O943
$$ 2727068 2677371 2666172 2852768 2818254 2653027 2649811 2780367 2714467 2622683 2711827 2718770
4359B718770J03126o0820K3144k0847N504r8440m0029Q8609O1273K0555j95945
$$ 2718770 2821896 2761076 2784220 2763373 2768877 2670437 2630408 2719017 2780290 2800845 2604900
4348B604900o735N0200Q1264m3446k4537l0470J21167J52223j8873r4667m4074
$$ 2604900 2598165 2648365 2729629 2686183 2661646 2631176 2752343 2904566 2885693 2791026 2746952
4337B746952o5090l5966K8202o3617J36285M0311q3321l2326n5919P0664L3237
$$ 2746952 2681862 2645896 2674098 2610481 2746766 2787077 2703756 2671430 2615511 2686175 2719412
4326B719412j71257n2686O1233Q423l2719M2Q1963K6380N160o3684J6013p56P8471
$$ 2719412 2548155 2495469 2556702 2565125 2532406 2532448 2614411 2640791 2645951 2582267 2598280 2597524 2675995
4313B675995j73353P897l6542L3868r441j23578J476m5793n2253J59791J965j40388
$$ 2675995 2502642 2510539 2473997 2507865 2498424 2374846 2376322 2330529 2278276 2438067 2440032 2299644
4301B299644J37369j19290J00652k9569o7462l1254p0114k0912N0696o0454q3142
$$ 2299644 2437013 2317723 2418375 2388806 2321344 2290090 2219976 2199064 2249760 2189306 2106164
4290B106164J0396K4807M3544j785o1084Q2280j17166j06615M7822p1741J46991
$$ 2106164 2116560 2141367 2184911 2183126 2122042 2204322 2087156 1980541 2028363 1956622 2103613
4279B103613K9891p7900j2580J00055n1849L6404j7332m9267k3917K3360K4497
$$ 2103613 2133504 2055604 2043024 2143079 2091230 2127634 2110302 2061035 2037118 2060478 2084975
4268B084975l2652J77107q8230p9732k4900p955J1622Q710m5286M7314R225j1373
$$ 2084975 2052323 2229430 2141200 2061468 2036568 2028613 2040235 2048945 2003659 2050973 2060198 2048825
4256B048825n853M4099J19267j19671K7399N6115r0974M0783J2829j11819p8471
$$ 2048825 2042972 2087071 2206338 2086667 2114066 2170181 2079207 2119990 2132819 2021000 1942529
4245A942529r139k1137Q6210j9184N1318J2376n0756J6551L9706k531P6675j03739
$$ 1942529 1933390 1912253 1998463 1979279 2030597 2042973 1992217 2008768 2048474 2045943 2122618 2018879
4233B018879n5081Q4713J17164M9368j61121n2592P4136L3256J797J1981q7935
$$ 2018879 1963798 2048511 2165675 2215043 2053922 2001330 2075466 2108722 2110519 2122500 2034565
4222B034565O9472o9778M0299Q3662J2726P0407K3743j1933L0901j9774m9241
$$ 2034565 2104037 2034259 2074558 2158220 2170946 2241353 2265096 2253163 2284064 2264290 2215049
4211B215049R0537m8434j09142K8705J29775l3552M5165J41356j18236j73988
$$ 2215049 2305586 2257152 2148010 2176715 2306490 2272938 2318103 2459459 2341223 2167235
4201B167235O9898P0528j7900m3072M5876P8807o0262j1064l8198K012R0182R759
$$ 2167235 2237133 2307661 2289761 2246689 2292565 2371372 2311110 2300046 2261848 2263860 2354042 2363801
4189B363801k38r84Q3180m0076K4171N3542n7417N1986n9223o7296j20102j0588
$$ 2363801 2363563 2362579 2445759 2405683 2429854 2483396 2425979 2477965 2418742 2351446 2231344 2220756
4177B220756J77474p522j1695j14574N4022R740J5114K9856p7432K9187J00654
$$ 2220756 2398230 2390708 2379013 2264439 2318461 2328201 2343315 2373171 2295739 2324926 2425580
4166B425580O2004j07501n7613J22581M7255o6373N1069o9621K4484q6901m067
$$ 2425580 2487584 2380083 2322470 2445051 2492306 2425933 2477002 2407381 2431865 2344964 2340897
4155B340897J2248P8502R745J09379l2930L1565k6889J8705k9074O0389p5552
$$ 2340897 2353145 2431647 2441392 2550771 2517841 2549406 2522517 2541222 2512148 2572537 2496985
4144B496985L8622Q6977k9116N2271j0330r2567M6779J24321j65405l1531O3655
$$ 2496985 2535607 2622584 2593468 2645739 2635409 2542842 2589621 2713942 2548537 2517006 2580661
4133B580661o5103o1651J80820l3666k4920M9787K0058M272J2864J17292O335
$$ 2580661 2515558 2453907 2634727 2601061 2576141 2625928 2645986 2650258 2663122 2780414 2786749
4122B786749j74420k2133J00361l5544M902J35108J3398L5283J6764j16778J6810
$$ 2786749 2612329 2590196 2690557 2655013 2659915 2795023 2808421 2843704 2860468 2743690 2760500
4111B760500Q5307q813L5147M8664m8989l2904M1119k5315M1069R6728J10339
$$ 2760500 2845807 2836994 2872141 2920805 2871816 2838912 2880031 2854716 2895785 2992513 3102852
4100C102852r2998l8288R3098l3246R4391L6380p7936O504P9192k2148p8507n923
$$ 3102852 3009854 2971566 3064664 3031418 3125809 3162189 3084253 3090757 3169949 3147801 3069294 3063371
4088C063371L8815o5417J8657J47977M4159j541j5718J08668j5529j8165J61883
$$ 3063371 3102186 3036769 3055426 3203403 3247562 3246021 3230303 3338971 3323442 3305277 3467160
4077C467160P9334n4518n2842j49108J45522J14537n1573P9071M3443p829j0652
$$ 3467160 3546494 3491976 3439134 3290026 3435548 3550085 3498512 3577583 3621026 3613197 3602545
4066C602545R6988o8762j87087J36486J11688l2199k1392K3780O9495J04867J3655
$$ 3602545 3699533 3630771 3443684 3580170 3691858 3659659 3638267 3662047 3731542 3836409 3850064
4055C850064k6162J40487K24991K6759Q2534N8628J08543K08823L8588K19595
$$ 3850064 3823902 3964389 4189380 4216139 4298673 4357301 4465844 4674667 4713255 4932850
4045D932850J80805J63381O9326P7943K60222j33442k1605K9447J3905k9556R0695
$$ 4932850 5113655 5277036 5346362 5424305 5684527 5551085 5529480 5558927 5572832 5543276 5633971
4034E633971Q9937m057J69851J52053J04738J40158J63826Q4286J5255Q9201K1629
$$ 5633971 5723908 5719851 5889702 6041755 6146493 6286651 6450477 6534763 6550018 6639219 6660848
4023F660848J4679P7449J40781Q2384J05967J26142K26740L58524K01085J50135
$$ 6660848 6675527 6752976 6893757 6976141 7082108 7208250 7434990 7793514 7994599 8144734
4013H144734r795M9387L0478k07521k85030k76307k60460k35281o3887j24629
$$ 8144734 8134939 8184326 8214804 8007283 7722253 7445946 7185486 6950205 6886318 6761689
4003F761689j08321J1409r8256o6686j02111l2923j49597j14601j84865l2900
$$ 6761689 6653368 6664777 6566521 6499835 6397724 6364801 6215204 6100603 5915738 5882838
3993E882838r4751j64981m3846j12607j10255k2108l2936j5401k21506J8894l5624
$$ 5882838 5788087 5623106 5579260 5466653 5356398 5334290 5301354 5285953 5064447 5083341 5047717
3982E047717J413j78732j58874q5629j18288n9026q2508l0732p1640k40032r7655
$$ 5047717 5049130 4870398 4711524 4625895 4507607 4448581 4366073 4335341 4263701 4023669 3926014
3971C926014m9633j77078k6917p395p6326j46339m9399Q7497M9110k3604o4803
$$ 3926014 3876381 3699303 3672386 3664991 3588665 3442326 3392927 3480424 3529534 3505930 3441127
3960C441127j31775N9915j1928J6828m2379r427j856L7530P247N5349n9299M9495
$$ 3441127 3309352 3369267 3357339 3374167 3331788 3322361 3320505 3358035 3365282 3420631 3361332 3410827
3948C410827l5100j43195m9726J3895r426J05571L1885j5160l0658N4822P117
$$ 3410827 3375727 3232532 3182806 3196701 3187275 3292846 3324731 3309571 3278913 3333735 3340852
3937C340852K8291Q7912N184K2365M362J0872M5207Q0551k2646O2764k7103P289
$$ 3340852 3369143 3457055 3462239 3484604 3488966 3499838 3545045 3625596 3602950 3665714 3638611 3645900
3925C645900j32683J4120P0971J9327n1l5601j8537K3230L8642O3418K2381N4101
$$ 3645900 3513217 3527337 3598308 3617635 3617584 3581983 3563446 3586676 3625318 3688736 3711117 3765218
3913C765218J7069k0839m6620o5289J6669R1155p1431P99J17243k3992K2484N037
$$ 3765218 3782287 3761448 3714828 3649539 3666208 3757363 3685932 3686731 3803974 3779982 3802466 3807503
3901C807503P9147p9265J0940P633j68453O0284J84457j39630j02528k5642p2609
$$ 3807503 3886650 3807385 3818325 3825958 3657505 3717789 3902246 3762616 3660088 3634446 3561837
3890C561837q2585J19724J01128L3079q872o9171n8371n826K1322r204Q0149n3896
$$ 3561837 3479252 3598976 3700104 3733183 3724311 3655140 3596769 3590943 3612265 3603061 3683210 3629314
3878C629314o8169l0957m4707o2749Q6661m3798j137l2535p386R5768M8371k3861
$$ 3629314 3561145 3530188 3485481 3422732 3509393 3465595 3464458 3431923 3424537 3520305 3568676 3544815
3866C544815j01015L5445J06014J03298j33059q7069k1408p3665J1592R800o5916
$$ 3544815 3443800 3479245 3585259 3688557 3555498 3468429 3447021 3373356 3384948 3394748 3328832
3855C328832n8231K1635Q892L0196o6025K244j09344j12328N9272L2592l6307
$$ 3328832 3270601 3292236 3301128 3331324 3265299 3267543 3158199 3045871 3105143 3137735 3101428
3844C101428L561M4354K9399l8452K0452n913j5402P7623l8653n2050R6264K507
$$ 3101428 3104989 3149343 3178742 3140290 3160742 3154829 3139427 3217050 3178397 3126347 3222611 3225118
3832C225118j04310q289j2894R6910R2053Q4080k0401J9253j41939J7508O5013
$$ 3225118 3120808 3112519 3099625 3196535 3288588 3372668 3352267 3371520 3229581 3247089 3312102
3821C312102o223L2138P2720J6230Q58O1179Q9593J4613j6906l847n3306R4994
$$ 3312102 3305879 3338017 3410737 3426967 3427825 3489004 3578597 3593210 3576304 3572457 3519151 3614145
3809C614145p1952J09636K0347n0372L9271q189J19712P1349j04062r0329j00566
$$ 3614145 3542193 3651829 3672176 3621804 3661075 3652886 3772598 3843947 3739885 3649556 3548990
3798C548990J153j3030J00950J0874m4218n91m1339N3964k9438N5049q3767r3685
$$ 3548990 3550143 3537113 3638063 3648937 3604719 3604128 3562789 3616753 3587315 3642364 3558597 3464912
3786C464912l3332J8989J21588r3028q8503n1970k7030J13107q7981Q9751o0996
$$ 3464912 3431580 3450569 3572157 3479129 3390626 3338656 3311626 3424733 3336752 3426503 3365507
3775C365507k0861o7284l4312R9638m05J9158J14925L0809j04081P0646J07673
$$ 3365507 3344646 3277362 3243050 3342688 3342283 3361441 3476366 3507175 3403094 3473740 3581413
3764C581413k1264l6796q3146M3122j609p289l0679p6216Q1125p2512K152K6100
$$ 3581413 3560149 3523353 3440207 3483329 3481720 3474431 3443752 3367536 3448661 3376149 3378301 3404401
3752C404401J29843M1424o9031j60774k73N7666M3772q5508m3224k2597r7184
$$ 3404401 3534244 3575668 3506637 3345863 3345590 3403256 3447028 3361520 3318296 3295699 3198515
3741C198515K4583K1990L3858k0859o6610j01580M9130k3254L5642Q1078p7509
$$ 3198515 3223098 3245088 3278946 3258087 3191477 3089897 3139027 3115773 3151415 3232493 3154984
3730C154984J7037l9530k1555m7729p9636l6625R3037M0306p9860M4440j12741
$$ 3154984 3172021 3132491 3110936 3063207 2983571 2946946 3039983 3080289 3000429 3044869 2932128
3719B932128M9052P4382j43424O4749Q6834m2187p4522Q8130p0815j00704N5316
$$ 2932128 2981180 3055562 2912138 2976887 3063721 3021534 2947012 3035142 2964327 2863623 2918939
3708B918939J9179L2805k57047j4505M0094M2854q5567M5420Q0101j98378K0776
$$ 2918939 2938118 2970923 2713876 2699371 2739465 2782319 2696752 2742172 2822273 2623895 2644671
3697B644671l8035r2266L0597J12061k7050r0123p4409J5030P2051N063N7405
$$ 2644671 2606636 2514370 2544967 2657028 2629978 2539855 2465446 2480476 2552527 2557590 2614995
3686B614995p8158q3769P2108q8962L0175J3332l5055j7119K7739k6820N3781
$$ 2614995 2536837 2453068 2525176 2436214 2466389 2479721 2444666 2427547 2455286 2428466 2482247
3675B482247J9063L7980q6434m6168p7676O7342M7886l2802J2323p4669n4004
$$ 2482247 2501310 2539290 2452856 2406688 2329012 2396354 2444240 2411438 2423761 2349092 2295088
3664B295088Q5918J7280m7052J5540m2020N8862Q7982K0672o5787j319P5436p5511
$$ 2295088 2381006 2398286 2351234 2366774 2324754 2383616 2471598 2492270 2426483 2425164 2500600 2425089
3652B425089j05314L8222N2681q274k9744j15740J32768J00470q0441j1027k5262
$$ 2425089 2319775 2357997 2410678 2402404 2372660 2256920 2389688 2490158 2409717 2398690 2373428
3641B373428J7960n195Q8127J6667J05965p5667l8568Q508n9569J06589L3083
$$ 2373428 2391388 2386193 2474320 2490987 2596952 2521285 2482717 2491225 2431656 2538245 2571328
3630B571328j04086k8021K1158k6624j08207L6806K087J22221K2744l8188Q8664
$$ 2571328 2467242 2439221 2460379 2433755 2325548 2362354 2364441 2486662 2509406 2471218 2559882
3619B559882J1863n9631k9518J05321k4157R397J58630P3371r6982q5799L7073
$$ 2559882 2571745 2512114 2482596 2587917 2563760 2573157 2731787 2805158 2708176 2622377 2659450
3608B659450J4041M4949M1387P7980j6900P163j2415k9056R0550Q861J15767l5508
$$ 2659450 2673491 2718440 2759827 2837807 2820907 2828070 2815655 2786599 2877149 2886010 3001777 2966269
3596B966269o3212J19142L3487Q8038J8217r8011K0690M7198N4727J0060r115
$$ 2966269 2903057 3022199 3055686 3143724 3161941 3063930 3084620 3131818 3186545 3196605 3187490
3585C187490N2372l6684L7759J26403K9214K4890N1276N1854J78335k8661J8374
$$ 3187490 3239862 3203178 3240937 3367340 3396554 3421444 3472720 3524574 3702909 3674248 3692622
3574C692622L1648N6363J04478M8350O784P5591P6669P3396N3055J60415M2563
$$ 3692622 3724270 3780633 3885111 3933461 3940245 4015836 4092505 4165901 4218956 4379371 4421934
3563D421934R2536l8870k0297J01063J73815J26433P5219J39625N7390o147J9169
$$ 4421934 4514470 4475600 4455303 4556366 4730181 4856614 4931833 5071458 5128848 5122701 5141870
3552E141870M0915J05363J16155O5526R6463O2919J38530P2457J12850J17296
$$ 5141870 5182785 5288148 5404303 5469829 5566292 5629211 5767741 5840198 5953048 6070344
3542F070344J21222J55166J86707k6991O7788J56840K2985P4372J48384J90799
$$ 6070344 6191566 6346732 6533439 6506448 6574236 6731076 6754061 6828433 6976817 7167616
3532G167616J38296L6262J11868J75664K42497J70678J59043J49195J76713J34354
$$ 7167616 7305912 7342174 7454042 7629706 7872203 8042881 8201924 8351119 8527832 8662186
3522H662186J45460J05454K88018Q2037J57376J09895O9088K66844L16168J26010
$$ 8662186 8807646 8913100 9201118 9283155 9440531 9550426 9619514 9886358 10202526 10328536
3512A0328536J90169J10946J85208L12696K18523K63292K26657K08328K74284
$$ 10328536 10518705 10629651 10814859 11127555 11346078 11609370 11836027 12044355 12318639
3503A2318639L39570K68471L26146L05213L22291L58136L65715M15601M73375
$$ 12318639 12658209 12926680 13252826 13558039 13880330 14238466 14604181 15019782 15493157
3494A5493157N23544M82650O00366O65301P86851O05406P36746Q27403Q76241
$$ 15493157 16016701 16499351 17099717 17765018 18551869 19157275 19894021 20721424 21597665
3485B1597665R65593R91293J125624J052101J120762J111453R75378R46426R18169
$$ 21597665 22563258 23554551 24680175 25732276 26853038 27964491 28939869 29886295 30804464
3476C0804464O04413M62788L17852J70273k944r7057l06132m20691n11245n89352
$$ 30804464 31408877 31871665 32189517 32359790 32356846 32259789 31953657 31532966 31021721 30432369
3466C0432369o18191p02615o66595m75890m58571l62384k92773l33790n21136
$$ 30432369 29814178 29111563 28444968 27969078 27510507 27148123 26855350 26521560 26000424
3457B6000424q64837j010105j128038j158316r71235r27012r10614p16275o48506
$$ 26000424 25135587 24125482 22997444 21839128 20867893 19940881 19030267 18313992 17665486
3448A7665486n76951n01168m38942m51065m46379k06804l48341j88621M749j7836
$$ 17665486 17088535 16587367 16148425 15697360 15250981 15044177 14695836 14507215 14511964 14494128
3438A4494128R1184J27387M9638K16876M48991O26261P22146P85491J150004J200412
$$ 14494128 14585312 14712699 14762337 14979213 15428204 16054465 16776611 17562102 18712106 19912518
3428A9912518J083393P63457R0233m59526r65622j382003j424042j411890j107359
$$ 19912518 20995911 21759368 21849601 21390075 20424453 19042450 17618408 16206518 15099159
3419A5099159j045041j056961p04804n88967m36843m72858m12759l50086l53105
$$ 15099159 14054118 12997157 12292353 11703386 11266543 10793685 10380926 10030840 9677735
3410I677735k11127k54229q7827j43258j14563p6146n9753J06000J91415J53516
$$ 9677735 9466608 9212379 9124552 8981294 8866731 8790585 8730832 8836832 9028247 9181763
3400I181763K66748L46915L16640L76261M00298L08241j4828k10946n08402o64723
$$ 9181763 9448511 9795426 10112066 10488327 10888625 11196866 11182038 10971092 10462690 9797967
3390I797967q20182o68683n32990n52114n37440m06047l89286j82626k75273k37689
$$ 9797967 8977785 8309102 7776112 7223998 6686558 6280511 5891225 5708599 5433326 5195637
3380E195637j74427j40893j62368j31400k14762j22066k6374k09308j17560j7300
$$ 5195637 5021210 4880317 4717949 4586549 4371787 4249721 4223347 4014039 3896479 3879179
3370C879179o3659p5331m0947O0151n4994j31109o0673j39470q5575j70962K097
$$ 3879179 3815520 3740189 3699242 3759393 3704399 3573290 3512617 3373147 3287572 3116610 3118707
3359C118707j4478J424j23443j01123P2474q6064r8818p5186N2336l660L5823
$$ 3118707 3104229 3105653 2982210 2881087 2953561 2867497 2768679 2693493 2745829 2742169 2777992
3348B777992m8475k0703j42109j89805O8076M4553l5792n6504n2283j53016q3541
$$ 2777992 2729517 2708814 2566705 2376900 2444976 2489529 2453737 2397233 2344950 2191934 2108393
3337B108393N3001R7769k6972N1683P334p3192k4767M7097j50870n9809m3239
$$ 2108393 2161394 2259163 2232191 2283874 2291208 2218016 2193249 2240346 2089476 2029667 1986428
3326A986428m9587O8976k79m0200m9418J5890j1375n687J451l2185K9174J0182
$$ 1986428 1936841 2005817 2005538 1965338 1915920 1931810 1920435 1914748 1916199 1884014 1913188 1923370
3314A923370j30253j02519J5711P2041M7457j9749m2556M9906j22782n1221M3855
$$ 1923370 1793117 1690598 1706309 1778350 1825807 1806058 1763502 1813408 1690626 1639405 1683260
3303A683260o8661m7582P7841l9653q215M6571n8359k4139r739O8914k7370n911
$$ 1683260 1614599 1567017 1644858 1605205 1596990 1643561 1585202 1561063 1551324 1620238 1592868 1586957
3291A586957j99345Q3427K9002J07431j21587Q4239L5692r8241l2694K4906J3373
$$ 1586957 1387612 1471039 1500041 1607472 1485885 1570124 1605816 1507575 1474881 1499787 1513160
3280A513160j0757J4322j98092l2650J32811R24J02620N9309r7203j13456k4911
$$ 1513160 1502403 1516725 1318633 1285983 1418794 1419718 1522338 1581647 1484444 1370988 1346077
3269A346077j377K6906J42147p4220j5663q2639L1749P8372K2198m9592n9069
$$ 1346077 1344700 1371606 1513753 1439533 1423870 1341231 1372980 1451352 1473550 1423958 1364889
3258A364889J5745q8658N4408J6968l8666P7777p121j5820N4490N201O9520K0379
$$ 1364889 1380634 1291976 1346384 1363352 1324686 1402463 1395342 1379522 1434012 1439213 1508733 1529112
3246A529112j06647k1298L4811n1599j6602P9492r0882l589J16913Q0581r2261
$$ 1529112 1422465 1401167 1435978 1384379 1367777 1447269 1356387 1352798 1469711 1550292 1458031
3235A458031j08L197J26987J6744K1492n7091l2523R062l946N4280L4859J00475
$$ 1458031 1457923 1461120 1588107 1604851 1626343 1569252 1536729 1545791 1541845 1596125 1630984 1731459
3223A731459J02318J10526L8533m2778j1666m8225j7258p9835J07931R5944r0848
$$ 1731459 1833777 1944303 1982836 1940058 1928392 1880167 1862909 1783074 1891005 1986949 1896101
3212A896101o756N5377j3347M9292J47077L9131r1374n5534p1314P5659O3421
$$ 1896101 1889345 1944722 1931375 1980667 2127744 2166875 2075501 2019967 1948653 2024312 2087733
3201B087733j42522M2832J00460J5604k3661R8436L1055j5799P6818L5675P3568
$$ 2087733 1945211 1988043 2088503 2104107 2080446 2178882 2209937 2194138 2270956 2306631 2380199
3190B380199R2940J59876R5866J15448J1887j06922r5987j918l8202P6330j3643
$$ 2380199 2473139 2633015 2728881 2844329 2856216 2749294 2653307 2651389 2613187 2689517 2675874
3179B675874M8332J60200Q1250Q9584Q3856n3406J7423M7792J8169R8103p004
$$ 2675874 2724206 2884406 2965656 3055240 3139096 3085690 3103113 3150905 3169074 3267177 3260173
3168C260173n5310Q2710l552l4468O6171J7716N258n7664R8439l3917N2623j8170
$$ 3260173 3204863 3287573 3284021 3249553 3315724 3333440 3338698 3281034 3379473 3345556 3398179 3380009
3156C380009Q723Q6399o4261L7841J1054J6374K5231P7244N1388M3506L0195J22238
$$ 3380009 3388732 3475131 3410870 3448711 3459765 3476139 3501370 3578614 3630002 3673508 3703703 3825941
3144C825941J84440P6010J41350J57292J97051R6615K7279j47236k12152l31500
$$ 3825941 4010381 4086391 4227741 4385033 4582084 4678699 4705978 4558742 4346590 4015090
3134D015090k59226j75260j78021j66228j07102p4535p7180n6941J3145j24001
$$ 4015090 3755864 3580604 3402583 3236355 3129253 3054718 2977538 2920597 2933742 2809741
3124B809741n4961j4035r8610N6843n0914j41993R7450J11697L6960K2187m442
$$ 2809741 2754780 2740745 2642135 2698978 2648064 2506071 2603521 2715218 2752178 2774365 2769923
3113B769923k733o996J6251K1078l2154L0424j31396j38318p8445K8835j20706
$$ 2769923 2767190 2760194 2776445 2797523 2765369 2795793 2664397 2526079 2447634 2476469 2355763
3102B355763j7061p9272m4878j00125j33742L6926j35030k55659l8491J7869J3692
$$ 2355763 2338702 2259430 2214552 2114427 1980685 2017611 1882581 1626922 1588431 1606300 1619992
3091A619992N763j25853p3865j0162q987j3171O537p8155n8420n3926l0423J0301
$$ 1619992 1625755 1499902 1426037 1415875 1406888 1393717 1400254 1322099 1263679 1209753 1179330 1189631
3079A189631q7679p1603n6761K0705l3226n5766J05053l4526L4615n5229J5032
$$ 1189631 1101952 1030349 973588 994293 961067 905301 1010354 975828 1010443 955214 970246
3068I70246m9083m1877P174K0763L29m0119j05405j4676N3942R583q4315r6248
$$ 970246 921163 879286 886460 907223 907552 867433 762028 747352 801294 810877 726562 630314
3056F30314J21988O601m2525J0929j81577k433Q9129M5103l6732m8349L0436J988
$$ 630314 752302 758903 716378 727307 545730 543297 632426 677529 640797 592448 622884 624872
3044F24872P046L3635n2772L9000N5956m2774m8388k4561o5449q7805n0640N0436
$$ 624872 631918 665553 612781 651781 707737 664963 616575 592014 526565 438760 388120 438556
3032D38556K4853m091j5939m5783J5356O3024L6980R2837M285p3397m2277P1085
$$ 438556 463409 459318 443379 397596 412952 475976 512956 605793 610078 536681 494404 565489
3020E65489j28924L1666O8779m4213m0648j09698L6343J41173o1694o1636R452
$$ 565489 436565 468231 537010 492797 452149 342451 378794 519967 458273 396637 406089
3009D06089K936J09140j32780j9635o8353K1683J08307J0634m9771L4793N0488
$$ 406089 409025 518165 385385 365750 297397 319080 427387 438021 388250 423043 473531
2998D73531p9690j0350q8523p959j8996m4359J17048L3909j5826Q1472l3207n8845
$$ 473531 393841 383491 294968 287009 268013 223654 340702 374611 358785 440257 407050 348205
2986C48205p7458n095N9072N5745l853n5602J8547J0238K065n9619p9059J1374
$$ 348205 270747 265652 324724 380469 376616 321014 339561 349799 351864 292245 213186 224560
2974B24560p8153O7168J32063r8193O183l8589J8911N0276N9160q2571m5828K3757
$$ 224560 146407 213575 345638 247445 253628 215039 233950 284226 343386 260815 214987 238744
2962B38744P3380p7469M9839K6586J45382j6864j46740O5358Q300J5205j2787
$$ 238744 312124 234655 284494 311080 456462 439598 292858 358216 366516 381721 368934
2951C68934n1675n6755K041k6789n5465J960K0250n0633J05704n9604j8770J12523
$$ 368934 317259 260504 262545 235756 180291 182251 202501 151868 257572 197968 179198 291721
2939B91721J8251m3638r781L27l1579Q8374k3055O524l5735l7119r7679K004J1783
$$ 291721 309972 266334 256553 256880 225301 313675 290620 297144 261409 224290 126611 128615 140398
2926A40398J06321l6812p3465Q0278N8022p1649r8833N1638m3637L4626n6377
$$ 140398 246719 209907 136442 216720 274742 203093 104260 155898 112261 146887 90510
2915I0510O071r788P0635r8063P1940N9920J9595j755r861j41026L5615K7313
$$ 90510 96581 86793 157428 59365 131305 191225 210820 209065 199204 58178 93793 121106
2903A21106O8507M2327p2328p352j28142J3863n3798K9603J45182L6073R6002
$$ 121106 189613 231940 159612 152260 24118 37981 -15817 13786 158968 195041 291043
2892B91043J0697r6310l876k3345J26093j9742q1456k6262J9198o703l148q6438
$$ 291043 301740 205430 201554 178209 304302 284560 203104 176842 196040 189337 186189 99751
2880I9751L7147j4515L8694J9108J06995p4207p6249O8344J17040j6846j08001
$$ 99751 136898 122383 161077 180185 287180 212973 136724 205068 322108 305262 197261
2869A97261l493M6127J725k7054r3775j1364m9451m462Q4692n6202K4520n1630
$$ 197261 193768 239895 241620 214566 120791 109427 59976 55514 140206 84004 108524 56894
2857E6894N5982l019l5571K7667Q3884L9197J4676l293l6072r3121O5103l385
$$ 56894 112876 109857 74286 101953 185837 225034 239710 236417 200345 107224 172327 168942
2845A68942j90027L1741j3133o2455M6390J186m560K7855O1029r305J25274m3498
$$ 168942 -21085 10656 -2477 -64932 -18542 -17356 -21916 5939 66968 57663 182937 139439
2833A39439k4197l0712l4074J7529K1689K2401Q4690L241r2498p3020Q9039j01031
$$ 139439 115242 84530 50456 67985 89674 112075 196765 200006 107508 34488 123527 22496
2821B2496m2192Q9858j9701j7618J39764j4277n7899K2443m7603o311k3387m2520
$$ 22496 -19696 70162 50461 32843 172607 158330 100431 122874 75271 68960 45573 3053
2809C053r439J06547o6019K0309O6553J2797j14307p305m0784L8752q1183R2364
$$ 3053 -6386 100161 34142 54451 121004 133801 19494 12189 -28595 10157 -71026 21338
2797B1338O3052k8244j48q3550j0684L3027M8205N6663N1024j10929K3954Q7086
$$ 21338 84390 56146 55998 -27552 -38236 -5209 42996 99659 150683 39754 63708 150794
2785A50794k7773m7894J03691j06483n9730K8536l8913L9653Q6588J6045K933
$$ 150794 123021 75127 178818 72335 12605 41141 2228 41881 128469 144514 147447
2774A47447q2363l5078M8494m1381J2597M3474J5120q2514N4803L6816p3178p2360
$$ 147447 65084 30006 78500 37119 49716 93190 108310 25796 80599 117415 44237 -28123
2762b8123N2186J2003p9984M2700j25719M3621J17132L3780k4914Q4199K2777
$$ -28123 24063 36066 -43918 -1218 -126937 -83316 33816 67596 42682 126881 149658
2751A49658j631j3955j56660J8052k9962K2607P8540m1586J6098O6307Q773N5470
$$ 149658 148027 134072 -22588 -4536 -34498 -11891 66649 25063 41161 107468 116241 171711
2739A71711n7349n012j08444m994r393j7268m9285j8583J36838k5302j38728K9719
$$ 171711 114362 109350 906 -4088 -13481 -30749 -80034 -98617 38221 12919 -125809 -96090
2727i6090N4390l4555K10540n9101o9993O8741n4707o4339l104k8630O970N8322
$$ -96090 -41700 -76255 134285 75184 5191 73932 19225 -45114 -48218 -76848 -69878 -11556
2715a1556m6486Q4886J5013O414k563M0111J7371j31658j14901M9159N0334R6822
$$ -11556 -58042 26844 41857 48271 45708 85819 103190 -28468 -143369 -94210 -43876 52946
2703E2946m9828m1496M9814K6454k6833R8025q3257O9006J23964j76578k0069
$$ 52946 3118 -38378 11436 37890 11057 109082 25825 94831 218795 42217 22148
2692B2148M5459m4030l0279N0580j00455j7733L5960R5420r380M1955r5498M490
$$ 22148 67607 23577 -6702 43878 -56577 -74310 -38350 57070 47690 89645 -5853 -1363
2680a363J7592n9325L6997l7394J76428L3363l7310m2827n293J9196j04787j6485
$$ -1363 16229 -43096 -6099 -43493 132935 166298 128988 86161 80868 100064 -4723 -21208
2668b1208Q1306J5905J17594q3454j15280L0226o004j0075p5930J19532K0851
$$ -21208 60098 76003 193597 110143 -5137 25089 19085 9010 -66920 52612 73463
2657G3463l1601l1795Q6817J8013j4400n5471n8799O3434P2123l8535r9257o0446
$$ 73463 41862 10067 96884 114897 100497 45026 -13773 49661 121784 83249 -16008 -76454
2645g6454N9296K1455L8175q002M2939K985L2390j4502o3865o2582P8737K687
$$ -76454 -17158 4297 42472 34470 77409 80394 112784 98282 34417 -28165 50572 53259
2633E3259q8860Q5457J5223k2537o5311R1268J23295l9833l8861n4709k0486J07139
$$ 53259 -35601 49856 65079 42542 -22769 68499 191794 151961 113100 58391 37905 145044
2621A45044J8231l0537j61847Q2366J82895R7508j09316m2457M8442q7772k3725
$$ 145044 163275 132738 -29109 53257 236152 333660 224344 181887 230329 142557 118832
2610A18832m7249l4927l0187j31033L0914R0240J4571j1063l464o4298N3203J85116
$$ 118832 71583 36656 6469 -124564 -93650 -3410 11161 98 -3366 -67664 -14461 170655
2598A70655J8080j21157k5091o4224q7366k2007K9949J26718J7402N0766k0085
$$ 170655 188735 67578 42487 -21737 -109103 -131110 -101161 25557 42959 93725 73640
2587G3640J2098J4184o0019Q483k3959j8506M8046q2251R729k2237n5080j7895
$$ 73640 85738 99922 39903 48386 24427 5921 53967 -28284 -18555 -40792 -95872 -113767
2575a13767R4022L2401M1954J7112K9334l0801q6054n2456J20710L4757o7631
$$ -113767 -19745 12656 54610 71722 101056 70255 -15799 -68255 52455 87212 19581
2564A9581N308K9519k8896q0229Q1117k1827L0519q9070k6448n9083J07989K1380
$$ 19581 24889 54408 25512 -54717 26400 4573 35092 -53978 -80426 -139509 -31520 -10140
2552a0140p3487J02911J2563L60l0790p4614L1500k6911k9942K4586P1336L88
$$ -10140 -83627 19284 31847 32207 1417 -73197 -41697 -68608 -98550 -73964 -2628 -2240
2540b240K1842l3501J708J27376q0078r7444Q9935J13512j74173r3711O046l6990
$$ -2240 19602 -13899 -12191 115185 35107 -62337 27598 141110 -33063 -126774 -120728 -157718
2528a57718P4437K0478K0559Q246k3501j10423N856R9954m1864k8502Q8107R5235
$$ -157718 -83281 -62803 -42244 -33998 -57499 -167922 -162066 -62112 -103976 -132478 -44371 50864
2516E0864k6793J1535p4594Q6533N10p8506Q7813l3416Q9173Q1786j28080m9372
$$ 50864 24071 35606 -38988 47545 48055 -30451 57362 23946 113119 194905 66825 17453
2504A7453J7774Q8915J8868j3731L7826r5114o6438k8285J23023m2225n718m6107
$$ 17453 35227 124142 143010 129279 167105 71991 5553 -22732 100291 58066 52348 6241
2492F241o1557J6219J15715L3471m5626m3234m9238Q1473n1198M0375L3881n7076
$$ 6241 -55316 -39097 76618 110089 64463 21229 -28009 53464 2266 42641 76522 19446
2480A9446K3410J35990o6241j21402J554K7596n955k0720M3518J395j8078N5730
$$ 19446 42856 178846 112605 -8797 -7243 20353 14398 -6322 37196 38591 20513 76243
2468G6243O968l430J00831k381k8025P524n200J439J73346r0694j03006p5272
$$ 76243 83211 79781 180612 178231 150206 157730 152530 153969 327315 236621 133615 58343
2456E8343k8142J22342N441N8002M4536o5560q9871J5813L0360J8282J24266P1974
$$ 58343 30201 152543 157984 215986 260522 194962 105091 120904 151264 169546 293812 365786
2444C65786q6488j2709j00775J06580R5578L1057N7159K6323O615j29345L9102
$$ 365786 279298 266589 165814 272394 367972 399029 456188 482511 489126 359781 398883
2433C98883R8662j09072M7933L5237N1306r1952R73R860J29409R2653n9499p6847
$$ 398883 497545 388473 436406 471643 522949 430997 431970 441830 571239 663892 604393 527546
2421E27546J4177r293k5331O9070J29151K9419m012J5215j30532L8438N3105J6096
$$ 527546 541723 532430 507099 576169 705320 734739 730727 745942 615410 653848 706953 723049
2409G23049K1262n4549N0047k5585L6958j0536K1527J33295J9175Q9305o6208
$$ 723049 744311 689762 739809 714224 751182 740646 762173 895468 914643 1003948 937740
2398I37740J89007j5183N771m607J03829O1770k8726Q2553K799P7827N177O7715
$$ 937740 1126747 1111564 1117335 1112728 1216557 1278327 1249601 1332154 1334953 1412780 1417957 1485672
$$ [...]
##END NTUPLES=NMR SPECTRUM
##END=
