##TITLE=1H_EC-3319(1)
 CDCl3
 8 sc, 
 6.3.2024
##JCAMPDX= 6.0         $$ Bruker NMR JCAMP-DX V2.0
##DATA TYPE= NMR SPECTRUM
##DATA CLASS= NTUPLES
##ORIGIN= UXNMR, Bruker Analytische Messtechnik GmbH
##OWNER= root
$$ XWIN-NMR		Version 3.5
$$ Wed Mar  6 17:12:30 2024 Russian Standard Time (UT+4h)  she@DPX200
##.OBSERVE FREQUENCY= 200.1313
##.OBSERVE NUCLEUS= ^1H
##.ACQUISITION MODE= SIMULTANEOUS
##.ACQUISITION SCHEME= undefined
##.AVERAGES= 8
##.DIGITISER RES= 18
##SPECTROMETER/DATA SYSTEM= spect
##.PULSE SEQUENCE= zg30
##.SOLVENT NAME= CDCl3
##.SHIFT REFERENCE= (INTERNAL, CDCl3, 0, 15.4307)
##AUDIT TRAIL= $$ (NUMBER, WHEN, WHO, WHERE, WHAT)
$$ ##TITLE= Audit trail, XWIN-NMR		Version 3.5
$$ ##JCAMPDX= 5.01
$$ ##ORIGIN= Bruker BioSpin GmbH
$$ ##OWNER= she
$$ F:/spectra/data/she/nmr/H-F/1/pdata/1/auditp.txt
$$ ##AUDIT TRAIL=  $$ (NUMBER, WHEN, WHO, WHERE, WHAT)
(   1,<2024-03-06 17:11:13.03 +0400>,<she>,<DPX200>,
      <created by zg, POWCHK disabled, PULCHK disabled
       configuration hash MD5:
       00 E9 B6 7A A2 85 ED C7 34 08 36 98 17 FE 4E 26
       data hash MD5: 16K
       58 F8 AB E8 31 B6 DF B5 B6 C0 D0 F5 F2 33 57 BE>)
(   2,<2024-03-06 17:11:15.95 +0400>,<she>,<DPX200>,
      <Start of raw data processing
       efp BC_mod = 2 LB = 0.24 FT_mod = 6 PKNL = 1 PHC0 = -24949.34 PHC1 = 20.38731 SI = 16K 
       data hash MD5: 16K
       10 49 EF BC 8E 8A 96 61 A1 2C 2E D7 E6 6D E0 1F>)
(   3,<2024-03-06 17:11:35.28 +0400>,<she>,<DPX200>,
      <pk PHC0 = -0.01074974 PHC1 = -1.4 
       data hash MD5: 16K
       A1 90 10 98 6E E0 95 AF 3B 62 18 76 8E 43 4C BA>)
(   4,<2024-03-06 17:11:38.87 +0400>,<she>,<DPX200>,
      <abs ABSG = 5 
       data hash MD5: 16K
       E4 69 A8 8A 65 44 2B 28 D0 8E A6 76 C2 D7 39 C7>)
$$ ##END=
$$ 
$$ hash MD5
$$ 94 4B C7 E3 4E 28 4A 03 5E 52 AE D4 54 11 76 4D
##$RELAX= 
##$RELAX= 
##$RELAX= 
##$RELAX= 
##$RELAX= 
##$RELAX= 
$$ Bruker specific parameters
$$ --------------------------
##$DU= <F:/spectra>
##$EXPNO= 1
##$NAME= <H-F>
##$PROCNO= 1
##$TYPE= <nmr>
##$USER= <she>
##$AMP= (0..31)
100 100 100 100 100 100 100 100 100 100 100 100 100 100 100 100 100 100 
100 100 100 100 100 100 100 100 100 100 100 100 100 100 
##$AQSEQ= 0
##$AQ_mod= 1
##$AUNM= <au_zg>
##$AUTOPOS= <>
##$BF1= 200.13
##$BF2= 200.13
##$BF3= 200.13
##$BF4= 200.13
##$BF5= 200.13
##$BF6= 200.13
##$BF7= 200.13
##$BF8= 200.13
##$BYTORDA= 1
##$CFDGTYP= 0
##$CFRGTYP= 5
##$CHEMSTR= <none>
##$CNST= (0..31)
1 1 145 1 1 1 1 1 1 1 1 1 1 1 1 1 1 1 1 1 1 1 1 1 1 1 1 1 1 1 1 1 
##$CPDPRG= <>
##$CPDPRG1= <>
##$CPDPRG2= <>
##$CPDPRG3= <>
##$CPDPRG4= <mlev>
##$CPDPRG5= <mlev>
##$CPDPRG6= <mlev>
##$CPDPRG7= <mlev>
##$CPDPRG8= <mlev>
##$CPDPRGB= <>
##$CPDPRGT= <>
##$D= (0..31)
0 1.2 0 0 0 0 0 0 0 0.06 0 0.03 0 0 0 0 0.0002 0 0 0 0 0 0 0 0 0 0 0 0 
0 0 0 
##$DATE= 1709730672
##$DBL= (0..7)
120 120 120 120 120 120 120 120 
##$DBP= (0..7)
150 150 150 150 150 150 150 150 
##$DBP07= 0
##$DBPNAM0= <>
##$DBPNAM1= <>
##$DBPNAM2= <>
##$DBPNAM3= <>
##$DBPNAM4= <>
$$ [...]
##$SUBNAM3= <"">
##$SUBNAM4= <"">
##$SUBNAM5= <"">
##$SUBNAM6= <"">
##$SUBNAM7= <"">
##$SUBNAM8= <"">
##$SUBNAM9= <"">
##$SW= 18.0517328524113
##$SWIBOX= (0..15)
0 0 2 0 0 0 0 0 0 0 0 0 0 0 0 0 
##$SW_h= 3612.71676300578
##$TD= 16384
##$TD0= 1
##$TE= 0
##$TE2= 300
##$TE3= 300
##$TEG= 300
##$TL= (0..7)
0 120 120 120 120 120 120 120 
##$TP= (0..7)
150 150 150 150 150 150 150 150 
##$TP07= 0
##$TPNAME0= <>
##$TPNAME1= <>
##$TPNAME2= <>
##$TPNAME3= <>
##$TPNAME4= <>
##$TPNAME5= <>
##$TPNAME6= <>
##$TPNAME7= <>
##$TPOAL= (0..7)
0.5 0.5 0.5 0.5 0.5 0.5 0.5 0.5 
##$TPOFFS= (0..7)
0 0 0 0 0 0 0 0 
##$TUNHIN= 0
##$TUNHOUT= 0
##$TUNXOUT= 0
##$USERA1= <user>
##$USERA2= <user>
##$USERA3= <user>
##$USERA4= <user>
##$USERA5= <user>
##$V9= 5
##$VALIST= <valist>
##$VCLIST= <CCCCCCCCCCCCCCC>
##$VD= 0
##$VDLIST= <DDDDDDDDDDDDDDD>
##$VPLIST= <PPPPPPPPPPPPPPP>
##$VTLIST= <TTTTTTTTTTTTTTT>
##$WBST= 1024
##$WBSW= 4
##$XGAIN= (0..3)
0 0 0 0 
##$XL= 0
##$YL= 0
##$YMAX_a= 298367
##$YMIN_a= -374278
##$ZGOPTNS= <>
##$ZL1= 120
##$ZL2= 120
##$ZL3= 120
##$ZL4= 120
##$ABSF1= 15.46703
##$ABSF2= -2.58482
##$ABSG= 5
##$ABSL= 3
##$ALPHA= 0
##$AQORDER= 0
##$ASSFAC= 0
##$ASSFACI= 0
##$ASSFACX= 0
##$ASSWID= 0
##$AUNMP= <proc_1d>
##$AZFE= 0.1
##$AZFW= 0.1
##$BCFW= 0
##$BC_mod= 2
##$BYTORDP= 0
##$COROFFS= 0
##$CY= -3
##$DATMOD= 1
##$DC= 0
##$DFILT= <>
##$DTYPP= 0
##$F1P= 0
##$F2P= 0
##$FCOR= 1
##$FTSIZE= 16384
##$FT_mod= 6
##$GAMMA= 0
##$GB= 0
##$INTBC= 1
##$INTSCL= 3.70164e-10
##$ISEN= 128
##$LB= 0.24
##$LEV0= 0
##$LPBIN= 0
##$MAXI= 10000
##$MC2= 0
##$MEAN= 0
##$ME_mod= 0
##$MI= 1.114404
##$NCOEF= 0
##$NC_proc= -7
##$NLEV= 6
##$NOISF1= 3.799351
##$NOISF2= 2.8
##$NSP= 0
##$NTH_PI= 0
##$NZP= 0
##$OFFSET= 15.43067
##$PC= 1
##$PHC0= -24949.35
##$PHC1= 18.98731
##$PH_mod= 1
##$PKNL= yes
##$PPARMOD= 0
##$PSCAL= 0
##$PSIGN= 0
##$REVERSE= no
##$SF= 200.130018217855
##$SI= 16384
##$SIGF1= 3
##$SIGF2= 2
##$SINO= 5.538805
##$SIOLD= 16384
##$SREGLST= <1H.CDCl3>
##$SSB= 0
##$STSI= 16384
##$STSR= 0
##$SW_p= 3612.71676300578
##$SYMM= 0
##$S_DEV= 0
##$TDeff= 16384
##$TDoff= 0
##$TI= <>
##$TILT= no
##$TM1= 0
##$TM2= 0
##$TOPLEV= 0
##$USERP1= <user>
##$USERP2= <user>
##$USERP3= <user>
##$USERP4= <user>
##$USERP5= <user>
##$WDW= 1
##$XDIM= 16384
##$YMAX_p= 370662875
##$YMIN_p= -1957286
$$ End of Bruker specific parameters
$$ ---------------------------------
##NTUPLES= NMR SPECTRUM
##VAR_NAME=  FREQUENCY,     SPECTRUM/REAL,   SPECTRUM/IMAG
##SYMBOL=    X,             R,               I
##VAR_TYPE=  INDEPENDENT,   DEPENDENT,       DEPENDENT
##VAR_FORM=  AFFN,          ASDF,            ASDF
##VAR_DIM=   16384,         16384,           16384
##UNITS=     HZ,            ARBITRARY UNITS, ARBITRARY UNITS
##FACTOR=    0.220516191357247, 1,           1
##FIRST=     3088.14022509488, 0,            0
##LAST=      -524.576537910905, 0,           0
##MIN=       -524.576537910905, -1957286,    0
##MAX=       3088.14022509488, 370662875,    0
$$ Real data points
##PAGE= N=1
##DATA TABLE= (X++(R..R)), XYDATA
$$ [...]
11849c9006l7224l548O8076J37779p1106M5014j65147J35061L1951l7460L6561
11838A00951j60678j7139j8874J75099Q0401j58575j57086k34343K60941J68609
11828C9306j12037J40811N0767J2491l24622O2170K8637J60736k7686J6986n6436
11817h877m6567P8841k99041O8820J22338J64696p3146n7158p0539J07799P2262
11806E9428j2005k36687j68138K6142J70782J18960k6713n2812L03707p2365k76068
11795a65769j72425L35095J5288j59663J27107J40598K0346k01035N742K66298
11785B11582p783j93177J775M6703k6388Q0041j53446j88983K37045n6059o9397
11774a18087R6016K194j10507J75267J22786j33997m2981J3062j14119J07358
$$ y = [-39006, -76230, -79778, -11702, 126077, 54971, 99985, -65162, 69899, 101850, 64390, 100951, -59727, -76866, -95740, 79359, 159760, 1185, -155901, -390244, -129303, 39306, -72731, 68080, 118847, 131338, -193284, -131114, -102477, 58259, 30573, 47559, -8877, -55444, 23397, -275644, -206824, -84486, 80210, 7064, -50094, -120633, -12834, 59428, 47423, -189264, -357402, -331260, -160478, -41518, -68231, -121043, 182664, 110299, -165769, -338194, -3099, 12189, -147474, -20367, 120231, 140577, -60458, -54716, 211582, 203799, 10622, 12397, 59100, 32712, 112753, -40693, -229676, 7369, -48690, -118087, -22071, -19877, -130384, 44883, 167669, 33672, -9309, 3753, -110366, -3008]
11764c008K02374m596q3139j58907l8355J89354m221k1895m0624l2651j24475
11753a20143r8103K56071L27008k43725k4951o3905O8052J29386o3597k2834n7630
11742H5629J02789J55284j88582J0398K18711j92245j62046L7175J44572j54236
11732E7449q4862J75752j14510K1126M3829J16091L4980j83524j87926J73897
11722E2302K4047j61849j89623o7354M98756N2636k5857q8834r8861J75669Q4293
11711B55325p676m1615q6653N2028J16774l4759J8170j36400k8053j25324j13866
11700a32049K6644P894Q7741J6732N3967j00587k8115J47499J09738n536O7980
11689B51908p9157k05233m2858K39882M4110K4142j02255p7351p3304J357J31240
$$ y = [-3008, 199366, 194770, 111631, -47276, -85631, 103723, 99502, 77607, 36983, 4332, -120143, -218246, 37825, 364833, 121108, 96157, 32252, 100304, 229690, 166093, 143259, 85629, 188418, 343702, 155120, 165518, 384229, 191984, 29938, 67113, 211685, 57449, -27413, 148339, 33829, 54955, 98784, 214875, 249855, 66331, -121595, 52302, 76349, -85500, -275123, -342477, 156279, 208915, 183058, 94224, -4637, 171032, 255325, 247649, 206034, 119381, 171409, 288183, 253424, 271594, 135194, 107141, -18183, -132049, -105405, -97511, -9770, 6962, 60929, -39658, -67773, 79726, 189464, 183928, 251908, 172751, -32482, -75340, 164542, 208652, 232794, 130539, 53188, -20116, -18759, 112481]
11678A12481l3872k8817j75524J46628L5192j09283J60403R028p3500k32419R3861
11667i5822J16563P8016J11572l5312k55206k0290J30697P3490m9687K8318q350
11656G3989L1524J08257j15000k04829J2652J69646q3567L3279K33741R0572r4947
11645B55317l9880l55837Q3599N9221r1410J2565P0286l9003J40400q109j54562
11634f7413j8054j84918J63544J91587J2020m687k2211j72958J57373m590m5406
11623D287O1145k2069n521M6273J11360k29933J39102K1845j6430r8359j98436
11612a86736J78649J36335n1074J13846j61107j19845K58517j83976Q0902O3110
11602A28621K1481j40291m1084k3049Q7136k53791l9924R4828J42889J22426N2972
$$ y = [112481, 78609, 49792, -125732, 20896, 56088, -53195, 107208, 116236, 42736, -189683, -95822, 20741, 98757, 210329, 175017, -80189, -100479, 30218, 103708, 54021, 82339, 73989, 105513, 213770, 98770, -106059, -93407, 76239, -7328, 25951, 259692, 350264, 255317, 215437, -140400, -56801, 2420, -88990, -76425, -6139, -45142, 95258, 87149, -67413, -85467, -270385, -106841, 84746, 96766, 92079, 69868, -103090, 54283, 49693, 4287, 65432, 43363, 37842, 84115, 195475, -34458, 104644, 126489, 110059, 11700, -186736, -8087, 128248, 77174, 191020, 29913, -89932, 168585, -15391, 65511, 128621, 150102, 9811, -31273, -54322, 32814, -220977, -260901, -166073, -23184, 99242, 152214]
11591A52214M823j46446Q2440O7907q1736j11856k8513Q1980o9596r4647K30522
11580H7092J86369n9770k33658j4951O8587o0860O689J71508r0357n9411j5788
11569a4550R992m846O3235p9955j06320j37295P2443J94075L07492Q4597l19081
11558F9787j01202j0602Q7634M4616k09239J72682m5269K0639O6020L0660j49001
11547b3275M3285Q7319k7593O9623j09782J59515R5992q0778J3042o4983l8947
11536A23418j88937k3650n9686R2618R0715L04698n4681j90817N1569L4819J38662
11525C18728Q980j00066k41165J34524q4009l0409l0169J16154J52312k43208
11515A672J48645O9542M5362m5239k02786n4932m3337j8460m2558K55026k5959
$$ y = [152214, 157037, 10591, 93031, 160938, 79202, -32654, -61167, 20813, -48783, -143430, 87092, 273461, 213691, -19967, -34918, 33669, -27191, -20502, 151006, 60649, 1238, -14550, -4558, -9404, 53831, -26124, -132444, -269739, -197296, -3221, 304271, 388868, 69787, -31415, -42017, 45617, 90233, -119006, 53676, 8407, 29046, 95066, 125726, -23275, 20010, 107329, 79736, 149359, 39577, 199092, 295084, 214306, 227348, 162365, 123418, -65519, -89169, -148855, -56237, 34478, 339176, 284495, 93678, 145247, 180066, 318728, 327708, 227642, -13523, 121001, 36992, 6583, -23586, 92568, 244880, 1672, 150317, 219859, 265221, 219982, 17196, -37736, -81073, -99533, -142091, 112935, 86976]
11504H6976j69237L03329l0511j19238M6554l9657K671k63075k7599K83695L6196
11493A10104m9973J25831j15442J10035r9042p573j9214n1605N9261j75832J42306
11482B8856Q4372j58008J02978j16676L6865R0364Q648J40871j4933M262J68582
11471C76181k0330q8694o7558j89020J99219Q4585p847J05049j29888j68594l5522
11460E7581K3390L3513J97372r2680q1239Q0657K8425k3730j42740o4985j08768
11449i3204k7170P6189m2914N0711J19841K96012l1965j08372J16122j28405j20485
11438A06360J05164K872J07810q0492k0993J18046k25649r8540J04269j81109
11428f2262J93751J07766j8277o9098j57535K74227P201o9105J8530K8834o1615
$$ y = [86976, -82261, 221068, 190557, 71319, 117873, 78216, 80887, -182188, -209787, 73908, 110104, 60131, 185962, 70520, 180555, 81513, 73940, 54726, 3121, 62382, -113450, 28856, 113228, -44780, 58198, -58478, -21613, 68751, 77399, 218270, 203337, 207599, 376181, 355851, 267157, 199599, 10579, 209798, 294383, 286536, 391585, 261697, 93103, 57581, 80971, 114484, 311856, 219176, 137937, 218594, 247019, 223289, 80549, 15564, -93204, -120374, -44185, -87099, -36388, 83453, 379465, 347500, 239128, 355250, 226845, 106360, 211524, 214396, 322206, 241714, 220721, 338767, 113118, 14578, 118847, -62262, 131489, 239255, 220978, 151880, -5655, 268572, 275773, 206668, 225198, 254032, 192417]
11417A92417J20136p9139j22830K55250K4009l5595j60851J9278J1028R125j29634
11406A03194J58922M3589l1704l9608j65079J19708j79962J33947k0336q0309
11396D2362L4430j85150P7418J89214q0323L7681J07864j39815p342p9541O0249
11385E7047M4479j68307J75166j01019l10585j9792M21810M3559o7301J33969
11375B09026n0182j20366j65629P8657K74730l9265q2990r6406M2261K3181j9731
11364E3286O9503j3631q312J3871J80408n0074k41623P4690j14778O8079J03473
11353A34892l1178J76945j13502r9130J58409q0063J49936r8823n4190j08332
11343C4964j5845m1481r913o6465K46839k0926j99325R7151m7868P9673R4912
$$ y = [192417, 312553, 233414, 110584, 365834, 389843, 354248, 193397, 212675, 223703, 232828, 103194, 262116, 305705, 274001, 234393, 69314, 189022, 9060, 143007, 122671, 42362, 76792, -108358, -30940, 158274, 77951, 115632, 223496, 83681, 76339, -3202, 57047, 101526, -66781, 108385, 7366, -303219, -323011, 98799, 142358, 75057, 209026, 158844, 38478, -127151, -48494, 226236, 186971, 103981, 7575, 49836, 73017, 53286, 122789, 109158, 100846, 114717, 295125, 245051, 3428, 78118, -36660, 31419, 134892, 103714, 280659, 167157, 68027, 226436, 146373, 296309, 197486, 143296, 34964, 19119, -22362, -32275, -98740, 148099, 127173, -72152, 24999, -22869, 56804, 151716]
11332A51716J2430L2706q5287J41459j29313J19822L1125k7917q0623p1358J13458
11321B08218J36764Q1584k03111n2899j72094J92456J94081j16711k85790K9077
11311A1575K08365n9171k14363J02565o352J30223j26134L5703m6362n2167Q6028
11300F9910J94614Q8645P558l2445r0650R2386P0372o4311q0125J197Q4493k7728
11288C13916J0170L3223j79990p0318j34729J66978J11674j13331J13849q8485
11278A62957j3931k3647N9933j52724J44718J7433n9547j0422J33929o4435m8400
11267A45864q5913J42050K18789o100J5930j64561o5351R1709J40784l13359L125
11256A22967o5546R1093J80809k67460J3596k70P7658j21116J26042J32391n4316
$$ y = [151716, 164146, 196852, 111565, 253024, 123711, 243533, 274658, 246741, 166118, 94760, 208218, 344982, 426566, 223455, 170556, -1538, 190918, 384999, 268288, -17502, 11575, 219940, 160769, -53594, 48971, 42619, 172842, 46708, 82411, 36049, -16118, 69910, 264524, 353169, 360727, 328282, 237632, 330018, 400390, 336079, 255954, 257151, 341644, 313916, 324086, 357309, 177319, 107001, -27728, 139250, 250924, 137593, 251442, 162957, 149026, 125379, 185312, 32588, 177306, 194739, 135192, 124770, 258699, 194264, 145864, 59951, 202001, 420790, 414690, 430620, 266059, 200708, 292417, 433201, 119842, 122967, 57421, 148514, 329323, 61863, 75459, 75189, 152847, 31731, 157773, 290164, 235848]
11245B35848L7237p26j23465k47492n1432P9187J63246J2375p8864k7797K51496
11234B49613P9857j1533j73680q647j9924J31661r0933L547L6016m3072Q5821
11223B38726L9231o3350p3362R3982j80674j04522K11956p3931q5788K25732N4993
11212B82993j43820Q7572J94636Q2270L5636j17275j71848k15091K03370J55682
11202C94125O0591j28247j56514o914N049m2266k22933J94034j8106n639J21017
11191A94197l4323K33701L6192r6810j02439k17664J72774j10778k03995L29798
11181B00653K6092j9353m6430j01787P6924K26817P9749Q463j76432m1273L0482
11170B63905j05592K00196p9864j48988K4098K3536o3321K63583J25883j74579
$$ y = [235848, 273085, 272359, 148894, -98598, -150030, -70843, 92403, 104778, 25914, -1883, 249613, 329470, 317937, 144257, 135610, 115686, 247347, 156414, 159961, 195977, 152905, 238726, 277957, 214607, 141245, 235227, 54553, -49969, 161987, 88056, 2268, 228000, 282993, 139173, 226745, 421381, 503651, 539287, 422012, 250164, 35073, 238443, 394125, 454716, 326469, 169955, 163041, 168090, 125824, -97109, 96925, 78819, 73180, 194197, 159874, 393575, 429767, 332957, 230518, 12854, 185628, 74850, -129145, 200653, 226745, 207392, 160962, 59175, 136099, 362916, 442665, 451128, 274696, 233423, 263905, 158313, 358509, 278645, 129657, 153755, 177291, 113970, 377553, 503436, 328857]
11160C28857n3464J57337j45451j64257j9730O6031J8880j0733O9819r320M2360
11149B80329L0857r6341r508o6220j45503K72360L9177j44894O0924p8926J0180
11138A52435K1811K5004K0407J01750J51752k49831j90642L8224J97757J1423
11128B80090l7506r8429p2232K37414l5598j61014J35635k6379q1380k2108J37108
11117B55601J39348j08222M9658m0347j1090q2363N4899J59407J52814j13225
11107D56480j79015M7133m1821j90349n4209M0132N9565Q1311k7275J44659j6518
11096C20093j6712k9081J26929k3913j498L6686r1923O4507J12509J7690M8599
11085E63886k2782N3093J36759q5368j37652j69707J82750r6694j04392J15226
$$ y = [328857, 275393, 432730, 287279, 123022, 103292, 169323, 188203, 177470, 247289, 237969, 280329, 311186, 214845, 205337, 139117, -6386, 265974, 305151, 160257, 221181, 142255, 152435, 174246, 199250, 219657, 321407, 473159, 223328, 32686, 70910, 268667, 280090, 242584, 144155, 71923, 309337, 273739, 112725, 248360, 221981, 140601, 118493, 255601, 394949, 286727, 336385, 296038, 284948, 202585, 257484, 416891, 569705, 456480, 277465, 324598, 282777, 92428, 38219, 78351, 137916, 219227, 191952, 336611, 320093, 303381, 274300, 401229, 377316, 375818, 412504, 320581, 385088, 497597, 515287, 563886, 541104, 594197, 730956, 645588, 507936, 338229, 520979, 424285, 319893, 435119]
11075D35119j43518K0797L3916J7286q0227m5909j19668J19478j28367L90213
11065D99120j14647n28396M30058J38846k328j10389n6823j26233J12548P601
11055B49357K283l0736M881J0810M2773O6309j17166j36591L8356J04214J64088
11044C98578k15871Q9550Q2667M6008l5856Q8008o070j01163q3952L1791q404
11033B85286Q0987J46671k94053r8448j26261J43360Q8786K8677j85216p489k7061
11022C5239J92462o0367N1729r7902j12406n5356K11449J45829P2132q6657m109
11011B92043m234j12104j35839R2976J34267M2923K7605n8910L8858q7883R5660
11000C25362k8842N7360p2837m0468J23367q665l6653M5252O9480O9746j19257
$$ y = [435119, 291601, 312398, 346314, 363600, 283373, 237464, 117796, 237274, 108907, 499120, 384473, -143923, 286135, 424981, 422653, 312264, 255441, 129208, 241756, 249357, 251640, 220904, 225785, 236595, 279368, 345677, 228511, 91920, 130276, 234490, 398578, 182707, 272257, 354924, 400932, 365076, 453084, 447014, 345851, 261899, 293690, 285286, 366273, 512944, 218891, 120443, -5818, 137542, 226328, 255005, 69789, 62300, 35239, 227701, 167334, 219063, 121161, 8755, -46601, 164848, 310677, 382809, 296152, 292043, 287809, 175705, 39866, 132842, 267109, 310032, 337637, 278727, 317585, 229702, 325362, 296520, 353880, 281043, 240575, 363942, 355277, 318624, 363876, 433356, 503102, 383845]
10989C83845P3421J15604k40074o6283O3649J23250K2125k04784N7903L47778
10979F76434j0755j04404j82455l4586K50723k33091q9124K3363J06704P734j00847
10968C09696q4450M3924J98460Q4380k17090M6274J64680j04380o7546J13023
10958D86971J2688j1596L2837K0538r6236M7448j85402k01097J32017J65968L5005
10947D39141J62762L177k8604o5942L755K16649n6932P456L5929O0899j8157K1879
10935G82012q2736K646M4380Q37j97833k9918K19236j8215j13711P079j45728
10924D68049o075J40710j90993J82670J71550n9762l00578r7697N5849l7231J13995
10913D40487O0977O6570p9176P810p5031j51329J05218J65081O8703N1820q2261
$$ y = [383845, 457266, 572870, 332796, 266513, 330162, 453412, 475537, 270753, 328656, 676434, 665679, 561275, 378820, 344234, 594957, 361866, 272742, 296105, 402809, 410543, 309696, 225246, 269170, 467630, 552010, 334920, 381194, 545874, 441494, 373948, 486971, 499659, 488063, 520900, 541438, 445202, 492650, 307248, 106151, 238168, 404136, 439141, 601903, 605080, 576476, 510534, 514289, 730938, 674006, 681462, 717391, 778290, 760133, 782012, 699276, 701922, 746302, 747139, 549306, 519388, 738624, 720409, 606698, 613777, 468049, 461974, 602684, 411691, 594361, 765911, 706149, 405571, 307874, 363723, 326492, 440487, 501464, 568034, 488858, 496668, 421637, 270308, 375526, 540607, 609310, 661130, 578869]
10902E78869J29756k06660P2174m1499K7299j47135l19449K63034P1804P8351
10892E06544L9292J26455j08282m3555l4778P6703J61986j8458j26504n4765j98313
10881C26325O2727m775N0481K82246k26927J755J55230j4779p7553j1330j90230
10870C53170J98652J24651r5149L6279q3661j3078J98971P4473j15598J31814
10860H10524J0336J37302N5954j8836l3504j6894l1760j04300l6478J78778K08005
10849A159127k84072K6947J11558j56469J69528p96R9914Q9106j42Q3707m8152
10838A250256j009J57263M02921p4779L08421J18932j85678K07071q8577N1800
10828B146621r7650j92800r1309j22376k61758M728r8840j38110j41494K5639
$$ y = [578869, 708625, 501965, 574139, 532640, 559939, 412804, 93355, 356389, 428193, 506544, 545836, 672291, 564009, 520454, 485676, 562379, 724365, 705907, 579403, 524638, 326325, 389052, 384277, 434758, 717004, 490077, 491832, 647062, 632283, 554730, 543400, 353170, 551822, 676473, 581324, 617603, 533942, 520864, 719835, 794308, 678710, 810524, 820860, 958162, 1014116, 995280, 961776, 944882, 913122, 808822, 772344, 951122, 1159127, 875055, 902002, 1013560, 857091, 1026619, 1025823, 1125737, 1214843, 1214701, 1298408, 1250256, 1249247, 1406510, 1809431, 1734652, 2043073, 2162005, 1976327, 2183398, 2094821, 2146621, 2048971, 1856171, 1764862, 1642486, 1380728, 1385456, 1286616, 1148506, 1007012, 1032651]
10818A032651n2741j16294o2850J9497l6437j167r3013J34208k34825k7332K69738
10807H31435K2906m2255k15245n2034p0932J28776M5386J21544j29898k11j1477
10796F27995J7827o8103k4442L070P7219j41066r072l6486O0660m4648N9840P8756
10784F01550p5843J66062q1358j32076J40896J7678L7662L0179j01262k7165N6404
10773F32727J00027k40729J68975K03515r8610O378J45959q216q5108j68221q721
10762F47976J40747r5858r4529p1143J44134O3811J51552j56242j89253o7597
10752D73598J65600R8760k26355P4108q4666K80124J60465k65397k75620n7559
10742C43058P3020K37810Q4122J6920J52453k2994j8222K057M2383R529J88289
$$ y = [1032651, 979910, 863616, 800766, 820263, 783826, 782659, 689646, 823854, 589029, 561697, 831435, 854341, 812086, 596841, 544807, 473875, 602651, 648037, 769581, 639683, 639472, 627995, 645822, 577719, 553277, 556347, 633566, 492500, 483428, 446942, 507602, 462954, 522794, 601550, 525707, 691769, 610411, 478335, 619231, 636909, 674571, 704750, 603488, 576323, 632727, 732754, 492025, 661000, 864515, 765905, 772283, 918242, 910026, 824918, 656697, 647976, 788723, 692865, 598336, 527193, 671327, 735138, 886690, 730448, 541195, 473598, 639198, 737958, 511603, 585711, 501045, 781169, 941634, 676237, 400617, 343058, 416078, 653888, 738010, 754930, 907383, 884389, 866167, 868224, 910607, 920136, 1108425]
10731A108425j83471p5949Q3202p1682k45843M6701K43592N5366j03761P5555
10721I32135N6126j36278k4585j0030J17051L7094n1656p4211q8517o3911J20347
10710H13565K46205l7527p9094Q6154j17804j89811j144K3487m5079M9852P3393
10699H22197Q0046L1076J42606J08808l1670j42427N6264R0001K1633j31245j50606
10688H96683P1027J37659p7383J0466M5220k7708j05720Q0733J40529J25244p4668
10677A222082r7127K51508O1442j19136r4727J4456q1978k3954K11684J91788
10667A536038r0893J43126J49915j14207j17842j44512K6972Q7064J38057j61507
10657A452211N5021J1985j16036J5668J26911P8870j6753O1457L279K79251N8705
$$ y = [1108425, 924954, 849005, 932207, 860525, 614682, 661383, 904975, 960341, 856580, 932135, 988261, 851983, 827398, 817368, 934419, 971513, 919857, 845646, 757129, 693218, 813565, 1059770, 1022243, 943149, 1029303, 911499, 721688, 720544, 744031, 698952, 748804, 822197, 902243, 933319, 1075925, 1184733, 1153063, 1010636, 1066900, 1156901, 1178534, 1047289, 896683, 967710, 1105369, 1027986, 1038452, 1083672, 1055964, 950244, 1030977, 1171506, 1296750, 1222082, 1124955, 1376463, 1437905, 1318769, 1224042, 1238498, 1156520, 1132566, 1344250, 1536038, 1445145, 1588271, 1738186, 1623979, 1506137, 1361625, 1388597, 1475661, 1613718, 1452211, 1507232, 1519217, 1403181, 1418849, 1545760, 1624630, 1607877, 1669334, 1672613, 1951864, 2010569]
10646B010569k02411L9129K53656J50383Q9637L093p7958K08847O3468j32314
10636B406099L6265K08343l5091j4169J03880K9725K91480J18420J78429L10642
10626C634023J48448J98758L21139N22010O39213O62896Q52767P94747Q47256
10617H621257J201198P17342N03693J29882n93055q98146j169136j001693p59588
10608F751754r71035m24059m95913m16832k57234l20303k20163j00759l88969
10599C156487k23983j28356k44647k19184j75657J74497j22640j91225J02689
10590B127981k26274j97011J18440J91253O6711k27866J7020k68251o3833J66711
10580A704881j26395k17850J26247n4767m8029q3750l6893n3923P1248j32496
$$ y = [2010569, 1808158, 1847287, 2100943, 2251326, 2340963, 2344056, 2266098, 2474945, 2538413, 2406099, 2442364, 2650707, 2615616, 2601447, 2705327, 2735052, 3026532, 3144952, 3323381, 3634023, 3782471, 3981229, 4302368, 4824378, 5463591, 6126487, 6979254, 7774001, 8621257, 9822455, 10539797, 11043490, 11173372, 10580317, 9682171, 8513035, 7511342, 6751754, 5780719, 5356660, 4860747, 4443915, 4186681, 3866378, 3646215, 3545456, 3156487, 2932504, 2804148, 2559501, 2340317, 2164660, 2339157, 2216517, 2025292, 2127981, 1901707, 1704696, 1823136, 2014389, 2081100, 1853234, 1870254, 1602003, 1538170, 1704881, 1578486, 1360636, 1486883, 1432116, 1384087, 1300337, 1263444, 1209521, 1280769, 1148273]
10570A148273J12167M3853P3893J5564j10019q3214j00050j26951J44099O1618
10560A179233j51476j26445J13705j86891j56916K20051K67638j19954p2883l208
10550I62854m2584p7922k152R7915J19822l6496k60132N663j1074J4672L18005
10539A088571R6468m5089l0015l50322J0747N6368J74477k13005K01184P0595
10529A059979o8680r8850j2653k7O6672J55754j8604m6435r0425Q378K58982J93446
10517A407537k86824p3032J010R9682Q3242m8975J57122o6377P1934k17193j85947
10506I42179l4813l1914J14433j72896J25194R8030J11008L5584r9763J41043
10496A228085J95306j36309k29251R2096n4191o8026L0696o7802M930J73618m344
$$ y = [1148273, 1260440, 1304293, 1378186, 1393750, 1283731, 1200517, 1100467, 973516, 1117615, 1179233, 1027757, 901312, 1015017, 828126, 671210, 891261, 1158899, 1038945, 966062, 962854, 920270, 842348, 840196, 938111, 1057933, 1021437, 761305, 766968, 755894, 770566, 1088571, 1185039, 1139950, 1109935, 759613, 770360, 826728, 1001205, 788200, 989384, 1059979, 991299, 892449, 879796, 879769, 946441, 1102195, 1083591, 1037156, 946731, 955109, 1214091, 1407537, 1120713, 1047681, 1048691, 1148373, 1231615, 1182640, 1339762, 1273385, 1345319, 1128126, 942179, 907366, 875452, 989885, 816989, 942183, 1040213, 1151221, 1186805, 1087042, 1228085, 1423391, 1287082, 1057831, 1149927, 1095736, 1027710, 1058406, 990604, 995534, 1169152, 1164808]
10485A164808O0415P0182j61916q3296p4967J00423J23466k7663j01904j8727
10475A050821p3013R7420j22873j05823K47923j4323l4906r0046K5043K05831
10465A186054M9087r0838O7657J48992k96807k23809J26625J52489R317j9300
10455A109467L0087k82341J24229k298J57586K1667m2004k2767j32320n9466O0798
10444I62638J330J26345J31730L7214J51613J1755j88078o1617k35037K29995
10434A167888J15457j61149m1728k2140L2889R9637J17930k31714k2798k251N6184
10423A108205p7304P4669J84420J63126j85417M4494O937o8675l7090Q5973O2805
10412A362143k07044O333R1585k85773q258J3476l5969J82424J60779o1638k38567
$$ y = [1164808, 1225223, 1295405, 1133489, 1050193, 975226, 1075649, 1199115, 1171452, 1069548, 1050821, 977808, 1075228, 952355, 846532, 1094455, 1080132, 1045226, 955180, 980223, 1186054, 1235141, 1144303, 1211960, 1360952, 1064145, 840336, 966961, 1119450, 1128767, 1109467, 1139554, 857213, 981442, 979144, 1136730, 1158397, 1116393, 1093626, 961306, 901840, 962638, 963968, 1090313, 1222043, 1259257, 1410870, 1422625, 1234547, 1172930, 937893, 1167888, 1283345, 1122196, 1080468, 1058328, 1091217, 1190854, 1308784, 1077070, 1054272, 1052021, 1108205, 1030901, 1105570, 1289990, 1453116, 1267699, 1312193, 1319130, 1250455, 1213365, 1299338, 1362143, 1155099, 1161432, 1253017, 967244, 958986, 972462, 936493, 1118917, 1279696, 1218058, 979491]
10401I79491Q7298Q9587J15868P4l79820k8048K47672K14492l27636K1678J22761
10390A143417R4236J63566P4856M7422k09742j61909K8505K785m1367m6554k3293
10379A071922Q0753n1354p6024J19314J71889k06470j82662J79275J29904p2458
10369A164089J94952j45420j18137p063j74959K0254j858K13032J276l9593k40902
10358H65671J13436J12180o7931J95928m9031J06442j77485o6235K7147K8638
10348A088760n1119m9135p3687J96671K28739L1783k74857j09803P6326R1381
10338A155059K08225r6926P4951J73066j87745L9938N2382K1565L0910R0978R4596
10327A656999l03805J02197L6079k45134j1302p656N8747M2180Q8429J58970p2270
$$ y = [979491, 1066789, 1156376, 1272244, 1272318, 892498, 864450, 1112122, 1326614, 998978, 1020656, 1143417, 1237653, 1401219, 1476075, 1523497, 1313755, 1151846, 1180351, 1183136, 1141769, 1095215, 1071922, 1152675, 1101321, 1025297, 1144611, 1316500, 1110030, 927368, 1106643, 1236547, 1164089, 1359041, 1213621, 1095484, 1088421, 913462, 933716, 931858, 1144890, 1146166, 1106573, 865671, 979107, 1091287, 1023356, 1219284, 1170253, 1276695, 1099210, 1032975, 1060122, 1088760, 1037641, 988506, 914819, 1111490, 1340229, 1372012, 1097155, 987352, 1063678, 1155059, 1363284, 1266358, 1341309, 1514375, 1326630, 1366568, 1418950, 1440515, 1471425, 1562403, 1656999, 1353194, 1455391, 1491470, 1246336, 1235034, 1227378, 1286125, 1328305, 1416734, 1575704, 1503434]
10316A503434k16575j15355j34739K33881L01064l2173j83165J03578O2090j83659
10306A338381j74076K8876K49009l9077j19870j0445o5452J04984K202O5915n8166
10295A322281j18013J15062n9774O4807J52879J52322k12606P1723m0296k13203
10285A235182j7841K27025J5543r4172P460J02313k7594L1962j83861L33O5910
10274A362260J93533k4274j76942J74461j38760p2920l1033K95992J83133j24255
10264A641195k12390J03781l4618P7434p3438P0342R4129o5806j76641o232J34686
10253A552442q2485K86429J88995J6681j11559r1475j25227J84271P6237P248
10243A901557m0053P6808p7322L235J17442M1545l0589J2516J1972p6909j16371
$$ y = [1503434, 1286859, 1171504, 1036765, 1270646, 1571710, 1539537, 1356372, 1459950, 1522040, 1338381, 1164305, 1193181, 1442190, 1403113, 1283243, 1272798, 1207346, 1312330, 1314532, 1380447, 1322281, 1204268, 1319330, 1259556, 1324363, 1477242, 1629564, 1416958, 1488681, 1448385, 1235182, 1217341, 1444366, 1459909, 1365737, 1373197, 1475510, 1447916, 1479878, 1296017, 1296350, 1362260, 1555793, 1531519, 1354577, 1529038, 1390278, 1317358, 1286325, 1582317, 1765450, 1641195, 1428805, 1532586, 1497968, 1575402, 1501964, 1572306, 1666435, 1600629, 1423988, 1417756, 1552442, 1469957, 1756386, 1945381, 1962062, 1850503, 1759028, 1633801, 1818072, 1894309, 1901557, 1861504, 1938312, 1860990, 1864225, 1981667, 2023212, 1992623, 2005139, 2017111, 1940202, 1823831]
10232A823831K24612P6941r6684J85505r4158r6963J93944J85285j59105L9472
10222B282680J23375o4239j70206P4473l2826k006N857N5789q3063M41q1105L2420
10210B141590L32764J23386j77204k02388K3061L3802Q1410K73105J11287N5805
10200B796618J15757l0554k366O633j41750j92746k0404l6934m1894k8987J11871
10189B535244O6359J8441p8471p1627L9744R674r9671N2235J51770j19464K42135
10178B746369J0790n1997K26932n3158o0766J08823j08460J5172p7471J7360J14480
10167B888074j54213J37070R1492J23578O3181J38735J33441l10787J47369J34708
10157C392648P8824J97440K36918k4654J09628m655J41985K22884K27271L45559
$$ y = [1823831, 2048443, 2125384, 2028700, 2214205, 2120047, 2023084, 2217028, 2402313, 2243208, 2282680, 2406055, 2341816, 2171610, 2246083, 2213257, 2211251, 2217108, 2272897, 2189834, 2190275, 2109170, 2141590, 2474354, 2597740, 2420536, 2218148, 2241209, 2275011, 2356421, 2629526, 2740813, 2796618, 2912375, 2881821, 2879455, 2886088, 2744338, 2551592, 2531188, 2494254, 2452360, 2423373, 2535244, 2601603, 2620044, 2541573, 2469946, 2509690, 2519364, 2419693, 2471928, 2623698, 2504234, 2746369, 2757159, 2705162, 2932094, 2878936, 2818170, 2926993, 2818533, 2833705, 2756234, 2773594, 2888074, 2733861, 2870931, 2962423, 3086001, 3149182, 3287917, 3421358, 3110571, 3257940, 3392648, 3471472, 3668912, 3905830, 3881176, 3990804, 3986149, 4128134, 4351018, 4578289, 4923848]
10147D923848M40800K49280L1909N60302J18553M501r6452l14760q479j82745
10137E726757l63919k44657j85024j89470m31656k51403k09291k35891J70142
10128C785588m3207j75945j07945l19331J79634J1458n0500N1712j24155j74959
10118C032350J08290J02942O6779J33985m7240J17445j43205j00286P6808j24953
10108C222915j83439j98J35217q035P6261k0195R5739J75541J0335J53383J94045
10097C851569j04743P2259k49877j86735L845K27212J46476L0639J52444Q8937
10087D032026K3663L66517J03513l4207k59282Q6672Q2551o1343J1898o6596l6953
10076D248459k29721k04311L1353O8711j2141M5265k04134O6479O9969m9951j91446
$$ y = [4923848, 5364648, 5613928, 5645837, 6206139, 6324692, 6329193, 6232741, 5917981, 5909502, 5726757, 5362838, 5118181, 4933157, 4743687, 4312031, 4060628, 3851337, 3615446, 3785588, 3742381, 3566436, 3458491, 3139160, 3318794, 3330252, 3279752, 3331464, 3207309, 3032350, 3140640, 3243582, 3310361, 3444346, 3397106, 3514551, 3371346, 3271060, 3347868, 3222915, 3039476, 3039278, 3174495, 3166460, 3242721, 3222526, 3318265, 3493806, 3504141, 3657524, 3851569, 3746826, 3819085, 3569208, 3382473, 3386318, 3613530, 3760006, 3790645, 3943089, 4032026, 4055689, 4422206, 4525719, 4491512, 4232230, 4318902, 4401453, 4340110, 4352008, 4285412, 4248459, 4018738, 3814427, 3845780, 3914491, 3902350, 3947615, 3743481, 3809960, 3879929, 3829978, 3638532]
10065C638532J31737l635M8335M2118j80518j02604Q1995j57393Q6356r5835J63949
10054C653037q1138R4251l10871k46993L67796j59197n2019N7671K90310P1743
10044C684590J00514j50131o7333J38790M467O3634J05570K2866o5877J824J07653
10033C946567P3119j79014l7475J01966k11121m5959M3089k30737J2921L5755
10023C509111J43819R2264k25208J31120o4297O0954o8045l4275J21856k2517
10013C644782j60294J73908J11505r6735J01158M4060j43828j87075j91894L9391
10003C334978K09814O1998n1011l4695M8296J83041N7349j57948J78572j35999
9993C694395J16485J19202L5624R0381j37776J60255J25605m3182P1753P3678
$$ y = [3638532, 3770269, 3766634, 3814969, 3857087, 3676569, 3573965, 3655960, 3498567, 3584923, 3489088, 3653037, 3571899, 3666150, 3355279, 3108286, 3476082, 3316885, 3264866, 3322537, 3612847, 3684590, 3785104, 3634973, 3567640, 3706430, 3710897, 3774531, 3880101, 3902967, 3837090, 3838914, 3946567, 4019686, 3840672, 3803197, 3905163, 3694042, 3648083, 3691172, 3460435, 3473356, 3509111, 3652930, 3745194, 3519986, 3651106, 3586809, 3647763, 3579718, 3545443, 3667299, 3644782, 3484488, 3658396, 3769901, 3673166, 3774324, 3818384, 3674556, 3487481, 3295587, 3334978, 3544792, 3606790, 3555779, 3521084, 3569380, 3752421, 3809770, 3651822, 3830394, 3694395, 3810880, 3930082, 3965706, 4056087, 3918311, 4078566, 4204171, 4160989, 4232742, 4306420]
9983D306420M6308N0840J46972k3022J00516J67450L63278J84278L66326J63499
9973E872865L14098J77993K16942M20224j17993N2424P6567k78981m61557m19503
9963E853079n2047l14853l53082l0271l05815J43390j217k54389k05353P2449
9953D551891Q5762j2686N8350j57398p6245n6063J55767j13944J00523p8807N1514
9942D508664K56687r4457j65221Q3694K94920j11746m9928m4863J61197J54281
9932D993228J21305m2460j09873J5841k4574l1585M2143j06376o4523R7423J13252
9921E003801M2522m3463J77306K31646j46429J73441k2462N0555j38526J21011
9911E449402J6710k78815M61194J26422k89389P1927N4686K4776L5328J24205
$$ y = [4306420, 4352728, 4403568, 4550540, 4527518, 4628034, 4795484, 5158762, 5343040, 5709366, 5872865, 6186963, 6364956, 6581898, 7002122, 6884129, 6936553, 7013120, 6734139, 6272582, 5853079, 5801032, 5486179, 5133097, 5102826, 4797011, 4940401, 4939184, 4684795, 4479442, 4551891, 4637653, 4624967, 4683317, 4525919, 4449674, 4393611, 4549378, 4435434, 4535957, 4457150, 4508664, 4765351, 4670894, 4505673, 4589367, 4884287, 4772541, 4722613, 4677750, 4838947, 4993228, 5114533, 5072073, 4962200, 4978041, 4953467, 4921882, 4964025, 4857649, 4793126, 4890549, 5003801, 5046323, 5002860, 5180166, 5411812, 5265383, 5438824, 5416362, 5466917, 5328391, 5449402, 5466112, 5187297, 5648491, 5774913, 5485524, 5557451, 5612137, 5636913, 5672241, 5796446]
9901E796446n9101J38801L5776n0653K19194J61391k8832p882l13542j2617L07350
9890F186331R374Q6024R1517l3370m7869K20197J37850K98379Q142o458j05495
9879F844622P2714j12002p380J83387n0044j45943K32389Q3920J23681J1623l1253
9868G205714J14967n2697L0994J00691L3675o663K05662l6628J03051M0928J36601
9857G876295K27185k7203k46469J37004J75369J17365K99361Q1926R092J84149
9847H834074K7283Q5721Q9265j02788J36840J72249O8059j9100L88839J26283
9837I806725K774J15609J56795n779J65729K57356j57112l8172J59095K49713
9827A0712733K32497Q2422K9614K88502J38888J10965K46448K03914K25469J20195
$$ y = [5796446, 5737345, 5876146, 5911922, 5861269, 6080463, 6241854, 6213022, 6205140, 5891598, 5878981, 6186331, 6195705, 6281729, 6373246, 6339876, 6292007, 6512204, 6650054, 6948433, 6956575, 6950117, 6844622, 6917336, 6805334, 6797954, 6981341, 6931297, 6785354, 7017743, 7101663, 7225344, 7236967, 7205714, 7320681, 7267984, 7298978, 7399669, 7433344, 7426681, 7632343, 7595715, 7698766, 7739694, 7876295, 8103480, 8076277, 7829808, 7966812, 8142181, 8259546, 8558907, 8640833, 8649925, 8834074, 8861357, 8947078, 9036343, 8933555, 9070395, 9242644, 9310703, 9291603, 9680442, 9806725, 9809499, 9925108, 10081903, 10076124, 10241853, 10499209, 10342097, 10303925, 10463020, 10712733, 10945230, 11027652, 11057266, 11345768, 11484656, 11595621, 11842069, 12045983, 12271452, 12391647]
9817A2391647K8001J59265J0553J82393M21827K34738o2637K36111K70791J69447
9807A4042136O8569O9096K56878J15493J60517L21165R7230J4112M75744M20839
9797A6041779L84750K19430J93685K08131P5914J79296M73004L80115K40560J66957
9787A8563621M53057L99543K75017P21862L81294L61365L63558L64210N58225
9778B2441752N66818L70629O93969O82991N94688N37622L90450O01754M41362
9769B7322035M62759O45765M42264N73330N89195M73437L87981O55831O41753
9760C2194350O14230P36623M20184O76440R84084Q77942J076215R80667J069578
9751C9630313J248152J494025J972947J893334J870514K143603K510346K839600
$$ y = [12391647, 12419648, 12578913, 12589466, 12771859, 13193686, 13428424, 13365787, 13601898, 13872689, 14042136, 14110705, 14179801, 14436679, 14552172, 14712689, 15033854, 15131084, 15145196, 15620940, 16041779, 16426529, 16645959, 16839644, 17047775, 17123689, 17302985, 17775989, 18156104, 18396664, 18563621, 19016678, 19416221, 19691238, 20413100, 20794394, 21155759, 21519317, 21883527, 22441752, 23008570, 23379199, 24073168, 24756159, 25350847, 25888469, 26278919, 26880673, 27322035, 27784794, 28430559, 28872823, 29446153, 30035348, 30508785, 30896766, 31552597, 32194350, 32808580, 33545203, 33965387, 34641827, 35625911, 36503853, 37580068, 38560735, 39630313, 40878465, 42372490, 44345437, 46238771, 48109285, 50252888, 52763234, 55602834]
9743E5602834L446741L571730L759976L601826L280062K744025K148339J033618
9735G9189151L32774J11747k24278j006211j700916k026914j862150j690145j552824
9726F9570234j348960j188943r17091n04272k77429O0439P6737M89073J236332
9717F7196120J432723J844174K023276K187344K494975K870726L570184M186257
9709H7805779M552699N152115N211507N129119N069825N607436O148149O043156
9701A30719785N876190M704338L484345K299402J763864J690381R08069K08914
9693A51655288l74375j068156j704867l227385m672753o259705o405378o089756
9685A21852913o660428o990476o656675n039867l845055k431995j360685l25222
$$ y = [55602834, 59049575, 62621305, 66381281, 69983107, 73263169, 76007194, 78155533, 79189151, 79521925, 79633672, 79409394, 78403183, 76702267, 74675353, 72813203, 71123058, 69570234, 68221274, 67032331, 66115240, 65610968, 65333539, 65393978, 65470715, 65959788, 67196120, 68628843, 70473017, 72496293, 74683637, 77178612, 80049338, 83619522, 87805779, 92358478, 97510593, 102722100, 107851219, 112921044, 118528480, 124676629, 130719785, 136595975, 141300313, 144784658, 147084060, 148847924, 150538305, 151446374, 151655288, 151280913, 150212757, 148507890, 145280505, 140607752, 134348047, 127942669, 121852913, 115192485, 108202009, 101545334, 96505467, 92660412, 90228417, 88867732, 88542510]
9677H8542510k1950N84120J020346J600454K436217K955037L603955M476337N685978
9668A10883004P400364Q583433Q716735O830308M493003J943725J46014L19512
9660A49316098J280845K779996L661399L128091O24240k945996p792109j1591232
9652A38461332j2360261j2508914j1779598j0699162r014071o702141n173848
9645G0223337l874322l147302k762392k568678k355110k160227j588806p72458
9637E0994042n54877q14689j329928j688453j830448j870786j657544j604593
9629C9642724j047948p73542n25892p91505r43703q20235o05737j68958n63232
9620C3401972o38797q92161q85435q40206r66733o83300m54163j91772m11210
$$ y = [88542510, 88520560, 89104680, 90125026, 91725480, 94161697, 97116734, 100720689, 105197026, 110883004, 118283368, 126866801, 135583536, 142413844, 146906847, 148850572, 148996586, 149316098, 150596943, 153376939, 157038338, 160166429, 160790669, 157844673, 150052564, 138461332, 126101071, 113592157, 101812559, 91113397, 82099326, 75397185, 70223337, 66349015, 63201713, 60439321, 57870643, 55515533, 53355306, 51766500, 50994042, 50439165, 49624476, 48294548, 46606095, 44775647, 42904861, 41247317, 39642724, 38594776, 37821234, 37295342, 36503837, 35560134, 34739899, 34134162, 33965204, 33401972, 32763175, 31871014, 30985579, 30145373, 29178640, 28495340, 28041177, 27849405, 27438195]
9611B7438195p67379q52894p35729n95883o35145j67151m61559m53585r6818m01883
9601B2270169l59824j58010o30417l57717p6529j66628J82267M2918q4492j57888
9591B0503849K91620k5360L8286k88813j52890N7433j93945k27965O7535L49447
9581B0419197J58655J84411o1490k13082j10783M6416n9219J06823m4227n37325
9571A9889376p51530q41401o53140m01031k15060k15898j50014k55703j6545J71770
9561A6560824P3475J59371q3184m100J5060k49677q5301R670k6752j27231k60444
9550A5981711k10504k59130l53982k81755r8894l49156m64587m79909p10690l88321
9540A2384783n71750m38709k45662k16760q693k37584l2949l38439R420k49875
$$ y = [27438195, 26670816, 25817922, 25082193, 24486310, 23851165, 23684014, 23222455, 22768870, 22672052, 22270169, 21910345, 21752335, 21121918, 20764201, 20687672, 20521044, 20703311, 20746229, 20661737, 20503849, 20795469, 20770109, 20808395, 20519582, 20366692, 20424125, 20230180, 20002215, 20069750, 20419197, 20577852, 20762263, 20700773, 20487691, 20376908, 20423324, 20364105, 20470928, 20426701, 19889376, 19137846, 18296445, 17643305, 17242274, 17027214, 16811316, 16661302, 16405599, 16389054, 16560824, 16634299, 16793670, 16710486, 16706386, 16721446, 16471769, 16386468, 16396138, 16369386, 16242155, 15981711, 15771207, 15512077, 15158095, 14876340, 14777446, 14428290, 13963703, 13483794, 12773104, 12384783, 11813033, 11374324, 11128662, 10911902, 10903209, 10665625, 10632676, 10294237, 10303657, 10053782]
9530A0053782k17633k19288k857Q7029k96922j11807J99507K8442r5313j10434
9520I314506j1734J6577K2660K6585q8759k00596J9100K51543O9276o6425k5280
9509I327453r3608j21472K88895J48869j12196J00416J23505J90242K21430K17296
9499A0290830P2155R9587J95686Q7820J74867J43370P6643M51571K79559K81725
9489A2153813K71841r7258J97204K64413j77827m6152o4343j00427L30714k69570
9479A2462408j99577j54993m31915m71336k57535m59946l30750m87786k39663
9470I428907j38112l19119j42240J20011N6693r2924j12911J92190K4820j79194
9460H838121K9798L5492j51431J78508J31753k2785j93065K97989J19552P572
$$ y = [10053782, 9836149, 9616861, 9614004, 9701033, 9404111, 9292304, 9491811, 9520253, 9424940, 9314506, 9302772, 9319349, 9342009, 9368594, 9279835, 9079239, 9098339, 9349882, 9419158, 9352733, 9327453, 9233845, 9112373, 9401268, 9550137, 9437941, 9538357, 9661862, 9852104, 10073534, 10290830, 10362985, 10462572, 10658258, 10746078, 10920945, 11064315, 11140958, 11592529, 11872088, 12153813, 12425654, 12328396, 12525600, 12790013, 12612186, 12566034, 12501691, 12401264, 12731978, 12462408, 12262831, 12107838, 11675923, 11204587, 10947052, 10487106, 10156356, 9668570, 9428907, 9290795, 8971676, 8829436, 8949447, 9006140, 8913216, 8800305, 8992495, 9017315, 8838121, 8867919, 8903411, 8751980, 8930488, 9062241, 9039456, 8846391, 9144380, 9263932, 9271504]
9450I271504j25474k0606o9962k0094l4545j14199R9290r685O018L9330K3973
9439I045550R2862k30787R0876K0986L7189l0882j23226J08971O4941K26635J81096
9428I484211n2559L2717J62580q5114K1209K97618n304k71328L06885j1476M704
9417I884143j61076J71194R9800J12605r4982L7005R2092m2440J70491J84568
9407A0453400J63482J78468J6407K78857J37838N26310M57728N33843P32281N78120
9397A4056734J61295J13948K36081J57212N611l21648m34845o27787m30203m4828
9387A2871570j84308L4224R6237j33019n04198l10555l89368l80856k99211j69693
9377A0630823J47780j07625K3878k0858J67888J61490j80580J02732J69285J77662
$$ y = [9271504, 9146030, 9125424, 9055462, 9035368, 9000823, 8886624, 8985914, 8976229, 8982247, 9021577, 9045550, 9138412, 8907625, 8998501, 9019487, 9056676, 9025794, 8902568, 9011539, 9076480, 9303115, 9484211, 9431652, 9464369, 9626949, 9541835, 9563044, 9860662, 9855358, 9584030, 9890915, 9879439, 9884143, 9723067, 9894261, 9994061, 10106666, 10011684, 10048689, 10140781, 10098341, 10268832, 10453400, 10616882, 10795350, 10811757, 11090614, 11228452, 11754762, 12212490, 12746333, 13478614, 14056734, 14218029, 14331977, 14568058, 14725270, 14730881, 14409233, 13974388, 13346601, 12916398, 12871570, 12687262, 12721486, 12817723, 12684704, 12180506, 11869951, 11480583, 11099727, 10800516, 10630823, 10778603, 10670978, 10694856, 10673998, 10841886, 11003376, 10822796, 10925528, 11094813, 11272475]
9367A1272475J45886L81201K37431M86888L81129N69791M61655J27023N1681J54425
9357A4269585P7212R8572K42295L74538J67892k79252m18571n05939j66708j27903
9347A3731721q1097M51187N75637J89253j27311k66084l89716l97660j81528k89180
9337A3215222o3058j66451K7188j32301k10544j56004K35735p2749n8860k47626
9327A2370552k67337l57100m66135m3590O7862m9954r0139j9537o8408l53601
9317A0722613k61886L5384l7081l23605N319L2300m4521j54639K9080K33600r0136
9306A0146428J95984J5599L3253J67221O8636N3186L5533R685J34071L63203p890
9295A1214909j56868P1323M8582J04117K1198P2786J2308o992J58645j8376p3946
$$ y = [11272475, 11418361, 11799562, 12036993, 12523881, 12905010, 13474801, 13936456, 14063479, 14115160, 14269585, 14346797, 14445369, 14687664, 15062202, 15230094, 14950842, 14532271, 14026332, 13859624, 13731721, 13650624, 14101811, 14677448, 14866701, 14739390, 14473306, 14083590, 13685930, 13504402, 13215222, 13152164, 12985713, 13012901, 12880600, 12670056, 12514052, 12749787, 12677038, 12618178, 12370552, 12103215, 11746115, 11279980, 11236390, 11304252, 11254298, 11164159, 11144622, 11076214, 10722613, 10460727, 10496111, 10459030, 10135425, 10140744, 10173044, 10128523, 9973884, 10002964, 10236564, 10146428, 10342412, 10358011, 10391264, 10558485, 10627121, 10680307, 10715840, 10725525, 10859596, 11222799, 11214909, 11058041, 11129364, 11177946, 11282063, 11303261, 11376047, 11388355, 11381363, 11540008, 11521632, 11447686]
9284A1447686r6523K69822L08216K10484N7036R0512l0499o0945K24124K86672
9274A2706585j57137J36584J90195n6825K51964J48939p9853J40051J69188K01597
9264A3651288j17540Q0640J39825K37564m0533P3245K18626L0197P9254J68020
9254A4520586N09092K39309L17932M92655J30574Q9987K8500L05028N578p3774
9244A6565467J34292N1835J95729J45828L12156M30816K45523M16378K11545O3007
9234A8772576J54508J62649M53203M34157N58388L43635J59495J09762j11408
9225B1036965J46587Q2209Q7485M11312L04301N68164P71743Q63413Q57250J268377
9215B6397806J259072J464929J926216K631909K507482K296058J115433K5480
$$ y = [11447686, 11351163, 11620985, 11929201, 12139685, 12196721, 12287233, 12256734, 12195789, 12419913, 12706585, 12549448, 12686032, 12876227, 12819402, 13071366, 13220305, 13140452, 13280503, 13449691, 13651288, 13533748, 13614388, 13754213, 13991777, 13951244, 14024489, 14243115, 14273312, 14352566, 14520586, 15029678, 15268987, 15586919, 16079574, 16210148, 16300135, 16328635, 16633663, 16639241, 16565467, 16699759, 16751594, 16947323, 17093151, 17405307, 17836123, 18081646, 18498024, 18709569, 18772576, 18927084, 19089733, 19542936, 19977093, 20535481, 20879116, 21038611, 21148373, 21036965, 21183552, 21265761, 21353246, 21764558, 22068859, 22637023, 23408766, 24272179, 25129429, 26397806, 27656878, 29121807, 31048023, 33679932, 36187414, 38483472, 39598905, 39624385]
9207C9624385k66219o91594k53305K4869O26396J001781P11617K29821r23485
9198D0084266j021052j297571j498459j106364j107071o50446j59606k96456J33535
9189C3080776O5474k27119j79059j62022r3082L40225M48085N55543O53546N94798
9179C5077165P29650J161594J147420J510041J939051J980809K400412L348901
9171D9295043L636910K664524J147420k71256n08591q7751r5857R73431J364255
9162E8118128J603149R36744p16792j479366j750774j699432j741058j405805
9154E1864794j144097n15466l8566j12184N99461Q89145J225295J748942J898521
9145E6415845K359112K228495J937981J103776M90039M68484M57701R16583J322549
$$ y = [39624385, 39358166, 38666572, 38413267, 38438136, 39064532, 40066313, 40777930, 41007751, 40084266, 39063214, 37765643, 36267184, 35160820, 34053749, 33403303, 33243697, 32947241, 33080776, 33146250, 32919131, 32740072, 32578050, 32484968, 32825193, 33273278, 33828821, 34482367, 35077165, 35806815, 36968409, 38115829, 39625870, 41564921, 43545730, 45946142, 49295043, 52931953, 55596477, 56743897, 56472641, 55964050, 55876299, 55780442, 56753873, 58118128, 59721277, 60658021, 59941229, 58461863, 56711089, 55011657, 53270599, 51864794, 50720697, 50205231, 50166665, 50054481, 50653942, 51543087, 52768382, 54517324, 56415845, 58774957, 61003452, 62941433, 64045209, 64535248, 65003732, 65461433, 66378016, 67700565]
9136F7700565J309662Q50443L96095n57439j267775q37588o7610N68722J554823
9127F9649898K346967L275997M006905L681521J652261r16109k039031j763090
9119G9895319q33703R24139K231668K822346K824635J177643p64435j470310r54179
9110H5853123m0575Q34898J179883K378812K791551L187551K595043Q94660q23313
9101I8851633k009790j748295k46083P30517P80395l50648j505814k270346k413208
9092H9818361k375229j700713p99561l203J476259K844014L880211L967602K535801
9083I9643542p6647k435572k732122j485649L44561K626353M722025N297475M513838
9074A10417804K226329n79327k990338l819639l078050j497430m07420n53675
$$ y = [67700565, 69010227, 69860670, 70256765, 69699326, 68431551, 67593963, 67526353, 68095075, 69649898, 71996865, 75272862, 79279767, 82961288, 84613549, 83697440, 81658409, 79895319, 79061616, 79985755, 82217423, 85039769, 87864404, 89042047, 88277612, 86807302, 85853123, 85812548, 86647446, 87827329, 90206141, 92997692, 96185243, 98780286, 99674946, 98851633, 96841843, 95093548, 94847465, 95577982, 96358377, 96007729, 94501915, 92231569, 89818361, 87443132, 85742419, 84942858, 84939655, 86415914, 89259928, 93140139, 97107741, 99643542, 99566895, 97131323, 94399201, 92913552, 93258113, 95884466, 100606491, 105903966, 110417804, 112644133, 112064806, 109074468, 105254829, 102176779, 100679349, 100271929, 99718254]
9066I9718254j605582k558652j971283o31213J041141K195048K431433K140301
9058A00759447J446242J038214M07219K59928j16643j3802q52349j959770l195188
9049I7773298m162103n224632o147001n874477m872636m013655l080740k627840
9041F1770214k197264j684078j275859j381028j231330r78402q85612m97820m54381
9032E1184440j50382R6638K71213L80748R58298J274005J596623J883115J905657
9023E9400355J882654J152956L53786j06869l29716k80962n12556m56884l30228
9014F0772536m23010o09507q37501o68888j087267r35752o12009m88208o1227
9005E5049167L9195j05228o3296N8468R549l16179l90602l11229k38406K25403
$$ y = [99718254, 98112672, 95554020, 93582737, 92951524, 93992665, 96187713, 98619146, 100759447, 102205689, 103243903, 103651122, 103911050, 103794407, 103780605, 102928256, 100968486, 97773298, 93611195, 88386563, 82239562, 76365085, 71492449, 67478794, 64398054, 61770214, 59572950, 57888872, 56613013, 55231985, 54000655, 53022253, 52136641, 51638821, 51184440, 51034058, 51130696, 51401909, 51782657, 52740955, 54014960, 55611583, 57494698, 59400355, 61283009, 62435965, 62789751, 62682882, 62353166, 62072204, 61559648, 61102764, 60772536, 60349526, 59740019, 58902518, 58233630, 57146363, 56210611, 55598602, 55110394, 55049167, 55088362, 54983134, 54919838, 54978306, 54987855, 54671676, 54281074, 53969845, 53731439, 53956842]
8995E3956842J35226L71818N31395N89984P77159J157932J140082J241429J839199
8986F1741066K287487K531438K617334K302268J934421J214106J220811J275925
8978G7124856K097270K678111L154622K407895J180750p73664j694543k504472
8970H3670825k205357j545359r50638n6406O11788Q76031J739508J897316J989620
8961H6027328J827230J637347J155452R38326L93444K19774L41584N73348J070602
8952I4184435J930602K235437L056935L590155M904176N147702N278754N614071
8944A25942267N446512M855816L094425J053753J145713K164300M440465N670056
8936A53813307O615320N790172N281290N246303P535361J1869300J8862180K5855599
$$ y = [53956842, 54092068, 54463886, 54995281, 55585265, 56362424, 57520356, 58660438, 59901867, 61741066, 64028553, 66559991, 69177325, 71479593, 73414014, 74628120, 75848931, 77124856, 79222126, 81900237, 85054859, 87462754, 88643504, 87869840, 86175297, 83670825, 81465468, 79920109, 78969471, 78913065, 79524853, 80400884, 82140392, 84037708, 86027328, 87854558, 89491905, 90647357, 91585683, 91979127, 92198901, 92540485, 93113833, 94184435, 96115037, 98350474, 101407409, 104997564, 109901740, 115049442, 120328196, 125942267, 131388779, 136244595, 139339020, 140392773, 141538486, 143702786, 148143251, 153813307, 160428627, 166218799, 171500089, 176746392, 184281753, 196151053, 215013233, 240868832]
8928B40868832L9231300M6465103L9285433M812207m2461261n3879773m8223121
8921B26098720l3161698k0662896j2717498q178048m633926k115664n6369R45820
8913A45518441O93603r59625j724455j564912q39690j512700k672153m821356
8905A32117153o064939o167160m871888l552781l131143l004647l601058l701197
8897I8022340k982332k104151j598714r26054n55940k83175j4874k93179j62396
8888H9101525P279r7223J5210N81161J470233K038186K503478K751311K911794
8879A01282954K353409O78072q76203j555556j704842j628774j337967j714699
8871I5496394j985671k322384k965500k743156k451478k002403j421172j118711
$$ y = [240868832, 280100132, 326565235, 365850668, 370662875, 328201614, 274321841, 226098720, 192937022, 172274126, 159556628, 151378580, 146744654, 144628990, 144572621, 145518441, 146212044, 145252419, 143527964, 141963052, 141123362, 139610662, 136938509, 132117153, 126052214, 119885054, 115013166, 111460385, 108329242, 105324595, 101723537, 98022340, 95040008, 92935857, 91337143, 90411089, 89855149, 89571974, 89557100, 89263921, 89101525, 89108804, 89011581, 89026791, 89607952, 91078185, 93116371, 95619849, 98371160, 101282954, 103636363, 104314435, 103438232, 101882676, 100177834, 98549060, 97211093, 95496394, 93510723, 91188339, 88222839, 85479683, 83028205, 81025802, 79604630, 78485919]
8863G8485919o87663l42257r994O24654O03559M44840L78623R9155n00696m65791
8853G8630349n28842m11564m98556J61407J53123L0406K46053O51318R96941J340432
8843H0771067J561739J787310J598578R18005Q61342J326144J686067K161994
8835I2672246K263151J302529l26531j530409k743661l455275l493086l613468
8827H1075496k892157j620874r18962k94240m06785l75613m33012N0732N40250
8818G4724835Q97211R79206J028737J433343J822257K551205L662949N085279
8810I2185022O460389P519644P605888O224915L915896P57127k491948n604355
8802A16572578o898180o431928n169593m201281l493961l539896l479618l319091
$$ y = [78485919, 77798256, 77455999, 77446005, 78070659, 78674218, 79119058, 79497681, 79596836, 79096140, 78630349, 78101507, 77689943, 77191387, 77352794, 77505917, 77536323, 77782376, 78433694, 79430635, 80771067, 82332806, 84120116, 85718694, 86636699, 87498041, 88824185, 90510252, 92672246, 94935397, 96237926, 95911395, 94380986, 91637325, 88182050, 84688964, 81075496, 78183339, 76562465, 75643503, 75349263, 74942478, 74566865, 74133853, 74184585, 74724835, 75622046, 76601252, 77629989, 79063332, 80885589, 83436794, 87099743, 92185022, 98645411, 106165055, 113770943, 119995858, 123911754, 124668881, 122176933, 116572578, 109674398, 103242470, 98072877, 93871596, 90377635, 86837739, 83358121, 80039030]
8794H0039030k802418k614141k759406l370138l337089l260756k786582k201476
8786E6907024j805954j316036q63784p84824l41647k5613L02811N11259N24692
8777E3107928Q63529Q03010J490219J712949K179745K945196L208321L610654
8769F9921551M116130L630212K228867K44373k704643n598226p063670p074209
8761E7700385o251691m917612l561183k825460k056313j472147j211655n68908
8753C4835416n79398o63078k48277k18579j50048j5431L54777M49539M13076j09440
8743C4068557p68997j145999j379578j573850j281584j204452o73953m51350n32953
8734B5055841l81511m17998k51842q3844k62740j49858Q9987l27706k41891j59713
$$ y = [80039030, 77236612, 74622471, 71863065, 68492927, 65155838, 61895082, 59108500, 56907024, 55101070, 53785034, 52921250, 52136426, 51794779, 51769166, 52071977, 52583236, 53107928, 53971457, 54774467, 56264686, 57977635, 60157380, 63102576, 66310897, 69921551, 74037681, 77667893, 79896760, 80141133, 77436490, 71838264, 64774594, 57700385, 51448694, 46531082, 42969899, 40144439, 38088126, 36615979, 35404324, 34835416, 34256018, 33592940, 33344663, 33126084, 32976036, 32960605, 33315382, 33764921, 34177997, 34068557, 33299560, 32153561, 30773983, 29200133, 27918549, 26714097, 26040144, 25588794, 25055841, 24674330, 24256332, 24004490, 23920646, 23657906, 23508048, 23598035, 23270329, 23028438, 22868725]
8724B2868725k34785k00390O8744o1585k55352l6506o3258j71285l47621j72813
8714B1393874l33591n2595J2041L44204J92158L14661O13319O60262M79043M90326
8704B4113702L48639j40116m71351m54117p56158p56370n34890m22079l70504
8695B0556756l41345r5092m29984o24795l69037n6113p9044q4672P786q5116j29021
8684A8270323p6866n0797K16838N2494k36609N4220j52683j90239j54828j13543
8674A7618310k10671j60440O0409L0748j99973J46246J16059O4223J52861J85273
8664A7803045J74455L77799J62741Q7440N02736L98107K96536M57772L69906M51689
8654B1082226N16168N08394N25159L09422N33636K06796P1735o3538j31139l19244
$$ y = [22868725, 22633940, 22433550, 22502294, 22440709, 22185357, 22148851, 22085593, 21914308, 21566687, 21393874, 21060283, 21007688, 21019729, 21363933, 21556091, 21870752, 22484071, 23144333, 23623376, 24113702, 24462341, 24322225, 23850874, 23396757, 22640599, 21884229, 21349339, 20927260, 20556756, 20215411, 20120319, 19690335, 19065540, 18696503, 18640390, 18561346, 18476674, 18484460, 18399344, 18270323, 18193457, 18142660, 18359498, 18411992, 18175383, 18229603, 18076920, 17886681, 17731853, 17618310, 17407639, 17247199, 17307608, 17338356, 17138383, 17284629, 17400688, 17464911, 17617772, 17803045, 17977500, 18355299, 18518040, 18605480, 19108216, 19506323, 19802859, 20260631, 20630537, 21082226, 21598394, 22106788, 22631947, 22941369, 23475005, 23681801, 23753536, 23689998, 23558859, 23239615]
8644B3239615k98279l60741o77822p38173m26954j59449j41444m39999p77389
8635A9219365p90938m73223m68255l96724l45109k26184O6145j56518r9166o9979
8625A6259414q7842J13584M20499J26495K31026N62752L71336N06746O68437L56826
8615A9529273N83579L20056J5048O5550R8813K03556p9150k52161o54869o56150
8605A9173545q38335q28296q91470j018312p43833n88021m87847k85291l37464
8596A3154676M3911q0297m4563l47753j39078j37474l7290j56911J1998j78062
8586A2089157k18993L35914J25075J86990J05017L44872Q2971j94779j85016J83120
8576A2854328J16040k9894L28243J4345K1735Q0887L60289J8972J06638j48481
$$ y = [23239615, 22941336, 22580595, 21902773, 21164600, 20737646, 20578197, 20436753, 19996754, 19219365, 18428427, 17955204, 17486949, 17090225, 16745116, 16518932, 16585077, 16428559, 16329393, 16259414, 16171572, 16285156, 16705655, 16832150, 17063176, 17625928, 17997264, 18504010, 19172447, 19529273, 20112852, 20432908, 20447956, 20513506, 20612319, 20815875, 20736725, 20484564, 19829695, 19173545, 18335210, 17506914, 16615444, 15597132, 14853299, 14265278, 13777431, 13492140, 13154676, 13198587, 13118290, 13073727, 12725974, 12586896, 12449422, 12412132, 12255221, 12267219, 12089157, 11870164, 12206078, 12331153, 12518143, 12623160, 12968032, 13051003, 12856224, 12671208, 12854328, 12970368, 12940474, 13268717, 13283062, 13304797, 13385684, 13745973, 13764945, 13871583, 13723102]
8566A3723102n13229l49934j63088l18846n01196M0372j44676j43163j33080p3705
8556A1422557J14355k0784J34992K29761n5889l0448R2520k7787j8832q0364O355
8545A1766436J35103L19228L7946p9328M87Q4177J20471K1176r5241L4489K06347
8534A2551291K80671N8900P2913L47699N6783J06095k8489J5867k99786k05645
8524A2956299j49118j89423j69648k49387l34637j52830j53470k90166k71232
8515A0996388J2575L7097j47002o5460m6766j5750Q8808j45387M4264q0123K09958
8504A0888602M8408J65613K64969K82046L44576K64845J97180O4285L24468L92525
8494A3237517k4170P7010L21032J03153m5605o866j2754l24311k11333Q0625j66500
$$ y = [13723102, 13209873, 12859939, 12696851, 12378005, 11876809, 11917181, 11772505, 11629342, 11496262, 11422557, 11536912, 11516128, 11651120, 11880881, 11824992, 11794544, 11887064, 11859277, 11840445, 11760081, 11766436, 11901539, 12220767, 12258713, 12179385, 12179872, 12264049, 12384520, 12405696, 12310455, 12344944, 12551291, 12831962, 12890862, 12963775, 13311474, 13368257, 13474352, 13445863, 13461730, 13161944, 12956299, 12807181, 12617758, 12448110, 12198723, 11864086, 11711256, 11557786, 11267620, 10996388, 11008963, 11046060, 10899058, 10833598, 10786832, 10771082, 10859890, 10714503, 10758767, 10678644, 10888602, 10937010, 11102623, 11367592, 11649638, 11994214, 12259059, 12456239, 12520524, 12844992, 13237517, 13213347, 13290357, 13611389, 13714542, 13668937, 13662071, 13649317, 13325006, 13113673, 13194298, 13027798]
8483A3027798j33145K39705j12715Q1727J01357J57931P6789J813K87845R4046
8473A3823151K18200J95114K45460M73480J90857M03776O86514O27973O23589
8464A7488114R53427J081421J241396J376338J676993K033259K152076K580705
8456C0583729L042484K592637K413070K162801J421981P13280K0436j003522j709309
8447D0237587k397216k898020k976846l056227k374823k285090j760141j333959
8439B1155265j359464q51544o14916m60656k12056l63035l66358j60813J16829
8430A6883252L4182J9551L12447M07455N95923N08924R38623J065707J502149
8421B2268213J764377J832494K231983J908132J871805J398566Q66586j8263o19633
$$ y = [13027798, 12894653, 13134358, 13021643, 13103370, 13204727, 13362658, 13439447, 13441260, 13729105, 13823151, 14041351, 14236465, 14481925, 14955405, 15146262, 15550038, 16236552, 16864525, 17488114, 18441541, 19522962, 20764358, 22140696, 23817689, 25850948, 28003024, 30583729, 33626213, 36218850, 38631920, 40794721, 42216702, 42929982, 42950418, 41946896, 40237587, 37840371, 34942351, 31965505, 28909278, 26534455, 24249365, 22489224, 21155265, 19795801, 18944257, 18329341, 17868685, 17656629, 17293594, 16927236, 16766423, 16883252, 16917434, 16936985, 17249432, 17656887, 18252810, 18761734, 19700357, 20766064, 22268213, 24032590, 25865084, 28097067, 30005199, 31877004, 33275570, 34142156, 34123893, 33504260]
8412C3504260j314069j741122k166102k547201k475694k348010k081126k048040
8404A6782896j594765j311630j127899o77144p17959p89664m71483l46954k69307
8395I476091m38391m51853l33237j32242k81145j98028j70723p8416l5296j96560
8385G160200m27754j75880k5320k55255j79321j44744r7441k38683K6085q6100
8375E555787m6757j12807q8616p2333k02842r6455j99941j26268n4947l8336K47427
8364D763912j49255j93999N1926P0945J80218o4563j21824j04110L0679m2049
8354D421880J3643j8824k22539R5059J16157j57693l9337P4596k6445r8415L661
8343D161743K3370j06879p3330q0493j17045O4873M4837J3950q1991J64764j25661
$$ y = [33504260, 32190191, 30449069, 28282967, 25735766, 23260072, 20912062, 18830936, 16782896, 15188131, 13876501, 12748602, 12071458, 11353499, 10563835, 10092352, 9745398, 9476091, 9037700, 8585847, 8252610, 8120368, 7839223, 7641195, 7470472, 7392056, 7356760, 7160200, 6732446, 6556566, 6531246, 6275991, 6096670, 5951926, 5854485, 5615802, 5641887, 5555787, 5509030, 5396223, 5307607, 5235274, 5032432, 4935977, 4736036, 4609768, 4554821, 4516485, 4763912, 4614657, 4420658, 4472584, 4543529, 4723747, 4659184, 4537360, 4433250, 4463929, 4421880, 4435523, 4416699, 4194160, 4289219, 4405376, 4247683, 4208346, 4282942, 4256497, 4158082, 4161743, 4185113, 4078234, 4004904, 3924411, 3807366, 3872239, 3917076, 3931026, 3849035, 4013799, 3888138]
8332C888138n5206m107J78384j2036l8559n5188O656L9607J41610j62427L3623
8321C960495K36356n2425n3575Q0745K81528j15006j91474j95187N161j9025j13582
8310C824011k01596k4673j59276j09102j49115m7639o7513K59801J11757r7570
8300C339085K36015m1426n1234j64474p5608n1141n7203j79657J6540P6852O9776
8289C117525j65262p9832j4011J57457J14324k62785R6704Q7202O6907J7155P3345
8278C208729J29061K89971l24113j41318j21977P0603M8234j34248m3027j94825
8268B787090j65932J65668P4473J54266k67561k0915M4755j61750m0835R5028
8258B664287L4907l32283j89424l9988J21942K4380P980k93423l9790K9984N9424
$$ y = [3888138, 3832932, 3828825, 4007209, 3995173, 3956614, 3901426, 3908082, 3947689, 4089299, 3926872, 3960495, 4196851, 4144426, 4090851, 4171596, 4453124, 4338118, 4146644, 3951457, 3956618, 3937593, 3824011, 3622415, 3597742, 3438466, 3329364, 3180249, 3132610, 3065097, 3324898, 3436655, 3339085, 3575100, 3533674, 3482440, 3317966, 3242358, 3191217, 3134014, 2954357, 2970897, 3047749, 3117525, 2952263, 2872431, 2858420, 3015877, 3130201, 2867416, 2964120, 3051322, 3118229, 3135384, 3208729, 3337790, 3627761, 3303648, 3162330, 3040353, 3110956, 3159190, 3024942, 2981915, 2787090, 2621158, 2786826, 2861299, 3015565, 2748004, 2727089, 2771844, 2610094, 2569259, 2664287, 2699194, 2366911, 2177487, 2137499, 2259441, 2283821, 2291801, 1998378, 1958588, 1988572, 2047996]
8247B047996k26709j26513P3513J69498J31695R4485n1923m9717K1009K1923k94966
8236A810291K4045P6533N2831j3572L0719N3475L5986J4429j30441j26792K08915
8225B036419j81920k40225L72715o6305m9088m54758p3182R9193Q0794p8830l5007
8214A409806n7296j06508K6025J04964J94698j98199p931r3136j5617q1634k6632
8203A148540p9040K1281l3353k4067j60955L89723l64028J3984k19951o7837j686022
8192a061725q95561L393486L66385j3227j93897j04449J06910J90885q9442j81083
8182A518282j19964p1436K2677L4245N1697j16059l55j03986q0382j16613L55737
8171A373843q1638j21559j7985k37125J45316K34845n5722q3666N009j6849j28549
$$ y = [2047996, 1821287, 1694774, 1768287, 1937785, 2069480, 2163965, 2112042, 2062325, 2083334, 2105257, 1810291, 1834336, 1910869, 1963700, 1950128, 1980847, 2034322, 2070308, 2084737, 1954296, 1827504, 2036419, 1854499, 1614274, 1986989, 1920684, 1871596, 1416838, 1343656, 1442849, 1523643, 1444813, 1409806, 1352510, 1246002, 1272027, 1376991, 1571689, 1373490, 1365559, 1272423, 1256806, 1175172, 1148540, 1069500, 1090781, 1057428, 1033361, 872406, 1262129, 898101, 912085, 692134, 624297, -1061725, -1957286, 1436200, 1802585, 1789358, 1595461, 1491012, 1597922, 1788807, 1699365, 1518282, 1398318, 1326882, 1349559, 1383804, 1435501, 1319442, 1319087, 1215101, 1134719, 1018106, 1373843, 1292205, 1170646, 1152661, 915536, 1060852, 1295697, 1239975, 1156309, 1161318, 1144469, 1015920]
8160A015920l7810O6360j75298o9726K47324J2044M7532r6654N1844K5620J52081
8149A239237L7348j40949o0527K91194o862j37632j09803j76599r7309L7308J61270
8138A036676L7811r2622k0633M017j43156o7898l8674J25565p225N5472o6905
8127H22428r1824Q0890j80359K48464R1335j53428K0392R9628o2575j34379j13850
8116F26722J89800m3822j5383M4838K18736j9679j09600j84021K07804J03477
8106A018872O2077r7170k27100J90405n7402r9599k801J24893m6329K28953O8682
8095A163481j77987j52068L7085L1111j25317J8017K15424j4407k2810k955K49065
8084A218639k03185k22067r4596K6129r9115n6220K77496n0400J14169q1452n3169
$$ y = [1015920, 978110, 1044470, 869172, 799446, 1046770, 1058814, 1106346, 1009692, 1061536, 1087156, 1239237, 1276585, 1135636, 1075109, 1366303, 1359441, 1221809, 1112006, 935407, 838098, 875406, 1036676, 1074487, 981865, 961232, 965249, 822093, 754195, 715521, 841086, 833861, 889333, 822428, 730604, 811494, 631135, 879599, 970934, 817506, 837898, 937526, 874951, 740572, 626722, 816522, 772700, 757317, 802155, 1020891, 1001212, 891612, 707591, 915395, 1018872, 1080949, 983779, 756679, 947084, 889682, 790083, 787282, 912175, 865846, 1094799, 1163481, 985494, 833426, 870511, 901622, 776305, 794322, 1009746, 995339, 972529, 969574, 1218639, 1015454, 793387, 698791, 724920, 625805, 569585, 847081, 796681, 910850, 829398, 776229]
8073G76229L2119r7731O2854K1270l3662r2927J61557K6311R7883L6085j13627
8062H76361J67429k7579k17656n153j04743J48780j5092k2332N1608K2031j23519
8051G50135J2580K29436m048O5440m6383K5356R363J96688P400K37842P4401J13754
8039A671964n4493O5093J18644Q1851L3984K05831N59734M93178M46311P16629
8029D338726Q47787N10417J94880j11702o09104p48677p95244o93279n66185m14223
8019A953396j03317m73645k86170q0848j8908N5854O9881j51566k57323n5321
8009F52033l07020k05123K18474j6312R0387O3641p5825j54203O2689J21210k76922
7998A73029j44477J80355j44578l259j14433N5546j4091p0586K24298J80587J8234
$$ y = [776229, 808348, 710617, 773471, 794741, 761079, 668152, 829709, 856020, 953903, 989988, 876361, 1043790, 1016211, 798555, 793402, 688659, 837439, 822347, 800015, 851623, 873654, 750135, 762715, 992151, 988103, 1053543, 1007160, 1032516, 1041879, 1238567, 1245967, 1483809, 1558210, 1671964, 1617471, 1682564, 1801208, 1883059, 1917043, 2122874, 2682608, 3175786, 3622097, 4338726, 5186513, 5696930, 5891810, 5780108, 5171004, 4422327, 3627083, 2933804, 2367619, 1953396, 1850079, 1376434, 1090264, 1009416, 990508, 1046362, 1116243, 964677, 707354, 652033, 345013, 139890, 358364, 342052, 432439, 496080, 420255, 266052, 328741, 449951, 173029, 28552, 208907, 64329, 61070, -53363, 2183, -11908, -82494, 141804, 322391, 340625]
7987C40625Q2731o9595J02819j70993J25827R468P068J00032j57270j16035q9522
7976A65155K82549j72094k39155P3037l986M0115m451L8226N9909P7685O5170
7965C82160n8687r961j00669p260j105p7387J7048M9330J25989r6995j21341R4937
7953A96059l4527J98956J48789k30413q8437J14120Q4157N4117J6546j1435O7774
7942E15706L1386j86207M7419o2957K26181j79945o8657J47102P8801r055k0023
7931E19751p2243N2599p5837J03050J00011l0685j22846J366j75601o8787R6949
7920C27727p1306J11917m1576M3367j28715R6724L15333q4431l06078K28081K11653
7909G02696l22320J18637P2856q5217k5815J731J94155N6174J02292j8822j29559
$$ y = [340625, 423356, 353761, 456580, 285587, 411414, 420882, 427950, 527982, 370712, 254677, 165155, 447704, 275610, 36455, 109492, 105506, 145621, 141170, 179396, 239305, 316990, 382160, 323473, 313512, 212843, 205583, 204478, 127091, 144139, 193469, 319458, 222463, 101122, 196059, 161532, 360488, 509277, 278864, 190427, 304547, 388704, 442821, 459367, 447932, 515706, 547092, 360885, 408304, 345347, 571528, 391583, 322926, 470028, 548829, 539774, 519751, 447508, 500107, 424270, 527320, 627331, 596646, 473800, 475166, 299565, 230778, 327727, 256421, 368338, 326762, 370129, 241414, 338138, 653471, 569040, 262962, 491043, 702696, 380376, 499013, 571869, 486652, 460837, 462568, 656723, 712897, 815189, 796367, 666808]
7898F66808p0674m0177M7749L7911j6959P8912k7168j82983m9513l3399L01962
7887G12469O4744j50966J3366O6427j00673l4548J37478m4311k7962n3784k20003
7876C62237l24P46O687J20800j59283P7514O0454m7581j78449J7515J65298Q7495
7864E13109L7465J3139K3082O8044j53525J24825n7914j65761K9921K7821l2199
7853D28007P9537j50018q9549P7017N5264J07552n8179k09319N2830K41119J2629
7842E46890Q3618J58643o8255j27900l0829l61301K8911m590j08091J95279j74150
7831A38225j68779K57213n1545r5687J37265r3615k03066J2072Q5093N0997M6843
7820A15016r011J21571j91734M226n2998K3420R2264P8094m8520m0645P5765K6504
$$ y = [666808, 596134, 555957, 603706, 641617, 624658, 703570, 676402, 493419, 443906, 410507, 712469, 777213, 626247, 639613, 706040, 605367, 570819, 708297, 663986, 636024, 582240, 362237, 361913, 362659, 369346, 490146, 330863, 408377, 468831, 421250, 242801, 260316, 425614, 513109, 550574, 563713, 586795, 654839, 501314, 626139, 568225, 402464, 432385, 460206, 428007, 507544, 357526, 267977, 344994, 400258, 507810, 449631, 240312, 293142, 534261, 546890, 630508, 789151, 720896, 592996, 562167, 200866, 229777, 225187, 117096, 312375, 138225, -30554, 226659, 175114, 79427, 216692, 123077, -79989, -67917, 17176, 68173, 115016, 106005, 227576, 35842, 40068, -12930, 10490, 102754, 180848, 132328, 91683, 167448, 193952]
7808A93952r9170q3924J73447m5579R7982m2423p979R1559j08162j5055K86672
7797D41320m78363l20721K09625P5897J51356N566J17432o0060P0405j08013q4627
7786A9817k9261J87375p1167j64167J3781J3325K42786N1168n9761p9524J4938
7775A39310k5478M4432n1308K16303J7078q3450k48643M683J92284j05345M9488
7764A49354K0082J94826O425j51947k76256N7439J04060J92373j45929O8964J13785
7753C33176j04717J80646J45941j15932K4434k5696O2905J54295J9848n4763j73546
7742D46591J62341j02441N3760o826l4938Q1254j46503j43594K18811M41P7191
7731F06087j1699j5361R74N8117J99690P1049q0446O4319j44360K1389n0375Q2396
$$ y = [193952, 94782, 10858, 184305, 138726, 236708, 194285, 186306, 277865, 169703, 154648, 441320, -37043, -357764, -148139, -72242, 79114, 84680, 202112, 142052, 212457, 104444, 19817, -9444, 177931, 106764, -57403, -43622, -30297, 212489, 263657, 203896, 124372, 139310, 113832, 158264, 106956, 323259, 340337, 256887, 8244, 12927, 205211, 99866, 149354, 169436, 364262, 370687, 218740, -57516, -77, 103983, 296356, 150427, 219391, 333176, 228459, 409105, 555046, 439114, 463548, 437852, 500757, 655052, 674900, 620137, 446591, 608932, 506491, 560251, 553425, 518487, 599741, 453238, 309644, 528455, 528896, 606087, 594388, 579027, 580001, 638118, 837808, 908857, 828411, 892730, 748370, 769759, 719384, 801780]
7719H01780J58797K85334Q9804K71036j4058J12755L8510k46016j01472n9122
7709A337348j36737l48625r886q9414J54016O7137j43472J8452k7071j59175k13045
7698D49528R844J43545k42346k9608j27007K07363j2024J8086j1438j80980j381
7687B23582r6854J04408N5398J34851k38862K9908k2142j01389n6774j78091J00258
7676d5707N931Q3254n0934K35735J54721j45719K5828j34540J3515J90092k32896
7665I9280r1928O7965J44014N6741R819j14433J1553j3406o4656l1008M2980l9296
7653G7625o2541j23220J02387J10908j935O8913o6096j02527P0966q2392M1097
7642C3185J49014R5124l12266j40407J89980m6361M8648K23045k12381N8633p0400
$$ y = [801780, 960577, 1245911, 1335715, 1606751, 1592693, 1705448, 1743958, 1497942, 1396470, 1337348, 1200611, 851986, 842100, 752686, 906702, 973839, 830367, 848819, 821748, 662573, 449528, 459372, 602917, 360571, 330963, 203956, 411319, 399295, 417381, 405943, 224963, 223582, 126728, 231136, 286534, 421385, 182523, 212431, 190289, 88900, 32126, -145965, -45707, -39776, 43478, -7456, 228279, 383000, 237281, 263109, 128569, 142084, 332176, 99280, 7352, 75317, 219331, 276072, 285891, 171458, 183011, 169605, 104949, 73941, 116921, 77625, 15084, -108136, -5749, 105159, 103224, 172137, 106041, 3514, 74480, -7912, 33185, 182199, 277323, -34943, -175350, 14630, -31731, 16917, 239962, 27581, 86214, 15814]
7631A5814Q84Q3647j0549P5236j31471J56476l7563J30435j00996J462M9770j3001
7619B20144q1131k21485J31454J59673l6608n6305K9044R0686j18792o24m1856
7608G4200J60J9107o899J9428k5194p0695N8029J91983j00222p0598J61459j6771
7596B33987j69631j36361J39925Q3412M3038P9034O8525Q0921Q1751j05579j90283
7585B08739J09939O0483j11588n8318K1700j45503j31341L10499J2249l7758o9821
7574A69280n5243Q305J30251K00412M1510j05653j08506J23577K13999k32191
7564C85741n7986m6761J53689J31375O3053M4493j06925J92863J48217M00042
7554A307801J96924L45503L15483K6496j810m64660l47113o6138j41298q6388
$$ y = [15814, 16698, 100345, 89796, 165032, 33561, 190037, 152474, 282909, 181913, 183375, 233145, 220144, 139013, -82472, 48982, 208655, 172047, 115742, 144786, 235472, 116680, 116056, 74200, 74360, 93467, 86568, 105996, 80802, 10107, 68136, 260119, 159897, 89299, 250758, 233987, 64356, -72005, 67920, 151332, 194370, 273404, 341929, 422850, 504601, 399022, 208739, 318678, 379161, 267573, 209255, 230955, 85452, -45889, 264610, 276859, 239101, 169280, 114037, 122342, 252593, 453005, 494515, 388862, 280356, 403933, 617932, 385741, 327755, 280994, 434683, 566058, 629111, 673604, 566679, 759542, 907759, 1307801, 1504725, 1850228, 2165711, 2192207, 2190397, 1725737, 1378624, 1312486, 1171188, 1084800]
7544A084800j04411j27091q776N1734J34677J40592k79835j11886K74479J01209
7534A155492M3593J22911J81284K64533K95203K41899l19318k02899k95156l46158
7524A141384j48790j15939j75029O9821l1330o9594q7448o9718O3153N4455j44820
7513D86145q8324J45029p8241n8066n109j9949j37060O7730J66623j06365j05814
7502B66599K14760P0197M5910j16601K8391k08855N870K2463j9043K19436j15753
7491D13374k00564N8758l9431o0934J89348j23870Q0961Q6145k19458J58392Q7876
7480D30597O413j38326q0449J71751n7214j30376K1311K23081j45552O6634l7036
7469C30834J45800j0280o2478j34167m0632K6079L4237K4613j79984J6166L0271
$$ y = [1084800, 980389, 853298, 844522, 896256, 1030933, 1171525, 891690, 779804, 1054283, 1155492, 1199085, 1321996, 1503280, 1767813, 2063016, 2304915, 1985597, 1782698, 1487542, 1141384, 992594, 876655, 701626, 771447, 740117, 670523, 583075, 513357, 576510, 630965, 486145, 397821, 542850, 464609, 406543, 401434, 381485, 244425, 312155, 478778, 372413, 266599, 481359, 551556, 597466, 480865, 509256, 300401, 306271, 328734, 309691, 529127, 413374, 212810, 271568, 232137, 171203, 360551, 236681, 317642, 403787, 184329, 342721, 430597, 437010, 298684, 218235, 389986, 332772, 202396, 223707, 446788, 301236, 367870, 330834, 476634, 466354, 403876, 269709, 229077, 255156, 289393, 314006, 134022, 150188, 180459]
7458A80459J71957k54666p6351r4294j08610R6262j33371K05827N8560K4161l1055
7447C8879J24837J84980l11384n6595R4708r360J7047m9588p4732P2051P2422
7436A03265j3695p0329j71036P1036Q1893j6027r9836o3959Q4213P1894J64321
7425A41740K286j10904n5135K52845K38888l02088k02206O7670L901L2066o472
7414F2591R9461k4790o342L6677k67770J00151O0410j83389M4475q5535P7032
7403h7029P5325N6555k85039j59235j2009K52965J12739P3256j19972j75856K10949
7392e7351k5831j60120M9170R0011n4652J42060J31022R087Q2972j09949j04165
7381g746J50730O4212j05372j42905O8442k0752j71353r6369O1109Q5233K77396
$$ y = [180459, 352416, 97750, 21399, -72895, -181505, -85243, -218614, -12787, 45773, 69934, 38879, 163716, 348696, 37312, -19283, 75425, 66065, 83112, 33524, -41208, 30843, 103265, 89570, 19241, -151795, -80759, 1134, -14893, -114729, -178688, -94475, -22581, 141740, 144026, 33122, -22013, 230832, 469720, 167632, -34574, 33096, 36997, 69063, 62591, 162052, 137262, 130920, 167597, -100173, -22, 60388, -123001, -78526, -164061, -87029, -11704, 44851, -240188, -399423, -411432, -158467, -45728, 27528, -92444, -268300, -57351, -83182, -243302, -194132, -104121, -158773, -16713, 114309, 123396, 206368, 96419, -7746, 142984, 207196, 101824, -41081, 27361, 6609, -164744, -261113, -200004, -114771, 162625]
7370A62625l9273J43450j15970k48875j27847P6494K0429k12220P5271L89944
7360A24028J01753j58008j11185j53726Q4567j2858K8545j06890L7879K64903
7350I9008k5148p7464O1929o8667J46406J12589K5866O73Q9008n6321j86416J97455
7338C18918j18483q4701R266p3167m5432O773Q0512j33j81643R2280j9637k30661
7326b46108r6306L4519J31823l8611n5761J88445L267p9685o1802j48934J97472
7315a71681O189R1624M9915l9145p6513l3937m10J43972K0461M5469j09698o7433
7303a41187j12120N6005K22417o2732q2951O6510J04742j78780j38605q659O7812
7292b07548P4191p7673j03136O3506Q8987j21947o9902J26698J68512O8990j51292
$$ y = [162625, 123352, 266802, 150832, -98043, -225890, -149396, -128967, -341187, -265916, 124028, 225781, 67773, -43412, -197138, -112571, -125429, -96884, -203774, -165895, 99008, 73860, -3604, 58325, -10342, 136064, 248653, 274519, 275192, 364200, 307879, 121463, 318918, 200435, 115734, 125000, 51833, 6401, 13174, 93686, 93553, -88090, 4190, -15447, -246108, -342414, -307895, -176072, -214683, -270444, -81999, -78732, -158417, -220219, -369153, -171681, -165492, -73868, -23953, -63098, -139611, -173548, -173958, -29986, -9525, 35944, -73754, -141187, -253307, -197302, 25115, -37617, -120568, -54058, 50684, -128096, -266701, -275360, -207548, -133357, -211030, -314166, -250660, -161673, -283620, -353522, -226824, -58312, 10678, -140614]
7281a40614l0930J13810j30109J38671N7363o2215P9942q3818j63255n1631L90344
7270A17558j08291r0320k7936o8867J49537k739k32503j9166J57443M5993K8170
7259e1121o7557j1817J15102P6833j95204J15979K1213O1477P4798j85740l8676
7248h4713n5878Q0392Q3452k7435J7954N3225l0189p9804R4721o4109O6032J18396
7236A72044L4354k9815j275J21338j14445J55785J80572J08900j09824R355K48618
7225G75607r1093j21504O2237j3972l04403K3582m325q9113l195r1001J18479
7214B61299n1114Q4043n6457J07218M5468J02110J58171j15244J10439K03494
7204H49427k20813L09238R4389N9646J80423K71412j10389j39543j5596l13393
$$ y = [-140614, -171544, -57734, -187843, -49172, 8191, -54024, 25918, -57900, -221155, -272786, 117558, 9267, -81053, -108989, -177856, -28319, -31058, -263561, -282727, -125284, -79291, -51121, -118678, -130495, -15393, 61440, -133764, -17785, 3428, 64905, 139703, -46037, -84713, -140591, -60199, 23253, -4182, 13772, 66997, 36808, -42996, 51725, -12384, 53648, 172044, 206398, 176583, 175308, 296646, 182201, 337986, 518558, 627458, 517634, 526989, 775607, 684514, 563010, 625247, 611275, 306872, 330454, 326129, 237016, 233821, 142820, 261299, 210185, 294228, 237771, 344989, 390457, 492567, 650738, 535494, 645933, 849427, 628614, 937852, 1032241, 1091887, 1272310, 1543722, 1433333, 1293790, 1278194, 964801]
7194I64801m44167k6498K32107r2209J03141n8524j3891l18033o3139l7136o9250
7183A77202o5581k01414J13804J71457P9934k0079L525N9581K29493Q1654j65033
7172D64543J71755r198k2042J9074j8545l37560r3541J47879k56048M3189R1443
7161B00949j45797L5017q9244J75871l6263j22770l5545K7155J9483j79470n2054
7150b02668L3934M2880J10645p2515P4497O9602p9884k6907r8574J5459J58167
7139B4636q1454p5089R749O7072k2137J8069p5265L6970O0498o1699J15604O5404
7127H2358R5312j40068j62801L3636N1225j6105q0046o8691M6958J18421p000
7116d6801o96J75339j42507N9850j77817j7659m0412o596L0987j18617J11524
$$ y = [964801, 520634, 494136, 726243, 634034, 737175, 678651, 664760, 346727, 283588, 246452, 177202, 111621, -89793, 24011, 195468, 275402, 255323, 258848, 318429, 547922, 629576, 464543, 636298, 627100, 605058, 624132, 605587, 268027, 174486, 322365, 66317, 109506, 200949, 55152, 90169, 925, 176796, 140533, 17763, -17782, 9373, 28856, -150614, -202668, -168734, -125854, -15209, -87724, -13227, 56375, -23509, -50416, -148990, -133531, 24636, -56818, -131907, -122158, -55086, -77223, -59154, -134419, -97449, -36951, -98650, 16954, 82358, 177670, 37602, -125199, -91563, -40338, -56443, -136489, -205180, -158222, -39801, -46801, -47497, 127842, -14665, 45185, -132632, -150291, -190703, -197299, -166312, -284929, -173405]
7105a73405K0334J35929Q9700j10502L827J833q4433j25407J7132K71853j47369
7094a00508n9864O4016j35773L0195J62593L2390P0519L7218j22360L4149J8374
7083C0949j58399k3925J05156n4497J04467o3777o7321K8668J47829j20685q4227
7072a55762J84856p9829K7450J51021q3392p9070J57567j52311j06684j13492
7062b49646J85092M6349j79765j2339J94678Q4205O4012j93750m5926J50113J6026
7051E9049p5912K41358J66318q090r5969O8459j72492k66666J07018n0302N3746
7040B6517J83467j41941r3220Q6402J12282P9768j40076L6301q1602J66405J76211
7029D10514k7569l3512j15305j8283J2301j19832p804j28053J28961n6828P4670
$$ y = [-173405, -153071, -17142, 72558, -37944, -34117, -32284, -116717, -242124, -224992, 46861, -100508, -160372, -96356, -232129, -201934, -39341, -6951, 63568, 100786, -21574, 12575, 30949, -127450, -151375, -46219, -100716, 3751, -60026, -127347, -98679, 49150, -71535, -155762, 29094, -50735, -23285, 127736, 44344, -34726, 122841, -29470, -136154, -249646, -64554, -18205, -197970, -210309, -15631, 68574, 132586, -61164, -107090, 43023, 59049, -16863, 224495, 390813, 382723, 286754, 355213, 182721, -83945, 23073, -27229, 26517, 209984, 68043, -25177, 61225, 173507, 253275, 113199, 149500, 67898, 234303, 410514, 382945, 349433, 234128, 215845, 228146, 108314, 100510, -27543, 101418, 44590, 119260]
7018A19260J19406J09871j09457O9176J32699K8532P541Q565J39513j1974r6753
7007E16379k3957R960k494j51062K5672j5400j15920Q2843O3028k0778m4525k9790
6995B93956j27664K8482m3823m2658q0951N3105J03865k12101K19557J39894l6090
6984B95572J89088j23551p6507j1429k2789J15349J90403j2341j0940K14002k24975
6973E21882q6673q0309q3334r798j66518Q8051p5365j3027n0228o4241Q4319O2745
6961A27504K35864l6535j5509K8915l2848Q5932l5696j0803O0687M0998J80869
6950F29378Q1893m2383p4273j49972q8507J2979R6499J44812k59879j70220L0420
6939B10747p8536r3685R6430J58738k71182J9921M5730N9198r0201O9414K14171
$$ y = [119260, 238666, 348537, 239080, 308256, 440955, 469487, 477028, 485593, 625106, 613132, 516379, 492422, 502382, 499888, 348826, 374498, 359098, 243178, 326021, 389049, 368271, 323746, 293956, 166292, 194774, 150951, 108293, 27342, 80447, 184312, -27789, 191768, 331662, 295572, 484660, 361109, 284602, 273173, 250384, 365733, 556136, 543795, 532855, 746857, 521882, 435209, 354900, 271566, 261768, 95250, 183301, 107936, 94909, 44681, -19560, 64759, 127504, 363368, 326833, 311324, 340239, 307391, 393323, 357627, 346824, 407511, 448509, 629378, 711271, 668888, 594615, 444643, 356136, 369115, 465614, 610426, 350547, 180327, 210747, 132211, 38526, 134956, 293694, 22512, 42433, 88163, 147361, 57160, 126574, 340745]
6928C40745o6033r8529p41J48202J43932j67810j25255k3909k9382j03127K60352
6917B78445J30905p3422j1704j0622k36520j84215M3888j28153O5317J56153j88298
6906a58226J70154J40858o4862M6538k9167j08919K0489P445k47961J68611N2052
6895b988j12622n3117M0420J18692J43287L1043q3031R6886q7345M2042j2983
6884A20284p5078R729l0089n0737J52642J48472q6273k30943r4719J30730J66635
6873A60653j46236N909R7922j37480k9167j84379L1059P4077q264j32925J33605
6862a35226J90780j59207P550p6013K1873J34098J54809j2802l16225P6276J49599
6851C5512q9907j11240j61283N8078K31284J02135l5952p7m3510r654j31018L8695
$$ y = [340745, 274712, 176183, 175442, 323644, 467576, 299766, 174511, 150602, 121220, 18093, 278445, 409350, 335928, 324224, 313602, 77082, -107133, -63245, -191398, -126081, 30072, -158226, 11928, 152786, 87924, 134462, 105295, -3624, 16865, 24310, -223651, -55040, -2988, -115610, -168727, -128307, -9615, 133672, 164715, 81684, 178570, 91225, 133267, 120284, 45206, 54935, 24846, -25891, 126751, 275223, 188950, -41993, -136712, -5982, 160653, 14417, 20326, 118248, -19232, -48399, -232778, -201719, -127642, -135906, -268831, -135226, 55554, -103653, -96103, -172116, -150243, -16145, 138664, 125862, -190363, -114087, 35512, -54395, -165635, -326918, -268840, -37556, 64579, 28627, 28550, -14960, -24614, -155632, -116937]
6839a16937l666J63072K54128j12182j33647J1649Q470L0288Q2664j9505j01963
6828F2371O9262m524j37281L6414O1911j26570M1721K14228Q5345k0121k74020
6817H736K79534k7490k45961N2561J92434N0200j40458k77179L02975J08772j05742
6806A98382k2196J79368j21340j31629o1086J15234k952K26325j88866j09895
6796H1345J73565j14450K15447J5263l042r8720q5483o4327J00646J21664p307
6785C34601l2549J05700P1315n4452K7286j2017O6772j68244M1162J58290r3392
6774D44472J22746j91331k1118M5904O8700Q6499K20076j08681p0996M1288P7405
6763G14964r7998l477j56056q5567J27464R0226O7543j31811r3312J48880K387
$$ y = [-116937, -120603, 42469, 296597, 184415, 50768, 62417, 70887, 101175, 183839, 164334, 62371, 131633, 127109, -10172, 26242, 88153, -38417, 3304, 217532, 302877, 282756, 8736, 288270, 260780, 14819, 67380, 259814, 310014, 169556, -107623, 195352, 304124, 198382, 176186, 355554, 234214, 102585, 41499, 156733, 153781, 380106, 191240, 81345, 254910, 140460, 355907, 371170, 368128, 269408, 183925, 119598, 220244, 341908, 334601, 302052, 407752, 479067, 424615, 451901, 439884, 506656, 338412, 379574, 537864, 444472, 567218, 375887, 354769, 400673, 469373, 555872, 775948, 667267, 596271, 637559, 714964, 616966, 613489, 457433, 371866, 499330, 589556, 657099, 525288, 431976, 580856, 583243]
6752E83243M605r2196Q0374J14852r3298L32786K42387j8196o8875M0772j47358
6741I79096J02394K3772r0809O6132P4596J98772L28054q8022o6912j6702j1386
6730A498985K40264R5973j72491j29982j27862R8833O5237j02748o7637J97273
6720A595845Q0309j67121P3617J1542Q128J4249J72973N0579J42748J0911k0143
6709A973637J49887L5931L40586J87849Q9843K34466P9731j79679o4779q4943
6699B762529l86974j60200l60279j10795J4642J4963j92903j28085o5869p862
6689A379167j22105J38981K24353p9249j492M7277L5993r695M2628J09097J43664
6678A908619K02845O480k73334j11879j20917O0380M8468l20289k62354K9408
$$ y = [583243, 587848, 495652, 576026, 690878, 597580, 930366, 1172753, 1154557, 1085682, 1126454, 979096, 1081490, 1105262, 1014453, 1080585, 1155181, 1353953, 1682007, 1593985, 1527073, 1510371, 1498985, 1739249, 1835222, 1662731, 1532749, 1404887, 1503720, 1568957, 1466209, 1398572, 1595845, 1676154, 1509033, 1582650, 1594192, 1602320, 1616569, 1789542, 1840121, 1982869, 1993780, 1973637, 2123524, 2159455, 2500041, 2687890, 2777733, 3012199, 3091930, 2912251, 2847472, 2762529, 2375555, 2215355, 1855076, 1744281, 1758923, 1773886, 1580983, 1452898, 1387029, 1379167, 1257062, 1396043, 1620396, 1541147, 1539655, 1586932, 1622925, 1613230, 1655858, 1764955, 1908619, 2111464, 2117944, 1844610, 1732731, 1611814, 1672194, 1720662, 1400373, 1138019, 1167427]
6668A167427j45775r4605O0753j31732o4539K26102J68660o4780j92041L4580
6658I64050m4960k39275J28419p545q5573M7119l1745J80267K5861p6269J9132
6647H79481K4590l8784p0073J97538M7717j22193r8932q2486J12113J11595N9581
6636A020147Q624k2172L9619j97457J81716j33348k55906N1216J46973J04845
6626I44257J43574O4118n172k2321o12M7529R4828M2925j62730n1057j03033m537
6614I87769J62504q7975J65447J55417l35636r7758L9523J72075j22244L0527
6604A069649J15095J24071p8075r6451j8920K962J52140K03077M3066r3363J12302
6593A535553l8606p8535J18870j73667j73325Q0520O7876j72951n273J18551r4089
$$ y = [1167427, 1021652, 927047, 987800, 856068, 791529, 1017631, 1186291, 1121511, 929470, 964050, 919090, 679815, 808234, 800689, 715116, 762235, 730490, 910757, 936618, 860349, 879481, 904071, 865287, 795214, 992752, 1040469, 918276, 819344, 736858, 848971, 960566, 1020147, 1028771, 1006599, 1046218, 848761, 1030477, 897129, 641223, 692439, 839412, 944257, 1087831, 1151949, 1146777, 1124456, 1123844, 1171373, 1266201, 1309126, 1146396, 1095339, 992306, 987769, 1150273, 1062298, 1227745, 1383162, 1047526, 949768, 989291, 1161366, 1039122, 1069649, 1184744, 1308815, 1230740, 1134289, 1115369, 1118331, 1270471, 1473548, 1516614, 1423251, 1535553, 1496947, 1418412, 1537282, 1363615, 1190290, 1270810, 1338686, 1165735, 1160462, 1279013, 1184924]
6582A184924k50224K01207M6807p343J12016J9643j6096K3783J55849N5443M2137
6571A568146J2865O1828r3020R988K9822r0700J74384r4575K753J78086O5028
6560A824605j0870n8975q7371M5912n5025p242n8390k5772K25731K03350j472
6549A994481L06851J01507p0556p9977N3247L59466o3063J10662j35747p1296
6539B505575J50759r7093L8415Q2419R1960L7716J49711R931j55418J36653M408
6528B955036m334J70221n8999O3101J90701l4625J20319K1213k7466K4473K40171
6517C659811j72889k4511M9988j90700J36685M71665J78378n3803L3921j08058
6507C980487O5581j04495j70109m3834k80263p4823j69887J118K9906O292K4395
$$ y = [1184924, 934700, 1135907, 1182714, 1175371, 1287387, 1307030, 1290934, 1314717, 1470566, 1526009, 1568146, 1581011, 1642839, 1549819, 1559807, 1589629, 1498929, 1673313, 1578738, 1581491, 1759577, 1824605, 1813735, 1754760, 1667389, 1713301, 1658276, 1651034, 1592644, 1566872, 1792603, 1995953, 1994481, 2301332, 2402839, 2332283, 2252306, 2305553, 2665019, 2601956, 2712618, 2576871, 2505575, 2656334, 2559241, 2597656, 2680075, 2772035, 2809751, 2959462, 2969393, 2813975, 2950628, 2955036, 2950702, 3120923, 3061924, 3125025, 3315726, 3281101, 3401420, 3422633, 3395167, 3419640, 3659811, 3486922, 3462411, 3512399, 3321699, 3458384, 3930049, 4108427, 4054624, 4088545, 3980487, 4046068, 3941573, 3771464, 3727630, 3447367, 3372544, 3202657, 3203775, 3233681, 3239973, 3264368]
6496C264368P6759Q4832M1867k15249q8098k66533P7802L630j55231J47455j895
6485B969707K02738n7638N3013Q1089J21138k8368j09350j48349k05131J0600
6475B889449l2354J52891n3334K3976k4729j57108L7949j57462J09973J46777
6465B936028j36417K33588J17035m0471K20057j28458J67955L6570k35911K3505
6455C193481O0756J2263J33338J2050J39246j06728p4035J7064J2730J03320J73628
6444C677113o0615p8051R7311p0433R9767J24488j5997p6380K3978l4870N8790
6433C745101N9030R8406q0910J93690J42845K27238J67076M6917m3135n8639J78360
6422D675979L2200J10326j34035j275K29993k39330P6968J93241L0961K82699
$$ y = [3264368, 3341127, 3425959, 3467826, 3252577, 3164479, 2897946, 2975748, 2979378, 2824147, 2971602, 2969707, 3172445, 3114807, 3167820, 3248909, 3370047, 3341679, 3232329, 3083980, 2878849, 2889449, 2857095, 3009986, 2956652, 2980628, 2955899, 2798791, 2836740, 2679278, 2789251, 2936028, 2799611, 3033199, 3150234, 3109763, 3329820, 3201362, 3369317, 3405887, 3169976, 3193481, 3254237, 3266500, 3399838, 3411888, 3551134, 3444406, 3370371, 3387435, 3400165, 3503485, 3677113, 3616498, 3538447, 3635758, 3565325, 3665092, 3789580, 3773583, 3697203, 3721181, 3686311, 3745101, 3804131, 3902537, 3821627, 4015317, 4158162, 4385400, 4552476, 4599393, 4556258, 4497619, 4675979, 4708179, 4818505, 4684470, 4683195, 4913188, 4673858, 4750826, 4944067, 4975028, 5257727]
6412E257727L5495J02182l5663K4499r3307O4437K33625j23785P5807j5558p2749
6401E452710N7731J59297L49785K0969J5638K26347J0760p7678J72620P2291K48688
6390F709158J44215K17441J92835k43982K50363K89203R2658j32942P8196J28839
6380G725984J78313O7630O3222J01075k7934J72825J01944l0585J72153J64069
6370H688696O0992J16101L09931K88900L53865J14462J29122Q6437j0485L50400
6360A0488421K63208K74002K14227L10821L39704K15754P8658J46524p2600J58718
6350A2417437M02526M64555L93373L64844L99097L43209L97144N23653O51722
6341A6357560N75220O91962J092698Q28755Q33303P13708Q94579R25434O93363
$$ y = [5257727, 5293222, 5395404, 5359741, 5384240, 5290933, 5355370, 5588995, 5465210, 5541017, 5525459, 5452710, 5510441, 5669738, 6019523, 6040492, 6056130, 6282477, 6293237, 6215559, 6388179, 6460470, 6709158, 6853373, 7070814, 7263649, 7019667, 7270030, 7559233, 7651891, 7518949, 7597145, 7725984, 7904297, 7971927, 8035149, 8136224, 8108290, 8281115, 8383059, 8352474, 8524627, 8688696, 8749688, 8865789, 9175720, 9464620, 9818485, 9932947, 10062069, 10148506, 10138021, 10488421, 10751629, 11025631, 11239858, 11550679, 11890383, 12106137, 12184795, 12331319, 12258719, 12417437, 12819963, 13284518, 13677891, 14042735, 14441832, 14785041, 15182185, 15705838, 16357560, 16932780, 17624742, 18717440, 19546195, 20379498, 21093206, 21987785, 22913219, 23606582]
6332B3606582Q54237Q22829Q05315P68084O08274N26279N96763L89768M12811
6323B9390942N86903O73909R82241R56557J253543J390098J592695J939666K312272
6314D1078826K227689K588122K189323J430492N42554j70898m33368o07258l59034
6305D8486448k06806N1629j14902j27255k38105k05648m49422l81195o3913K82884
6295D7033715P08412J160689J066749J514826K273496K582339L070490L376904
6287F2787620K725265J122988q07195k669794l770821l979319l769262l172546
6279D8466936k322379j870494j629921j545461j288059j063673j120514l35329
6271C7291106m82711o58581k92383j08990L22310M81618N84097Q44706J054012
$$ y = [23606582, 24460819, 25283648, 26088963, 26857047, 27465321, 27991600, 28588363, 28978131, 29390942, 29977845, 30651754, 31633995, 32590552, 33844095, 35234193, 36826888, 38766554, 41078826, 43306515, 45894637, 48083960, 49514452, 50057006, 49886108, 49452740, 48845482, 48486448, 48279642, 48331271, 48216369, 48089114, 47851009, 47645361, 47195939, 46814744, 46750831, 47033715, 47742127, 48902816, 49969565, 51484391, 53757887, 56340226, 59410716, 62787620, 65512885, 66635873, 65828678, 63158884, 59388063, 55408744, 51639482, 48466936, 46144557, 44274063, 42644142, 41098681, 39810622, 38746949, 37626435, 37291106, 36808395, 36149814, 35857431, 35748441, 36070751, 36552369, 37136466, 37981172, 39035184]
6262C9035184N30422j3628q08857j810638k529280k437733k385836k306723j764523
6253B5508388j452294j023344q82191o74298p63067l86470o75952l39635m23462
6244A8887675l71946k81553k33651j75448k66326J6335j64446l52587j76976k67669
6234A6613408O7277L42536p2244j11444q8368J71838K47961J89748O0888J02503
6224A7524103N1638j01442j63938J3369p948j06189K82882N0284p8742p2657j26712
6213A7264648J69810K49006J69195J93392J27873L81094M16914J73209J82719
6204A9327860j0052J13652N1768O8850J96141J06867r9900j2267j30472j65382
6194A9447065P5703Q4691m9284j96192q4686K48974J90577l212j96798l33527
$$ y = [39035184, 39565606, 39551978, 38743121, 36932483, 34403203, 31965470, 29579634, 27272911, 25508388, 24056094, 23032750, 22150559, 21476261, 20713194, 20326724, 19650772, 19311137, 18887675, 18515729, 18234176, 18000525, 17825077, 17558751, 17575086, 17410640, 17058053, 16881077, 16613408, 16680685, 17023221, 16950977, 16839533, 16751165, 16923003, 17170964, 17360712, 17421600, 17524103, 17575741, 17474299, 17310361, 17323730, 17315782, 17209593, 17492475, 17542759, 17464017, 17391360, 17264648, 17434458, 17683464, 17852659, 18046051, 18173924, 18555018, 18971932, 19145141, 19327860, 19317808, 19431460, 19483228, 19552078, 19748219, 19855086, 19755186, 19742919, 19612447, 19447065, 19522768, 19607459, 19558175, 19361983, 19277297, 19526271, 19716848, 19713636, 19516838, 19183311]
6184A9183311l85573k33535j19863k4489j76033o7388K4326Q3000K13392O5282
6174A8562430J93112K93094l6218j30157K25739K97693J92020k2968k54552k77335
6164A9042858k33296j54117r6540r3021Q5375j43039O0448K44053j24367J06484
6154A8694838L92156M15336Q81144Q09472R79675J471850J722101J155974O57051
6145B7179597j44366q00176j088111j278862n68333j19887K14851M69437N41700
6136B4405850P34316J141917R81196Q05804L78920L22827N81724J107871J248443
6127C1708868J303883J030335O66108J7369m91396p08583j34291K73633L57481
6118C4023407L10728l2922n95012o31677p06998l25929O6911j7861M53163R05918
$$ y = [19183311, 18797738, 18564203, 18444340, 18419851, 18243818, 18176430, 18200756, 18283756, 18497148, 18562430, 18755542, 19048636, 19012418, 18882261, 19108000, 19405693, 19597713, 19574745, 19320193, 19042858, 18809562, 18655445, 18558905, 18465884, 18551259, 18408220, 18468668, 18712721, 18588354, 18694838, 19086994, 19502330, 20383474, 21192946, 22172621, 23644471, 25366572, 26522546, 27179597, 27035231, 26235055, 25146944, 23868082, 23299749, 23179862, 23394713, 23864150, 24405850, 25140166, 26282083, 27263279, 28069083, 28448003, 28770830, 29352554, 30460425, 31708868, 33012751, 34043086, 34709194, 34726563, 34235167, 33526584, 33392293, 33665926, 34023407, 34334135, 34301213, 33706201, 33074524, 32367526, 32041597, 32108508, 32090647, 32543810, 33449728]
6108C3449728J244147J546402J363488P76735n00542j095595j063069q85490j65162
6099C4670642J15907L66084O10008O00329K50251k23221k74203n68333n71745
6090C4975719n12634l62692j97563j08501L83993R87601O52741O97329O80801
6081C7196794P75767Q36774P75838O85618K53630J04731m56410o02033j113606
6072C8457103o16549l01838q28903q33296q65699r93946o24356m98972O7658R3211
6062C3054413M67785R84585R67882J419963J851871K053946K343183K376947J953922
6053D7474497J042056O0306j251231k047594k969756l042446k919400k561020
6045C3785412k197467j879084j437304j213224j044391n66662n73158k76274j88096
$$ y = [33449728, 34693875, 36240277, 37603765, 38380500, 37879958, 36784363, 35721294, 34835804, 34670642, 34786549, 35152633, 35762641, 36362970, 36613221, 36390000, 36115797, 35547464, 34975719, 34463085, 34100393, 33902830, 33794329, 34178322, 35165923, 35818664, 36515993, 37196794, 37972561, 38809335, 39585173, 40270791, 40524421, 40629152, 40172742, 39570709, 38457103, 37840554, 37538716, 36709813, 35876517, 35010818, 34016872, 33392516, 32893544, 32961202, 33054413, 33522198, 34506783, 35474665, 36894628, 38746499, 40800445, 43143628, 45520575, 47474497, 48516553, 48576859, 47325628, 45278034, 42308278, 39265832, 36346432, 33785412, 31587945, 29708861, 28271557, 27058333, 26013942, 25447280, 24874122, 24597848, 24409752]
6036B4409752K5561N56512M83942N42362Q65386R28715J071150O17714K69520
6027B9770614k19299r83147j512117j824399j677405j576846j257795j047497
6019A9672109r94306r38906q39251o22259o76244o59453o20969m93392m34945
6010A3392384k81120j99025k50783m19329j14811j70523l6061K78552q8062M1770
6000A2152992Q508K68370r1582J03869L11922m7999M7154j00889j8784k09536
5990A2424025k33846q6318j75709o0490m34721k75995k63272j60160k29510j48350
5980A0355654n100l43257j35117J48097K7490j49609o2123J47232J9819k3172
5970I979914n5597m6447j03465p5390l10707O9471m8178J42510r1539o2659j53984
$$ y = [24409752, 24435313, 24991825, 25475767, 26018129, 26883515, 27812230, 28883380, 29501094, 29770614, 29551315, 28568168, 27056051, 25231652, 23554247, 21977401, 20719606, 19672109, 18677803, 17738897, 16899646, 16277387, 15601143, 14941690, 14320721, 13827329, 13392384, 13111264, 12912239, 12661456, 12242127, 12127316, 11956793, 11920732, 12199284, 12111222, 12152992, 12161500, 12429870, 12338288, 12442157, 12754079, 12706080, 12753234, 12652345, 12633561, 12424025, 12190179, 12103861, 11928152, 11867662, 11432941, 11156946, 10893674, 10733514, 10504004, 10355654, 10350554, 10007297, 9872180, 10020277, 10047767, 9898158, 9836035, 9983267, 10003086, 9979914, 9924317, 9877870, 9774405, 9699015, 9388308, 9457779, 9409601, 9552111, 9460572, 9397913, 9243929]
5959I243929j30535l7126j87029l23532J9210j04542m1600j09208k08986k06657
5949G913924k07565q5112n3999J1629m0440M3153j16927j16622j5973j49261q6222
$$ y = [9243929, 9113394, 9076268, 8889239, 8565707, 8584917, 8480375, 8438775, 8329567, 8120581, 7913924, 7706359, 7621247, 7567248, 7578877, 7538437, 7581590, 7464663, 7348041, 7332068, 7182807, 7096585]
$$ [...]
##END NTUPLES=NMR SPECTRUM
##END=
