##TITLE=1H_EC-3318(II-22)
 CDCl3
 8 sc, 
 1.4.2024
##JCAMPDX= 6.0         $$ Bruker NMR JCAMP-DX V2.0
##DATA TYPE= NMR SPECTRUM
##DATA CLASS= NTUPLES
##ORIGIN= UXNMR, Bruker Analytische Messtechnik GmbH
##OWNER= root
$$ XWIN-NMR		Version 3.5
$$ Mon Apr  1 16:12:15 2024 Russian Standard Time (UT+4h)  she@DPX200
##.OBSERVE FREQUENCY= 200.1311
##.OBSERVE NUCLEUS= ^1H
##.ACQUISITION MODE= SIMULTANEOUS
##.ACQUISITION SCHEME= undefined
##.AVERAGES= 8
##.DIGITISER RES= 18
##SPECTROMETER/DATA SYSTEM= spect
##.PULSE SEQUENCE= zg30
##.SOLVENT NAME= D2O
##.SHIFT REFERENCE= (INTERNAL, D2O, 0, 16.9071)
##AUDIT TRAIL= $$ (NUMBER, WHEN, WHO, WHERE, WHAT)
$$ ##TITLE= Audit trail, XWIN-NMR		Version 3.5
$$ ##JCAMPDX= 5.01
$$ ##ORIGIN= Bruker BioSpin GmbH
$$ ##OWNER= she
$$ F:/spectra/data/she/nmr/H-F/1/pdata/1/auditp.txt
$$ ##AUDIT TRAIL=  $$ (NUMBER, WHEN, WHO, WHERE, WHAT)
(   1,<2024-04-01 16:10:11.00 +0400>,<she>,<DPX200>,
      <created by zg, POWCHK disabled, PULCHK disabled
       configuration hash MD5:
       00 E9 B6 7A A2 85 ED C7 34 08 36 98 17 FE 4E 26
       data hash MD5: 16K
       90 13 50 4A 79 4F 2B 70 4B A6 E1 60 58 93 4B DE>)
(   2,<2024-04-01 16:10:14.39 +0400>,<she>,<DPX200>,
      <Start of raw data processing
       efp BC_mod = 2 LB = 0.24 FT_mod = 6 PKNL = 1 PHC0 = -25296.17 PHC1 = 4.587312 SI = 16K 
       data hash MD5: 16K
       1F 1F C5 2E 72 19 9E 5E 45 35 CE 78 6C 37 BF 16>)
(   3,<2024-04-01 16:10:33.31 +0400>,<she>,<DPX200>,
      <pk PHC0 = -1.808613 PHC1 = 3.6 
       data hash MD5: 16K
       D4 11 C7 3B E5 C6 C5 E3 33 C6 20 41 66 A8 A2 00>)
(   4,<2024-04-01 16:10:36.81 +0400>,<she>,<DPX200>,
      <abs ABSG = 5 
       data hash MD5: 16K
       8D E8 D0 4D 4A FE 6A 2C 58 1A 0B 65 73 C8 49 22>)
$$ ##END=
$$ 
$$ hash MD5
$$ 25 9E FB 69 F5 CF B0 AA 5F 83 32 6A 79 48 AB 48
##$RELAX= 
##$RELAX= 
##$RELAX= 
##$RELAX= 
##$RELAX= 
##$RELAX= 
$$ Bruker specific parameters
$$ --------------------------
##$DU= <F:/spectra>
##$EXPNO= 1
##$NAME= <H-F>
##$PROCNO= 1
##$TYPE= <nmr>
##$USER= <she>
##$AMP= (0..31)
100 100 100 100 100 100 100 100 100 100 100 100 100 100 100 100 100 100 
100 100 100 100 100 100 100 100 100 100 100 100 100 100 
##$AQSEQ= 0
##$AQ_mod= 1
##$AUNM= <au_zg>
##$AUTOPOS= <>
##$BF1= 200.13
##$BF2= 200.13
##$BF3= 200.13
##$BF4= 200.13
##$BF5= 200.13
##$BF6= 200.13
##$BF7= 200.13
##$BF8= 200.13
##$BYTORDA= 1
##$CFDGTYP= 0
##$CFRGTYP= 5
##$CHEMSTR= <none>
##$CNST= (0..31)
1 1 145 1 1 1 1 1 1 1 1 1 1 1 1 1 1 1 1 1 1 1 1 1 1 1 1 1 1 1 1 1 
##$CPDPRG= <>
##$CPDPRG1= <>
##$CPDPRG2= <>
##$CPDPRG3= <>
##$CPDPRG4= <mlev>
##$CPDPRG5= <mlev>
##$CPDPRG6= <mlev>
##$CPDPRG7= <mlev>
##$CPDPRG8= <mlev>
##$CPDPRGB= <>
##$CPDPRGT= <>
##$D= (0..31)
0 1.2 0 0 0 0 0 0 0 0.06 0 0.03 0 0 0 0 0.0002 0 0 0 0 0 0 0 0 0 0 0 0 
0 0 0 
##$DATE= 1711973410
##$DBL= (0..7)
120 120 120 120 120 120 120 120 
##$DBP= (0..7)
150 150 150 150 150 150 150 150 
##$DBP07= 0
##$DBPNAM0= <>
##$DBPNAM1= <>
##$DBPNAM2= <>
##$DBPNAM3= <>
##$DBPNAM4= <>
$$ [...]
##$SUBNAM3= <"">
##$SUBNAM4= <"">
##$SUBNAM5= <"">
##$SUBNAM6= <"">
##$SUBNAM7= <"">
##$SUBNAM8= <"">
##$SUBNAM9= <"">
##$SW= 18.051750892319
##$SWIBOX= (0..15)
0 0 2 0 0 0 0 0 0 0 0 0 0 0 0 0 
##$SW_h= 3612.71676300578
##$TD= 16384
##$TD0= 1
##$TE= 0
##$TE2= 300
##$TE3= 300
##$TEG= 300
##$TL= (0..7)
0 120 120 120 120 120 120 120 
##$TP= (0..7)
150 150 150 150 150 150 150 150 
##$TP07= 0
##$TPNAME0= <>
##$TPNAME1= <>
##$TPNAME2= <>
##$TPNAME3= <>
##$TPNAME4= <>
##$TPNAME5= <>
##$TPNAME6= <>
##$TPNAME7= <>
##$TPOAL= (0..7)
0.5 0.5 0.5 0.5 0.5 0.5 0.5 0.5 
##$TPOFFS= (0..7)
0 0 0 0 0 0 0 0 
##$TUNHIN= 0
##$TUNHOUT= 0
##$TUNXOUT= 0
##$USERA1= <user>
##$USERA2= <user>
##$USERA3= <user>
##$USERA4= <user>
##$USERA5= <user>
##$V9= 5
##$VALIST= <valist>
##$VCLIST= <CCCCCCCCCCCCCCC>
##$VD= 0
##$VDLIST= <DDDDDDDDDDDDDDD>
##$VPLIST= <PPPPPPPPPPPPPPP>
##$VTLIST= <TTTTTTTTTTTTTTT>
##$WBST= 1024
##$WBSW= 4
##$XGAIN= (0..3)
0 0 0 0 
##$XL= 0
##$YL= 0
##$YMAX_a= 324216
##$YMIN_a= -707785
##$ZGOPTNS= <>
##$ZL1= 120
##$ZL2= 120
##$ZL3= 120
##$ZL4= 120
##$ABSF1= 16.89004
##$ABSF2= -1.161854
##$ABSG= 5
##$ABSL= 3
##$ALPHA= 0
##$AQORDER= 0
##$ASSFAC= 0
##$ASSFACI= 0
##$ASSFACX= 0
##$ASSWID= 0
##$AUNMP= <proc_1d>
##$AZFE= 0.1
##$AZFW= 0.1
##$BCFW= 0
##$BC_mod= 2
##$BYTORDP= 0
##$COROFFS= 0
##$CY= -3
##$DATMOD= 1
##$DC= 0
##$DFILT= <>
##$DTYPP= 0
##$F1P= 0
##$F2P= 0
##$FCOR= 1
##$FTSIZE= 16384
##$FT_mod= 6
##$GAMMA= 0
##$GB= 0
##$INTBC= 1
##$INTSCL= 3.70164e-10
##$ISEN= 128
##$LB= 0.24
##$LEV0= 0
##$LPBIN= 0
##$MAXI= 10000
##$MC2= 0
##$MEAN= 0
##$ME_mod= 0
##$MI= 1.114404
##$NCOEF= 0
##$NC_proc= -6
##$NLEV= 6
##$NOISF1= 3.799351
##$NOISF2= 2.8
##$NSP= 0
##$NTH_PI= 0
##$NZP= 0
##$OFFSET= 16.90712
##$PC= 1
##$PHC0= -25297.98
##$PHC1= 8.187312
##$PH_mod= 1
##$PKNL= yes
##$PPARMOD= 0
##$PSCAL= 0
##$PSIGN= 0
##$REVERSE= no
##$SF= 200.129522744263
##$SI= 16384
##$SIGF1= 3
##$SIGF2= 2
##$SINO= 5.538805
##$SIOLD= 16384
##$SREGLST= <1H.CDCl3>
##$SSB= 0
##$STSI= 16384
##$STSR= 0
##$SW_p= 3612.71676300578
##$SYMM= 0
##$S_DEV= 0
##$TDeff= 16384
##$TDoff= 0
##$TI= <>
##$TILT= no
##$TM1= 0
##$TM2= 0
##$TOPLEV= 0
##$USERP1= <user>
##$USERP2= <user>
##$USERP3= <user>
##$USERP4= <user>
##$USERP5= <user>
##$WDW= 1
##$XDIM= 16384
##$YMAX_p= 315898463
##$YMIN_p= -693205
$$ End of Bruker specific parameters
$$ ---------------------------------
##NTUPLES= NMR SPECTRUM
##VAR_NAME=  FREQUENCY,     SPECTRUM/REAL,   SPECTRUM/IMAG
##SYMBOL=    X,             R,               I
##VAR_TYPE=  INDEPENDENT,   DEPENDENT,       DEPENDENT
##VAR_FORM=  AFFN,          ASDF,            ASDF
##VAR_DIM=   16384,         16384,           16384
##UNITS=     HZ,            ARBITRARY UNITS, ARBITRARY UNITS
##FACTOR=    0.220516191357247, 1,           1
##FIRST=     3383.61380674304, 0,            0
##LAST=      -229.102956262738, 0,           0
##MIN=       -229.102956262738, -693205,     0
##MAX=       3383.61380674304, 315898463,    0
$$ Real data points
##PAGE= N=1
##DATA TABLE= (X++(R..R)), XYDATA
$$ [...]
7945 22251424 21884520 21697974 21753803 21904410 22191352 22502702 22720586 22823840 23274717 24299255
7935 24299255 25618014 27394333 29333460 31337789 33531130 35931105 38179526 39577803
7927 39577803 39834327 38933146 37909914 37213923 36652259 36607164 36206712 34951444 32411206
7918 32411206 29329405 26526206 24012159 21673298 19629953 18034719 16650230 15858869
7910 15858869 15087852 14665513 14112172 13630787 13318437 12996071 12779800 12525236 12384507
7901 12384507 12368147 12470743 12505717 12675532 12827236 12907543 13080659 13091084 13100184 13209154
7891 13209154 13500631 13693933 13956004 14088591 14226647 14354993 14456285 14598625 14546564 14488687
7881 14488687 14456496 14432135 14372150 14354097 14159213 14066260 13936473 13544546 13378887 13021709
7871 13021709 12773095 12558569 12201232 11980237 11710810 11439590 11188744 10756030 10497520
7862 10497520 10296458 10148147 9847830 9674058 9498237 9260246 9071514 8999695 8996889 8903605
7852 8903605 8956027 8862602 8556013 8436178 8339442 8314986 8190023 8050517 8016316 8078565 8184915
7841 8184915 7964659 7920627 7750054 7793823 7985657 8056836 8188694 8267810 8483820 8570834
7831 8570834 8485330 8528729 8690200 8731415 9080078 9518068 9870411 10386589 10731265 11283934
7821 11283934 11659765 11962729 11978973 12043039 12228532 12440652 12466639 12681089 12872756 13008409
7811 13008409 13036558 13016604 12906866 12734593 12638377 12705457 12720523 12868403 12520631 12331749
7801 12331749 12679546 12702445 12827951 13036504 13251021 13444511 13890966 14405817 14959188 15454062
7791 15454062 16076871 16866194 17819787 18947275 20166570 21728919 23403804 24995512 26600190
7782 26600190 28072096 29068239 29588425 29806788 30069065 30422553 30920274 31527022 32070482
7773 32070482 32529029 32693403 32647961 32152397 31700136 31621656 31579727 31648662 32018855 32446073
7763 32446073 32876190 33184508 33170988 32857314 32740345 32523142 32438512 32622835 32772627 32806696
7753 32806696 32548060 31855030 31047179 30335807 30028213 29883988 30085601 30460922 31008860
7744 31008860 31923642 32773361 33192594 33312857 33130843 32895848 32806525 32846590 33148224 33546403
7734 33546403 34098810 34289668 34098061 33706101 33279012 33106056 33069698 33198240 33499902 33983533
7724 33983533 34515454 34947227 35062874 34761819 34424014 34212149 34091289 34028501 34029526 33657203
7714 33657203 32976850 31689537 29994414 28166394 26172787 24323987 22586162 20883464
7706 20883464 19516909 18429027 17344114 16401152 15556661 14776872 14137576 13622765 13342474
7697 13342474 13043290 12762556 12528151 12377398 12265943 12116225 11775140 11563325 11286360
7688 11286360 11079592 10857134 10832983 11074908 11107651 11289733 11385265 11402181 11345984 11398186
7678 11398186 11473675 11707802 11970417 12109091 12221377 12303466 12281634 12262844 12277270 12260327
7668 12260327 12237418 11949257 11462575 10899404 10340289 9706738 9152148 8644915 8107664 7828474
7658 7828474 7568131 7496572 7518194 7457174 7270737 7283735 7172324 6887415 6883615 6940649 6976531
7647 6976531 6912421 6872610 6838092 6770714 6917391 6815764 6950995 7184497 7503115 7657235
7637 7657235 7620685 7734834 7738134 7819776 7906080 8139391 8393469 8780432 9065784 9178039
7627 9178039 9303459 9246828 9216372 9155370 9231478 9406768 9353444 9411655 9428910 9625829 9467534
7616 9467534 9459941 9585590 9717515 9972058 10236862 10470772 10724635 10934080 10966739 11282355
7606 11282355 11636682 11885089 12402647 12867287 13192198 13538469 13595277 13638116 13781010 14160556
7596 14160556 14835985 15481757 15936080 16304038 16661114 16993279 17365383 17899351 18815574
7587 18815574 19648138 20637112 21487811 22339843 23282834 24183693 25591803 27187844 28856447
7578 28856447 30313767 31427622 32169664 32981531 33681795 34567435 35896938 37394071 39380370
7569 39380370 41814251 45109258 49509036 55675012 63711407 73665812 84987350 96754307
7561 96754307 107690735 118923470 130063284 136748224 135636222 125725549 110773165 96249214
7553 96249214 83560739 71441831 61054402 52816132 46375524 41224818 37201766 34039369
7545 34039369 31644013 29789673 28174930 26999654 26223719 25518014 25024309 24686303 24211961
7536 24211961 23522069 22767409 21982077 21160194 20541837 19919669 19349709 18974553 18682852
7527 18682852 18509680 18205009 18083168 18103915 18022727 18070726 17994605 17952807 18030223 18026904 18023943
7516 18023943 17998111 18031907 18306453 18614204 18978351 19363864 19746289 20340220 20740871 21317075
7506 21317075 22074940 23073514 24474500 25996225 27697544 29373120 31288230 33348272
7498 33348272 35344359 37094804 38364911 38780433 38702904 38215455 37336121 36604861 35617550
7489 35617550 34838526 33989374 33135373 32269648 31258906 30380273 29797545 29343707 29015571
7480 29015571 28942365 28979951 29232150 29540500 29854403 30176077 30604143 31193583 31781240 32412192
7470 32412192 33212611 34066460 35074106 36177586 37443025 38934452 40784673 43033879
7462 43033879 45669248 48746576 51981538 55553262 59344331 63018530 66666672 69917203
7454 69917203 72899408 75493140 77964599 80197056 82087634 83303732 83682307 83692879 83614635
7445 83614635 83761783 84520191 85732583 87219429 89162879 91346199 92947720 94069355
7437 94069355 94111357 93186969 91411327 88665730 85180858 81403972 77076340 72517323 68377242
7428 68377242 64815367 61769153 59124953 57241234 56105290 55554461 55285014 55413110 55583009
7419 55583009 55856169 56179314 56397801 56826728 57500129 58462922 59697721 61345865 63413096
7410 63413096 65687891 68186185 70430626 72304891 73437406 74441161 75574113 76950156
7402 76950156 78677070 80629855 82540201 84430949 85895439 86648051 86738079 85791746 83379303
7393 83379303 79924159 75979431 71800800 67577219 63375933 59707496 56444573 53486236
7385 53486236 51059806 48921318 47048294 45453858 43786307 42040418 40048634 37764471
7377 37764471 35518437 33296109 31006984 28860987 26850478 25167340 23866760 22558772
7369 22558772 21259860 20470979 19640410 18942299 18440052 17930954 17395837 16982378 16746423
7360 16746423 16477369 16364344 16424004 16319375 16372364 16547887 16809057 17186131 17504890 17963977
7350 17963977 18380356 18844144 19239761 19583309 20027933 20388318 20601955 20643805 20639322 20356405
7340 20356405 20181515 19905625 19340595 18768849 18364341 17902491 17365719 16859713 16454126
7331 16454126 15977003 15538001 15322665 15011605 14736369 14702963 14658108 14538220 14663437 14661702
7321 14661702 14859161 15041194 15321399 15633377 16020922 16428179 17092947 17786920 18573160
7312 18573160 19334254 20189572 21147428 21909287 22862371 23893663 24885139 25927939 26985199
7303 26985199 28131351 28989308 29814298 30393189 30841826 31182895 31383696 31545136 31901622
7294 31901622 32392077 32961788 33410062 34106385 34605260 34844955 34684459 33951817 32853230
7285 32853230 31770084 30890294 30169132 29983199 29978920 30225986 30678305 31238763 31486546 31374552
7275 31374552 30851187 30054253 28919790 27653239 26752173 25831229 25209566 24854213 24627331
7266 24627331 24627345 24656789 24967841 25302224 25778613 26278190 27064584 27814673 28621350 29593217
7256 29593217 30689684 32114282 33927633 36150304 38707347 41338193 44142227 46860450
7248 46860450 49184207 50450606 50523994 49599975 48039583 46614215 45352674 44737117 44753501
7239 44753501 45116587 45980260 46907638 47767260 47994507 47222370 45473999 43172993 40493929
7230 40493929 37903743 35241116 32690804 30346717 28439086 26704142 25532576 24673585
7222 24673585 24135159 23718697 23484506 23443250 23327021 23275516 23020317 23005823 23205156 23736701
7212 23736701 24436319 25423642 26712191 28235017 29756464 31021822 32001861 32568767 32310424
7203 32310424 31519415 30751180 30026811 29459778 29424271 29698476 30292345 31013642 31890572 32582026
7193 32582026 32669974 32246222 31381351 30216035 28771949 27442147 25891784 24343713 22777366
7184 22777366 21248983 20271727 19370225 18777749 18234143 17887164 17557294 17087548 16401506
7175 16401506 15540046 14582768 13648844 12880146 12047526 11369037 10773425 10321303 9972716
7166 9972716 9840581 9743494 9519093 9334233 9094709 8864117 8716713 8759171 8605779 8492258
7156 8492258 8571554 8640432 8748516 8904472 8967421 9100539 9297111 9450344 9410819 9279709
7146 9279709 8985964 8432482 8035090 7709514 7484376 7398762 7224191 7081365 7118995 7113509
7136 7113509 7038759 6751314 6367408 5938335 5590595 5239103 4750800 4423849 4230762 4092971
7126 4092971 3908708 3657732 3438730 3300598 3182672 3119796 2987928 2964134 2893998 2861869
7116 2861869 2786231 2762409 2669334 2560607 2537625 2546492 2553352 2510367 2560397 2602530 2566749 2479600
7104 2479600 2433072 2431636 2343848 2436914 2585363 2574417 2417488 2487984 2522158 2389784 2401651
7093 2401651 2452276 2569610 2604523 2708235 2870796 2980151 2905575 3015019 3069079 3119485
7083 3119485 3211959 3220343 3303567 3166552 3017592 2847890 2825392 2824650 2817181 2700847 2552481
7072 2552481 2577698 2636878 2623512 2629191 2595055 2576997 2502178 2217465 2199475 2318051 2189903
7061 2189903 2083448 2082472 2122703 2034160 1941026 1953167 2088733 2163064 2141957 2109189 1943109
7050 1943109 1870459 1870118 1962259 1906687 1972351 1972061 2188460 2117148 2076978 2168933 2086354 2104831
7038 2104831 2113485 2040427 2135220 2100681 2015037 1933539 2070373 2244179 2201047 2079076 2156652
7027 2156652 2275892 2192432 2347748 2484613 2466007 2439453 2385525 2327258 2327239 2426087 2487161
7016 2487161 2623804 2600069 2559850 2712239 2894099 3012957 3132711 3113472 3071682 3202477
7006 3202477 3241591 3397935 3526411 3554167 3698139 3953393 4094549 4208277 4246298 4305326
6996 4305326 4482711 4606553 4799771 4841789 4998966 5158960 5195932 5405836 5658094 5936276
6986 5936276 6093037 6437353 6606053 6920163 7258961 7666388 8113791 8526930 9000812 9544662
6976 9544662 9985897 10297621 10734480 11386646 12018096 12550194 13241818 14250640 15636512
6967 15636512 17051253 18622721 20570827 22738437 25408449 28760631 32587349 36611166
6959 36611166 40559495 44528732 48091767 50647379 51706392 50894513 48403586 44714777
6951 44714777 40275839 35827636 31524538 27557259 24002914 20960149 18375272 16245470
6943 16245470 14437379 12865821 11583819 10513920 9734087 8999527 8307624 7862203 7329850
6934 7329850 6749973 6391054 5882492 5405561 5078154 4767655 4393486 4104065 3926960 3795127
6924 3795127 3731398 3436376 3357787 3148493 3021517 3081317 2782890 2659685 2488048 2372256
6914 2372256 2279434 2261461 2164003 2073147 2040237 2061559 1854432 1869805 1782717 1723821 1664287
6903 1664287 1509862 1447375 1382940 1439862 1536105 1491931 1326137 1351247 1316466 1390131 1291749
6892 1291749 1202003 1175499 1164308 1233671 1262293 1268296 1216773 1106626 1112998 1124838 1155861 1186548
6880 1186548 1151882 1128949 1183227 1192654 1242655 1261557 1177426 1232840 1233634 1109328 1161072 1250823
6868 1250823 1306662 1261909 1157960 1376586 1593242 1485074 1521991 1548873 1581934 1753400
6858 1753400 1850343 1874177 1882789 1809807 1748212 1631820 1522227 1571347 1476116 1217260 1005525
6847 1005525 925241 965532 917901 939379 974347 799851 913245 997613 1167688 1250404 1139773
6836 1139773 1055483 1154225 1327158 1402985 1483579 1448623 1507938 1636980 1646877 1751514 1905679
6825 1905679 2044990 2158278 2180194 1985794 1751648 1804796 1830212 1767065 1609572 1426719
6815 1426719 1428359 1364389 1246412 1220015 931288 994379 1112091 972572 946697 898774 920048
6804 920048 926057 915254 1018536 950468 908592 1005494 1075547 1201334 1311376 1513310 1624841
6793 1624841 1809980 1841281 1850033 1909661 1782436 1792540 1573536 1432736 1292926 1131321
6783 1131321 1080677 1041720 1031776 993889 944574 1044764 936639 794952 828364 735461 645523
6772 645523 674589 729558 685629 784222 816860 796660 883494 981272 1007435 1224618 1414970
6761 1414970 1284225 1283148 1302215 1199815 1022648 865324 605692 427627 452518 422733
6751 422733 312755 364096 324217 370095 361231 328780 394561 294943 256658 133395 269726
6740 269726 246657 198429 251421 350956 329596 421838 335937 431970 430252 321337 376316 287197
6728 287197 285124 339380 326252 324904 337527 256771 330560 383514 384564 522339 580989 606633
6716 606633 713064 685100 661974 559202 484571 492636 506520 556504 640123 547456 586808
6705 586808 520846 522653 355419 308645 456071 422402 249281 221115 122111 85941 -38831
6694 -38831 107526 133800 60342 130218 198765 202517 280544 228392 382619 397629 312641 281722
6682 281722 277655 345852 238621 233980 153423 154283 55028 113213 69550 138002 70633 44843
6670 44843 -22680 -109732 -321376 -298074 -338080 -252483 -245631 -217921 -130025 -50968 -18872 -83596
6658 -83596 -118339 -143782 -163010 -209321 -305991 -367134 -462264 -414159 -382818 -318708 -269109 -210272
6646 -210272 -284463 -249226 -94292 -178154 -262077 -292827 -394115 -478654 -504255 -503809 -460151 -451773
6634 -451773 -268241 -155417 -131634 -249064 -232200 -87218 -190020 -150813 -250282 -380309
6624 -380309 -306527 -211760 -224158 -259463 -302494 -173909 -94275 -203847 -143128 -121606 -196685
6613 -196685 -237222 -75601 -93914 -147834 -170438 -137943 -42781 -57559 72283 57483 -84077
6602 -84077 2414 -12934 -102498 -85719 -154669 -246842 -123936 -193596 -311477 -345739 -232765
6591 -232765 -180388 -152592 -121914 -66475 -161708 -136958 -107207 -132802 -186975 -232938 -52697
6580 -52697 -98002 -118066 32023 140412 28411 -38929 -21164 -116233 120016 247716 184846
6569 184846 147913 248468 108725 94711 199743 139996 159782 162584 156293 145337 169687
6558 169687 282420 179686 81905 55989 72909 1084 955 43202 141885 33310 31726 119211
6546 119211 71660 143782 165672 156953 135781 156424 223687 273615 278958 339128 264071 268239
6534 268239 277055 324787 386999 305766 285644 412948 499689 468299 302130 241273 201794
6523 201794 110248 -22300 -33839 65324 4510 50277 117144 112215 186045 207240 179372 115618
6511 115618 85235 30366 -60755 -112358 -39 78385 156732 76309 64531 87043 311469
6500 311469 441721 368167 394423 288900 60053 96230 96229 67645 81049 95782 115100 48421
6488 48421 86803 197662 165978 122527 184980 137240 261172 144951 -96020 -116250 -50632
6477 -50632 -56360 -44076 -79458 -66824 -71073 -25533 8909 -121604 -113493 -61929 -58974 -180244
6465 -180244 -151253 -132973 -145548 -9960 51967 34093 105654 -98742 -166738 -65475 -50765
6454 -50765 -86022 71558 19006 -232123 -190633 -240699 -307360 -224881 -60917 -85554 -139994
6443 -139994 -31011 61569 -31608 -80106 -129448 -200775 -245099 -317829 -245338 -265384 -324498
6432 -324498 -349182 -142451 -49788 -164281 -77679 -65690 -99241 -126811 -115506 -120848 -122883 -140503
6420 -140503 -274949 -321822 -273275 -240373 -166332 -126135 -271704 -134582 -84692 -54364 -154791
6409 -154791 -352919 -210056 -136606 -166360 -114170 -50187 -209200 -142196 101667 125587 -46251
6398 -46251 -120356 -61048 -118844 -201180 -366256 -471788 -469550 -439803 -373586 -316347 -299883 -304244
6386 -304244 -304418 -375840 -326153 -329100 -352733 -366866 -320730 -294269 -298283 -438851 -557173 -560200
6374 -560200 -422024 -244204 -190907 -440583 -426307 -324121 -424592 -463333 -459789 -408582 -417155
6363 -417155 -520274 -380897 -350883 -364712 -422609 -394974 -419938 -367397 -366787 -468969 -398242
6352 -398242 -431263 -463732 -541655 -616723 -479909 -324775 -402482 -385300 -323832 -259399 -46329
6341 -46329 -45576 -171827 -315743 -440654 -402223 -359206 -211963 -277185 -349713 -450571 -409700
6330 -409700 -230108 -157699 -244257 -317342 -203370 -173820 -287487 -282627 -226038 -323946 -302486
6319 -302486 -334023 -271683 -333743 -347086 -285564 -328654 -234269 -248668 -313120 -327087 -281407 -319571
6307 -319571 -315612 -343387 -319840 -274070 -367176 -289174 -152793 -267131 -191485 -194568 -163223 -242037
6295 -242037 -270723 -239985 -255045 -262439 -253508 -214425 -204011 -192611 -258827 -149641 -72948 -72220
6283 -72220 -157095 -204722 -175630 -126330 -220366 -289184 -268377 -283793 -234337 -170672 -184790 -245197
6271 -245197 -134909 -186512 -137978 -29345 -99466 -188891 -240598 -306456 -374978 -462547 -431594
6260 -431594 -431571 -319968 -363827 -343629 -404605 -262396 -163829 -253466 -112906 -194951 -246805 -214321
6248 -214321 -368742 -513518 -412302 -385068 -329842 -202504 -96146 -273938 -218968 -280455
6238 -280455 -283249 -382666 -467050 -572624 -540994 -424067 -324368 -321784 -364620 -426572 -397560 -436774
6226 -436774 -479646 -282949 -257478 -299069 -417943 -347277 -390246 -470859 -581379 -491979 -494042
6215 -494042 -454091 -436881 -437151 -415772 -322361 -302281 -345362 -496227 -597745 -500570 -416316 -328650
6203 -328650 -433906 -406549 -338168 -332683 -337668 -328352 -294127 -246639 -250428 -287664 -373597 -378203
6191 -378203 -504928 -496069 -492320 -538295 -290095 -356542 -487463 -499177 -464265 -396046 -503344
6180 -503344 -515990 -693205 -575763 -485700 -466711 -459254 -531365 -439440 -394656 -360582 -329883
6169 -329883 -326061 -439995 -448717 -380665 -248870 -288691 -414804 -448922 -541471 -486160 -425896
6158 -425896 -564696 -526301 -468295 -401070 -322534 -378091 -409938 -296785 -271842 -278225 -218300
6147 -218300 -404435 -436923 -303724 -311268 -369497 -320157 -232148 -214395 -352066 -438090 -298248
6136 -298248 -398881 -363015 -450698 -473286 -288319 -227830 -260602 -316987 -373215 -315315 -265135
6125 -265135 -316597 -420938 -478520 -277972 -424494 -488719 -456215 -525313 -410240 -385502 -462224
6114 -462224 -313794 -299041 -260196 -173897 -235238 -269302 -285818 -375682 -413968 -497772 -329539
6103 -329539 -272191 -201116 -163970 -236191 -96033 -109860 -110449 -33524 29514 -26754 -5372 -69124
6091 -69124 -15815 7943 85979 63387 -50212 57117 68608 -90572 -38455 107503 97959
6080 97959 -51615 -164063 -72233 -26123 -134175 -136926 -22040 70490 134824 27067 86777
6069 86777 99958 -14281 2468 -19166 64012 176069 63537 -49050 -43227 38281 149942
6058 149942 184347 217443 221403 218801 146188 56876 31243 59335 25686 15724 31060 239013
6046 239013 258823 177509 123302 4213 129729 194636 258324 166852 211085 135722 86423
6035 86423 140059 84392 -37586 6916 143624 130031 71412 129306 114583 -23476 7394
6024 7394 73828 84405 -80356 -124225 -33252 35744 59715 153586 116899 117346 192050 228319
6012 228319 149621 -52582 -146050 -155478 -75723 -134143 -110268 -138004 -116399 -129977 -94919 -4796
6000 -4796 -33314 -75034 -165995 -104307 -60959 -71089 -167473 -77483 -85061 -155006 -195181 -173213
5988 -173213 -143620 -164131 -68285 -795 -77855 -99018 -234812 -297028 -336337 -315535 -212879
5977 -212879 -202905 -243949 -326637 -369793 -252123 -124859 -104768 -136468 -253718 -401918 -461894
5966 -461894 -498378 -444534 -307204 -371296 -380527 -333681 -335649 -235107 -113762 -141968 -62706
5955 -62706 2374 -48116 133992 144457 1380 -53422 88725 168441 207557 216598 216155 209734
5943 209734 151436 88939 18140 28382 -75818 -163883 -218248 -163347 -217298 -333318 -384532
5932 -384532 -281885 -328811 -389052 -340050 -286559 -251171 -308671 -271884 -242078 -395079 -433450
5921 -433450 -471711 -417807 -241178 -200224 -345086 -321374 -245596 -242414 -202425 -152031 -160431 -208355
5909 -208355 -398096 -443317 -460289 -446392 -384937 -296578 -363529 -286884 -361677 -297133 -216880
5898 -216880 -291620 -247479 -243307 -154921 -292220 -333795 -251880 -349896 -251616 -119468 -83981
5887 -83981 -154443 -53073 53963 -150145 -104535 -63779 -79750 944 102202 189620 228204
5876 228204 293199 311429 283156 286163 211634 152703 199440 279762 55891 -110791 -112814 -138259
5864 -138259 -220004 -329331 -257124 -77973 -258959 -103707 -24612 -155280 -140660 -230537 -316037
5853 -316037 -216591 -365575 -546022 -480928 -469425 -321650 -210258 -137173 -153549 -251632 -177202
5842 -177202 -144537 -178969 -317486 -224242 -285510 -337248 -212901 -63812 6953 -94689 -155826
5831 -155826 -114993 -170330 -32039 9130 17044 41045 -118857 -102301 -36062 37767 19769
5820 19769 -52980 38666 87924 235381 212588 236520 104593 161604 254866 269583 118280
5809 118280 116002 170784 39381 156462 107568 220788 140349 177171 159247 185151 268015
5798 268015 55878 9654 82733 88034 235818 293358 330429 431870 577752 636598 679258
5787 679258 525888 589241 552587 474794 309459 114805 60571 169089 233433 286183 350709
5776 350709 322316 336164 301219 353139 244972 247276 356651 301655 336089 309451 277612
5765 277612 253421 452105 517810 448841 509901 490076 505722 459565 488843 595037 388470
5754 388470 386882 473779 392966 445156 464483 443418 427067 412264 542830 621528 600037 599465
5742 599465 561294 509986 576196 750707 847715 753460 880264 956647 1044290 1125714 1133336
5731 1133336 1118523 1005946 908291 859284 957172 837033 868248 1007520 1091734 1147598 1205487
5720 1205487 1320974 1421814 1313128 1312612 1410974 1468408 1450389 1365843 1267116 1353575 1455290
5709 1455290 1394732 1533438 1550929 1732846 1816533 1864328 1839958 1811462 1776788 1495566 1295144
5698 1295144 1134957 1098567 1019158 968255 907089 1032391 1037128 817225 782726 838918 931908
5687 931908 936592 838596 933566 885021 912115 1176235 1195456 1294219 1310916 1359604 1476830
5676 1476830 1497925 1442961 1496425 1348254 1201795 1086363 758214 792002 688389 502738
5666 502738 428180 476395 502918 551285 618060 659085 583909 431905 244114 283097 282748 280018
5654 280018 242406 206583 342330 420055 426923 658648 673164 608022 551849 399347 244306
5643 244306 312708 475133 443223 235826 196414 94887 172458 342975 423646 514533 374486
5632 374486 259933 400225 339019 278619 224386 273732 197487 222808 378568 394682 416381
5621 416381 477254 550035 539052 580637 619679 639273 574004 462911 591934 614493 661277
5610 661277 818678 743826 899401 943751 967675 872869 1030586 1125706 1076301 1151953 1167589
5599 1167589 1171078 1380169 1383893 1390209 1482505 1744624 1925341 2019040 2223327 2420970 2503277
5588 2503277 2640848 2778137 2920417 3163080 3161231 3257830 3383354 3366560 3302624 3259971 3243253
5577 3243253 3096012 3223441 3133945 3067875 2881871 2898556 2805621 2800633 2904968 2981810 3121823
5566 3121823 3346434 3408737 3522014 3717527 3917449 4292331 4508276 4793454 5109224 5346372
5556 5346372 5554829 5839909 5986534 6037189 5898504 5590764 5285660 5026542 4657291 4266070
5546 4266070 3959730 3638035 3455460 3251758 3008483 2789228 2749808 2698682 2643347 2619559
5536 2619559 2547486 2495746 2528979 2431975 2393441 2462163 2654455 2814237 2808957 2839163 2860007
5525 2860007 3029983 3047985 2839150 2735958 2556518 2295050 2191768 1989989 1885803 1641567
5515 1641567 1378857 1246113 1159469 1107783 1117291 879634 693443 724426 689085 563747 410142
5504 410142 391073 218040 106409 145899 199971 256904 289032 269290 268496 334160 213812
5493 213812 188769 66114 128558 99098 7053 12318 -90090 -51786 77358 -80889 -3213
5482 -3213 15222 19230 23882 -92917 -235922 -206055 -269311 -159590 -121934 -197639 -278124 -268359
5470 -268359 -240645 -174673 -105629 -41585 45154 -37218 -207091 -410470 -440303 -365737 -260831
5459 -260831 -241889 -176070 -341049 -382250 -269304 -234313 -240459 -410380 -428878 -364380 -340841
5448 -340841 -385908 -404895 -434403 -365954 -268030 -291771 -213898 -142133 -167831 -163435 -352568 -310028
5436 -310028 -292543 -372586 -397790 -440602 -361515 -311985 -350377 -354364 -229626 -270986 -329693 -298730
5424 -298730 -437382 -469184 -445231 -409034 -324237 -286964 -333815 -369921 -332164 -355309 -121166
5413 -121166 -234792 -246232 -198601 -322092 -400459 -424917 -460162 -255416 -218409 -381724 -383603
5402 -383603 -350460 -339686 -310942 -199096 -399175 -377547 -292795 -478790 -415029 -440221 -235072
5391 -235072 -221404 -326934 -338873 -260722 -336550 -323439 -293369 -310183 -360167 -468982 -502111
5380 -502111 -465793 -423467 -237093 -259376 -223668 -70258 -42653 -68269 -167785 -246155 -169089
5369 -169089 -225275 -253996 -267155 -256309 -268307 -330908 -235661 -316261 -264166 -201327 -243240 -202041
5357 -202041 -184881 -323120 -412021 -283125 -313573 -255032 -112603 -180100 -187170 -106085 -65183
5346 -65183 -50218 55018 -121475 -59412 7945 -81415 -137410 -175699 -186099 -164618 -49856
5335 -49856 9634 95385 -10789 6103 -34220 166648 158066 -23595 97915 37555 -32578
5324 -32578 19615 -52935 -45932 -8754 25810 71473 203746 317339 361686 343867 180564
5313 180564 162646 84549 243972 174522 290577 298238 344068 352930 364234 340814 434826 515543
5301 515543 563724 493928 398172 295001 218759 299373 178028 211594 306412 360466 380265
5290 380265 290481 93385 74891 85695 277460 242685 282503 264459 292911 334126 346936
5279 346936 402163 437882 419707 332478 516282 330989 415614 415501 381524 285567 232470 203783
5267 203783 316373 428518 380479 469020 574514 534826 525955 446427 388650 450656 561616
5256 561616 593684 685799 774140 860437 955623 960201 1097394 1136028 971363 930541 947621
5245 947621 983666 965322 822304 801901 942190 879237 857357 1066152 1069044 1105773 1069804
5234 1069804 1086136 1074331 1137105 1155589 1134817 1289852 1363438 1390196 1514510 1581030 1572386
5223 1572386 1547299 1582456 1577723 1566170 1488322 1502091 1258175 1092180 1070157 1048261 1066378
5212 1066378 910468 849417 896569 969543 851579 824069 872962 959314 986628 921952 905555
5201 905555 1014514 1099078 1140733 1128590 1138511 1181456 1161100 1120143 1016873 1003248 951224
5190 951224 914291 753691 645442 683014 810526 795646 743556 749842 777698 742019 776293
5179 776293 741815 737003 754751 735421 691399 815817 856905 925864 882211 888290 1008191 1019971
5167 1019971 1021834 1103763 1165328 1194315 1158353 1104872 1062719 1200140 1413552 1526350 1599868
5156 1599868 1623604 1667064 1767845 1888693 2138749 2240175 2170451 2253405 2244146 2180379 2307164
5145 2307164 2393058 2270570 2360551 2494297 2500008 2233747 2273252 2205016 2141518 2241220 2311739
5134 2311739 2357520 2483748 2662178 2835047 2916738 3060580 3331396 3340407 3418935 3739149
5124 3739149 3807837 3845882 3760518 3623487 3528047 3357205 3250647 2992756 2775325 2746856
5114 2746856 2795381 2533816 2435121 2279301 2220450 2106348 1983920 1814340 1752438 1669733
5104 1669733 1704043 1771719 1990080 2295347 2268342 2216855 2180506 2067873 1961492 1812043
5094 1812043 1786866 1716392 1591613 1554825 1473532 1428508 1189818 1139560 1060763 1010640 978350
5083 978350 909868 720806 725178 647341 545674 563812 612452 613438 733127 726677 657636 591971
5071 591971 506727 501468 514132 489695 479525 486510 542911 513742 503340 483482 487630 490883
5059 490883 516385 509930 402942 315379 434294 331678 291048 167202 225689 431454 459584
5048 459584 421840 442834 393481 440468 499004 402593 392421 326614 293028 303611 311962 252615
5036 252615 393850 389797 473311 530867 454182 488010 551063 545110 449483 422673 463411 506977
5024 506977 529383 472359 572148 548194 648501 720330 557665 501534 466809 431510 421312
5013 421312 421484 575890 580547 660901 760003 711515 821510 792051 818562 805691 774095 773435
5001 773435 758203 820002 935498 1062893 1256678 1501285 1484329 1495058 1499873 1533784 1623895
4990 1623895 1599831 1432169 1338971 1413882 1480166 1522854 1449226 1338139 1443789 1444509 1501478
4979 1501478 1527015 1463313 1413676 1387788 1399335 1236142 1219913 1300542 1328166 1461221 1554700
4968 1554700 1486608 1529667 1637306 1731432 1747086 1693925 1875516 1880474 1840496 1779077 1798791
4957 1798791 2022782 2105540 2271928 2322972 2431710 2585744 2701467 2798044 2834246 3068250
4947 3068250 3249358 3377125 3533058 3721938 3709723 3869254 3903762 3945065 3883002 3796109
4937 3796109 3795551 3773237 3693631 3717988 3646554 3712922 3879912 3940665 4053782 4169985 4478633
4926 4478633 4670209 4838068 5135209 5486387 5847045 6110933 6384349 6733112 6946846 7048698
4916 7048698 7022820 6887143 6572974 6313127 5994287 5682054 5311072 5093825 4795268 4495663
4906 4495663 4390881 4337918 4324242 4476528 4452577 4579907 4770798 5060805 5186802 5391455
4896 5391455 5564935 5668694 5852095 5849395 5919197 5864826 5902871 5537241 5265049 5085579
4886 5085579 4858141 4718893 4633714 4304263 4021833 3951219 3996193 3951241 3885191 3955942 4121147
4875 4121147 4110685 3959700 4040303 4069754 4178703 4102217 4141671 4237448 4257295 4207975 4164543
4864 4164543 4331173 4382047 4481997 4455958 4480321 4552114 4692293 4820814 4972603 5208356
4854 5208356 5436361 5617905 5732321 6072013 6327295 6662691 6877516 7220746 7586982 8022853
4844 8022853 8486348 8964774 9429953 9839430 10238179 10711299 11016086 11185128 11323458 11327432
4834 11327432 11243397 11094771 11067598 11103134 10977095 10957440 10947645 11147849 11451523 11687114
4824 11687114 12086956 12595917 13247436 13982703 14757447 15550394 16420647 17422482 18215545
4815 18215545 18963732 19487307 19750900 20095691 20217640 19934594 19493541 18920905 18275607
4806 18275607 17700153 17071999 16660141 16126026 15646297 15250761 14985465 15013221 15096468 15034979
4796 15034979 15050898 15286912 15564724 15817401 16260511 16684067 16940303 17285576 17544285 17678013
4786 17678013 17921647 18017139 18103811 18048419 17802339 17538241 17200552 16510823 16083706 15619808
4776 15619808 15007954 14481556 14038238 13726805 13323214 12872597 12310123 11866814 11591867
4767 11591867 11343097 11103479 10852743 10856208 10897687 10934146 10944839 11065552 11277419 11346413
4757 11346413 11314129 11331311 11342671 11077475 10946309 10714855 10618734 10393878 10142036 10017168
4747 10017168 10104419 10136579 10109122 10072647 10176265 10329510 10405152 10709833 10807555 11138660
4737 11138660 11621039 12085553 12456325 12850382 13157552 13476999 13796699 13950834 13965639 13909190
4727 13909190 13783785 13440159 13350846 13255366 13120831 13141225 13255321 13348037 13543448 13852988
4717 13852988 14109580 14475050 14802244 15336982 15899137 16428651 17088926 17672927 18220321
4708 18220321 18691534 19061492 19127740 18939469 18590600 17989555 17374427 16541582 15637695 14768822
4698 14768822 14096858 13587559 13122869 12874632 12601051 12417071 12376570 12403498 12624582 12855215
4688 12855215 12790007 13031581 13307675 13614596 13808226 13821210 13909608 13597486 13209829 12973033
4678 12973033 12481389 11945521 11446546 10876565 10334129 9873709 9568731 9251064 8818148
4669 8818148 8634023 8514286 8433096 8378417 8241234 8192669 8148046 8058029 7931474 7924264 7808147
4658 7808147 7696461 7533930 7492469 7488361 7555795 7626711 7738013 7703549 7699299 7725747 7745161
4647 7745161 7804916 7928980 8113581 8237150 8417496 8767161 9037936 9054092 9141826 9172721
4637 9172721 9108227 9061625 8929773 8826045 8800376 8802263 8959158 9005964 9191861 9322691 9434092
4626 9434092 9728470 10064749 10333016 10593616 10930133 11477958 11891096 12260664 12549481 12937418
4616 12937418 13248645 13336197 13477730 13435727 13283723 13144391 13027545 12716132 12520531 12232840
4606 12232840 11931809 11977746 11936674 11953184 12212589 12485513 12872691 13440902 14113055 14787272
4596 14787272 15452731 16097603 16885517 17560409 18061522 18505744 18526802 18213593 17673071 16873751
4586 16873751 15909918 14927156 13947865 12979402 12112716 11433395 10788829 10352733 10041510
4577 10041510 9731787 9599599 9497475 9538965 9569830 9622505 9973438 10166857 10299406 10408688
4567 10408688 10712118 10953428 10863233 10746872 10547920 10182644 9615666 9053230 8555133 8019258
4557 8019258 7508571 7190999 6744072 6388704 6134181 5792342 5554140 5366624 5258911 5171755
4547 5171755 4895188 4442530 4151994 4013575 3823477 3637801 3463344 3263894 3135533 3068489
4537 3068489 3141651 3052620 2999318 3023697 3064443 3137795 3093857 2974136 2911770 3007265 3117740
4526 3117740 3032923 3041361 3091553 3039021 2930427 2847093 2896614 2788181 2771882 2683739 2591560
4515 2591560 2567252 2369201 2280125 2321285 2263645 2348385 2298217 2312047 2366110 2346108 2370057
4504 2370057 2389107 2427012 2354623 2382963 2307629 2328827 2457794 2393384 2328284 2514275 2530356
4493 2530356 2467629 2564984 2531215 2511953 2444346 2434874 2421250 2533530 2480329 2593607 2679892
4482 2679892 2645520 2831328 2773352 2792412 2881310 2960405 3165814 3185252 3324299 3436212 3578209
4471 3578209 3831248 4115148 4226979 4525890 4769484 4829979 4920563 5068140 5076883 5049905
4461 5049905 5063028 5012515 5047744 4937294 4867252 4714929 4515094 4444070 4461304 4598349 4781635
4450 4781635 4818118 5001815 5231737 5514478 5728101 6134519 6663836 6974696 7271138 7493316
4440 7493316 7719327 7803700 7946165 7842862 7529108 7292238 7016171 6790639 6512974 6320587
4430 6320587 5989687 5734481 5604440 5526581 5665537 5631989 5517973 5624939 5740570 5897800
4420 5897800 6148616 6382343 6546299 6585780 6550664 6575495 6412963 6352363 6243865 6043565
4410 6043565 5876062 5714399 5608211 5472091 5341368 5237923 5008344 4928299 4917659 4779163
4400 4779163 4885251 4929044 4817030 4850033 4859774 4979092 5145028 5114174 5157467 5343980 5342793
4389 5342793 5301547 5316963 5323246 5232703 5231033 5408290 5417906 5350703 5421727 5534117 5592685 5640598
4377 5640598 5654155 5632524 5668798 5713532 5614126 5794267 5906573 5905215 6045936 6111541 6246121
4366 6246121 6401352 6784373 6932167 7232536 7390619 7547103 7792151 7957863 8273992 8411598
4356 8411598 8442908 8709438 9040893 9104783 9307211 9731588 9876567 9906964 10272680 10538822
4346 10538822 10974372 11356269 11692046 12040236 12275236 12622129 13034193 13408388 13690332
4337 13690332 14246131 14790943 15241296 15800898 16401498 17170189 17932777 18654262 19358110
4328 19358110 19922511 20351250 20812967 21107584 21253721 21140584 20992359 20846219 20553233
4319 20553233 20250248 20067238 20050776 20212701 20261985 20302835 20442201 20809402 21282593 21553701
4309 21553701 21976443 22485481 23163114 23806280 24359436 24995764 25519328 25910141 25960375 25805748
4299 25805748 25270014 24493704 23668125 22741767 21812239 21050020 20184567 19523622 18989700
4290 18989700 18467248 18079041 17742073 17574046 17453997 17307748 17433811 17636683 17848347
4281 17848347 18139144 18496050 18789623 19067122 19267139 19232897 19073633 18838792 18532231 18110293
4271 18110293 17532126 16935491 16421903 15924950 15581490 15245516 14945945 14625269 14456026
4262 14456026 14292138 14318793 14439987 14696682 14895426 15261288 15728235 16301881 16703690 16923686
4252 16923686 17137856 17365203 17495139 17287738 17191954 16974203 16780270 16592150 16421371 16362311
4242 16362311 16281336 16325929 16487871 16590034 16747543 17088720 17595005 18108686 18542768 19070855
4232 19070855 19731732 20301929 20716455 21168366 21453293 21550549 21417917 21342883 21147968 20941104
4222 20941104 20716390 20553286 20494577 20727519 20981777 21364411 21676574 21842782 22202404 22477544
4212 22477544 22836630 23419809 23994051 24683376 25444502 26340353 27131241 27698646 28287128
4203 28287128 28504511 28834912 29056538 28960967 28862141 28770849 28762732 28881635 28923146 28934391 28800830
4192 28800830 28865098 28757184 28586364 28323247 27999212 27549894 27290102 27040591 26883802 26767649
4182 26767649 26668217 26730466 26979365 27266400 27582639 28002543 28443974 28799970 29220154 29610634
4172 29610634 29973850 30192493 30480520 31015283 31274678 31372274 31235823 31121592 30858129 30336802
4162 30336802 29565334 28782398 27764549 26777771 25792851 24660503 23723397 23004367 22462983
4153 22462983 21819104 21406525 21107625 20955441 21005568 20973450 21300281 21602289 22087022 22791635
4143 22791635 23546635 24373336 25112882 26006054 26930361 27563660 28030944 28270961 27952649
4134 27952649 27179327 26174611 24698293 23223632 21714141 20169700 18787803 17695849
4126 17695849 16588169 15559973 14946554 14152444 13625733 13174119 12738297 12630473 12496669
4117 12496669 12497238 12455530 12503943 12617964 12787165 12981100 12961665 13036599 12937331 12720130 12319832
4106 12319832 11818220 11403606 11071422 10546492 10048320 9481701 9043853 8873753 8494646
4097 8494646 8294089 8006929 7808714 7732378 7527040 7305213 7334862 7351645 7142161 7058557
4087 7058557 7024118 6983013 7006821 6971905 7150689 7310850 7396554 7355325 7392438 7485240 7573584
4076 7573584 7537355 7636239 7694220 7664557 7792834 7883204 8068587 8212964 8367072 8475410
4066 8475410 8650543 8821743 8886908 8958946 8970446 9040518 9237131 9311494 9457575 9659566
4056 9659566 9934540 10118950 10382116 10552744 10564410 10813945 11034578 11304801 11487771 11708838
4046 11708838 12156908 12499216 12956800 13388321 13726675 14046685 14451326 14727658 15114582
4037 15114582 15475928 15873251 16205265 16633064 16988367 17360245 17932075 18285853 18533608
4028 18533608 18823219 19339299 19650226 20047603 20462852 20990038 21467480 21925830 22323144
4019 22323144 22680121 23006059 23519564 24168143 24706405 25270795 26021522 26982309 27843152
4010 27843152 28790310 29870705 31009929 31887856 32720614 33587758 34482428 35258011 36055796
4001 36055796 36609378 36883796 37072227 37139881 37038506 36794073 36765066 36743949 36981904 37579665
3991 37579665 38334016 39428988 40645452 42130277 43739111 45245604 46703679 48100910
3983 48100910 49051465 49746388 50227743 50431540 50471628 50236562 49652480 48928275 47908843
3974 47908843 46519494 44918872 43199941 41333179 39429494 37397887 35405706 33553330
3966 33553330 31863515 30181077 28701139 27487679 26390303 25538294 24782740 23798999 22992865
3957 22992865 22400243 21779081 21190056 20549931 19957045 19437626 19122279 18725758 18303163
3948 18303163 17997308 17786063 17504026 17505024 17603213 17824016 18016644 18269137 18574410 18736427
3938 18736427 18752476 18751905 18638655 18469285 18241580 18041742 18021586 18110013 18319423 18793742
3928 18793742 19577513 20478114 21624963 23003278 24209451 25232963 26096976 26462521 26114445
3919 26114445 25161857 23643119 21836143 19967729 18022865 16226084 14694869 13379017
3911 13379017 12108739 11056274 10321907 9364941 8512720 7804382 7404000 6921471 6359439
3902 6359439 5972002 5809109 5597561 5449823 5099915 4850885 4586895 4488069 4177249 3954555
3892 3954555 3813664 3707586 3677885 3565924 3502533 3441945 3380661 3166121 3239074 3061749
3882 3061749 2845671 2741480 2678724 2603929 2602882 2682902 2633830 2473411 2314025 2258339 2355167
3871 2355167 2321267 2189501 1949024 1915712 1939847 1949573 1924315 1842495 1765958 1793764 1707663
3860 1707663 1796238 1987725 1882331 1675948 1679037 1658262 1701374 1648515 1535982 1551267 1641319
3849 1641319 1641517 1626329 1617771 1562210 1478998 1494375 1482061 1529056 1581585 1690242 1707646 1643735
3837 1643735 1444069 1443240 1381682 1416494 1423319 1400833 1605946 1590396 1406007 1521997 1529952
3826 1529952 1569637 1496634 1488792 1376918 1257254 1306926 1275074 1351529 1200843 1401142 1431452
3815 1431452 1416040 1420963 1410031 1468267 1454490 1384760 1459043 1430826 1396736 1477102 1423149 1428209
3803 1428209 1472015 1523727 1568069 1487670 1452171 1421297 1327711 1268564 1314210 1389474 1482047
3792 1482047 1643800 1670943 1614506 1630228 1573584 1487683 1443752 1355998 1418751 1537533 1522661
3781 1522661 1547456 1615799 1558273 1539774 1566485 1429355 1388889 1500515 1464944 1425268 1536308
3770 1536308 1539780 1649771 1611717 1665984 1684976 1748872 1642461 1615682 1646619 1657389 1653245
3759 1653245 1705428 1784534 1832337 1850866 1740861 1695292 1719080 1649707 1806115 1864377 1711361
3748 1711361 1733046 1777396 1800820 1834941 1922730 1969875 1991313 1919134 1771942 1816476 1831673
3737 1831673 1776036 1830841 1797933 1839394 1924203 1970869 1982202 1995644 1922102 1866276 1856959 1854311
3725 1854311 1852213 1946899 2067484 2158964 2070057 2076685 1968212 2043787 2075188 2048104 2042648 2103181
3713 2103181 2301326 2394231 2392406 2530566 2490229 2418678 2321224 2249593 2260824 2175268 2231851
3702 2231851 2321532 2312927 2457958 2549231 2536369 2584122 2564497 2764336 2654063 2639205 2609361
3691 2609361 2655745 2732387 2741221 2661994 2730319 2850295 2923838 3032714 3114612 2941160 2919474
3680 2919474 2968437 2950707 3066251 3057279 3161351 3189870 3236213 3328775 3275647 3202388 3174401
3669 3174401 3180381 3262065 3242069 3242022 3399651 3476552 3472324 3560531 3562841 3583857 3549622 3516667
3657 3516667 3482897 3580651 3707520 3800403 3798128 3881515 4046225 4162032 4215341 4182637 4151836
3646 4151836 4141338 4186157 4200442 4233900 4277615 4398098 4494258 4464724 4398261 4299829 4301320
3635 4301320 4379274 4355408 4306648 4349614 4391401 4542395 4651558 4655128 4566957 4455994 4373025
3624 4373025 4532072 4566500 4675351 4686121 4532231 4609086 4766582 4967079 4876753 4803082
3614 4803082 4761463 4661582 4633116 4826261 4866952 5000490 5117178 5108914 5191473 5376697 5359907
3603 5359907 5172636 5208333 5244343 5259680 5318278 5439945 5536332 5589322 5674986 5749864 5819683
3592 5819683 6022905 6214526 6168880 6124276 6115814 6198719 6309323 6370594 6327331 6486362 6621818
3581 6621818 6787703 6881161 6888100 6869760 7036851 7062932 7163657 7478568 7540723 7546466 7669444
3570 7669444 7778777 7677924 7678484 7748534 7856059 7800093 7853670 7869492 7921458 8080365 8190642
3559 8190642 8003221 7910538 7878991 7929050 7899285 7908424 8063681 8244579 8458216 8442646 8547066
3548 8547066 8716710 8840981 8795059 8761327 8876862 8799308 8993071 9160288 9306270 9328207
3538 9328207 9491734 9573272 9639061 9702172 9776042 9767644 9827496 10010318 10090644 10299477 10500792
3527 10500792 10670164 10951389 11232407 11318371 11565740 11902249 12115443 12266512 12534387 12932127
3517 12932127 13423654 13856953 13967034 14100824 14475479 14609407 14768943 14879837 15218535
3508 15218535 15402536 15546939 15772081 16010904 16252293 16539371 16559947 16670747 16915731 16926745
3498 16926745 17182020 17521978 17839109 18188716 18541244 18954465 19150743 19368384 19514542
3489 19514542 19661663 19733429 20069108 20015716 20140746 20225388 20405704 20651891 20728993 20763846
3479 20763846 20790700 20832374 20936414 21082163 21089914 21174530 21311556 21506821 21478852 21573770 21609890
3468 21609890 21687194 21738360 21816024 22000317 22198598 22403672 22536466 22789829 23042445 23125694
3458 23125694 23491289 23561703 23585596 23765434 24192900 24542588 24911930 25118537 25571502 25941644
3448 25941644 26213737 26583113 27079513 27388209 27647838 28085113 28588982 29159754 29802855
3439 29802855 30481993 31059871 31746573 32527525 33355924 34386856 35396605 36485787 37693207
3430 37693207 38880604 40210025 41400509 42760847 44202247 45844844 47469347 49198298
3422 49198298 50984946 52682527 54595671 56507048 58528873 60597808 62599498 64455277
3414 64455277 66283392 67990537 69772881 71679011 73736108 75939329 78276949 80750821
3406 80750821 83357498 85994076 88657554 91218227 93883636 96494325 99168667 101828215
3398 101828215 104602248 107413715 110354170 113406885 116250425 119154800 122078910 124637099
3390 124637099 126931126 128982308 130619540 131886486 132821729 133600249 133915736 134358398 134463181
3381 134463181 134630310 134924358 135553255 136400417 137435156 138669910 140217377 141943430 143621505
3372 143621505 145183641 146770665 148300222 149733537 151005069 152213871 153288268 154012744
3364 154012744 154476570 154347237 153629096 152368807 150591976 148360538 145727826 142962602
3356 142962602 140175990 137127923 134026925 131151226 128260110 125578545 123063692 120902287
3348 120902287 118857502 117145771 115572625 114352120 113198198 111928824 110693142 109267319
3340 109267319 107830453 106110601 104519243 102613370 100657957 98785798 96885925 95062297
3332 95062297 93241106 91582270 90080413 88859887 87839927 86991476 86301886 86017751 85993014
3323 85993014 86071798 86403895 86771549 87092594 87376310 87463910 87295969 87032976 86378803 85687727
3313 85687727 84965025 84090466 83311528 82479466 81493928 80522297 79437514 78398273 77378988
3304 77378988 76548300 75818278 75196547 74825444 74672921 74596057 74711770 74773883 75058371 75344093
3294 75344093 75633136 75863627 76005150 76027022 75941961 75705345 74912922 73880400 72692538
3285 72692538 71249920 69610585 67981609 66236154 64564167 62816635 60737668 58687553
3277 58687553 56659445 54626321 52559033 50797972 49210649 47825876 46605353 45513891
3269 45513891 44738506 43781578 42815241 41906499 40975042 40147536 39281787 38315513 37372357
3260 37372357 36534956 35733806 34929479 33945989 32973520 31919964 30804819 29688308 28649022
3251 28649022 27500957 26473971 25473784 24516472 23792004 22923300 22191239 21306831 20524711
3242 20524711 19717896 19161101 18846497 18581709 18091866 17534284 17203825 16900574 16377786
3233 16377786 16157106 15974015 15836080 15767525 15635515 15507876 15377212 15243429 15123540 15082234
3223 15082234 14979082 14815466 14845239 14940525 15015121 14999509 15061403 14901753 14688481 14634764
3213 14634764 14387014 14141877 13955580 13884365 13707699 13504350 13281741 13147590 12967263 12559833
3203 12559833 12203108 11979290 11805996 11785503 11809203 11824444 11480557 11401503 11340232 11252584
3193 11252584 11143135 10946428 10870231 10852529 10830807 10784374 10681370 10462155 10355491 10269033
3183 10269033 10064889 9928541 9848572 9855511 9675407 9575602 9406446 9132233 9016472 8736635
3173 8736635 8421692 8238451 8187546 8078680 8148269 8085247 8079513 8021213 7961694 7902914 7649823
3162 7649823 7707943 7677554 7535240 7519985 7517330 7575672 7571141 7507830 7401638 7226168 7257882
3151 7257882 7328914 7354946 7509209 7530432 7619473 7674831 7613287 7589055 7552416 7622182 7769585
3140 7769585 7832248 8004026 8099952 8105815 8092131 8073496 8114808 8053411 8126126 8364799 8738562
3129 8738562 8985801 8988429 9232102 9233995 9322221 9417357 9707361 9971791 10064214 10179606 10273044
3118 10273044 10276867 10200801 10225674 10104628 10246485 10494576 10656963 10884139 11070660 11184104
3108 11184104 11233900 11303099 11261199 11303289 11562318 11835693 12022273 12070040 12059691 11840093
3098 11840093 11551516 11387290 11158337 10983321 11044085 11109797 11123300 11131228 11281966 11317460
3088 11317460 11181549 11132358 11339051 11400623 11618780 11847189 12113957 12302719 12508043 12579371
3078 12579371 12672992 12992776 13528874 14030386 14514558 14977990 15398683 15773046 16040424 16216791
3068 16216791 16854969 17630653 18219502 18874397 19449655 19937573 20362253 20737336 21151867
3059 21151867 21994268 22971317 23983734 24803525 25379100 25693663 25972529 26061502 26261009
3050 26261009 26767836 27387545 28069837 28673534 29098185 29637309 30261693 30995427 31893154
3041 31893154 32847191 33827304 34809066 35788752 36601340 37543349 38771851 40109834 41661374
3032 41661374 43353134 45310346 47003072 48706061 50606182 52659092 54985729 57488017
3024 57488017 60238937 63274504 66480368 69827117 73557086 78035719 83360628 89438745
3016 89438745 96254696 104175624 113454089 124366243 137650145 154015596 173411550 195666174
3008 195666174 219921282 244965982 269028131 290967912 307949122 315898463 312226340
3001 312226340 296769447 273395998 246513713 218980896 192407825 168307798 147326745
2994 147326745 129406053 114192261 101491894 90709261 81630338 73645785 66918525
2987 66918525 61131766 56210079 51788566 48089374 44727699 41655044 39191469 36854313
2979 36854313 34660586 32741649 31119002 29647820 28252709 27046249 25893562 24902817
2971 24902817 24044947 23105655 22292517 21779099 21286887 20589427 20032848 19346898 18943398
2962 18943398 18419295 17928499 17406105 16796724 16346522 15887659 15465754 15169249 14703930
2953 14703930 14141439 13800048 13496159 13201601 12914278 12741924 12539045 12308997 12122871
2944 12122871 11837292 11498366 11234569 11068047 10843751 10603601 10468444 10347643 10227383
2935 10227383 10029400 9829240 9658543 9521297 9328321 9098407 9096619 8972806 8767230 8752933
2925 8752933 8607039 8506612 8520577 8375186 8333839 8181184 8060642 8008780 7999541 7960003 7875905
2914 7875905 7765275 7783651 7884099 7834638 7915919 7946213 7849685 7769493 7802802 7733165 7640805
2903 7640805 7659022 7797713 7801203 7934398 7979247 7781013 7785304 7782766 7644538 7555129 7632693
2892 7632693 7705312 7626563 7550594 7691512 7577038 7500297 7592612 7637051 7691883 7700654 7515067
2881 7515067 7567659 7584466 7704926 7722492 7734170 7711294 7827182 7943287 7847492 7764501 7726971
2870 7726971 7790164 7867360 7870899 7786859 7811637 7784336 7814259 7887486 7931351 7911444 8090996
2859 8090996 8041478 8143586 8282399 8231803 8238900 8337926 8415044 8588051 8629418 8506144 8491639
2848 8491639 8452644 8584962 8678537 8788889 8825587 8829263 8844496 8855443 8853697 9001225 9029418
2837 9029418 9130697 9298988 9255159 9249975 9296792 9281170 9216893 9337372 9403368 9573042 9780133
2826 9780133 9847237 9797462 9920165 10059609 10142476 10171470 10205919 10346312 10413230 10412924 10513199
2815 10513199 10463872 10505606 10648811 10755059 10795694 10895242 10983268 11163775 11366350 11394387
2805 11394387 11514207 11767430 11859471 12064844 12342874 12555607 12785937 13026536 13198148 13439306
2795 13439306 13609846 13759656 14031082 14366142 14490849 14816434 15193933 15497884 15713635
2786 15713635 15852243 16102800 16425712 16777828 17089252 17541663 17947510 18229971 18536033
2777 18536033 18850551 19304469 19856355 20182094 20758013 21309956 21811578 22381211 22949732
2768 22949732 23508410 23926241 24385377 25062721 25612232 25913537 26266096 26751570 27141084
2759 27141084 27566129 28052682 28443488 28896007 29494388 30103172 30700958 31326194 31645817
2750 31645817 31940031 32486506 32848999 33237871 33709718 34178379 34570401 34946234 35480449
2741 35480449 36049457 36654601 37427361 37992705 38629988 39284373 40058650 40854197 41632058
2732 41632058 42603020 43590815 44643967 45800049 46951792 48266775 49537599 50806266
2724 50806266 52169784 53534486 54903427 56283191 57486807 58620575 59767158 60900031
2716 60900031 61887206 62930594 64114779 65170569 66487769 67798195 69208767 70647802
2708 70647802 72201496 73966627 75701148 77627719 79712668 82044293 84366667 86531213
2700 86531213 88415223 90087969 91599536 93042348 94439965 95892766 97249543 98352171
2692 98352171 99550929 100615047 101569912 102389197 102968441 103481421 103936419 104360223 104662874
2683 104662874 104758915 104785647 104797267 104629243 104545166 104468895 104402672 104377068 104439137 104638556 104662114
2672 104662114 104356858 103883949 103179592 102362482 101509634 100813392 100291023 99903688 99680612
2663 99680612 99392632 99249915 99148985 99069269 98968858 99042706 99247976 99558150 100005624 100420994
2653 100420994 100938396 101520218 102031103 102529981 103043835 103472435 103713244 104043096 104312216
2644 104312216 104559783 104866665 105123167 105497948 105960848 106501848 107236431 108064141 109227802
2635 109227802 110529219 111871658 113670925 115677223 117883819 120463820 122993726 125898838
2627 125898838 129006796 132207608 135384100 138516362 141257915 143532709 145151621 146125018
2619 146125018 146492823 146307141 145582528 144577186 143494072 142254863 141142142 139940672
2611 139940672 139029116 138180367 137422784 136731342 136121408 135419225 134680245 134189867 133843675
2602 133843675 133436613 133065469 132822902 132675878 132285699 131668170 130591326 129038787 126840618
2593 126840618 123991690 120743036 116930724 112836845 108573423 104405641 100340988 96587732
2585 96587732 93147613 89994937 86906056 84164510 81667208 79401912 77382858 75606428
2577 75606428 73839444 72210882 70773506 69393804 68063568 66853813 65677893 64509665
2569 64509665 63245242 62088966 60896091 59594955 58090917 56444981 54840426 53388830
2561 53388830 51984686 50407107 49023487 47598972 46318601 45126461 43961854 42845911
2553 42845911 41730209 40672635 39641754 38731507 38015930 37424046 36673994 35878749 35412444
2544 35412444 34899990 34569063 34160615 33558620 33041399 32593771 32017362 31350126 30645681
2535 30645681 30080540 29577162 28994703 28182695 27622612 27244318 26719575 26177903 25529070
2526 25529070 24997309 24536780 23955958 23601146 23276675 22858159 22490134 22109977 21540351
2517 21540351 21173842 20890662 20438156 19939024 19390723 18952031 18557831 18334317 18013834
2508 18013834 17784704 17605698 17303787 17019268 16752015 16520655 16372772 16182040 15836580
2499 15836580 15610061 15531084 15371832 15256664 15078788 14912979 14758115 14630386 14533570 14460928
2489 14460928 14385537 14259452 13979446 13876720 13850632 13743229 13682576 13527012 13321336 13264458
2479 13264458 13408928 13304565 13299851 13213462 13193511 13090641 13016836 13023529 12994240 12835302 12914875
2468 12914875 12931491 12859084 12827726 12686850 12664989 12647790 12585984 12629861 12607790 12524852 12492815
2457 12492815 12419711 12456158 12510625 12438340 12513502 12505890 12463879 12496780 12551906 12458221 12523202
2446 12523202 12503445 12412155 12347181 12424497 12462423 12346233 12459614 12527244 12445889 12482788 12531067
2435 12531067 12371885 12333129 12420792 12371692 12353714 12309257 12296593 12410388 12357635 12509122 12426481
2424 12426481 12351303 12401399 12492353 12478376 12426553 12386891 12667477 12679577 12644628 12484683 12461399
2413 12461399 12440692 12435515 12372394 12411314 12438180 12535767 12676238 12648113 12597609 12574197 12632621
2402 12632621 12693290 12501562 12334848 12303549 12360294 12518843 12499510 12486845 12445998 12325794
2392 12325794 12343376 12471594 12571612 12595207 12546414 12645056 12668633 12593759 12730674 12833924
2382 12833924 12807053 12924940 12776308 12840130 12992814 12950614 12993371 12951744 12944622 13009601 13020129
2371 13020129 12950869 12970243 12996089 13124819 13178611 13286728 13410845 13448710 13486477 13394531 13518446
2360 13518446 13616833 13653264 13724958 13845549 13919379 13824667 13944015 14009995 14102198 14227884 14347390
2349 14347390 14425852 14415141 14491236 14514763 14661831 14864355 15043068 15143948 15286509 15519830
2339 15519830 15667826 15602596 15754083 15935586 16047860 16201206 16347521 16810475 17315237 17628721
2329 17628721 18058561 18758077 19524219 20079311 20722769 21336926 21831939 22227514 21904678
2320 21904678 21356096 20806211 20148078 19519876 19167977 18827987 18496006 18359857 18273118 18164381
2310 18164381 18001905 17938262 17944313 18056141 18103071 18068237 17979571 18132267 18293809 18380989 18442360
2299 18442360 18773056 18850768 18856534 18779037 18955511 19152151 19360952 19489686 19698056 19846626
2289 19846626 20069066 20358660 20538433 20744270 20986465 21133572 21358247 21676725 21853854
2280 21853854 22111381 22270349 22324879 22565912 22749961 22920767 23144534 23393564 23538992 23775084
2270 23775084 24043224 24354897 24727656 25070503 25480504 25959358 26194015 26542090 26959935
2261 26959935 27189835 27525421 28012166 28561031 28822490 29114631 29520471 30012758 30479656
2252 30479656 31108896 31554643 31930430 32314765 32808364 33372751 33873416 34272775 34922679
2243 34922679 35475692 36056072 36537776 37097492 37628230 38262050 38841987 39430782 40089128
2234 40089128 40935267 41669771 42310072 43118694 44004433 44942983 45825898 46735522 47707771
2225 47707771 48746989 49768063 50904950 51882936 52895331 53924792 54857674 55882563
2217 55882563 57002150 58152384 59247600 60427875 61405001 62553999 63829740 64912908
2209 64912908 66090328 67317368 68541667 69900049 71359221 72816065 74493925 76163979
2201 76163979 77784391 79836443 81733707 83624084 85718196 87824907 89988062 92458243
2193 92458243 95022383 97502472 100081973 102911463 106237331 109823344 113892360 118385924
2185 118385924 123031305 128049512 133544716 139332606 145116800 151075793 157211241 163168025
2177 163168025 168952352 174392529 179248892 183542411 186809054 189121376 190393799 190347489
2169 190347489 188859443 185880038 181621525 176285796 169862042 162821450 155553079 148358031
2161 148358031 141488261 134819158 128711841 123012441 117680070 112768559 108375351 104178340
2153 104178340 100324346 96765415 93425622 90263568 87446046 84682635 81989557 79615150
2145 79615150 77231185 74921375 72678769 70480211 68349568 66416519 64571350 62843186
2137 62843186 61189140 59474965 57901068 56218682 54810707 53289663 51972734 50722174
2129 50722174 49480330 48181777 46838925 45692311 44735397 43860519 42843580 41948935 41088351
2120 41088351 40418357 39592608 38837066 38211463 37607080 36882489 36291589 35829853 35213191
2111 35213191 34638670 34054105 33476021 32823989 32291770 31857263 31531049 31118778 30646572
2102 30646572 30143737 29663520 29356037 28988867 28515717 28177711 27901533 27509332 27155628
2093 27155628 26852705 26533828 26278536 26034272 25814813 25548093 25242503 25023077 24875405
2084 24875405 24626265 24341208 24142936 24015750 23845020 23670188 23357915 23159369 23251971 23080741
2074 23080741 22750452 22493882 22256772 21995707 21770103 21633673 21453157 21344672 21250999 21027974
2064 21027974 20935074 20761841 20606238 20539920 20252208 20069034 19928658 19889761 19833138 19633626
2054 19633626 19556739 19376148 19170861 18999386 18817284 18702655 18675430 18591358 18440092 18296306
2044 18296306 18228711 18178178 18058585 18012641 17984717 17704786 17574946 17545787 17494964 17397328 17365466
2033 17365466 17210298 17026982 16921313 16872684 16779864 16841769 16814170 16724287 16727665 16601840 16513210
2022 16513210 16469178 16335280 16244095 16274570 16239336 16173701 16070900 16006484 15919763 15892683 15850987
2011 15850987 15805780 15719569 15570967 15496327 15294967 15182578 15139431 15134667 15147267 15059094 14996945
2000 14996945 14944457 14813663 14660891 14621488 14522316 14348246 14331334 14292761 13988311 13858492
1990 13858492 13975222 13984471 13967884 13837312 13693778 13678511 13699338 13643379 13590914 13389384 13397212
1979 13397212 13307951 13119387 13168076 12978448 12938629 12911350 12711009 12574217 12520422 12448560
1969 12448560 12398216 12442711 12504336 12470931 12222818 12073809 11998999 12046254 12039075 12025394 11958406
1958 11958406 11915973 11937179 11914689 11910026 11845985 11932010 12002922 11992575 12068867 12221612 12139216
1947 12139216 12208134 12186948 12267568 12213185 12256857 12347401 12337052 12384846 12542370 12388980 12527714
1936 12527714 12629131 12687876 12788234 12880750 12938978 12985659 13068138 13213238 13350802 13598437
1926 13598437 13673069 13728629 13926796 14074901 14285042 14427333 14800187 14793920 14874195 15065793
1916 15065793 15323428 15340241 15647666 15843563 16141815 16305410 16435097 16712902 16905569 17042143
1906 17042143 17384454 17598978 17836020 18161593 18412949 18652452 18858833 19126222 19284384
1897 19284384 19569506 19852221 20156427 20430211 20726092 21169046 21404577 21818372 22303285
1888 22303285 22691656 23064191 23438021 23900811 24365584 25027140 25538932 26150837 26680689
1879 26680689 27431594 28261998 28975655 29694917 30438190 31303959 32256884 33180060 34337740
1870 34337740 35395544 36538308 37825860 39087928 40208244 41677504 43116739 44428343
1862 44428343 45877030 47191070 48374504 49428826 50541923 51425743 52139053 52633373 53264238
1853 53264238 53910960 54521434 55134337 55831262 56734907 57821588 58833073 59831591 61035019
1844 61035019 62269610 63683778 65303938 66943623 68813214 70790967 72875788 75134818
1836 75134818 77497684 79931950 82380860 84547295 86435418 87969005 88995284 88918693
1828 88918693 87620480 85548274 83247663 80737070 78273708 76237845 74549530 73193860
1820 73193860 72303863 71657426 71318980 71191350 71178670 71514821 71768521 72200840 72627127 73130225
1810 73130225 73667586 74048848 74300449 74248388 74064131 73475956 72823365 72113143 71039459
1801 71039459 69966635 68635157 67151945 65404197 63464434 61788036 60002152 58407900
1793 58407900 56855238 55399311 54213741 52969757 51826024 50933836 50078239 49043151
1785 49043151 47990501 47231199 46150063 44963712 43984818 42748371 41489862 40015334
1777 40015334 38439478 36815549 35227561 33712880 32353059 30910510 29595459 28459832
1769 28459832 27482444 26248693 25280138 24520774 23789847 23031593 22428419 21754197 21101768
1760 21101768 20627646 20137460 19697661 19146637 18636571 18159960 17713088 17219349 16757854
1751 16757854 16357319 15918689 15566883 15268333 14878621 14440712 14010528 13600930 13200188
1742 13200188 12968851 12573406 12175922 11922988 11635428 11480360 11170187 10772864 10599079
1733 10599079 10472174 10216610 9975634 9874132 9676685 9502240 9342714 9097888 9014116 8871118
1723 8871118 8737434 8616306 8460432 8448873 8149391 8042941 7958125 7765749 7662003 7520872
1713 7520872 7371974 7182237 7120147 7011802 6819900 6679169 6523852 6361805 6171228 6211357
1703 6211357 6112068 5776083 5702009 5614963 5728062 5503516 5223749 5256879 5185244 5172421 5120994
1692 5120994 5005332 4812357 4854158 4755733 4596945 4435092 4431391 4345068 4302235 4260845 4229183
1681 4229183 4133212 3952633 3921393 3935656 3820411 3779260 3550222 3587281 3573274 3319188 3260479
1670 3260479 3252195 3154594 3029407 3009828 3037041 2999414 2850707 2922000 2881727 2708371 2712018
1659 2712018 2721829 2711784 2716757 2733119 2661417 2662873 2649039 2518711 2405625 2361326 2408505 2310236
1647 2310236 2320721 2232677 2170474 2148505 2198968 2112245 2024850 2038333 2022070 2102483 2052804
1636 2052804 1913596 1945707 1965139 1974785 1959758 1892647 1779209 1792338 1837120 1890059 1878656
1625 1878656 1816516 1784128 1795605 1738089 1736937 1676065 1597047 1698767 1654358 1721994 1635421
1614 1635421 1669746 1642461 1602434 1534401 1506066 1615749 1535940 1605684 1605605 1587810 1607967 1552850
1602 1552850 1473615 1504198 1475185 1426543 1487754 1485330 1476473 1465665 1395019 1370075 1224155 1252186
1590 1252186 1324574 1344168 1411566 1361987 1398309 1382153 1254189 1287576 1299574 1368762 1407832
1579 1407832 1331868 1327002 1443840 1525279 1463724 1353410 1338112 1292314 1385340 1376458 1321448
1568 1321448 1291084 1207860 1137647 1215194 1276634 1272389 1137635 1187466 1237707 1288260 1273606
1557 1273606 1245213 1299333 1354226 1427939 1322537 1399606 1435238 1372644 1359580 1342001 1343629
1546 1343629 1119727 1085996 1195954 1240963 1248303 1151476 1117824 1022026 1071059 1054294 1047094
1535 1047094 1026018 933867 861976 831903 926412 1000440 1039414 1056559 1106684 1054019 1047793 1036450
1523 1036450 998754 1021781 1001187 1050986 856273 867137 921857 1035329 986811 989082 982526
1512 982526 963142 946195 940146 953657 951334 755404 647760 777968 751445 680431 804120
1501 804120 896367 867888 816648 674430 728277 728466 666479 749803 668468 709734 678308 628146
1489 628146 624730 605461 648207 497701 529761 471503 502676 631629 613139 622357 704651 637587
1477 637587 579559 578433 465905 490768 378779 347404 515331 583003 530433 505586 394952
1466 394952 501196 453198 338037 338294 358069 419507 402918 436262 473863 378417 206557
1455 206557 391413 467469 381739 309797 203372 275165 357046 333692 302766 343733 289362
1444 289362 262431 225469 382799 216962 209284 289336 223531 213388 202235 156380 69548
1433 69548 146975 291113 310325 268049 318392 250354 247840 305184 181074 115991 93883 190976
1421 190976 191579 208333 210462 234443 279814 254039 220291 109124 149296 37082 28346 -52014
1409 -52014 102758 25155 183777 145637 241249 165529 65096 94089 148481 129998 111183
1398 111183 85700 199404 117092 847 24868 51928 84794 95711 73899 405 25293
1387 25293 11012 -94940 -30964 40760 -100110 -124430 -2333 111308 79335 36416 31608
1376 31608 15505 40920 100005 7858 5035 94565 -11901 -113026 -169532 -37994 46871
1365 46871 -45145 -56082 -77057 -73377 -73110 -31162 5091 -24213 -64068 3432 48514 4212
1353 4212 -46317 -94645 -76115 -32212 -83011 -80888 -66632 -35423 3730 98631 65 -23451
1341 -23451 -112340 -153154 -93219 -110379 -129488 2870 -579 -67382 -232433 -163125 -52444
1330 -52444 -4880 54993 -86949 -158203 -33551 -76138 -129843 -127472 -72416 -113401 -191414 -139870
1318 -139870 -113158 -171890 -158078 -27104 126824 -68090 -151119 -39914 42858 -435 -70828
1307 -70828 4286 -52480 -190786 -39901 -55005 -33870 -22302 -26560 -23616 -61449 -92643 -43755
1295 -43755 -150981 -266662 -176170 -272329 -215509 -34778 -22907 -97311 -116137 -154165 -185410
1284 -185410 -223260 -138119 -116098 -181782 -168346 -230685 -118319 -77109 -230780 -285879 -152297
1273 -152297 -162780 -120530 -20131 -153639 -115382 -175418 -47476 -57800 -92244 -196149 -205109
1262 -205109 -184202 -130531 -103003 -120426 -117612 -242016 -193390 -179128 -203071 -121824 -120531 -80968
1250 -80968 -75482 -106204 -120308 -153512 -204629 -174275 -35983 7304 -144770 -86721 -127792 -137842
1238 -137842 -221518 -270455 -48237 -86293 -238744 -266140 -183453 -143403 -193469 -143404 -188258
1227 -188258 -107493 -138436 -172001 -126406 -172650 -177409 -74649 -86237 -156076 -348917 -228102
1216 -228102 -70794 -191225 -298178 -256174 -149428 -277134 -249079 -121370 -63247 -169969
1206 -169969 -227887 -212596 -143338 -120157 -201341 -281017 -267757 -329699 -182132 -93583 -187073
1195 -187073 -177840 -159640 -26083 77182 62857 -71852 -36148 -107306 -217318 -99112 -144796
1184 -144796 -322950 -242138 -90550 -4906 -5978 26805 -102666 -42858 23259 -76816 -171846
1173 -171846 -182830 -92756 -113311 -142985 -183366 -104772 -185618 -149083 -136836 -166208 -222553 -83137
1161 -83137 -216409 -176266 -107069 -157654 -248505 -316579 -243932 -124271 -83277 -194541 -186512
1150 -186512 -75890 -91302 -163299 -247688 -202722 -104695 -190296 -245014 -192659 -202762 -85585
1139 -85585 -19079 -119151 -210875 -129863 -176633 -141734 -188429 -152417 21082 16104 69751 -110642
1127 -110642 -64397 -46432 -68865 -7060 87922 78172 -207814 -308741 -254003 -218671 -258658
1116 -258658 -156280 -84242 -34083 70374 156265 -5784 -86668 -11180 -18145 -44691 55058
1105 55058 128429 149291 101708 13354 100099 140766 114816 25766 71951 105330 -21953 -11970
1093 -11970 39704 59569 219042 71326 102677 132359 161422 174895 181619 126032 356197
1082 356197 398596 348442 335875 217972 402240 543340 420219 505327 453378 448787 458166
1071 458166 438624 480569 586194 571743 604774 827828 930817 905769 822597 913347 969677
1060 969677 1102033 1092266 1230300 1257365 1335363 1501918 1525935 1676330 1805932 1947998 2114376
1049 2114376 2330459 2821256 3283909 3965250 4681213 5344571 6007303 6750475 7536076 7966336
1039 7966336 7989824 7346382 6427559 5499697 4604109 3883441 3296329 2727954 2261471 1996686
1029 1996686 1708828 1403090 1291942 1187643 1080969 905895 863768 786311 600584 624607
1019 624607 637773 521920 374955 224172 157092 195622 141571 163723 134888 145537 175780
1008 175780 218088 146294 107588 58760 202635 278324 172672 82706 -84346 -85009 55109
997 55109 48582 69550 54581 109785 94877 75248 110086 25692 -60963 -18793 13683 -77519
985 -77519 38639 -147224 -64363 -28270 -73590 -75432 -146207 -111682 -76576 -116398 -86005 -104013
973 -104013 -88869 72768 125597 4856 39920 28140 -75419 -113631 -110495 -49629 -210495
962 -210495 -119890 -68307 -54618 -2775 -54007 -216991 -227464 -122418 -139807 -91644 -31509
951 -31509 -41017 -86203 -44234 -16463 -14216 -61889 -231494 -244991 -189706 -84102 -103352 -69803
939 -69803 -151252 -282361 -188359 -77284 -152516 -67762 84336 -17626 15170 -18587 -71525
928 -71525 21808 28943 55806 68057 66337 71075 -116313 -160298 -100415 -123486 -230547 -188135
916 -188135 -58218 -8767 -15705 11191 -84527 -200022 -122229 -183875 -228704 -328136 -114871
905 -114871 -37319 -65069 -57305 -134805 -110107 -230851 -274709 -190168 -188680 -137758 -97719 -143832
893 -143832 -108317 -113089 -108334 -174528 -118596 -77797 -24746 -32637 -15794 -10441 -52870 -44281 -131517
880 -131517 -197181 -240944 -235916 -140784 -90045 -186097 -178564 -146707 -120060 97920 81960 -22313
868 -22313 18348 -57705 -119476 -212520 -149221 -111604 -182960 -131549 -175117 -160095 -47625 70177
856 70177 -85171 -79401 -35039 -78012 -130691 -62683 -148539 -121862 -4252 95934 81231 -63923
844 -63923 -67991 23776 -90841 -145046 -112411 38195 9477 -41357 -241041 -260507 -81334
833 -81334 -71001 71938 128141 85116 7576 -66600 -120418 -95528 -75367 -124781 -159145 -103821
821 -103821 -309844 -92671 -63318 -49779 44957 11125 -115684 -104547 -131585 -90088 -157385
810 -157385 -65513 79108 -47623 -116620 -121041 -47958 24157 77635 32066 -100285 -131329
799 -131329 -192805 -84061 -71303 6129 -81095 -132824 -67579 -28396 -51016 -53861 -5459 21989
787 21989 -99080 -135775 -17630 -36595 -19753 -49075 -106203 -163279 59064 112871 92202
776 92202 27219 -34975 -113746 -38376 14875 -45909 -2285 65344 54523 -26829 -56980 -5928
764 -5928 -81059 -82085 -96945 -66526 -77395 5925 51652 -83636 -173438 -120494 -146055 -203347
752 -203347 -169368 -45451 60735 69364 -65630 -57834 -134022 -16094 8069 -57456 48006
741 48006 -42115 -105651 -136057 -2419 -69932 -92660 52243 28986 69420 7295 -58580 -37169
729 -37169 -7071 17026 -41221 -36845 -147845 -128479 -84669 12423 83523 37219 -52025 -60505
717 -60505 -9119 -20322 -114762 -106213 -44700 -7244 10975 -5050 134874 111285 -23183 3388
705 3388 157524 66973 -22696 -25767 12100 44907 69517 55702 -110278 -29026 99868 102393
693 102393 -27660 -70289 -88117 -125005 -160274 -68656 -4978 -115282 -104527 -112466 -229284
682 -229284 -165600 -148321 9994 39296 100075 77223 13263 66024 20312 -75953 -100798 -35495
670 -35495 -104414 -74731 96614 116125 126661 165750 139297 63682 -55472 27174 119743 208683
658 208683 77301 49992 68290 16447 -23968 90327 171938 32701 49461 12036 -89159
647 -89159 -22273 20317 -95314 -30566 116824 -1620 29019 26818 -62661 -35751 -24857 39868
635 39868 -98552 -37166 52163 -58929 -92864 -108275 -33517 46440 122871 14129 53700
624 53700 61593 40314 168795 164830 99221 134452 260710 63951 58382 62482 -57638 -191415
612 -191415 -148426 39472 17855 -13122 115000 220125 221259 239997 167426 188907 126395
601 126395 32552 171817 227103 145949 183534 119312 142852 -30505 -68598 94208 31924
590 31924 8645 62298 59109 41800 -28006 97831 19929 -80410 10986 31868 -11552 -3299
578 -3299 -21167 63674 123177 70850 92098 39329 32814 91971 217549 229422 34821 91489
566 91489 124966 17321 -57324 6785 59414 10417 156894 104656 -9668 -3970 37427 46517
554 46517 47014 133658 170694 203362 277223 195212 259841 209051 199021 178163 98207 47005
542 47005 97414 61099 43686 84445 136749 238274 170883 115037 177834 74424 72819 153603
530 153603 125155 184722 210061 172930 203752 156890 129272 184277 241840 141096 73836 204419
518 204419 243450 216832 131656 173742 164681 282316 205732 8962 32124 9935 79793 162301
506 162301 178621 219591 36533 -15678 167337 124299 109066 139551 152281 140129 158768
495 158768 -40965 27002 147654 137672 146593 56597 76209 -15153 101566 152940 100961 64347
483 64347 4526 -14866 112875 163628 225120 132255 102665 86516 -14058 108363 82289
472 82289 127702 129618 207423 120545 -59527 53176 159171 130441 106325 -4901 -18095
461 -18095 119854 273680 222159 392193 301328 132831 148782 66445 80948 173344 360043
450 360043 259915 223474 253921 108507 61546 162198 123584 173902 226418 212039 123295
439 123295 132921 182056 165645 246665 116006 45419 204500 280015 195318 183128 280573 234800
427 234800 240503 149244 189789 201267 112238 68523 105862 254609 209894 165484 91206 97917
415 97917 248203 230121 227032 260221 166350 80828 199831 236236 89875 88555 184385 210545
403 210545 160810 249333 212719 254043 378433 366963 289552 250878 180886 184742 150851 130865
391 130865 177425 243749 184216 123506 131645 117397 132054 109339 175381 206191 254161 187445
379 187445 241468 159577 240429 165740 249889 315308 326492 264344 260729 332530 210427 220710
367 220710 318874 305550 350341 468251 287535 175796 252185 284190 275160 254784 297457
356 297457 313971 209408 316506 343271 221603 218068 228742 327556 369607 423150 445448
345 445448 337719 251691 274818 271859 283861 209857 210514 262004 364755 319960 222580 111353
333 111353 31564 29554 41504 192962 100138 213308 209750 162375 108743 199527 179916 189269
321 189269 175661 111133 120933 308979 321358 336075 310324 322147 213795 183183 200392 249966
309 249966 348421 303666 280345 244783 285082 310996 367352 242402 251492 160844 167392 298263
297 298263 321993 309582 336441 227495 212381 202516 242025 250180 200973 256950 193744 298401
285 298401 248400 282309 260433 223237 203965 209323 307879 315429 282010 149899 152473 190031
273 190031 175337 194478 190163 254809 311109 457090 403620 350774 339040 367917 298035 245866
261 245866 319065 373200 339166 307001 256524 279994 219382 123611 230376 342411 366790
250 366790 210869 230723 342422 310352 304261 383383 290139 309479 357829 313832 252402 269540
238 269540 303978 350330 331726 335857 329789 388016 275589 299800 183137 276816 394467 328386
226 328386 261540 318847 361743 328711 290840 385055 317266 248713 292978 312152 298787 321369
214 321369 403205 284616 284811 344099 300443 259064 298879 293288 186496 134718 303590 352704
202 352704 318390 305533 299319 327922 447749 423557 410636 361384 420043 362231 291419 328622
190 328622 313629 228042 99705 149315 198124 269516 292250 264587 354972 421891 353480 309565
178 309565 267461 277510 311844 282635 287797 330892 385525 391650 298927 280769 312341 429013
166 429013 447131 243298 261854 288709 296528 282403 309548 243118 291125 398462 333949 422025
154 422025 430036 260755 226760 276079 304964 305353 298953 277884 321589 384553 486803 471382
142 471382 404051 336561 318343 328039 419337 421189 284407 329544 301761 320328 418755 400654
130 400654 368938 357561 428509 397339 359175 388533 303195 311738 395011 362393 318485 433216
118 433216 380362 411837 357694 344916 386275 480115 404566 316878 415199 373475 203352 307603
106 307603 337354 376646 379780 384951 444443 361464 377312 448852 381326 336891 369905 327769
94 327769 301716 334982 343579 333110 414932 412522 434228 373142 253982 219019 332803 383388
82 383388 418022 343891 358715 380830 324597 335389 308392 357294 458915 219428 301560 393214
70 393214 362718 357619 359812 425136 361998 452077 441028 387070 385411 306311 288423 315802 299999
57 299999 341949 345691 441836 409073 306928 352839 430661 426288 383432 434987 479850 373679
45 373679 318501 374622 419416 341273 301467 339811 288971 340972 413426 476013 408847 427694
33 427694 504530 517100 459393 437941 438759 330527 332419 321870 301020 350103 268870 380495
21 380495 489471 521947 448426 389392 416582 456757 414913 510092 497657 430611 433250 476649
9 476649 464169 404223 385117 400445 423363 366017 324859 318014 379176
0 379176
$$ Imaginary data points
##PAGE= N=2
##DATA TABLE= (X++(I..I)), XYDATA
16383 -4253044 -4376858 -4300152 -4140771 -4050642 -4010037 -4004706 -4001668 -3948322 -3931599 -3752473 -3670439
16372 -3670439 -3695003 -3621249 -3552371 -3423916 -3432310 -3541357 -3410755 -3331137 -3256061 -3246928 -3249222
16361 -3249222 -3123780 -3147106 -3075677 -3063871 -2917490 -2945099 -2892404 -2771554 -2760732 -2666568 -2634255
16350 -2634255 -2611742 -2518226 -2421045 -2344100 -2316254 -2328698 -2298234 -2263328 -2267960 -2268467 -2139708 -2007828
16338 -2007828 -2036755 -1997634 -1872922 -1833784 -1808541 -1871126 -1762772 -1601377 -1592770 -1646836 -1692936
16327 -1692936 -1670857 -1586217 -1548093 -1522003 -1436947 -1484213 -1330612 -1215657 -1151069 -1096378 -958334
16316 -958334 -905768 -976995 -958997 -895122 -941697 -888299 -807317 -875639 -701710 -696314 -738756
16305 -738756 -719141 -496465 -375590 -319436 -261689 -243022 -203526 -237095 -275880 -250834 -222199
16294 -222199 -268560 -130974 -2595 -88770 -89008 26820 53772 210592 292134 293304 325173
16283 325173 334604 330089 370892 468729 509321 449333 478385 481076 548961 551413 539592 671250
16271 671250 784009 840155 942457 941281 875824 931735 941621 833998 921070 1158121 1160075
16260 1160075 1154008 1118623 1155679 1132616 1052335 1213044 1257832 1232072 1189113 1249177 1319556
16249 1319556 1406834 1452682 1467239 1425853 1541436 1538626 1578355 1540131 1547045 1618058 1689721
16238 1689721 1618478 1672811 1844251 1772676 1700562 1728416 1713686 1725669 1833323 1952217 1852287
16227 1852287 1862128 2088470 1929398 1969741 2011542 1966203 1973341 1966641 2078621 2070923 2087874
16216 2087874 2272697 2360494 2434403 2429126 2414278 2342283 2285766 2226699 2282420 2338806 2367649
16205 2367649 2395350 2346689 2275749 2322916 2433500 2600144 2597730 2653827 2623261 2672889 2632444
16194 2632444 2653823 2634023 2790091 2747498 2628208 2633709 2687895 2724130 2654330 2686129 2698385
16183 2698385 2791765 2792585 2838748 2966490 2968993 2910525 2942638 2824552 2820011 2866986 2858154 2807465
16171 2807465 3070105 3063744 2922147 2919889 2872133 2859410 2971117 2928490 3033982 2992584 2898237
16160 2898237 3078078 3094125 3013314 3011853 3098289 3099775 3141339 3102840 3094231 3039202 3215676
16149 3215676 3210756 3249912 3240695 3239250 3265394 3265056 3242683 3353135 3416043 3324917 3336345 3311547
16137 3311547 3268328 3320132 3374246 3225324 3194079 3233441 3234817 3235173 3248274 3176817 3277831
16126 3277831 3307921 3275986 3255933 3334543 3270872 3336800 3412740 3387430 3316111 3448278 3421605
16115 3421605 3270893 3415494 3367953 3451334 3440935 3414325 3516776 3589714 3415367 3419200 3560467
16104 3560467 3514606 3548976 3626039 3593099 3515174 3504901 3434722 3361926 3344087 3353626 3344145 3424021
16092 3424021 3453097 3515018 3530337 3504326 3609574 3582416 3599896 3604966 3543907 3490746 3309989
16081 3309989 3409648 3560518 3475461 3427447 3584159 3630321 3537188 3606969 3662669 3538186 3512658
16070 3512658 3666060 3622779 3583499 3637982 3566978 3573664 3695867 3624025 3513158 3579748 3554951
16059 3554951 3579658 3603198 3469808 3495018 3485355 3585501 3684223 3640783 3671102 3605253 3552242
16048 3552242 3573784 3458188 3481156 3487483 3523507 3519466 3537351 3553217 3581836 3628387 3652698
16037 3652698 3690798 3569334 3539204 3592962 3547081 3556383 3570020 3448992 3380344 3443808 3453486
16026 3453486 3529503 3697639 3647676 3734945 3625640 3618931 3627960 3647225 3676500 3688482 3680563
16015 3680563 3699712 3556614 3571352 3568392 3579937 3624188 3527763 3539258 3599774 3574972 3628774
16004 3628774 3779686 3733305 3725301 3694506 3647123 3690943 3782759 3723049 3633790 3632319 3658426
15993 3658426 3582630 3585002 3635628 3695587 3750023 3736842 3690279 3654249 3793017 3849598 3661076
15982 3661076 3500070 3518317 3512620 3523283 3653357 3744709 3593325 3446475 3575124 3554213
15972 3554213 3532558 3720993 3642918 3620073 3710635 3818270 3745223 3692333 3817126 3711162
15962 3711162 3682098 3616762 3670325 3604127 3622934 3582139 3591669 3570788 3601477 3626198 3504075
15951 3504075 3766118 3788576 3811151 3942238 3733018 3700873 3725427 3705448 3685499 3527707
15941 3527707 3594840 3719902 3771989 3743238 3744526 3765576 3716545 3761839 3792884 3941594 3972166
15930 3972166 3920308 3824367 3664944 3659957 3626245 3540302 3630171 3616555 3740572 3735326 3600622
15919 3600622 3609415 3665017 3702828 3752359 3732847 3707031 3704470 3702869 3812644 3800914 3621522
15908 3621522 3570518 3673774 3646333 3620983 3561027 3591942 3725434 3752817 3800003 3874696 3867950
15897 3867950 3739601 3720603 3652149 3769553 3721468 3768161 3838274 3668918 3596401 3634496 3694191
15886 3694191 3638110 3583837 3728196 3758251 3660212 3708994 3759659 3806079 3675138 3661324 3680385
15875 3680385 3636749 3605729 3632630 3600556 3635690 3688244 3684886 3635802 3638843 3586275 3629718 3737722
15863 3737722 3844697 3767790 3889937 3903500 3731207 3806602 3847592 3604159 3523634 3595639
15853 3595639 3600959 3709565 3736922 3707718 3609591 3620861 3679880 3767058 3813323 3720963 3676754
15842 3676754 3610650 3688086 3756681 3700261 3743001 3682659 3573776 3703182 3784101 3697158 3682350
15831 3682350 3713925 3713234 3685045 3763923 3835974 3832841 3907524 3843155 3743085 3753054 3713032 3703201
15819 3703201 3714263 3762126 3749364 3717421 3805248 3732527 3732458 3703978 3751804 3833203 3875648 3922596
15807 3922596 3824898 3881725 3872366 3738333 3571111 3502226 3561856 3658724 3709776 3646045 3703383
15796 3703383 3758322 3912317 3939161 3775562 3722385 3760094 3700348 3703661 3701784 3652458 3602682
15785 3602682 3695117 3701040 3647358 3646083 3646258 3679675 3756836 3867638 3877747 3841601 3742674 3750387
15773 3750387 3762753 3788795 3837700 3855473 3812497 3716284 3709110 3589480 3660575 3643612 3614243
15762 3614243 3756031 3781929 3848419 3780086 3852392 3955514 3921159 3762036 3774064 3710413 3725364
15751 3725364 3790220 3835239 3691018 3662346 3705996 3724180 3743240 3792669 3900614 3825104 3818964
15740 3818964 3894050 3856673 3805482 3804395 3836368 3712163 3564830 3657236 3622421 3596353 3654281
15729 3654281 3734144 3810645 3861098 3984971 3941590 3906835 3903014 3770157 3862478 3867919 3813617
15718 3813617 3911585 3824600 3852765 3774585 3670805 3765135 3776622 3806797 3844158 3789063 3820472
15707 3820472 3914119 3906488 3705995 3720455 3748780 3784568 3861391 3823299 3952660 3856931 3749103
15696 3749103 3692959 3743114 3763107 3862522 3892311 3878407 3935784 3863896 3699244 3748787 3729689
15685 3729689 3685879 3763139 3776747 3751987 3833823 3939521 3804967 3740096 3613748 3736126
15675 3736126 3814877 3770613 3625932 3694198 3704643 3614468 3769106 3939192 3759620 3590271
15665 3590271 3630575 3688993 3629934 3730792 3959712 3908481 3816722 3759039 3740297 3805486 3723842
15654 3723842 3776568 3802551 3721511 3845542 3897266 3840808 3882961 3781516 3689781 3835211 3817852
15643 3817852 3780065 3765386 3637452 3842332 3960761 3940301 3899692 3810363 3694896 3644414
15633 3644414 3745869 3719616 3751782 3751002 3822225 3909999 3811606 3627963 3638275 3690550 3842789
15622 3842789 3706261 3787395 3721399 3683726 3724061 3714991 3807228 3901038 3740842 3690376 3707459
15611 3707459 3761824 3644306 3719006 3779864 3678328 3741396 3777224 3837654 3890622 4069787 3967477
15600 3967477 4022757 3891744 3855031 3784456 3771465 3888035 3804462 3914478 3852454 3722975
15590 3722975 3697491 3733606 3731569 3748052 3867440 3974735 4002282 3905340 3877488 3871608 3790103
15579 3790103 3683054 3696630 3841488 3724388 3796225 3870633 3826887 3741711 3755975 3808502 3909668
15568 3909668 3925104 3915468 3907499 3860494 3859610 3884318 3754821 3691232 3739922 3665396 3678222 3746683
15556 3746683 3752101 3857955 3839893 3831513 3843714 3765612 3774520 3948340 4011950 4013177 3999232 3831760
15544 3831760 3774899 3770470 3733394 3700589 3845369 3859709 3630887 3574694 3775233 3938980 4054869
15533 4054869 4043956 4042003 3924532 4035188 3966804 3834233 3777023 3690649 3512084 3591537 3718745
15522 3718745 3848151 3740490 3645201 3609652 3789371 3920418 3897546 3938328 3862299 3872849
15512 3872849 4006996 4001971 3961363 3793543 3784136 3825900 3848769 3781951 3797676 3902362 3920306
15501 3920306 3939744 3865051 3851745 3842569 3827737 3834986 3910156 3974087 4010065 3893389 3850439
15490 3850439 3844729 3767320 3798808 3816528 3791519 3847103 3761249 3669635 3778139 3918770 3914141
15479 3914141 3848075 3810914 3902474 3839614 3807675 3856636 3747046 3789976 3775706 3818185 3785940
15468 3785940 3770156 3787770 3872666 3834311 3803242 3881744 3856460 3915157 3803301 3796290 3801929
15457 3801929 3803245 3739967 3731468 3786625 3819201 3945077 3953216 4054587 4005926 3833330 3827815
15446 3827815 3802073 3873168 3917940 4097586 4106888 3970537 3717026 3816167 3913787 3904072 3885156
15435 3885156 4025983 3949553 3990855 3997093 3967705 3844034 3849919 3946312 3965241 3903632 3847828
15424 3847828 3806306 3627667 3760490 3682059 3759380 3789767 3833613 3885798 3919855 3975685 4024636
15413 4024636 3898429 3801150 3848144 3652720 3642505 3792531 3835829 3901018 3851625 3755832 3722327
15402 3722327 3844878 3861431 3797878 3852375 3981227 3940347 4023016 4007746 3867850 3915416 3870290
15391 3870290 3931616 3993278 3907319 3944688 3864939 3860603 3942855 3856693 3824529 3936281 4047812
15380 4047812 3922503 3848864 3845685 3924619 3890153 3927201 3992931 3864772 3899650 3992580 3842151
15369 3842151 3787399 3821548 3665030 3707511 3924000 3843485 3741451 3808325 3792061 3881497 3972847
15358 3972847 3827714 3885973 3927552 3862951 3883413 3946982 3991458 3972766 3868975 3794499 3842557
15347 3842557 3867019 3900431 3898925 3796610 3833786 3903257 4002530 4005771 4005422 3911407 3914985 4034904
15335 4034904 3999639 3936646 3958245 3891299 3893967 3910218 3835544 3916681 3750274 3798377 3857953
15324 3857953 3909744 3953801 3962416 3955770 4071632 4085631 4005008 3900418 3928344 3966743 4000647
15313 4000647 4044960 3958328 3869313 3795363 3795005 3787653 3866023 4017747 4048966 3987282 3978214 3981305
15301 3981305 3941750 4088364 4082975 3908208 3851438 3847409 3866934 3888798 3936490 3792516 3848824
15290 3848824 3828752 3897328 4039072 3959209 3954200 3886192 3876927 3957546 3859110 3828498 3868245
15279 3868245 3915875 3789757 3691622 3813061 3945222 4046551 3894568 4025016 4054618 4018585
15269 4018585 4055778 4137389 4146130 4165934 4093652 3966710 3933101 3855140 3915113 3960631 3941172
15258 3941172 3976021 4094301 4123886 4040669 4000747 3962752 4006842 4043982 3980607 3852931 3778098
15247 3778098 3813797 3899450 3776603 3848931 4004964 3950516 4032142 3996228 3973697 4081132 4078576
15236 4078576 4208045 4151807 4044780 4088301 4013714 4034027 4016649 4075552 4035326 3928463 3903235
15225 3903235 3975598 4058566 4114287 4099220 4038586 3999337 4061394 3912952 3870957 3890592 3816541
15214 3816541 3791156 3861455 3875612 3890166 3892822 3874173 3955417 4079787 4203826 4236876 4159117
15203 4159117 4133771 4168815 4096174 3947791 3996333 3903604 3898007 3756765 3753357 3829357 3884408
15192 3884408 4019043 3983615 3983852 4019183 3935588 3886255 4028473 4099569 4055272 3897941 3959456
15181 3959456 3995606 4010391 4053656 4026229 4022105 3918116 3947758 3881525 3853334 3958178 4009917
15170 4009917 4134056 4078322 3901597 3844340 3976371 4026201 4093843 3962411 3895474 3796960
15160 3796960 3812065 3877548 3867070 4074246 4107717 4081038 4062205 3869525 3882430 3961857 4031537
15149 4031537 3963729 3983445 4101347 4135623 3970711 3928073 4040330 3884074 3991834 3912163
15139 3912163 3910509 4042826 3979941 3944878 3931027 3990805 3980888 3904562 4003080 3980608 4035552
15128 4035552 4054384 3912056 3914938 4002364 3894683 3846514 3959817 4108351 4094469 3884115
15118 3884115 3884718 4009242 4044476 3924009 4004206 4073687 4093300 4078501 4042851 3962905 3944625
15107 3944625 3925672 3938177 4068804 4070813 3993708 3971408 3892037 3865108 3828556 3900809 4004842
15096 4004842 4017671 4045033 4054759 3968475 4010694 3979461 3979919 4038715 4003804 3915246 3886200 3923058
15084 3923058 3973607 4061506 4063355 4055108 4018349 3898698 4065337 4059602 3962350 3946493 3880895
15073 3880895 3878071 3801739 3847752 3888788 3931440 3905633 3970725 4161045 4052101 3971193 4071981
15062 4071981 4138603 4159403 4157366 4148847 4160080 4146351 4002740 3902514 3851751 3981245 3923049
15051 3923049 3935410 3978048 3956536 3988549 4001425 3951500 4063888 4075379 4025621 4048266 3906324
15040 3906324 3992381 4062387 3978403 3968221 3896200 3906937 4023236 4071061 4037671 4057765 4037624
15029 4037624 4251186 4158825 4045933 4132575 4121399 4107699 4112709 4059398 4079270 4117060 3885765
15018 3885765 3840413 4055470 4147837 4183353 4209536 4264985 4209355 4122693 4108291 4088186 4040398
15007 4040398 4102014 4009187 3914500 3937169 3996290 3905850 3876459 3792039 3921340 4069316 4089533
14996 4089533 4299602 4171972 4130592 4144550 4226768 4218801 4179264 4073985 3901454 3869780 4085239
14985 4085239 3955448 3974361 3977602 4006564 4100537 4085093 4160077 4047284 4007580 4150574 4237071
14974 4237071 4187231 3975881 3922863 4016057 4068561 4058508 4098766 4121959 4127150 4086256 3990368
14963 3990368 4042409 4045634 4063988 4180577 4159495 4091970 4164028 4248555 4219341 4177598 4022386
14952 4022386 4094597 4187947 4121775 4072029 4050131 4054030 4113182 4216874 4245158 4149080 4156654
14941 4156654 4195698 4140101 4164189 4142966 4024213 4035814 4058195 3968921 4090023 4121136 4096230
14930 4096230 4142334 4143136 4110257 4121611 4171376 4069771 4058604 4127330 4116049 4030602 4080247
14919 4080247 4170324 4100408 4091524 4106907 4072034 4154126 4064012 4035712 4058792 4071227 4173957
14908 4173957 4119817 4079037 3995628 3995099 4043247 3963091 3910300 3925579 4096808 4155945 4065646
14897 4065646 4011808 4116872 4259523 4164987 4180605 4048428 3990547 4052410 4125963 4194596 4179643
14886 4179643 4043866 4057225 4188236 4169409 4061503 4032340 4090204 4164289 4174434 4142432 4061580
14875 4061580 4109004 4119429 4086515 4037629 4082547 4159851 4275728 4194773 4060136 4069163 4072556
14864 4072556 4047840 4062022 4131174 4217647 4118414 4114089 4079745 4050067 4091748 4132662 4181882
14853 4181882 4251340 4195097 4112603 4113021 4137818 4091370 4107294 4162876 4079692 4123935 4243939
14842 4243939 4371188 4429160 4369727 4159156 4109426 4053283 3976162 4117789 4252998 4248651 4073984
14831 4073984 4011235 4144472 4156069 4111268 3985001 4157661 4177360 4149406 4158721 4113382 4162352
14820 4162352 4261483 4424095 4368344 4233637 4205112 4101052 4194248 4142815 4171979 4233703 4205124
14809 4205124 4194446 4121561 4133183 4165392 4154032 4198618 4214155 4287944 4224587 4243100 4225165
14798 4225165 4063274 3962317 4053026 4119175 4066216 4018952 4063537 4188926 4061178 4089645
14788 4089645 4098757 4224632 4229176 4090924 4124148 4248740 4158503 4253260 4163131 3938330 3976672
14777 3976672 3993728 4098880 4177206 4164515 4183339 4106112 4117670 4204825 4185187 4158892 4124770
14766 4124770 4191736 4294411 4243776 4278040 4184904 4125314 4063537 4079833 4237856 4155657 4161335
14755 4161335 4225001 4250328 4290362 4448171 4315550 4311350 4306288 4228096 4088626 4138875 4103842
14744 4103842 4011073 4129322 4125912 4021278 4026777 4113411 4181660 4157585 4040253 4123176 4162537
14733 4162537 4122623 4174884 4134118 4082674 4058158 4128725 4062217 4007674 4054156 4070566 4172305
14722 4172305 4268502 4233195 4213952 4154959 4150685 4276333 4261036 4259490 4289517 4231227 4241748
14711 4241748 4244684 4267169 4240588 4274685 4171827 4143371 4212335 4272003 4482592 4315008 4254380
14700 4254380 4205231 4105042 4238520 4131886 4182578 4250480 4130900 4202772 4185017 4143446
14690 4143446 4117421 4199346 4276375 4322174 4250900 4376887 4293535 4202345 4182242 4157277 4135168
14679 4135168 4136633 4114973 4181012 4206001 4247774 4160946 4293375 4345324 4286252 4325950 4234783
14668 4234783 4151953 4169325 4258233 4241831 4120392 4149732 4184710 4264685 4306745 4234032 4116620
14657 4116620 4085199 4173904 4219172 4297106 4288018 4294706 4203994 4243163 4196793 3975698 4117698
14646 4117698 4259971 4282125 4202429 4195053 4189039 4090341 4198457 4181400 4257015 4249100 4273252
14635 4273252 4293170 4317447 4173441 4178437 4235090 4269732 4249554 4314556 4178654 4137097 4151760
14624 4151760 4165609 4176487 4228365 4360735 4235518 4228699 4270321 4267858 4240638 4235066 4285433
14613 4285433 4469055 4498622 4373344 4382349 4378756 4371667 4268307 4274830 4333853 4243532 4255903
14602 4255903 4215628 4104356 4318522 4419370 4402939 4364440 4353233 4326379 4192877 4313745
14592 4313745 4168931 4173351 4151568 4068366 4172673 4258748 4182058 4174151 4129034 4185348 4262056
14581 4262056 4380452 4318794 4278540 4337198 4240879 4276754 4315544 4241424 4170971 4194852 4211232
14570 4211232 4161053 4202082 4331826 4315745 4295644 4322921 4393582 4465020 4484910 4442487 4403560
14559 4403560 4283785 4138893 4247057 4204460 4186797 4204019 4184092 4269888 4168331 4211635
14549 4211635 4303239 4402241 4494800 4448820 4357309 4357542 4466910 4308848 4364509 4275138 4192717
14538 4192717 4186297 4026104 4060620 4137645 4248292 4251354 4297317 4378119 4392877 4316991 4435540
14527 4435540 4459368 4423257 4440725 4378931 4304679 4316467 4235730 4325399 4270001 4280280 4295602
14516 4295602 4373245 4386845 4394010 4412219 4514173 4418307 4372043 4415320 4318118 4308265 4311834 4194893
14504 4194893 4243038 4279425 4329580 4283512 4384558 4480428 4449502 4431905 4479353 4534714 4394207
14493 4394207 4441117 4436905 4299906 4287459 4262918 4228366 4363199 4470941 4352518 4155891
14483 4155891 4327391 4252513 4221722 4307444 4335456 4331592 4374785 4285875 4274915 4213191 4205847
14472 4205847 4256001 4329606 4308188 4367765 4313706 4279845 4144206 4319620 4524430 4436397 4418496
14461 4418496 4432343 4257395 4252331 4159454 4217154 4360554 4293628 4425531 4332359 4217987 4218735
14450 4218735 4165635 4320034 4435315 4399360 4366522 4239650 4230998 4248886 4368074 4395332 4490297
14439 4490297 4593266 4488315 4466418 4456424 4331313 4340612 4376059 4371248 4444823 4414644 4327050
14428 4327050 4343448 4358774 4333631 4214247 4261882 4211981 4327886 4302111 4293623 4205097 4131883
14417 4131883 4271477 4297096 4297425 4363844 4298109 4244708 4228156 4203911 4269509 4284599 4334433
14406 4334433 4435179 4454814 4377542 4252403 4234417 4313416 4230955 4306374 4296021 4408567 4314969
14395 4314969 4210568 4257824 4356741 4368382 4403800 4303215 4193996 4266217 4466427 4625350
14385 4625350 4487370 4362968 4311716 4269913 4251653 4358531 4344797 4301923 4291922 4200275 4319956
14374 4319956 4464918 4388736 4368626 4424970 4438016 4388909 4445149 4501648 4399434 4349442 4382712
14363 4382712 4345077 4342056 4319133 4386500 4425782 4346419 4273712 4329166 4357378 4374122 4328935
14352 4328935 4173769 4232200 4208709 4269318 4284859 4223085 4355173 4252255 4265991 4430842
14342 4430842 4522769 4378024 4381028 4315015 4303323 4266099 4268443 4238117 4271936 4330798 4224813
14331 4224813 4329450 4394839 4374694 4231174 4382947 4444668 4422607 4412814 4513624 4499494 4511000
14320 4511000 4383299 4321038 4216931 4242789 4242779 4257001 4170977 4216175 4316000 4176209 4297910
14309 4297910 4382812 4425135 4461263 4564796 4581119 4504272 4487658 4491657 4383485 4420253 4408895
14298 4408895 4413115 4373977 4330470 4363142 4386530 4444875 4497042 4421254 4517789 4522380 4449996 4502291
14286 4502291 4524657 4455775 4307107 4290063 4319938 4329369 4332163 4351720 4421654 4195698 4330265
14275 4330265 4236319 4338414 4437066 4399557 4413568 4481180 4408725 4369219 4361025 4469432 4496016
$$ [...]
##END NTUPLES=NMR SPECTRUM
##END=
