##TITLE=1H_EC-3317(22)nk
 DMSO
 8 sc, 
 11.3.2024
##JCAMPDX= 6.0         $$ Bruker NMR JCAMP-DX V2.0
##DATA TYPE= NMR SPECTRUM
##DATA CLASS= NTUPLES
##ORIGIN= UXNMR, Bruker Analytische Messtechnik GmbH
##OWNER= root
$$ XWIN-NMR		Version 3.5
$$ Mon Mar 11 14:03:36 2024 Russian Standard Time (UT+4h)  she@DPX200
##.OBSERVE FREQUENCY= 200.1313
##.OBSERVE NUCLEUS= ^1H
##.ACQUISITION MODE= SIMULTANEOUS
##.ACQUISITION SCHEME= undefined
##.AVERAGES= 8
##.DIGITISER RES= 18
##SPECTROMETER/DATA SYSTEM= spect
##.PULSE SEQUENCE= zg30
##.SOLVENT NAME= DMSO
##.SHIFT REFERENCE= (INTERNAL, DMSO, 0, 15.4031)
##AUDIT TRAIL= $$ (NUMBER, WHEN, WHO, WHERE, WHAT)
$$ ##TITLE= Audit trail, XWIN-NMR		Version 3.5
$$ ##JCAMPDX= 5.01
$$ ##ORIGIN= Bruker BioSpin GmbH
$$ ##OWNER= she
$$ F:/spectra/data/she/nmr/H-F/1/pdata/1/auditp.txt
$$ ##AUDIT TRAIL=  $$ (NUMBER, WHEN, WHO, WHERE, WHAT)
(   1,<2024-03-11 14:02:27.82 +0400>,<she>,<DPX200>,
      <created by zg, POWCHK disabled, PULCHK disabled
       configuration hash MD5:
       00 E9 B6 7A A2 85 ED C7 34 08 36 98 17 FE 4E 26
       data hash MD5: 16K
       09 81 2A BF 1C 3B 21 AE A4 F1 5A D6 E3 65 EC 02>)
(   2,<2024-03-11 14:02:30.18 +0400>,<she>,<DPX200>,
      <Start of raw data processing
       efp BC_mod = 2 LB = 0.24 FT_mod = 6 PKNL = 1 PHC0 = -25297.05 PHC1 = 8.18731 SI = 16K 
       data hash MD5: 16K
       DB 9C A6 9D A0 03 32 E9 70 28 50 66 6F 84 E8 CF>)
(   3,<2024-03-11 14:02:48.70 +0400>,<she>,<DPX200>,
      <pk PHC0 = -6.747121 PHC1 = 3.6 
       data hash MD5: 16K
       55 ED 20 97 3D C7 FB 7C 2F C0 EE 92 19 3F D6 64>)
(   4,<2024-03-11 14:02:53.12 +0400>,<she>,<DPX200>,
      <abs ABSG = 5 
       data hash MD5: 16K
       47 5D 90 E3 02 A8 B0 AA 99 D3 CF 2E AE 1D 8C AF>)
$$ ##END=
$$ 
$$ hash MD5
$$ 37 F8 C6 25 21 D8 DE F8 79 C8 27 35 DC 34 BB AA
##$RELAX= 
##$RELAX= 
##$RELAX= 
##$RELAX= 
##$RELAX= 
##$RELAX= 
$$ Bruker specific parameters
$$ --------------------------
##$DU= <F:/spectra>
##$EXPNO= 1
##$NAME= <H-F>
##$PROCNO= 1
##$TYPE= <nmr>
##$USER= <she>
##$AMP= (0..31)
100 100 100 100 100 100 100 100 100 100 100 100 100 100 100 100 100 100 
100 100 100 100 100 100 100 100 100 100 100 100 100 100 
##$AQSEQ= 0
##$AQ_mod= 1
##$AUNM= <au_zg>
##$AUTOPOS= <>
##$BF1= 200.13
##$BF2= 200.13
##$BF3= 200.13
##$BF4= 200.13
##$BF5= 200.13
##$BF6= 200.13
##$BF7= 200.13
##$BF8= 200.13
##$BYTORDA= 1
##$CFDGTYP= 0
##$CFRGTYP= 5
##$CHEMSTR= <none>
##$CNST= (0..31)
1 1 145 1 1 1 1 1 1 1 1 1 1 1 1 1 1 1 1 1 1 1 1 1 1 1 1 1 1 1 1 1 
##$CPDPRG= <>
##$CPDPRG1= <>
##$CPDPRG2= <>
##$CPDPRG3= <>
##$CPDPRG4= <mlev>
##$CPDPRG5= <mlev>
##$CPDPRG6= <mlev>
##$CPDPRG7= <mlev>
##$CPDPRG8= <mlev>
##$CPDPRGB= <>
##$CPDPRGT= <>
##$D= (0..31)
0 1.2 0 0 0 0 0 0 0 0.06 0 0.03 0 0 0 0 0.0002 0 0 0 0 0 0 0 0 0 0 0 0 
0 0 0 
##$DATE= 1710151347
##$DBL= (0..7)
120 120 120 120 120 120 120 120 
##$DBP= (0..7)
150 150 150 150 150 150 150 150 
##$DBP07= 0
##$DBPNAM0= <>
##$DBPNAM1= <>
##$DBPNAM2= <>
##$DBPNAM3= <>
##$DBPNAM4= <>
$$ [...]
##$SUBNAM3= <"">
##$SUBNAM4= <"">
##$SUBNAM5= <"">
##$SUBNAM6= <"">
##$SUBNAM7= <"">
##$SUBNAM8= <"">
##$SUBNAM9= <"">
##$SW= 18.0517328524113
##$SWIBOX= (0..15)
0 0 2 0 0 0 0 0 0 0 0 0 0 0 0 0 
##$SW_h= 3612.71676300578
##$TD= 16384
##$TD0= 1
##$TE= 0
##$TE2= 300
##$TE3= 300
##$TEG= 300
##$TL= (0..7)
0 120 120 120 120 120 120 120 
##$TP= (0..7)
150 150 150 150 150 150 150 150 
##$TP07= 0
##$TPNAME0= <>
##$TPNAME1= <>
##$TPNAME2= <>
##$TPNAME3= <>
##$TPNAME4= <>
##$TPNAME5= <>
##$TPNAME6= <>
##$TPNAME7= <>
##$TPOAL= (0..7)
0.5 0.5 0.5 0.5 0.5 0.5 0.5 0.5 
##$TPOFFS= (0..7)
0 0 0 0 0 0 0 0 
##$TUNHIN= 0
##$TUNHOUT= 0
##$TUNXOUT= 0
##$USERA1= <user>
##$USERA2= <user>
##$USERA3= <user>
##$USERA4= <user>
##$USERA5= <user>
##$V9= 5
##$VALIST= <valist>
##$VCLIST= <CCCCCCCCCCCCCCC>
##$VD= 0
##$VDLIST= <DDDDDDDDDDDDDDD>
##$VPLIST= <PPPPPPPPPPPPPPP>
##$VTLIST= <TTTTTTTTTTTTTTT>
##$WBST= 1024
##$WBSW= 4
##$XGAIN= (0..3)
0 0 0 0 
##$XL= 0
##$YL= 0
##$YMAX_a= 127813
##$YMIN_a= -118582
##$ZGOPTNS= <>
##$ZL1= 120
##$ZL2= 120
##$ZL3= 120
##$ZL4= 120
##$ABSF1= 15.40312
##$ABSF2= -2.648727
##$ABSG= 5
##$ABSL= 3
##$ALPHA= 0
##$AQORDER= 0
##$ASSFAC= 0
##$ASSFACI= 0
##$ASSFACX= 0
##$ASSWID= 0
##$AUNMP= <proc_1d>
##$AZFE= 0.1
##$AZFW= 0.1
##$BCFW= 0
##$BC_mod= 2
##$BYTORDP= 0
##$COROFFS= 0
##$CY= -3
##$DATMOD= 1
##$DC= 0
##$DFILT= <>
##$DTYPP= 0
##$F1P= 0
##$F2P= 0
##$FCOR= 1
##$FTSIZE= 16384
##$FT_mod= 6
##$GAMMA= 0
##$GB= 0
##$INTBC= 1
##$INTSCL= 3.70164e-10
##$ISEN= 128
##$LB= 0.24
##$LEV0= 0
##$LPBIN= 0
##$MAXI= 10000
##$MC2= 0
##$MEAN= 0
##$ME_mod= 0
##$MI= 1.114404
##$NCOEF= 0
##$NC_proc= -6
##$NLEV= 6
##$NOISF1= 3.799351
##$NOISF2= 2.8
##$NSP= 0
##$NTH_PI= 0
##$NZP= 0
##$OFFSET= 15.40312
##$PC= 1
##$PHC0= -25303.8
##$PHC1= 11.78731
##$PH_mod= 1
##$PKNL= yes
##$PPARMOD= 0
##$PSCAL= 0
##$PSIGN= 0
##$REVERSE= no
##$SF= 200.130023730637
##$SI= 16384
##$SIGF1= 3
##$SIGF2= 2
##$SINO= 5.538805
##$SIOLD= 16384
##$SREGLST= <1H.CDCl3>
##$SSB= 0
##$STSI= 16384
##$STSR= 0
##$SW_p= 3612.71676300578
##$SYMM= 0
##$S_DEV= 0
##$TDeff= 16384
##$TDoff= 0
##$TI= <>
##$TILT= no
##$TM1= 0
##$TM2= 0
##$TOPLEV= 0
##$USERP1= <user>
##$USERP2= <user>
##$USERP3= <user>
##$USERP4= <user>
##$USERP5= <user>
##$WDW= 1
##$XDIM= 16384
##$YMAX_p= 457438038
##$YMIN_p= -382912
$$ End of Bruker specific parameters
$$ ---------------------------------
##NTUPLES= NMR SPECTRUM
##VAR_NAME=  FREQUENCY,     SPECTRUM/REAL,   SPECTRUM/IMAG
##SYMBOL=    X,             R,               I
##VAR_TYPE=  INDEPENDENT,   DEPENDENT,       DEPENDENT
##VAR_FORM=  AFFN,          ASDF,            ASDF
##VAR_DIM=   16384,         16384,           16384
##UNITS=     HZ,            ARBITRARY UNITS, ARBITRARY UNITS
##FACTOR=    0.220516191357247, 1,           1
##FIRST=     3082.62677930988, 0,            0
##LAST=      -530.089983695903, 0,           0
##MIN=       -530.089983695903, -382912,     0
##MAX=       3082.62677930988, 457438038,    0
$$ Real data points
##PAGE= N=1
##DATA TABLE= (X++(R..R)), XYDATA
$$ [...]
11322 -52119 -6614 78851 12876 -42008 -54872 -127761 -152171 -16917 26664 -15718 -15546 -20952
11310 -20952 42925 -67604 -113046 24567 54797 -7160 -21317 -21574 38716 -25391 -45428 -110030
11298 -110030 -123106 -85041 -79852 -74243 -107945 -57704 -112024 -131943 -90358 -59596 -116940 -119219
11286 -119219 -117618 -93738 -45191 -11269 19574 -31013 14286 986 5756 119036 17165
11275 17165 78431 51552 24475 92387 108130 129508 120924 88076 69742 9049 -12503 -472
11263 -472 12190 33745 12450 -93815 -74050 59186 23594 97004 15009 -18521 -40759 -50710
11251 -50710 -5320 -63546 -51483 -109946 -175285 -158920 -129599 -19187 12117 -19682 -21740 -39890
11239 -39890 -39774 -88238 -147448 -137669 -45940 -107096 -100152 -112523 -24888 -23293 -92957 -132644 -21281
11226 -21281 41096 4627 58817 -43184 42040 52337 -19829 -84339 -59186 -78180 -113759
11215 -113759 -22390 39804 24747 -70307 -122990 10889 38088 36776 -5637 20180 3759
11204 3759 100103 -37924 -134388 3398 -4957 -4366 -125697 -61340 -78918 -83571 -8627 18249
11192 18249 -40702 -115145 -47145 -17569 -23908 -65498 -110701 -124129 -53449 -11305 -30287 -50712
11180 -50712 -50653 17349 81452 101197 -92300 -147725 -72887 7183 75707 -33320 -61211 -8489
11168 -8489 9950 -108799 -36950 65653 10210 -78087 -45041 115379 51842 -5481 -33842
11157 -33842 -15941 -84866 -487 -130857 -192724 -131478 -63366 39389 50950 -57990 -78743
11146 -78743 -28710 -18388 -7152 32783 28040 -1230 45372 131543 104466 38658 64987 -46015
11134 -46015 -51097 -123952 -131708 70502 120379 51444 59134 -63183 -87381 -51334 4721 39941
11122 39941 30684 63227 34584 -85241 -115309 -29333 -11871 -9252 -21351 -73879 10019 -34724
11110 -34724 -83197 -74792 -41564 10142 -13122 16421 -18133 -78641 -42381 -107669 -31998 -12488
11098 -12488 -52404 -128826 -222826 -89789 3813 -84060 -102781 -68752 -73050 -160033 -229208 -281422
11086 -281422 -201579 361 26956 60797 -8731 16432 -49055 -67740 60467 64609 36033
11075 36033 -34238 -54272 -28935 101259 96900 11349 60388 87747 82201 10937 -86512 -93285
11063 -93285 -54130 -57042 -25701 -53420 9333 -67752 -48635 28175 52636 26440 -110338 -118355
11051 -118355 -136112 -2791 119191 15149 -15814 74287 42043 -55558 90469 90651 -57486
11040 -57486 -49018 -35775 -122121 -99356 -17023 43204 -15228 -25389 52482 -41502 70394 -17405
11028 -17405 -101681 -150267 -16322 67956 25346 39776 19963 -10384 -87457 -63319 -76081
11017 -76081 -17079 33695 22166 -81585 -56567 -112493 -77582 -39055 29729 -20854 -77297
11006 -77297 -18452 -10987 -1787 -60721 -106565 26647 100148 8990 -56335 10986 43102 -30871
10994 -30871 -68781 -252581 -169896 -157568 -125351 -64498 -70357 -140754 -28199 90325 64192
10983 64192 101125 144198 64635 -62750 -66234 -23596 -27221 -73899 -88275 -114487 -81845 -72382
10971 -72382 29627 -44147 9064 -43514 -121157 -97765 -93230 -62402 -36414 -14579 -16632 39829
10959 39829 -14898 -28259 37341 91176 19945 4488 -15761 -44785 -38963 -13493 -61276 -91572
10947 -91572 9411 5779 -14389 37118 41221 -53089 49085 64375 56930 60559 33294 95799
10935 95799 77323 66150 19650 13520 27745 95544 25348 112181 107689 -5154 22034 -35426
10923 -35426 9972 37328 -26673 -51287 47940 59558 60621 -40191 46440 85049 -14948 38041
10911 38041 83975 98769 67068 -54267 -45686 41295 83138 84575 -15644 -136962 -140462 19032
10899 19032 -32765 -52835 -87576 -63292 -52109 22852 41793 17907 98288 202787 152016
10888 152016 36408 -32500 -66926 -49793 8626 -103380 -65979 -23495 -9763 -44226 -29128
10877 -29128 -93771 -139992 -69218 -9548 -22282 -10258 -73830 -88099 -81416 -79436 -31812 -35555
10865 -35555 -31800 -53536 -36912 -69463 -28052 -17577 -28627 -14784 9711 -3734 -16087 -117852
10853 -117852 -161558 -30642 -9789 -91931 -47790 -77249 36993 -56120 -105648 -96701 -83353
10842 -83353 -69638 28050 54193 -20114 22317 94637 175961 185526 107986 28912 -42551 981
10830 981 -63683 -36154 -75319 -176872 -193549 -99256 -43726 -7318 46001 59142 32241 -9613
10818 -9613 10394 -45454 -81660 -77351 -17361 104700 2263 71076 3869 -96269 -39344
10807 -39344 20597 14076 -78934 -89712 -142424 -77832 57861 -79950 -46969 -37290 -123916 -31243
10795 -31243 -34210 -53801 -66961 83978 35547 -58672 9239 65165 50591 86854 39839 23222
10783 23222 -51932 -105184 -10719 17881 85941 139456 83725 67711 -59050 -86018 -130136
10772 -130136 -128404 -135178 -128566 23671 56142 -41595 -74859 -8168 -16134 26488 -52083 -18466
10760 -18466 -90846 -31098 -13758 -59807 9978 -45567 -29349 -39248 -65385 -111308 -35837 -32093
10748 -32093 -22434 -69170 -93476 -95390 -41919 -40972 -2886 -93301 -59519 -6216 54780 29191
10736 29191 59018 -32896 -4968 -69884 -41331 1989 -36482 -23746 -18994 -36508 -104312 -41557
10724 -41557 -85139 3427 -11678 -40779 -28572 -1315 -19561 93764 161951 67752 17694
10713 17694 -35622 -13577 100808 19514 -64664 -85428 -156152 -47878 88631 39158 4596
10702 4596 -79594 -85672 48911 92623 -17162 -76405 -42985 -41426 -15002 -20301 -23181 -99291
10690 -99291 -72144 -51569 -40630 1253 -16001 -97940 -40304 12482 -38417 58230 94786 45105
10678 45105 -68600 -32222 9759 64081 58127 -109997 -53865 72764 39410 23492 -119871
10667 -119871 -135299 -83947 -100382 -18373 25082 -90961 -130729 -92417 -57234 -60854 -111437
10656 -111437 -32513 -17038 -39637 -16524 -52020 -102978 -77163 65702 155027 131632 115910
10645 115910 9530 -46284 98616 -39320 -46408 -88258 -155732 -133851 -1728 71433 -1204
10634 -1204 -58348 -50058 -3082 37379 -123702 -138937 -24913 77748 68763 109348 89243 41283
10622 41283 27644 -4554 28145 -75834 45651 50545 3238 10592 -10243 -50164 -90923 30650
10610 30650 -18060 -89508 52156 38346 141669 39293 7168 -6609 -103878 -34438 54128
10599 54128 -8458 -154295 -128789 -112025 -84145 -34397 29735 -1380 -52102 101688 192244
10588 192244 96279 -27457 76366 47867 44235 85395 73524 -20530 -53579 108779 24000
10577 24000 -49898 -12951 37481 -6657 -12056 -52559 -49037 -141889 -46147 40288 36134 84203
10565 84203 25356 16520 -20206 -27312 -94623 -17052 -67224 -69570 -64038 -45644 42663 -43747
10553 -43747 -87197 -125654 -133528 32603 45695 -43673 -68669 -38830 -121925 -110459 34650
10542 34650 12380 -13874 -8648 55719 33016 56975 113441 96139 54876 66465 75395 67775
10530 67775 -11787 -95277 -103453 -69778 -54376 -33359 -39304 -125780 -66773 -35881 -16860 -102833
10518 -102833 -73014 -61694 -119970 -58276 -25811 -73357 -123097 -134174 -40298 -67414 -62701 -36249
10506 -36249 -3009 54469 85873 95123 119899 98038 84857 -7990 -109929 -91917 -131560 -107153
10494 -107153 -51921 28703 -8678 -36098 -58591 -134038 -96287 -61045 -28601 87244 50629
10483 50629 -125945 -76199 -43393 -11315 -37968 -35214 121877 28905 -47439 49730 43375 76060
10471 76060 91120 11769 73579 53246 10891 -44083 -93483 -89386 -55120 -15397 -18420 11602
10459 11602 92369 69130 44144 67447 90622 65565 -2917 -11780 23981 -20151 -102041 -92328
10447 -92328 -91126 -24860 53112 56869 1609 -76267 -20319 -30132 75442 29887 30385 85503
10435 85503 106299 56299 30938 32226 30097 59549 137563 86127 63176 -20033 27849 33121
10423 33121 58235 85851 5822 12432 13624 53314 105589 39991 60328 96347 -16888 25423
10411 25423 -36765 8204 80889 147260 53904 -67939 -151058 -96248 3807 33986 9857
10400 9857 33042 63006 62329 1347 72998 13113 -106505 -84293 -86378 13599 -597 21710
10388 21710 -52759 -32614 -39021 -82771 42331 111743 129190 51290 6035 19239 62346 -5186
10376 -5186 -2150 3085 98572 173267 237151 170101 63822 174686 185943 116417 95161 125553
10364 125553 170763 77674 8137 32898 62799 104364 -5764 -85027 -113748 -200 126517
10353 126517 82520 -15192 -17312 -25529 -9018 -46911 -30172 55513 39159 105043 113606 63738
10341 63738 -4697 -597 17270 48421 79533 111161 46809 86849 85599 -7759 53820 15081
10329 15081 -52997 28648 62556 -3953 39999 14674 -23279 49897 125856 100568 102993 124041
10317 124041 -419 -51722 -105568 -60617 -60186 -56411 -114252 221 36989 58798 80528 59971
10305 59971 139289 121989 132410 131377 74260 -63394 -42727 -18611 -17177 37295 117324 206867
10293 206867 233930 108714 47748 -51275 -18929 39332 60376 -18737 633 185363 206540
10282 206540 120701 77586 102460 91827 -29104 54437 56227 29772 -18877 -41167 -58538
10271 -58538 -50831 104362 67294 -7817 18618 -42760 -16636 -4459 19400 111508 44149 5961
10259 5961 43725 72329 72772 69181 105615 141436 50447 28540 63561 61744 75904 131494 199267
10246 199267 149818 78535 169258 125628 84105 57947 93646 86041 -19151 80502 141984
10235 141984 79195 13087 -14432 28643 23319 11649 -16554 -39233 22294 92163 -8271
10224 -8271 -86169 -9956 179491 161763 135854 144318 95222 2510 64523 122341 137947 212774
10212 212774 129048 123504 111312 150828 109052 141210 142733 110457 211090 248011 175700 173641
10200 173641 141601 100749 144818 159335 103351 43911 59213 102425 104908 25561 94473 120164
10188 120164 127315 109398 144421 168856 174139 126495 165687 48166 53719 191420 108871 142755
10176 142755 208155 170275 125480 94131 38435 20835 29398 19790 88939 15227 -51130 1538
10164 1538 137360 228071 262797 212997 77150 82190 93221 203604 116679 117753 118359 131384
10152 131384 235822 233368 90475 57425 93474 86843 28593 129117 73199 46954 47010 103432
10140 103432 171370 176388 226474 190174 134477 141759 188786 164425 218154 227367 98605 164258
10128 164258 183941 239811 255683 214464 177435 168239 165692 208454 275792 267661 346288 379450
10116 379450 323228 319849 292228 264595 328039 282496 204472 236405 228197 212434 302135 351169
10104 351169 387457 354013 307226 237137 258510 371000 445778 447524 511290 474316 487911
10093 487911 457390 479135 489541 472550 458773 445052 423135 446198 548172 467623 489344
10082 489344 453306 509257 619644 634748 509142 500600 610562 590460 640084 616124 722812
10071 722812 728375 682808 655179 635025 674239 729008 735458 754870 696848 646429 692286 808800
10059 808800 852839 850775 871269 879676 801726 828359 883894 789224 885404 914231 908394 970147
10047 970147 996685 914280 971714 1136270 1166730 1184833 1231402 1322816 1297066 1257036 1274727
10036 1274727 1384170 1467360 1625758 1590557 1539231 1463680 1533658 1607670 1789618 1967078
10026 1967078 1985828 1893686 1902261 2027675 2038055 2159807 2145533 2203340 2343131 2436370 2467932
10015 2467932 2566004 2688033 2909891 3080464 3132310 3230976 3352701 3508179 3742912 3950756
10005 3950756 4136604 4365264 4634077 4898845 5134872 5327845 5669325 6090794 6485979
9996 6485979 6856240 7287058 7760335 8334691 9036185 9850010 10660672 11591565 12625678
9987 12625678 13568003 14509056 15223449 15761500 16072847 16073349 15821830 15684434 15725306 15712410
9977 15712410 15451614 15011164 14396929 13411548 12386822 11164442 10032007 9093013 8240547
9968 8240547 7502925 6795970 6164365 5733969 5408069 5013776 4621293 4329045 4076579 3926898
9958 3926898 3700276 3419699 3186757 3152355 2984820 2887676 2712411 2574594 2468145 2424263
9948 2424263 2309196 2120642 2001751 1911449 1769031 1744805 1681266 1545506 1548540 1518432 1510168
9937 1510168 1478595 1420601 1281957 1206069 1201809 1219117 1163055 1092196 1012159 1003828 997111 998961
9925 998961 889868 966901 989699 932091 920040 874915 895663 894366 934372 865633 786240 824164
9913 824164 837320 866933 805500 826529 720626 714574 754320 682251 644879 650569 679513 684921
9901 684921 573087 488771 489594 545465 484202 491701 604084 574657 462334 389666 395021 378041
9889 378041 321595 336568 395109 382445 383293 399210 341465 301062 276458 280105 221645 261116
9877 261116 359791 295328 309359 358551 310776 287871 217671 248037 368062 307365 426168
9866 426168 378770 402147 366135 390426 352955 325939 292897 270037 335176 204100 241298
9855 241298 262267 249057 244121 130435 165865 220701 180269 222817 285350 195726 177509 177969
9843 177969 110503 358509 340570 238145 167597 165093 108850 90876 273406 183336 224411
9832 224411 158358 62106 117537 71817 62823 37334 156218 138557 94831 -9562 58060
9821 58060 172686 135321 37501 63947 124372 160609 157531 203729 205712 141773 58638 -748
9809 -748 28123 31445 39856 41279 37386 91190 88920 132872 224236 125733 44182 129359 89569
9796 89569 121797 120542 175085 114389 52474 186824 173263 77808 -7591 86978 226680 173719
9784 173719 74864 63292 54868 130280 29283 45407 -4571 77854 101069 108228 99232 127766
9772 127766 180825 192240 118271 103349 160770 178148 171489 195701 164055 125132 175313 79477
9760 79477 78814 42722 25388 80956 42021 -10510 61593 137500 137064 186012 221448 277760 273577
9747 273577 163300 29728 133160 99167 121975 158673 96421 35191 51165 74223 153579
9736 153579 127223 30881 83611 49699 -14440 88334 166038 91798 135212 61659 103443
9725 103443 99421 137939 113523 76809 144080 141920 162853 155934 125781 109133 248513 218000
9713 218000 226912 174518 149549 157329 188783 294195 170235 94860 105734 182232 251847 145240
9701 145240 144127 109360 48288 80220 102992 55621 26082 22052 56871 54827 -15024 9656
9689 9656 51054 31147 15625 -12545 -63522 -29012 41917 188601 131188 84015 30318 58877
9677 58877 97922 57754 63376 153756 142944 148258 154141 212645 191728 85264 70087 64714
9665 64714 180330 161004 54791 35639 91001 88442 21669 17627 5255 75371 133571 199449
9653 199449 109211 76536 114595 118954 175592 200369 3422 61151 144445 148566 102417 72781
9641 72781 80260 109566 19058 -86713 -17114 20160 13317 9261 -33347 -30879 119465 140743
9629 140743 40088 38429 51676 17132 49997 96236 131149 46972 -24827 -24508 157637 208826
9617 208826 211404 139388 53363 -47350 143599 166214 63252 59792 27997 50474 29610
9606 29610 85642 167700 210008 118092 74734 86277 117310 231507 195316 137094 171274 122608
9594 122608 162805 193971 153879 110644 60808 38910 191717 248354 273534 198393 87684
9583 87684 86681 98812 75351 129488 27024 -45982 -66467 5524 98822 41782 87625 -9452
9571 -9452 48440 82524 107018 272509 217537 134347 130282 139757 171373 113383 222912 176336
9559 176336 156796 140643 162121 225336 106337 48845 176347 259712 271769 241953 294753
9548 294753 143623 221801 279212 247578 328016 356789 430605 430431 479088 567241 575610 568373
9536 568373 576917 470263 499286 494452 458733 484588 443988 303490 344760 383002 400670 360291
9524 360291 388997 407948 282070 342786 308864 193481 234031 277364 248723 154204 202847
9513 202847 184707 133902 77134 48937 125817 193514 217186 245095 239292 283042 315516 259205
9501 259205 177789 178414 174929 75068 204812 235192 218182 190059 97393 127947 110949 68148
9489 68148 178094 93522 125382 225027 121379 116311 148332 154540 184330 157368 135846 114049
9477 114049 115505 174357 159564 106341 170534 172335 150827 144712 130154 63013 62281 96794 105497
9464 105497 171778 137367 160671 221878 176933 222995 235737 204067 194593 55791 96211 166464
9452 166464 119167 96068 45979 60916 177556 146406 106804 91814 176031 174114 183081 163396
9440 163396 161535 114749 48824 16147 -12862 84970 166732 275972 253472 267411 201385 145553
9428 145553 126226 153616 175372 103948 63618 1326 177201 241594 228672 223100 266828 286694
9416 286694 144990 62954 140276 64609 139624 86781 73133 106728 154389 106177 128700
9405 128700 124694 138703 139435 138638 108742 55790 39764 15025 171726 164557 113029 12329
9393 12329 48706 116523 89813 49269 111866 171066 122101 33701 134398 136239 76522 76045
9381 76045 188449 91304 103621 161575 127246 30319 -20749 123651 100618 69106 42350
9370 42350 30386 29255 44928 95411 56419 -17686 25246 171221 181713 136556 167398 244780
9358 244780 206059 237759 229682 269602 270730 244834 198773 219822 127525 86657 142925 157324
9346 157324 118522 232715 295540 216839 161553 106598 214301 142561 103775 190890 326506
9335 326506 355257 256269 210436 233115 266523 243100 171101 217412 198290 289178 283032 288293
9323 288293 306989 242560 397187 290214 282338 280209 243799 46661 217585 308918 241723
9312 241723 334729 270952 290472 285507 430958 427492 393225 327547 403549 334120 252894 276726
9300 276726 304696 404892 395686 396888 340088 364116 376586 271037 292356 321994 395331 407432
9288 407432 369702 384810 383893 370127 405065 402192 502920 515077 480364 493272 475876 444606
9276 444606 474306 412781 425740 523196 490969 454957 517244 575275 554094 535565 509097 628510
9264 628510 698846 692109 688690 693016 652242 671511 688083 686771 671983 669433 789734 800880
9252 800880 728455 655843 812165 804611 824947 842868 872136 832781 839318 1004768 1033529 996140
9240 996140 1056241 1195075 1175053 1216594 1229406 1318534 1314535 1286912 1355402 1435583 1431695 1491346
9228 1491346 1561791 1572278 1621054 1676087 1575805 1553729 1694650 1673895 1696953 1703690 1769830
9217 1769830 1744185 1847286 1981851 1946034 1993236 2099084 2136018 2137806 2261284 2310413 2275853
9206 2275853 2340346 2471294 2566688 2679798 2831076 2896519 2982706 3168644 3207149 3194118 3193457
9195 3193457 3280235 3346147 3311753 3305002 3319090 3372810 3422325 3432870 3445152 3375179 3462126 3477349
9183 3477349 3569258 3584468 3536853 3440105 3512573 3631311 3596007 3665493 3767641 3927427 4128529
9172 4128529 4355400 4509986 4688302 4930919 5259119 5571500 5824777 5960649 6089906 6183695
9162 6183695 6102692 6094777 6142555 6189695 6216258 6285740 6362406 6251257 6104167 5982848 5792988
9151 5792988 5748978 5648623 5683085 5674083 5564153 5699116 5780598 5846029 6066985 6054013 6183001
9140 6183001 6423937 6612470 6819046 7143371 7436070 7754137 8233666 8642459 9199864 9840484
9130 9840484 10569770 11241289 12130637 12917218 13640134 14198311 14497269 14500178 14283866 14270523
9120 14270523 14409744 14447412 14468800 14331948 14069733 13568727 12927586 12217477 11460768 10866329
9110 10866329 10414344 10012235 9722874 9498445 9301667 9271796 9299835 9431060 9573173 9650362
9100 9650362 9994141 10482472 10958901 11468974 12116924 12787771 13691392 14676040 15407845 15992339
9090 15992339 16366916 16318882 16028153 15293458 14410438 13359856 12088221 10999459 10080060
9081 10080060 9186295 8448315 7879151 7312368 6854838 6503063 6128237 5771743 5553605
9072 5553605 5435304 5244755 5119463 5014653 4964326 4773576 4632371 4698397 4685586 4573569
9062 4573569 4524859 4612331 4710444 4817745 4861068 4988962 5152065 5353345 5522909 5744749
9052 5744749 5761129 5951870 6051448 5824687 5711549 5546746 5253023 4830375 4362899 4011055
9042 4011055 3680206 3399033 3142252 2904929 2704843 2622404 2410820 2220752 2214921 2241708
9032 2241708 2109630 2065610 1962105 1882948 1771843 1744565 1676199 1528066 1384485 1443800
9022 1443800 1396003 1310607 1328405 1328074 1289411 1288297 1186066 1071371 1102484 1042118 981512 1110856
9010 1110856 1159502 1067886 968956 949129 972609 997029 858203 942514 1011060 912427 851064
8999 851064 858183 834654 734818 661763 644439 742509 833010 766024 632301 607612 533755 565154
8987 565154 520273 516537 554287 519051 467341 550904 518921 490890 468728 459576 513173 529614
8975 529614 376532 390152 431531 428068 477669 441049 439323 525700 425239 320040 334357
8964 334357 345488 330621 390042 388459 406549 253590 224109 167129 235748 248304 174221 222330
8952 222330 278764 378269 342688 320271 308964 223506 288979 275514 227389 209830 297917 239137
8940 239137 266133 300484 250708 338705 241171 56561 154671 205732 191561 85347 65206
8929 65206 108272 162002 144144 88074 129321 169677 176040 130336 163162 214210 147906 94480
8917 94480 131836 216086 197852 132721 226075 145418 158425 156556 162046 210632 274469 194170
8905 194170 129645 123456 150868 159391 162438 122002 25114 -36165 50142 43215 87587 67069
8893 67069 68141 110242 101217 41231 129513 161726 171384 87125 89298 76543 69467 84306 38576
8880 38576 44224 107411 164618 216384 229122 193893 139534 130268 126966 59271 75749 126158
8868 126158 226682 260981 229617 64196 110441 187647 106584 75504 116654 161976 176903
8857 176903 202468 127228 186084 197061 302948 336035 320114 208357 201520 201812 164984 175845
8845 175845 89874 105139 85421 195604 167356 139147 125358 52356 140106 138938 164771 129420
8833 129420 169566 114416 93290 181874 108204 154788 162310 94196 14287 23819 149295 249431
8821 249431 179462 101419 40508 101975 93493 164413 166307 172831 167150 155463 152544 87631 89369
8808 89369 123850 118849 177995 117480 4003 -39977 -265 -61677 -19725 27169 51593 181205
8796 181205 80792 55970 7975 -76710 -37083 15114 108451 64126 29467 23454 55165 49050
8784 49050 22935 79589 8340 -17472 -17395 16562 88293 88945 2464 85358 189284 54329
8772 54329 56964 48142 12286 -6373 61219 54579 37118 48740 14453 4504 -45121 -23245 2946
8759 2946 3587 14257 69505 79232 93847 183793 89320 112636 78147 80819 69853 -70542 -145288
8746 -145288 -42074 -62511 -35743 -6283 61298 147530 39636 17428 -16462 63513 19898
8735 19898 68609 13500 -19089 -36503 69448 46568 89575 65593 120577 98035 81157 106537
8723 106537 30277 218 53573 19092 -51975 2991 -30234 19968 61718 104167 126233 58284
8711 58284 22491 30045 -11615 33829 20553 55262 -42885 -141574 -53024 15848 -22035 -106792
8699 -106792 -15892 -20298 -42923 38397 80708 51025 53871 56113 -8949 -50812 -136895 -118570
8687 -118570 -108768 -106491 -25892 -1219 -45901 13148 65429 41760 97776 89675 68332 60705
8675 60705 -85984 -106348 -71111 -109994 -104156 -43632 90353 109316 56528 -123756 -77322
8664 -77322 -1831 -67218 -63730 -34149 -81229 -26556 -20328 -99218 -129022 -51572 -54242 -10346
8652 -10346 53999 81744 61895 22420 -1012 1896 78248 135540 142115 28197 141212 175374
8640 175374 89297 -40534 -54987 -7632 -87261 -59369 -50782 -69355 27173 14082 -49610 -5693
8628 -5693 8610 29864 74068 -33680 11221 -42370 -35397 -81962 9920 -60182 -67744 -90619
8616 -90619 -103771 -71740 3591 -43682 -1647 -28102 -158792 -69989 -48797 -12010 -64438 -85175
8604 -85175 52063 -39734 -114402 -109659 -28416 -86564 -109386 -94743 -153332 -96739 -119384 -131597
8592 -131597 -204475 -106507 -77234 -85628 -66312 -8785 -40019 18336 24034 58804 -127111 -164085
8580 -164085 -127026 -60198 -44515 9057 37873 -29346 -12476 -20076 -80425 -104809 -175543 -194632
8568 -194632 -141295 -60353 -87963 -100949 27227 -15087 -40981 -142272 -178065 -123741 -157477
8557 -157477 -95500 -38878 -78748 -127785 -110021 -98616 -161641 -170011 -100455 -34764 62573 22315
8545 22315 25456 14653 -62512 -10588 49527 72646 -31140 -185302 -117656 -60070 26445 90185
8533 90185 86044 29666 268 -85919 -135308 -107550 -34086 -51428 -39335 -74014 -86228 23305
8521 23305 -74765 -174352 -135954 8106 79271 -11239 -15863 -24869 -58402 -19496 -146297 -63977
8509 -63977 -42254 -33076 -83306 44075 33076 10041 43717 -57738 -67505 -89569 -91740 -125990
8497 -125990 -140301 -89268 -55728 -130782 -170762 -62401 -13345 -26937 -62013 -32083 -2921
8486 -2921 11715 -29675 -45264 -2083 -63813 -25652 -12141 -23564 -74763 -41375 23886 -26839
8474 -26839 -84460 -27443 -23266 -55696 -61250 -15782 30746 -76871 -20820 -104267 -194295 -172347
8462 -172347 -143334 -29171 49152 3087 -30678 -24994 -25816 -31931 -131894 -193182 -137543 -40006
8450 -40006 109703 76411 -37193 -11134 5745 -52024 -152674 -62766 33443 44524 60807
8439 60807 -55245 41443 -22336 -38513 -34021 -69324 -130741 -170846 -203288 -138299 -74582 -71262
8427 -71262 26639 -10703 -11775 9492 35003 35711 -77671 -61445 43365 -14763 27729 -95517
8415 -95517 -123187 -108766 -39128 -84115 -197295 -136480 -40192 -10240 -45396 -28459 -23742 -92429
8403 -92429 -136349 -144845 -90078 -111870 -99512 -96056 -62163 13635 -56328 -35060 -124911 -135274
8391 -135274 -80395 16641 40423 -17624 -73737 -40262 37463 4960 25672 -45656 4187 -31501
8379 -31501 -51228 -45860 -9402 7915 51869 -31592 -46778 -51539 -101930 -53337 -90632 25710
8367 25710 11927 26567 98460 58027 -28222 33454 63882 -34492 -112882 -187618 -232171 -129618
8355 -129618 -116049 -56710 -24855 -41312 -52150 -2601 128660 -101 -35096 -83267 39676
8344 39676 47323 -57045 30336 43592 -52259 -48309 -72581 -74925 -125964 -10799 58291 14726
8332 14726 -80939 -116773 -12928 -43046 -92011 -67820 -126330 -165532 -55947 -30415 -71039
8321 -71039 -58303 -104619 -86433 -90420 6339 68856 -11831 -25837 -142730 -145608 -24514 96673
8309 96673 -18367 -64924 -114406 16615 94445 -81952 -101537 -7054 -25126 38046 59145
8298 59145 -66055 -61247 -41351 -31324 -35390 14963 17178 -65206 -52665 29123 -23837 -61850
8286 -61850 -47899 -112146 -138108 -83518 -19140 -71767 -62344 -52382 -61293 -78771 33764 83836
8274 83836 7701 -111886 -109000 -112016 -44224 -77016 -31888 -85679 -143954 -107895 -106271 -51608
8262 -51608 6893 -12375 -85600 -111113 -105922 -45480 30778 -37171 -128437 -61682 25896 -30034
8250 -30034 -74377 55941 -12901 -34558 -77084 27743 4436 -28965 -82221 -102663 -29883
8239 -29883 -35059 21626 -32121 -109521 -19104 85968 -35408 -12139 12872 40683 -17854 -128501
8227 -128501 -142289 -72007 -99843 -97115 12958 96298 -4270 -181635 -154014 -101627 -118302
8216 -118302 -120112 -5794 -46 -70032 -106922 10260 26009 71500 85537 40249 -15751 -66399
8204 -66399 -63833 34847 -15704 15521 -7791 22463 -32215 46192 89066 104301 183274 588229
8192 588229 538116 -376340 -382912 -307785 -265011 -220889 -98278 -67112 -110913 -108302 -115252 -163576
8180 -163576 -93687 13889 -107649 -123390 -112061 -143363 -179386 -144545 -49961 50764 53976
8169 53976 52889 197138 69463 -46160 14681 -101484 -140521 -127257 -23193 -9359 -49942
8158 -49942 -102491 -116339 -132098 -185405 -145782 -127084 -55245 -9086 -9778 -46747 -11313 61139
8146 61139 84927 -938 16532 -60526 -91053 -102317 -67049 -44748 -70605 26161 30680 19404
8134 19404 -100767 -132582 16482 78673 105061 126179 16840 -25618 26456 42788 -52713
8123 -52713 -82313 -120794 -97690 -123111 -105944 -114398 -11797 -66655 -25577 -23696 -139740 -75364
8111 -75364 18686 -98236 -85214 -118448 -114346 -101592 -47760 -8028 10507 -35800 -131576 -138101
8099 -138101 -88397 -137034 -139257 -79856 -26145 -4128 -89943 -74353 -24809 -80210 -119481 -4959
8087 -4959 -100282 -123152 -109738 -115647 -121850 -30670 -100069 809 23887 35114 -80605 -194616
8075 -194616 -135900 19225 72283 20252 59049 34938 -43835 -52764 -42495 -33359 -30281 -35295
8063 -35295 -42117 -58873 -46262 23895 -75510 -87439 -52248 -100680 -60400 -41418 -13696 -102982
8051 -102982 -177757 -210754 -118370 -72188 -97792 -131736 -105168 -142214 -163688 -93076 -88023 -114544
8039 -114544 -544 59198 -5540 49623 -4379 -74850 -125656 -90589 -30599 -88626 -144393
8028 -144393 -177075 -49090 -5542 -73359 -70655 -187369 -155204 -149626 -18987 -32753 -49145
8017 -49145 -27612 -31637 -50955 -54887 -57734 -122414 -56201 -15642 -50649 -56776 -49570 -48791 12062
8004 12062 -64865 2082 -1368 13254 11687 -134443 -69168 -34031 40095 -17120 -41546 -117343
7992 -117343 -192710 -95590 -38476 -54042 -42081 -71264 -8946 27030 -16321 -65416 -9419 23548
7980 23548 -152983 -122975 -152872 -179844 -53114 48601 131189 21341 52893 18131 -114750
7969 -114750 -83639 -42176 8698 -65877 -137161 -166493 -111486 5394 60095 75960 57858
7958 57858 68778 77486 -70850 10280 86093 -3843 -142744 -113112 -114013 -43281 -76288 -66636
7946 -66636 -120312 -55952 -55946 44632 44422 -26416 -76046 -105626 -96655 -42553 35030 107057 35631
7933 35631 7446 46990 141003 35482 2803 76192 93668 -20999 -43977 11767 -12290
7922 -12290 -3252 -74728 125179 -26989 3199 -76137 -25683 -31358 -78026 -68949 -49724 -28483
7910 -28483 27006 -9595 -136033 -118304 1189 69936 93967 -44015 -147429 -81452 5677
7899 5677 50831 21915 17293 -32469 6805 -145361 -108605 -97325 -67021 -101415 -81103 -55818
7887 -55818 -41080 -56835 95967 112616 4945 -73207 -47196 -40647 -59204 4180 -57996 1884
7875 1884 9451 48298 -18605 -2959 -3248 -19650 -35809 -28233 8169 4186 -37609 -21864 -2672
7862 -2672 49321 11106 -51405 -137288 -108867 -165940 -139124 -131890 -42313 2067 -48337 -73149
7850 -73149 -14575 -98109 -196875 -160097 -192622 -155180 -148407 -136389 -62611 79600 86749 -46812
7838 -46812 -4358 -165 -82945 -80487 83404 26626 -73913 -102574 -194923 -202413 -138564 -79236
7826 -79236 -113794 -92177 -71162 -66433 24161 27625 15827 -30764 -94905 -110788 -123937 -45581
7814 -45581 -94284 -23950 -40116 2113 4688 -9538 -13760 55672 67589 49475 -80438 -250741
7802 -250741 -53131 37512 75234 55804 -45261 19802 16955 -64803 33162 26137 -39529 81132
7790 81132 156858 158735 40684 -52158 10055 439 -11554 71669 139459 132736 99601 42712
7778 42712 78376 56875 49908 -2376 -66943 -19717 14196 -9133 -121635 -37077 -56914 -97176
7766 -97176 -31696 -60755 -103256 -91145 -78615 -102454 -100316 -104794 -103630 -22749 -127186 -207584
7754 -207584 -193011 -68149 -24172 35381 64318 46805 12256 -19400 -20700 -38459 29588 60193
7742 60193 -26904 -35743 15326 6394 89368 5400 51576 65687 -23694 29133 50860 8640
7730 8640 -52160 -48871 -77315 -41340 -36109 -26043 74354 24078 -12748 -48771 -53916 10183
7718 10183 46207 -7042 -82263 -13341 117877 80603 122798 132027 -27820 -106413 -31226 -6532
7706 -6532 -4897 18092 9914 41003 1537 6595 68646 15255 -1966 -118 -25241 -49 -40148
7693 -40148 -68685 -68664 -102640 -39853 14473 -66854 -96740 -78210 2039 107315 119671 -37184
7681 -37184 44695 60043 44330 -73725 -189653 -128623 -52334 33394 10041 27612 32858 66976
7669 66976 -37912 3667 58000 -107640 -107870 74679 19045 -16199 14846 -34028 -69777 -56855
7657 -56855 -61051 -55055 50793 129821 49531 -53672 -14401 -127195 -174613 -130584 -86256 -103118
7645 -103118 -165014 -132545 -128445 -77601 -58941 -107587 -57995 -56832 -114447 -85930 -98716 -106143
7633 -106143 -51018 -89409 -56409 -74369 49697 15875 -41759 119480 114531 100428 61684
7622 61684 -78348 -146841 -132277 -82748 -150914 -172198 -71624 -92733 -78088 -83267 -94933 -75335
7610 -75335 -78055 -120796 -117669 -140943 -80235 -38340 17873 814 -84049 -74861 -619 -55920
7598 -55920 1705 -91940 -12922 40240 6428 17035 -31376 -48466 -72881 -102542 -79730 -57602
7586 -57602 10319 101697 -6906 -62228 -84628 -19336 -23870 -46192 -40623 31642 7042 7055 -76558
7573 -76558 19800 -19015 -103781 -80019 -44348 24327 -54076 -282 -33565 2865 -31617 -86253
7561 -86253 -84489 -55675 -59723 -112408 25325 34590 -66781 -101875 -105793 -119696 -44929 -26712
7549 -26712 -45178 13087 -1503 -51504 -79177 -43802 22550 -37474 -18657 19638 -23013 -69636
7537 -69636 -84458 -14986 20926 6102 -51 -2374 -27270 -32120 -5447 -30330 -112244 8588
7525 8588 63771 16240 -20056 36862 -9921 34438 36218 71790 64879 2352 -37465 -94186
7513 -94186 -165350 -161135 -219908 -185763 -115206 -134886 -68546 -6492 59640 87849 -31747 -126565
7501 -126565 -95049 -52523 -28352 -45819 -87913 -76986 -62116 -44202 -66611 -122222 -93448 -125753
7489 -125753 -104533 -119558 -39075 -89619 -125384 -55101 -907 8757 41539 -49863 -102348 -112879
7477 -112879 -141633 -196048 -124219 -69695 -18632 -52693 20743 21553 56146 -9270 -47871 -70922
7465 -70922 -102637 -32569 471 26992 -39502 -70476 -76923 -64988 -22499 -38314 6815 -90613
7453 -90613 -62700 49866 36839 88850 -38504 -62990 -38094 -151565 -83677 33102 -19522
7442 -19522 -116584 -90788 -40232 -6265 -57326 -87923 34619 54191 34390 61847 84414 128228
7430 128228 -4880 -55843 -924 102662 143765 137708 91917 24501 -40464 -105869 -34351
7419 -34351 -29921 -21454 -42215 -17083 -46498 57989 20152 -83219 -143322 -106557 -58309 -20683
7407 -20683 -100234 -161463 -98685 71118 38300 -25508 -55893 -119030 -147962 -116557 -4838
7396 -4838 15883 1180 23644 36402 -22357 -102062 3202 44676 79097 58288 -72534 -120429
7384 -120429 -32057 -36834 -62547 24854 -29189 72975 123804 -16805 -94223 -28611 20551
7373 20551 -47043 12256 78705 188659 114705 5811 68778 5590 -48540 52586 27891
7362 27891 46612 58018 9926 -35377 -65566 -20128 27869 50308 28056 -50465 -37844 -10947
7350 -10947 26132 19233 82949 55037 42807 77985 42260 25732 25381 64052 54692 21975 39192
7337 39192 56840 -20903 -41870 -24558 -12141 11136 21084 11245 22180 -62551 -89529 -88672 -174765
7324 -174765 -31323 21176 -155944 -135745 -67674 -5392 -77309 -93203 -60412 -43278 -27089
7313 -27089 -86224 -65211 -76410 -103691 -128653 -58891 83799 139230 91035 79027 64519 -18252
7301 -18252 -9890 -21612 -6521 -82053 -7927 -66742 -30455 -28997 -44925 -40925 -41851 -105421 -16662
7288 -16662 23840 73402 41051 49843 40669 -52139 26340 69359 15718 -2378 73440 93106
7276 93106 16413 -82293 -91430 -115843 -81136 22679 64349 -32048 -2917 39149 -34591 54679
7264 54679 35538 47326 -70319 -16948 29887 19732 60542 60703 -4278 -134807 -116146 -108294
7252 -108294 25281 3103 16864 14304 -40741 -22496 -802 -19962 -2870 1197 -12480 -153673
7240 -153673 -153197 -62400 -85754 -181896 -69736 -19018 -57043 -25171 -5182 46458 -16349 -33353
7228 -33353 36100 13384 -43447 -112695 -127265 -40457 16108 11683 -16880 -59561 -117653 -49607
7216 -49607 29244 76222 107221 51333 -32048 -41087 -86487 -89158 -77021 -132425 51346 72410
7204 72410 30739 -34531 -1202 -3568 21811 17122 -51009 -21587 -26867 46476 48191 30960 6860
7191 6860 75928 116998 62725 39943 27874 13708 70060 154109 136323 120987 47090 -69705
7179 -69705 -8705 98824 68433 102818 43058 14685 -1457 128 56262 80743 35281 -21210
7167 -21210 -125251 -64063 -52712 -87636 -47657 -31455 -6850 72315 106958 89197 41141 88835
7155 88835 144359 -40354 -15142 79771 104886 129904 104964 3041 -81188 -87253 -115916 -19133
7143 -19133 33278 -54862 -90820 -123159 -26248 43551 53886 -6199 -27700 -7506 23527 64855
7131 64855 25240 11710 -7812 -34331 -79393 -44710 -5916 -117672 -41261 82116 121277
7120 121277 41925 25354 37833 4892 -132803 -145543 -79063 -53683 52525 51248 106721
7109 106721 88810 53002 -38446 -37683 -79925 -117215 -83360 -37538 118772 44602 50253 23201
7097 23201 -18942 -34561 9915 12922 20494 59900 2653 21458 33883 -23152 -37624 34754
7085 34754 33561 66478 -19675 -26362 13764 81042 57211 4708 -15123 -92921 -73671 35922
7073 35922 133026 110729 111645 15007 -8899 26736 60423 91233 79779 4728 27451 -78163
7061 -78163 -30561 89175 41414 -23259 -13967 49928 30657 45908 -17081 -28274 -79970 -95002
7049 -95002 -99200 -45408 8289 -11065 14205 -54287 -50477 -35194 -57175 -80768 60835 22072
7037 22072 22313 99035 92040 46180 23912 -32758 71591 15061 -72605 -67124 -19992 38760
7025 38760 52038 91194 -41269 -50874 58355 59425 65258 69571 78774 58214 8654 112170
7013 112170 -13696 -19035 -27273 -81468 2288 -27736 -65331 91044 91474 112439 49908 72296
7001 72296 60267 -37089 -70441 12192 -45049 -160057 -114914 -114640 -82868 -69209 -44685 19654
6989 19654 55002 22947 -29442 24939 -12828 -53387 -7569 47902 70353 93623 63651 119489
6977 119489 108800 5716 25861 2535 -5986 -12932 15066 -121631 -70177 -639 51853 16622
6965 16622 105538 62453 -84512 -4307 50449 1629 -58609 11849 55594 55133 42181 20748
6953 20748 116642 -16869 19093 156930 39275 84715 -22451 -66204 63192 121929 24155
6942 24155 28521 60329 53212 52105 -7631 -35891 36151 88099 37899 -24518 -34419 -48253 25788
6929 25788 -83559 -49979 -30656 32278 -15210 -21649 148702 17928 -24297 19446 7327
6918 7327 41371 2117 -62199 -33415 51820 -5053 -13815 -54830 -47267 -89307 3269 120402
6906 120402 76959 -19657 -7216 10468 -7908 34582 83697 114851 72853 104769 22583 -98844
6894 -98844 -51963 -579 86058 124972 -2693 43085 83908 81946 82883 36288 3836 -13504
6882 -13504 -63209 32876 43086 55150 8417 -92178 -98600 38645 32530 114538 139847 167531
6870 167531 88549 34440 50431 129247 99229 82176 133455 132658 80764 42026 -57159 2384
6858 2384 -50582 -95986 -26798 -46332 37779 44684 -28568 -27838 138653 106260 91570 14442
6846 14442 -45890 -2709 -33343 -59644 -79112 25046 -24762 8616 71326 -6522 49128 77271
6834 77271 -2629 -74105 -18196 -33759 -39548 -59 -61881 -52022 -306 5629 92656 66694
6822 66694 120591 67527 9110 125993 89738 26667 8467 64665 44310 51735 28483 -12112
6810 -12112 149351 -5233 -60032 -8577 67595 1455 2791 17854 -40189 17532 107584 85460
6798 85460 -16694 -26151 -23142 131666 162733 143563 21771 -91352 15458 96584 37038
6787 37038 124332 162237 124703 85892 37451 -20312 19454 82044 106444 90064 35475 9868
6775 9868 60502 114030 59296 98367 131754 21020 67282 140705 171808 123631 103732 88003
6763 88003 25566 57510 138903 177870 -11335 71075 54862 99224 132715 119596 108555 161987
6751 161987 173364 -18437 -13180 68338 7339 19458 28204 10884 84786 96898 9935 -12829
6739 -12829 -54297 -11481 -10250 19713 80446 26442 37300 53641 49845 23236 -4807 49676
6727 49676 53855 81002 90597 27809 48504 106340 181196 145311 97434 34920 72277 121113
6715 121113 125632 106677 100768 -4248 58382 134992 93796 27489 -26801 -34559 -42980 -4416
6703 -4416 25531 117678 107993 84054 17469 32003 -80925 -15046 31575 -47101 -33146 97814
6691 97814 56736 96881 147735 126418 110422 123769 258013 191569 138977 84688 49922 82561
6679 82561 32516 -57744 24588 12824 4826 -82176 -117896 2687 -24042 -47900 162983 94214
6667 94214 125099 116401 19770 13310 101548 58797 89364 44047 151611 148957 -7415 -6165
6655 -6165 63922 161685 90591 129178 42125 31429 20832 5688 22349 88418 51611 69329
6643 69329 185938 73396 154289 39048 -29474 75876 11958 30439 42619 80234 55022
6632 55022 -389 144367 94208 82982 197533 172973 54315 124027 120400 104855 148258
6621 148258 140168 154358 98775 141212 179759 181514 83072 105847 140214 54597 9836 23400
6609 23400 74147 73845 97335 167487 110585 80149 79157 117614 167837 147525 149072 152479 34097
6596 34097 41180 85348 267599 156977 51913 105212 149591 193501 180517 85319 214419
6585 214419 264701 267754 159967 172315 210392 224864 258407 161418 249968 262474 244533 125610
6573 125610 112163 147420 214596 137148 182405 258203 211143 220158 237803 206984 205772 211638
6561 211638 200459 233922 259299 196653 192191 295220 248355 185369 184952 138349 113888 152980
6549 152980 127942 164426 169968 166969 188479 149579 287052 270915 206000 196388 121710 167083
6537 167083 266794 221687 225293 202095 283656 273559 195681 241272 259451 221115 126047 39545
6525 39545 65596 169635 204614 267772 245770 278793 199025 233156 174237 165165 167947 153330
6513 153330 180918 175330 155612 154669 201236 203410 176240 183939 192338 117580 166517 160585 255654
6500 255654 260319 184313 212936 190058 215009 236786 271873 263605 256373 266717 239891 353920
6488 353920 365295 300576 321866 357392 376706 405677 360977 409397 418407 369728 345329 352084
6476 352084 406308 477186 427187 389674 444001 487191 491244 462160 422864 493468 536565 431820
6464 431820 464735 481236 437505 438909 541739 555434 656053 623505 563552 599397 575530
6453 575530 541830 563632 642576 646462 675339 736804 708743 627790 699420 745422 796079 782830
6441 782830 764721 909554 860690 769528 762224 798668 788402 785561 821841 778950 809536 750514
6429 750514 852940 889782 965990 994889 874441 807977 862738 750374 773650 827200 815647
6418 815647 800969 833553 910977 915748 884601 786212 813020 855560 908749 813231 833486 859856
6406 859856 869771 785015 702514 696183 742284 835507 793010 666087 768919 823859 836250 801546
6394 801546 833399 770619 708713 756915 681443 726296 703956 722760 751833 666611 786532
6383 786532 840099 748168 737234 653786 754263 882212 811020 640189 645423 637361 477108
6372 477108 534497 664349 698855 725238 723530 636359 532853 635892 744870 715417 736538
6361 736538 851717 756349 725463 610641 529373 597084 663271 734424 724853 815094 842855
6350 842855 815425 772390 888425 904809 807438 771667 749820 710814 809225 785196 731104
6339 731104 839568 952235 915637 1058266 1068436 1102783 1016239 1003929 1102789 1120519 1117258
6328 1117258 1098404 1228234 1224745 1196702 1232647 1207501 1151581 1162128 1255422 1308644 1406394
6317 1406394 1374870 1391562 1532736 1520954 1653838 1611954 1651618 1783329 1829253 1820282 1839513
6306 1839513 1859770 1853271 2020595 2181159 2255362 2296643 2222924 2353140 2320704 2324703 2377358
6295 2377358 2513639 2634385 2838448 2905268 3034665 3150755 3208267 3286288 3371013 3591555
6285 3591555 3857512 4054508 4106413 4332624 4545136 4729411 4846275 5009513 5152912 5377768
6275 5377768 5591745 5755077 5860498 5974572 6018114 6064244 6218141 6331620 6372574 6428840
6265 6428840 6450351 6568646 6736859 6744627 6844351 7009678 7154710 7298605 7531435 7644929
6255 7644929 7811441 8048358 8125756 8175482 8360242 8446333 8450204 8491705 8465418 8342949 8184976
6244 8184976 8068016 7932114 7633644 7337965 7148289 6926987 6781857 6591020 6527081 6372063
6234 6372063 6184295 6086160 6116669 6051126 5989804 5870090 5735666 5671172 5476329 5271052
6224 5271052 5160970 5143509 4927552 4720291 4469510 4242771 4137968 3857363 3728325 3447546
6214 3447546 3314799 3269029 3213739 3088357 2837662 2616617 2481810 2516715 2383591 2365677
6204 2365677 2206518 2100329 1857404 1919288 1898894 1744954 1715069 1673207 1580065 1490749 1542936
6193 1542936 1437544 1429316 1437142 1362120 1241706 1178806 1166961 1092220 1180752 1203294 1009430
6182 1009430 1013507 1027594 936972 937520 988339 1001242 962042 830297 771210 772689 789030 773483
6170 773483 850259 832534 784743 693902 695965 728873 719301 659803 781480 742575 604233 588653
6158 588653 569868 664739 616291 551484 535033 570148 501197 425573 448671 478242 483784 486400
6146 486400 459101 463723 516980 520432 484942 473160 560123 535918 514685 477447 444010 453323
6134 453323 497350 525264 410030 366984 415883 420546 417843 455992 484300 488041 421847 433422
6122 433422 451560 504467 450104 372032 356372 311255 448316 462787 336651 359495 416805
6111 416805 480258 460460 397227 304885 253192 303588 429572 409985 438134 339131 313750
6100 313750 386276 388014 396413 428552 395136 358726 504248 503446 463178 424623 429003 503623
6088 503623 423657 412337 457026 370624 384026 430254 341023 329775 390755 372758 419261 349758
6076 349758 221062 170469 259498 334686 374163 316447 186376 196163 289455 296345 353484 435086
6064 435086 341865 293157 218576 290700 280594 238006 297105 336116 260906 309412 312500 329583
6052 329583 291799 199597 278612 281331 256536 331682 452522 413450 377351 373463 390146 404396
6040 404396 473338 510248 407889 329020 359082 365237 382822 418484 323461 345177 421650 362450
6028 362450 262723 233298 248075 260178 280183 263025 290520 285590 306822 353917 320430 330809
6016 330809 358739 294504 395783 366523 374789 244005 250246 204108 201949 252328 250454 284459
6004 284459 289612 276987 270291 284124 327352 405333 360791 328872 208600 254530 338618 328423
5992 328423 206219 220953 210505 223584 242831 235355 243428 236519 186765 246226 159644 166163
5980 166163 355033 344080 264074 226647 217909 118236 148998 204437 205958 209351 172505 129962
5968 129962 209628 260466 298779 278248 283281 353362 306584 312288 336602 413050 365887 302496
5956 302496 285182 212666 250881 298742 266428 215312 266353 247490 228132 202051 247652 258589
5944 258589 294437 324627 356874 403439 415799 277292 248738 263757 334532 389625 350704
5933 350704 303562 310511 297921 310712 391248 347454 339123 361121 347441 271717 400404 407118
5921 407118 367448 332915 392286 414349 456454 397700 404636 449406 364471 254443 337586 400769
5909 400769 439968 385913 328586 273078 260074 276415 403482 536207 473424 448848 287287
5898 287287 292240 296355 356729 342739 361562 351054 405686 345609 279852 361010 376053 426691
5886 426691 453976 310459 337769 310949 200297 266287 228601 315963 366555 326930 338951
5875 338951 280186 264539 272803 291825 346609 405553 517186 447881 429960 445332 383020 277373
5863 277373 293748 294369 324768 346199 347580 305040 234889 302342 314264 291317 312744 292801
5851 292801 370588 339679 268814 317358 290617 285953 275751 383418 379007 332421 376817 371920
5839 371920 344723 411751 418833 262684 378397 385129 429461 506015 399103 450440 475826
5828 475826 479828 495631 450188 507006 427794 347515 492421 450216 446524 478741 448937 508026
5816 508026 490670 391546 372846 418305 435671 598219 561426 518660 528530 585122 549172 511369
5804 511369 582124 470935 395638 430364 509350 535663 644969 595968 550442 605375 710748
5793 710748 591806 587516 664426 602463 602237 518937 643331 659989 620669 563011 564624 728157
5781 728157 700471 693374 685242 699965 687740 730575 799374 816356 796540 715526 583694 670208
5769 670208 687544 705723 606377 574841 645699 714048 729717 755210 651431 735001 797799
5758 797799 744733 821044 784913 798215 881436 882804 815596 812171 888104 921194 862121 1006952
5746 1006952 1027349 1020899 1096639 1004844 966664 1101679 1140747 1161723 1097185 1024696 1131725
5735 1131725 1278581 1279735 1258917 1261455 1242373 1257752 1264233 1268788 1298480 1391735 1429871 1350024
5723 1350024 1367921 1400874 1506576 1616829 1523245 1520724 1498184 1498776 1515071 1529653 1572448 1520948
5711 1520948 1527436 1426738 1561385 1545218 1542984 1567250 1595209 1649738 1601855 1604142 1672068 1680728
5699 1680728 1629963 1689872 1726636 1647366 1707902 1713776 1672909 1633062 1714420 1694048 1722534 1737356
5687 1737356 1627460 1711918 1664221 1804857 1824367 1804864 1722485 1664386 1709221 1739134 1781170
5676 1781170 1749680 1630969 1711807 1806495 1732286 1723967 1634165 1589275 1637760 1700960 1708291 1804830
5664 1804830 1837244 1756092 1736939 1665166 1763606 1760830 1784087 1940375 1812456 1776452 1820698
5653 1820698 1773970 1868343 1927292 1895127 1875938 1801051 1851995 1959390 1963035 1971183 2020334 2011261
5641 2011261 1954863 1949668 1933307 1918327 1961025 2041679 2192681 2127768 2054711 2098183 2116718
5630 2116718 2140911 2196272 2266613 2384314 2382187 2308965 2316117 2252655 2218672 2266420 2253228 2295567
5618 2295567 2373506 2419130 2422235 2450571 2569917 2638311 2583713 2516809 2602264 2753536 2777563
5607 2777563 2838507 2788216 2788612 2767648 2840848 2933181 2958407 2942525 2953176 3050717 3219431 3311252
5595 3311252 3228036 3234873 3227950 3346447 3504711 3601199 3566441 3613168 3595413 3696596 3821128
5584 3821128 3983050 4074997 4096496 4066140 4070565 4087692 4217344 4350959 4398424 4418357 4538136
5573 4538136 4590057 4573770 4617255 4643881 4752266 4806438 4756282 4796473 4901277 4938593 4966766
5562 4966766 4973829 5026153 5086216 5221517 5279510 5419417 5532829 5614364 5678231 5810904 5953800
5551 5953800 6027841 6173465 6294913 6367476 6467203 6708041 6842822 6954021 7003743 7154045
5541 7154045 7346094 7561053 7737157 7950962 8117197 8405983 8585513 8725988 8902015 9236764
5531 9236764 9508122 9703284 10019051 10244158 10510319 10907866 11267554 11598246 11921541 12127217
5521 12127217 12331969 12528420 12787917 13029178 13227418 13495453 13592102 13616508 13794109 13984095
5511 13984095 14227315 14363655 14559943 14923500 15085366 15228918 15561729 15835549 16170821
5502 16170821 16531335 16940406 17334135 17665775 17910549 18265688 18517316 18684129 18831675
5493 18831675 18967190 18951227 18982719 18961303 18862483 18760132 18847489 18928601 19050375 19109083 19228454
5482 19228454 19412996 19594004 19841825 20196213 20416725 20619925 20887489 21220342 21632102
5473 21632102 21855461 22219472 22525756 22724408 23027341 23351790 23674102 24001002 24243452
5464 24243452 24586168 24901121 25212123 25444464 25749381 26162336 26613087 27109979 27577242
5455 27577242 28194918 28692595 29373891 30023213 30689293 31337892 31985502 32740813 33522808
5446 33522808 34276531 35128506 36100294 37115696 38198198 39320350 40508773 41740366 43047001
5437 43047001 44326852 45791523 47379304 49147870 50927851 53114009 55534664 58024207
5429 58024207 60483004 63109141 66049362 69168343 72607271 76155610 79977386 83860745
5421 83860745 87702200 91582698 95587325 99849941 104407715 109352730 114811935 121166610
5413 121166610 128441056 136918463 146727975 157924152 171109101 186876325 205900261
5406 205900261 228459468 254339934 282635452 313746230 348817550 386950087 423037118
5399 423037118 449486276 457438038 441062379 406038558 362968201 318316235 276305274
5392 276305274 240509771 211222969 187606165 168499435 152705211 139239789 127814060
5385 127814060 118060623 109368120 101906197 95254311 89136414 83650731 78733953 74486992
5377 74486992 70778616 67439550 64059965 60739577 57711032 54874597 52257195 49867186
5369 49867186 47623015 45671493 43808462 42029362 40305902 38770601 37330981 35834541
5361 35834541 34391399 32996166 31769908 30614450 29507563 28465988 27575337 26619429
5353 26619429 25719354 25161651 24508840 23692750 23004700 22401135 21736789 21130694 20512082
5344 20512082 20041489 19506014 18886755 18298473 17798944 17370116 16885798 16517666 16088043
5335 16088043 15702952 15293760 14886684 14513409 14244118 14020408 13680618 13328938 13045918
5326 13045918 12729673 12397914 12197041 12061420 11890731 11658161 11370385 11108510 10836031
5317 10836031 10671907 10457867 10300190 10185722 9980615 9817424 9640044 9462594 9312978
5308 9312978 9169855 9028550 8784767 8688592 8518654 8593899 8520787 8311657 8183195 8108405
5298 8108405 8016703 7934061 7810724 7827391 7759482 7520443 7463207 7429757 7306208 7247188 7227959
5287 7227959 7104148 6981566 6952944 6932927 6915168 6855168 6716638 6629105 6657191 6605478 6553723
5276 6553723 6486223 6385905 6295002 6283082 6347522 6377935 6475732 6465802 6394660 6422846 6432724 6452968
5264 6452968 6603770 6621891 6691606 6726002 6856113 6857173 7027122 7252588 7475056 7545642 7717601
5253 7717601 7822560 7969091 8241122 8438267 8692736 8811705 9017961 9213932 9457360 9564264
5243 9564264 9702553 9763444 9879616 10274036 10566609 10893607 11148970 11434562 11804370 12317665
5233 12317665 12838354 13321806 13935956 14692520 15298657 15828597 16357673 16739130 16879976
5224 16879976 16703181 16183468 15444152 14633950 13781856 12842792 11877218 11016880 10330477
5215 10330477 9695214 9059914 8484284 7899375 7436713 7154980 6855262 6448303 6229897
5206 6229897 5871420 5637010 5359401 5143661 4983384 4681893 4627842 4537364 4334379 4340350
5196 4340350 4218063 4059558 3929566 3790507 3720203 3629354 3576953 3452239 3322917 3249486
5186 3249486 3173802 3132948 3104393 3035403 3001075 2945700 2824265 2720059 2608594 2541868 2628159
5175 2628159 2658430 2522204 2490517 2433513 2310508 2312946 2235462 2160588 2103709 2147346 2106212
5164 2106212 2057605 2064874 1982558 1904158 1908535 1958542 1994690 1960011 1885207 1924749 1922905 1899542
5152 1899542 1805714 1772911 1761643 1839530 1789112 1618450 1617153 1644422 1595398 1596804 1556344 1429949
5140 1429949 1415863 1346879 1370806 1437059 1510070 1459378 1275859 1360604 1335022 1294970 1237302
5129 1237302 1191413 1299435 1277056 1251500 1149613 1199749 1256887 1204088 1142243 1051007 1129345
5118 1129345 1214666 1183444 1208672 1213019 1088163 1123814 1125144 1075800 1116215 1055622 1130231 1132186
5106 1132186 980733 994253 1045204 976620 944945 877847 871184 871074 747367 739304 779328 730257
5094 730257 816878 765480 754950 784566 775387 767256 796007 825128 737985 651048 660573 745591
5082 745591 732412 752134 842044 783296 678486 619160 622394 674325 688356 714911 734240 686572
5070 686572 676994 672059 729020 718966 522950 590686 614890 605122 717680 724005 689534 666534
5058 666534 644183 638197 641074 560475 591414 687798 693287 627114 530357 468215 441872 494242
5046 494242 506300 584413 574280 590615 539034 495581 638989 622150 494494 528719 649376
5035 649376 600215 529297 562334 662356 642529 662555 570337 467175 544816 466386 493832
5024 493832 568854 548852 603037 625591 678566 722747 653762 595136 627549 606575 581931 599293
5012 599293 507051 494303 474296 521755 605967 628501 484144 436376 500019 529777 489387
5001 489387 541243 589391 624599 599977 639665 664588 560005 513168 536567 530514 580141 595492
4989 595492 698412 646251 679862 673408 741643 845190 776735 752389 808227 877020 769753
4978 769753 717462 642042 726011 664552 700202 743884 686673 714798 762302 742669 697707 690580
4966 690580 701285 770136 760744 747429 820224 886071 853098 854596 843506 868517 1051276 1001968
4954 1001968 932674 908923 922667 1039100 1171086 1123614 1178475 1132769 1220929 1432479 1568062
4943 1568062 1733329 1891991 2116934 2312005 2395016 2411155 2346386 2241066 2067032 1878508
4933 1878508 1578537 1440609 1296070 1146407 1114083 990203 947929 865458 721726 859167
4923 859167 781154 793506 768040 618514 698947 612326 593363 665208 732488 735926 636890 557709
4911 557709 537033 560926 525932 687182 752067 642060 656439 631699 693755 691658 669522
4900 669522 672085 678355 659492 610084 567004 606232 539345 498103 554020 581350 568481 568117
4888 568117 521511 477956 451121 619273 626838 538823 470660 498181 492661 457004 433012 459229
4876 459229 402194 452766 602623 616548 643157 607463 525387 461493 524005 510305 518682 564643
4864 564643 556589 535076 560961 537520 528276 493711 482334 390412 423934 507760 489835 548341
4852 548341 503335 493734 495472 478374 462447 429299 467044 492158 473388 471280 407362 452494
4840 452494 387479 443223 501298 432127 522798 495531 586093 696827 650155 678687 628308
4829 628308 543277 602217 613028 580219 563700 528597 604018 619741 662519 575819 580758 596175
4817 596175 631314 711321 720961 631287 700545 785593 765596 814265 854738 897100 945379 971850
4805 971850 1044799 1202341 1236397 1270995 1405090 1471459 1596383 1760362 1889553 2060026
4795 2060026 2162545 2218786 2134232 2042994 1945601 1755181 1631118 1469502 1262203 1278210
4785 1278210 1143106 995359 948100 838326 809287 868393 779056 755514 756010 792860 688748
4774 688748 663556 722012 656672 660087 613051 557276 539260 504528 551262 515445 555961 546619
4762 546619 585465 577834 600359 563631 553328 532357 447565 486134 518245 510407 491376 480581
4750 480581 505615 498619 460751 465541 589815 559708 559561 517471 609256 683399 605029 530442
4738 530442 484422 445908 502003 600464 594917 643683 632819 599097 607607 664281 610556 557863
4726 557863 566701 597693 435186 569125 547607 427845 517837 567221 530494 560641 604319
4715 604319 621241 656571 656980 576698 649297 624088 657139 685075 645998 742810 782085 667171
4703 667171 682995 641729 679128 746171 765201 745500 763488 861255 789283 769351 833233 837135
4691 837135 837997 891847 887286 891110 895490 1060905 1007174 942236 1039504 1023415 1076112 1148457
4679 1148457 1183041 1083493 1107617 1150718 1198895 1174674 1163234 1267964 1366551 1433306 1531633
4668 1531633 1491366 1401213 1458530 1505438 1577144 1618136 1642272 1719907 1746142 1804442 1839002
4657 1839002 1893665 1962727 1918213 1969568 1994436 2072172 2241980 2293344 2304549 2293672 2260118
4646 2260118 2406145 2419858 2551805 2631584 2662336 2725323 2862020 2949668 2993549 3081703 3269104
4635 3269104 3358684 3258376 3442246 3614522 3757155 3781463 3928687 4199671 4453885 4636266
4625 4636266 4915273 5175939 5485936 5635028 5799959 6108915 6391293 6678516 7069671 7469210
4615 7469210 7980911 8552864 9112665 9707882 10219781 11030452 11792630 12569968 13402778 14300223
4605 14300223 14996888 15684228 16350821 17157645 18030372 18874725 19757661 20552854 21149677
4596 21149677 21509770 21739611 22035141 22432638 22973297 23396727 23593808 23538501 23219875 22461925
4586 22461925 21796391 21279358 20752220 20166188 19683239 19128771 18257522 17332197 16352327
4577 16352327 15426972 14535485 13688993 12891797 12119152 11412086 10609663 9738033 8862057
4568 8862057 8198097 7770809 7129978 6521909 6052675 5667398 5436177 5114869 4778937 4493901
4558 4493901 4283887 4055241 3817734 3623023 3399866 3156120 3149092 3172190 2978689 2857060
4548 2857060 2724368 2700047 2549499 2423541 2278555 2204421 2171804 2138378 2107677 2041629 1915214
4537 1915214 1891990 1845344 1803772 1829743 1859882 1671501 1527188 1449373 1424547 1479222 1383866
4526 1383866 1343130 1337713 1223008 1215536 1218205 1283298 1210403 1055992 954133 1034846 1038200 1022744
4514 1022744 1025144 953276 1031063 957153 902936 973757 910250 847804 863077 879558 826687 871038
4502 871038 902928 790098 780401 736284 723892 659085 765919 769892 559109 545547 571312
4491 571312 734633 691771 596557 528720 500952 513106 464018 447579 406606 471425 414649
4480 414649 441401 423568 416588 404707 430231 404486 432475 408376 341810 357977 407360 395596
4468 395596 435463 435134 347070 419367 352334 364805 396183 348533 265744 266072 301841 308212 353731
4455 353731 321128 315741 323084 301960 317047 330870 242403 238779 231091 171738 232271 253627
4443 253627 317774 327047 344226 246040 282692 301670 250808 302555 335924 258346 203172 312515
4431 312515 173713 246485 291760 225138 160930 180953 125012 151773 119525 96806 72996
4420 72996 112559 202573 48583 -7195 73374 156499 132907 46643 92017 174305 153509 206112
4408 206112 128410 170175 212111 228290 235188 81593 162625 228611 229883 183421 167416 129002
4396 129002 139978 244872 144377 177473 190714 197532 116739 97531 202167 215774 194919
4385 194919 117240 113263 126688 114654 100861 128009 78492 -9246 -22530 43689 60989 86679
4373 86679 42533 -39476 32946 74403 -4147 17091 137733 227530 105860 97380 150477 234662
4361 234662 273342 312524 306647 183147 98726 116289 289369 230392 148326 150120 164995 121273
4349 121273 74102 61901 72069 11090 61995 113145 64352 77004 79292 111673 112060 55184
4337 55184 73225 81554 75436 21213 113101 40622 133246 81421 -64797 -9298 -43181 46531
4325 46531 102740 63911 74146 124371 157734 87701 96238 49692 22547 89211 -71134 -62202
4313 -62202 -43207 69712 69990 20929 13764 33948 165574 73703 63347 132314 -6295 -1815
4301 -1815 104080 83808 65477 112639 141188 86565 106277 194879 121991 94834 104345 81763
4289 81763 126952 9959 107359 133103 103829 122984 83414 138962 203453 199502 261586 210851
4277 210851 176856 131254 90484 222343 207091 146002 151696 195356 135932 128558 198065 246978
4265 246978 215536 147706 165713 158470 147405 136401 60795 19873 55430 183328 168622 171348
4253 171348 178640 148950 178929 162529 162485 154781 154420 146746 82356 7170 26561 57583 61652
4240 61652 111168 114197 81219 61213 37540 40272 86759 163874 170823 134056 213727 137776
4228 137776 128444 154417 189863 165629 78521 6567 -25916 42951 187611 198278 160032 16042
4216 16042 134047 140442 135102 230803 349067 496148 461591 404151 354872 317390 396615 277824
4204 277824 141133 127629 105142 181150 98202 100437 30043 106369 69052 112233 36484 25026
4192 25026 48672 31130 125837 94930 61810 26264 -33214 -5785 1087 86542 69944 70703
4180 70703 21873 -32082 53657 130418 45021 45368 69502 71564 36929 -18902 13370 -7892
4168 -7892 30204 34965 20743 31183 63170 -55096 -48817 -21283 -32800 13637 73500 -23958
4156 -23958 -22267 51578 -101557 -99303 -137101 -110181 -18477 86666 155738 15451 -43628 -6697
4144 -6697 -79818 7405 -58004 -33489 -156 -20574 -11008 -20663 56526 47972 -67160 -128316
4132 -128316 -49008 -23316 1903 41453 67352 -52310 63690 214205 269282 170970 193947
4121 193947 108133 28320 65063 31589 -59999 33203 -9239 -77425 -126104 -75014 7777 33097
4109 33097 58858 110717 99813 137617 124552 135557 38531 72545 100315 34724 -44615 -90519
4097 -90519 24281 -55540 -162523 -85215 -32059 -41114 5081 71151 27222 3283 58653 54967
4085 54967 100529 41717 -33970 -25947 -12613 -132334 -141984 -50386 22259 12906 -6030 54777
4073 54777 -2589 -74382 118605 14551 -30766 -79217 -71404 -25222 38404 -18933 -27710 30638
4061 30638 67499 11903 -27366 -57824 -111247 44492 27278 -66404 -111196 -45793 137607
4050 137607 44262 101378 107801 74308 6516 -92822 -133780 30659 91930 46045 -89488
4039 -89488 -30178 116907 100246 48206 102477 58862 16956 -38809 -28381 106091 53845
4028 53845 45184 19084 -84397 -23814 1683 -5293 26870 -46194 -44553 59999 55972 -136260
4016 -136260 -41833 -22554 9455 -88252 -24048 65690 461 18192 -47889 -10543 -15014 -71949
4004 -71949 -65263 -55870 26092 19019 -23925 -11781 11320 -18677 -35430 -9075 -9578 36848 -25231
3991 -25231 -31147 -25441 -92359 -28915 -34640 84871 64558 83263 1282 -43847 -62024 -18825
3979 -18825 -64328 -61331 -111949 -67949 -90749 -37697 31519 9853 -20406 -64490 -68174 -74960
3967 -74960 19754 108511 38938 77655 110868 34442 -60613 -72589 10746 16824 62174 46562
3955 46562 -27397 -12386 -62207 26593 156272 187671 65194 -5656 -21241 39009 -2402
3944 -2402 15301 17797 -25448 -71364 -55161 -10364 -73965 -534 -9291 28682 -20832 99165
3932 99165 172858 140085 27748 16092 104022 150123 31681 44332 27193 79683 24508
3921 24508 8196 57792 60559 37385 29424 33968 95545 66169 35894 29084 76802 12253 80717
3908 80717 23691 -39249 -507 44188 -59609 -54325 -28997 31854 199357 120800 56581 51189
3896 51189 -15900 -36706 23710 -65324 -76130 -33068 -82126 3170 36720 7556 -30757 -73042
3884 -73042 28287 50197 -9003 22169 27267 88015 32201 -101436 69974 63589 -48025
3873 -48025 -88205 -10344 141186 69521 -36960 34570 35601 -2414 34348 37952 62011 73534
3861 73534 17428 13179 -13321 14751 6194 19485 -36117 -65013 -128304 1562 122024 -46640
3849 -46640 -43396 -139354 -148120 -78475 -21846 -2978 -65608 -54608 22041 61037 -1089 -17996
3837 -17996 -70692 33224 58857 45038 1844 499 22542 -53658 -39296 -3748 -30693 -15555
3825 -15555 -63822 -17056 -70198 -108760 -51503 -41483 65058 153108 82958 112510 229086
3814 229086 110155 -13940 13067 56727 130743 98070 -34887 -79729 -30954 13741 -45910
3803 -45910 -26382 -8501 -3552 33886 -28771 37532 -4236 41261 114307 38391 -2879 -20021
3791 -20021 -120345 -28593 8132 159806 194150 174458 111646 46026 85308 67638 115836
3780 115836 81332 142744 37672 27616 79804 195251 67939 16614 -12559 -52457 -110313
3769 -110313 -171665 -67498 -21544 -61054 -49985 -38480 30051 101206 141196 27316 -5905
3758 -5905 4775 44854 20104 -29433 -11729 82529 53581 -47386 8344 20261 185798 150504
3746 150504 139477 51563 -25088 102568 64967 -100043 -81630 16503 28502 19908 -73159
3735 -73159 -6118 60116 39099 5508 -13358 -48684 -19972 -78003 12181 548 43280 17826
3723 17826 -137114 -43766 -47518 -25257 -49689 75038 83512 -69420 -16521 -48179 -73461 -8155
3711 -8155 -70986 -126586 -88829 7122 62958 120205 92963 39557 -22076 52467 85762 85398
3699 85398 45398 31835 -18057 83322 94483 14539 23721 24523 78623 83003 132509 61973
3687 61973 -4060 35493 63656 54034 42272 -34994 83972 99721 97942 46361 76270 93710
3675 93710 116632 212808 146943 149579 43680 100812 140415 84160 110205 75039 72868 64786
3663 64786 42664 126796 145171 77094 130774 123244 25046 71137 84206 39788 132826 228323
3651 228323 161158 29951 27257 38923 78529 24280 25453 102413 158616 109535 107997 99335
3639 99335 40554 220985 204928 145095 132193 184377 113931 58937 41869 126995 196889 72000
3627 72000 43738 120890 200294 180678 232081 236723 198938 186927 297850 199125 227674 221116
3615 221116 254740 319162 302012 341632 323768 303528 278444 256061 218974 294450 287453 344736
3603 344736 296869 360693 352270 405039 308229 319957 321672 289832 234073 229711 260219 268090
3591 268090 282708 281115 202656 197274 297717 345922 375294 337169 341450 296361 469987 456163
3579 456163 484694 491416 415890 382845 517182 510005 414770 339348 329402 407512 385673 357104
3567 357104 421777 455031 444169 395696 257024 292515 416809 374047 426109 470909 488997
3556 488997 539059 523761 506530 449869 493923 384760 443645 662358 598700 605105 640693
3545 640693 718140 727182 608877 480897 495209 525729 496677 503251 553234 578245 417345
3534 417345 489996 592149 553328 570996 582979 543717 462773 551154 542835 485130 428161 426377
3522 426377 449599 363937 417497 395265 361907 383940 374301 451965 543827 475640 498643 577115
3510 577115 490227 349647 376106 411410 357761 338941 395436 414213 356805 335286 273480
3499 273480 365004 409681 405893 389955 309731 372501 385629 413457 395674 440708 404708 338675
3487 338675 382499 379126 455748 459375 371108 267067 340485 436674 499933 389975 411031 473840
3475 473840 377412 430827 496880 449962 414671 354218 323331 343881 419824 415612 304951 362130
3463 362130 360472 385436 481026 368215 279037 336570 343033 346228 327363 249709 211943 389216
3451 389216 427675 413268 368668 372898 427931 386345 345456 396071 484635 390018 356709 355761
3439 355761 312747 288171 365440 447817 451945 509668 441514 501539 442349 439924 390227 355152
3427 355152 419031 435856 385733 438966 406529 389659 435665 373142 382355 330493 241129 227961
3415 227961 267577 284409 302954 262583 212507 220219 268201 248105 206581 110867 177729 293130
3403 293130 250106 259494 265555 152869 82306 160950 211230 302689 268344 282150 317376 353489
3391 353489 344426 294988 284395 240250 333122 191737 127137 106497 161997 188077 212486 115020
3379 115020 106798 137171 120834 107423 175231 176888 193373 290881 287211 188979 94743 167155
3367 167155 311728 312272 269693 288556 274371 287998 290816 386320 315055 220097 290151 320340
3355 320340 363518 333111 274891 266944 289941 270922 202185 95481 189427 175402 140019 156846
3343 156846 214749 271719 117813 88136 160407 111074 54182 131480 143480 75577 139389
3332 139389 111472 92396 162092 138639 118417 71171 28919 119481 73217 18082 -31724 -49990
3320 -49990 20991 29460 129492 132518 17524 -8322 -59370 -38342 64867 15735 -58 55578
3308 55578 80229 127450 176598 196671 194702 164982 186673 149154 274204 153141 21933
3297 21933 55963 94329 50225 20242 84514 56400 13222 91062 16558 12630 3476 23178
3285 23178 24050 6069 -79463 -96806 -46624 -153267 -139319 -159748 -81485 -48667 -43632 79859
3273 79859 79599 134264 105526 34116 50050 15014 -59694 15621 17405 -14155 67384 149529
3261 149529 27569 -31249 -56516 99333 54295 68112 149535 95007 50686 -18103 70907
3250 70907 55770 139390 96893 14685 60609 75949 8295 14840 88291 65783 41779 45490
3238 45490 -66223 -59045 -133362 -43136 34698 84618 122328 193280 110079 109029 85428 38993
3226 38993 85405 108636 36043 30641 79361 126977 202123 37457 -59316 -23840 11672 41733
3214 41733 13798 -16594 44672 -28500 -102057 -15145 31834 -5035 58993 179893 119402 135379
3202 135379 187357 38986 888 5270 86762 167878 52675 -27180 -86480 12383 158786
3191 158786 149378 118682 80664 64522 23874 14237 4992 81211 161319 108807 90636 47719
3179 47719 76441 122685 180014 227695 257508 97588 147332 121396 140099 137044 98529 64606
3167 64606 139926 220614 222042 166370 113600 81715 110001 95514 16798 192348 191592 206985
3155 206985 60364 36588 96577 141574 212022 196332 131634 296083 376157 423466 367974
3144 367974 293785 276234 304895 235164 254426 337708 427977 461442 455783 464543 514945 528525
3132 528525 583161 587260 646922 696751 674353 601373 586989 685225 599606 539507 542218 481520
3120 481520 397362 397584 412082 504232 543435 570471 548767 443251 493038 491116 470009 545943
3108 545943 623630 632050 575162 669838 695770 680577 816130 900950 877408 971716 1063817 1082618
3096 1082618 989706 928974 914734 871764 664048 666929 648700 534280 425334 428081 499642
3085 499642 598052 504351 452630 506976 520161 505755 347615 394139 442735 397818 461229
3074 461229 439860 440875 390192 404606 425694 421378 521899 506630 458530 443021 553902 513405
3062 513405 530412 424940 394518 326526 349346 325909 310291 331397 246402 239773 249362 303773
3050 303773 307848 207662 122170 223705 213908 199827 151352 98247 30603 143684 163001
3039 163001 121359 51850 62813 42135 73257 79849 -40113 -26074 15836 18785 -11221 47829
3027 47829 14917 30556 57256 88531 466 -10853 38939 81015 -80059 -80670 62577 106156
3015 106156 93752 110269 -13012 -94119 -68395 -30856 11367 842 -51213 -81192 -33328
3004 -33328 -35111 -87129 -121418 -78209 -62872 -71758 -44581 -36431 -55354 -122479 -186281 -33707
2992 -33707 28969 -23361 -44082 -31927 -33669 -84180 11765 17664 -50376 -53283 -8228 2464
2980 2464 106887 161819 -64171 -54396 -49823 81564 57908 22787 8085 66872 -43716 -11250
2968 -11250 57103 -47015 44248 98568 64053 49892 86040 98837 122002 15186 -89922
2957 -89922 -117388 -106603 36803 23798 25850 54567 17161 85108 57481 21204 16626 12335
2945 12335 -79974 -66682 37908 23362 -33364 -4975 7345 15664 -76628 57066 85354 3103
2933 3103 55502 48432 105423 -1905 14852 -4017 -11945 -27050 -23732 24609 -119070 -144174
2921 -144174 -108713 30169 68266 -5075 -92298 -82065 -88178 -38496 -52541 -103841 -14270 -30614
2909 -30614 -18941 -18986 -13670 77080 75198 29150 -24975 -89485 -37919 1312 -27198 5055 -1699
2896 -1699 -88892 -34536 -34226 -71606 -69862 -48398 -6619 44910 166338 18313 -76433 -121819
2884 -121819 -144326 -147856 -33762 -70906 -30283 93448 34641 -41765 -36658 -128359 -15239
2873 -15239 -3283 -103861 -24619 -24113 -44965 21959 89727 178534 89677 72725 179316 61757
2861 61757 71782 26745 -11516 -256 77171 30680 -14287 88874 31456 32659 60444 -8790
2849 -8790 -69396 -23384 55171 16158 -7907 5349 22808 66327 97840 35446 129771 96802
2837 96802 58699 -24284 -115623 -91310 -51658 -86721 -13059 -20951 -2908 -132946 -91358 -37232
2825 -37232 -58153 -65883 -87563 -168441 -89667 -77606 -46453 68591 6891 -67760 -96223 -53076
2813 -53076 -66925 -63797 38228 12714 3206 22099 55374 83361 42304 -22125 -66959 -75715
2801 -75715 -75571 -70749 -10460 100009 82817 -3293 40966 12053 -47480 -7941 -662 95100
2789 95100 85457 50248 87562 14293 -76277 -20756 -51421 -53475 44418 67720 36070 36937 5310
2776 5310 -40479 -63654 13982 9197 -14706 -34133 -5753 -28497 -20143 -59300 -100107 -66703
2764 -66703 -40929 -58464 -58126 -87347 -2375 29730 30059 -74187 -52469 -37960 9436 -27969
2752 -27969 -59305 18083 61416 10653 61399 70599 -1125 -53102 45390 59670 31136 -9148
2740 -9148 40941 75009 -66302 -52986 -25792 -70593 6678 10460 60942 84963 56920 49476
2728 49476 79820 76530 59231 -27099 -77259 -33455 -68053 -85115 -138291 -91695 -93399 -11355
2716 -11355 10994 -4877 33314 62807 -116501 -55798 -28409 -51153 -55220 -125091 -12877 41152
2704 41152 25312 -121625 -189503 -55121 25004 36966 42487 92323 54208 10552 -36867 -82058
2692 -82058 -90494 -167502 -87395 -34959 17168 15297 -38317 -35525 -84207 24942 -42472 6
2680 6 -58033 27081 -706 -68537 -27333 -2636 15586 -4381 -26006 -3928 -40315 -25138 9838
2667 9838 4264 18441 -24224 -67638 -33108 -10600 -37170 -15809 19162 -73376 -53914 54101
2655 54101 -7538 -45538 64839 111734 174136 17426 49994 62244 44494 88767 -4940
2644 -4940 -44221 -25911 6692 27914 81602 45653 113407 149143 42563 1891 7960 -87078
2632 -87078 -76001 -19321 -66946 -114595 -4274 98780 96219 36716 -25414 -43938 -14978 -20170
2620 -20170 -10829 3828 -56302 -100877 -81193 -170053 -137012 -165655 -133087 -43678 29532 161427
2608 161427 163920 -53694 -72047 -47211 -54518 -48717 -73234 26989 -32501 -38838 -169368 -149926
2596 -149926 -65258 -55195 -17023 -79403 -63037 -76152 -26164 1496 90877 -42613 57727
2585 57727 117185 61908 -56430 -61890 2751 12430 96967 36033 107211 120853 98971 20242
2573 20242 -106264 29109 16342 105691 27914 -8987 17017 32249 121724 54145 64548
2562 64548 68874 -40991 -51145 -134254 -23805 38683 -16440 38702 37522 99480 -542 -88740
2550 -88740 -113775 -59700 36272 43379 56384 -31254 -91075 -77295 -62022 23316 24650 10019
2538 10019 -50338 -66032 -89192 -70787 -91461 -112719 -136364 -155655 -86759 -12024 69989 52082
2526 52082 -83122 -38772 -7173 9315 12802 105925 94385 62219 7093 82690 29799 7003
2514 7003 -10950 -46774 2246 -104028 -31694 31087 28497 1104 7100 21001 -82384 -55739
2502 -55739 -3435 7986 -7547 -57560 -19436 -42090 5101 11079 51211 16791 -13196 -18694
2490 -18694 -8808 21452 -51839 -38678 -562 -112199 -97238 -58192 -31732 71134 91710 39507
2478 39507 40331 9715 -30855 -73731 -34249 10423 -54073 51168 46438 -28812 -114419 -14205
2466 -14205 -101446 -115605 1007 39194 37205 54233 -55017 -156444 -99527 -81761 -43326
2455 -43326 -108579 -37056 29328 -19076 -3525 21444 27862 -61487 -169380 -211271 -20966 -82690
2443 -82690 -128 27781 -11644 -36407 -42851 -61754 -22404 56596 -51813 -61001 27088 -3549
2431 -3549 -96756 -13804 -36890 27907 79118 74853 87915 -3682 -18650 5348 46338 33169
2419 33169 110245 59949 -13892 72553 -26160 8440 3763 -1661 89230 139204 54280 -21674
2407 -21674 25767 167023 121925 52010 -52660 -71061 -48531 -47993 -58604 8366 -98732 -147438
2395 -147438 -105304 -81583 -128280 -126656 -88720 -50469 20640 105110 70481 12219 17232 -50065
2383 -50065 13020 -6756 -35690 23415 76791 141320 10264 20442 -8162 -46521 -45730 49740
2371 49740 68015 29023 46491 69533 44935 -46293 1806 8568 38036 -20730 -79732 -131245
2359 -131245 -113224 -129393 -189246 -131210 -104542 -31131 -41660 -125747 -86369 -27912 -88587 -92589
2347 -92589 14021 -2062 -23469 74216 -13457 -48460 13954 -128687 -13970 -203 -10022
2336 -10022 12911 19520 -84055 -91258 -95067 -91248 -37318 -86916 -36630 -96937 -83261 10266
2324 10266 2792 3550 39591 33594 -57530 81288 29290 4811 36000 -43269 47281 32390
2312 32390 -8818 -110852 -123170 -87694 -65713 -132435 -39628 -9708 73405 -71860 -132431
2301 -132431 56486 73917 -17054 -8348 -79310 7790 173119 120228 68498 -33112 -139
2290 -139 11891 4442 -90681 -75813 -90759 -60038 -22984 -54614 -90068 -88319 -84839 -53334 -62923
2277 -62923 -144535 -96575 -1982 6596 1550 -67148 -15950 -32543 20693 35115 -11715 -44527
2265 -44527 4204 15319 62598 33079 -32545 33173 -18895 -49268 3009 -23675 7218 -89234
2253 -89234 -43064 -42717 7175 37034 -69144 -104580 -41659 44744 10065 41973 39409 42910
2241 42910 24592 24081 65528 17610 -65320 -36185 -37957 -52445 -141993 -48398 -38880 -36095 6460
2228 6460 55753 3238 36482 58318 59634 28355 15473 -56827 -100868 -138591 -84512 -4080
2216 -4080 -117249 -58271 -93941 -124778 -61286 -49235 -50188 -31767 -16301 40234 -11057 -52455
2204 -52455 -79599 -35062 21506 -20213 -74133 -95179 -75980 23529 35935 20927 -4661 -13421
2192 -13421 -78191 -113283 -35091 -1344 58296 131606 110848 129010 63849 45899 -17679 -60731
2180 -60731 28749 36648 10165 -15950 71910 51920 46433 -41892 46203 -19305 -58468 -159249
2168 -159249 -85446 36447 126708 46996 -30796 -45797 -4766 57554 97271 77650 20
2157 20 -12609 -76287 -106014 -22896 -57364 -9215 28942 30722 44195 -90416 -52907 -46559 -83835
2144 -83835 -39671 8474 19075 15539 -88903 -75393 -55460 6213 -91297 -45439 -25445 43569
2132 43569 -18883 -54229 -86151 -130149 -38810 -62785 -66101 -21943 -28280 -108087 -124461 -127905
2120 -127905 -12085 -52987 23686 130159 10554 -48071 4611 26529 -1763 65702 -3067
2109 -3067 928 -53782 -133557 -107797 -84065 -96903 -41647 -12086 -35222 -39644 -11149 59926
2097 59926 97102 13062 -153206 -81496 32758 44163 -60056 -42211 63927 67468 17123
2086 17123 -52573 -57385 -71891 -60620 1056 22786 20988 53875 64303 -517 -8731 -23886
2074 -23886 -172301 -112834 -67908 -4686 -61049 -18033 33160 81895 5665 -44527 -28643 127246
2062 127246 217551 13342 -59275 -67790 -136560 -123309 -102711 -136225 -30220 -22864 90980
2051 90980 113956 78425 78732 34189 -82831 -157256 -42753 32107 32467 40822 -21639 -38715
2039 -38715 -56023 15429 -46607 13669 -33937 -78348 -46721 -39279 -124799 -95135 -54173 -21875
2027 -21875 20939 21501 74246 113455 18551 -12112 14577 64064 100919 26913 -77758 -155648
2015 -155648 -93052 -15201 53577 -15388 58030 162721 51087 -68716 -94650 -154890 -105548
2004 -105548 -82494 -79843 -37403 -30507 9313 60443 -18708 -66847 53202 7819 1359 -22502
1992 -22502 -21577 -34464 -84352 -42444 -75837 18564 -30366 31517 -19411 -137591 -80486 -73573
1980 -73573 -37158 -41844 -20565 -37028 -11386 -100493 -159286 -40124 -159972 -189476 -162963 -41462
1968 -41462 -29427 -43426 38639 -119695 -121678 -40086 -38329 48503 75693 109190 2619 -55277
1956 -55277 -47454 -42321 -61820 -5444 -1905 -74827 -115425 -34380 2289 55834 94068 50867
1944 50867 -1000 22627 31311 -45764 14913 92546 48493 30802 50545 55832 32802 16022
1932 16022 43286 -14492 -33487 -20407 -61283 -71762 -24767 -78880 -74507 -73457 -111449 -104818
1920 -104818 -46972 -26570 -19169 5936 58121 -22982 -69131 -47681 24369 -38730 -31601 8752
1908 8752 -62682 -108489 -51959 -108333 -54916 -116815 -586 19302 -1480 68570 99686 88240
1896 88240 -37844 -21164 -74176 -161539 -167878 1617 13182 -23035 34224 137358 67391
1885 67391 -6125 -45600 -63258 -65514 45797 77971 85313 56267 66039 -52006 -72827 -58612
1873 -58612 -166468 -56167 41039 43609 17408 89800 47918 5614 116977 138024 -28039
1862 -28039 -27046 5239 64502 115967 112364 56211 40242 106068 55758 -12965 4494 30168
1850 30168 -15578 -22530 -39164 -167245 -81895 -78038 -54746 -116535 -36078 53849 36873 -26300
1838 -26300 -110194 -71339 -79960 -79507 -60929 61948 122449 58155 90670 82587 103421 390
1826 390 -43471 -42393 -110978 -114431 -59931 123418 37445 18823 -3694 -49491 29463 -44855
1814 -44855 -57474 40751 2173 -104531 -54717 34876 -19183 11004 -50076 26609 22350 51957
1802 51957 -67061 -96543 -124968 31226 42631 -2996 66277 63516 6201 -56136 -52239 -33538
1790 -33538 -56397 -95316 -110594 -78202 -2240 17148 2488 -90713 -57136 47049 133188 90830
1778 90830 24399 23324 61896 90676 115298 -18839 -52144 -2012 -60290 -113214 -21614 -39901
1766 -39901 -94813 -124913 -174451 -38958 -51087 -100547 -8034 15213 -20910 -52459 -58661 35967
1754 35967 -9318 -20537 -96264 -49436 56462 64644 19359 -83212 -130385 -72632 -87418 51828
1742 51828 81317 8657 -97078 -136201 -98955 -105365 54751 37817 3276 9781 61603 64707
1730 64707 48158 -14125 65530 23805 -12173 -153401 -177579 -65385 -74001 -85293 -143712 -147280
1718 -147280 -137234 -177632 -88987 -64524 -49541 -101230 -38035 18361 -37263 -92825 38283
1707 38283 96769 89780 97337 85184 90077 -31170 -138684 2056 -1803 -53900 13301 18860
1695 18860 -38179 -75139 -109616 -146093 -190456 -93705 163 -10628 12864 42720 68331 23436
1683 23436 -21669 -70022 -91053 -119932 -62698 -12799 63837 6423 -77507 -34084 -23429 -52009
1671 -52009 -129393 -133390 -110521 -92720 14421 69184 25384 -58238 -5293 47407 58931 29938
1659 29938 86980 16579 -90606 -53915 -25206 -48576 -146009 -77243 -48156 -115153 -75836 -123098
1647 -123098 -102704 -49763 -7029 -4712 -42845 68169 40516 -113888 -71320 -60387 -121256
1636 -121256 -126707 -122891 -50847 8420 27092 5917 72967 34568 -8549 -40089 -48113 -52447
1624 -52447 -72823 -24336 56630 116301 87907 -33344 42307 76907 -106245 71255 81551
1613 81551 2554 -46801 -16883 20569 50174 -12708 -56931 -44627 -58406 -75030 -55483 -3384
1601 -3384 90254 101440 16322 8697 -39596 12276 -3394 5540 -21267 -104482 -100568 -62104 -12182
1588 -12182 -13543 2739 -26999 -85528 -48336 -19940 -45121 -2364 -83492 25606 89656 8336
1576 8336 62979 80065 68962 -72623 -109459 -59616 -34196 -6277 36978 225260 196685 53807
1564 53807 -26623 -87840 -14855 4064 32016 62738 2920 -158667 -222745 -135102 -31448
1553 -31448 -1744 -118857 -52613 39696 22159 24624 -81941 -56135 26906 41839 18039 6538
1541 6538 28266 -9624 92227 8266 -30761 -73400 -127279 2066 28334 22026 31444 -78938
1529 -78938 -86210 -47863 -28745 29874 92709 21006 -104549 -65723 -14455 8427 -116741 -169404
1517 -169404 -192300 -142078 -113976 -86476 -53581 -76237 -17729 72053 74693 31711 51035 60037
1505 60037 -36336 23557 39821 92401 85013 -20178 -3847 -30803 -84356 -82667 -130560 -80514
1493 -80514 38885 88678 48754 -67821 -18017 10403 -78799 -86016 -109105 -36506 -13980 46359
1481 46359 -65152 -95633 -16742 59662 39456 -31255 13014 39907 38816 -72821 -180037
1470 -180037 -122373 -63683 -14148 34240 44544 22111 12846 -12593 34733 85080 18350 14295
1458 14295 -54073 525 53406 70671 16116 25907 -122935 -158895 -137999 -25928 -61480 -35217
1446 -35217 -12253 -81113 -83231 -138078 -94305 -91193 -86742 -102381 -102216 -65582 -27159 3988 8107
1433 8107 -73820 -82962 11794 29918 -83209 -26855 -49209 8968 75813 54332 -21517 86897
1421 86897 53682 10570 65812 -23988 -58910 -114585 -50519 -33051 -41178 7 71087 56349
1409 56349 53905 14005 53736 134654 72840 46672 18813 -90606 -87352 -39223 -84319 -71380
1397 -71380 -97718 -102806 -53681 -62287 73814 30800 -110791 -144943 -74854 -59107 -72589 7206
1385 7206 -70307 -130105 -135346 -42741 9013 72064 68184 96652 81412 77800 -26434 -51850
1373 -51850 -90742 -161176 -129649 -122545 -8193 -25672 -14264 -17948 10524 16095 -21048 72479
1361 72479 168186 142344 116428 63041 -13804 -21078 110370 -19871 -35604 88541 36118
1350 36118 33225 44220 -24619 -66465 -171977 -161826 -48455 12627 -22232 -41976 -29508 -24629
1338 -24629 -40045 -12265 41301 7372 -921 -69213 -139681 10888 22671 31623 32146 26536 -8631
1325 -8631 -72506 -34677 -54581 -32743 9792 -83471 -45209 68003 20537 8934 151476 110717
1313 110717 58116 6264 51148 69131 -63741 -46134 -17826 -34839 59958 1655 -14644
1302 -14644 16914 -35159 27479 6638 -47122 -20126 -50167 -754 129949 122474 84748 -55362
1290 -55362 -41431 -51937 -15463 -4692 9337 27609 1091 -106881 -31684 50760 -13354 -16597
1278 -16597 -3927 -8667 -46040 -67710 -88901 -63949 3888 45534 68876 21852 -16399 2006
1266 2006 31895 -51291 6567 -50556 -96956 -15971 77678 38181 66943 -6360 -11751 -26912
1254 -26912 22764 -51229 -59479 -74836 -48751 4733 -43858 -32914 -20444 -37531 -6532 -1010
1242 -1010 40680 98085 107815 79863 -30842 -10781 46872 45301 29476 -10940 42868 50496
1230 50496 256 -16160 34746 131021 47180 -9464 -12517 -19285 -74172 -91900 -13786 -27408
1218 -27408 -44617 -83486 -136486 -80941 -157405 17743 143490 141260 59009 660 -42588 -45848
1206 -45848 -66182 -11278 -9964 9763 -52728 -6499 15840 35934 9897 3449 81725 58681
1194 58681 -17895 15315 -4874 -66376 32493 27812 16346 -11419 -21785 137984 76617 35402
1182 35402 -21176 -1400 -543 -13121 -14341 -57818 -23222 -40779 -66175 1056 48061 97965
1170 97965 164226 147049 119068 61684 -17970 -27297 -4837 -811 75057 48773 32409 64913
1158 64913 7069 -20117 -6795 79643 60178 36215 -26563 -63317 30100 26340 19142 -23836
1146 -23836 -70982 -63571 -5428 30404 67962 48927 52634 42351 15101 -7414 -49709 -112774
1134 -112774 -34633 -83607 -63972 -73796 20247 74171 4191 24898 55063 66408 81799 113730
1122 113730 80878 35849 35598 49247 48461 117853 83353 58486 30020 -10356 31881 32291 27601
1109 27601 6427 -117982 -146118 -90567 -68084 -1015 -20123 -50022 -79172 -58357 -66809 -26881
1097 -26881 108051 -73338 -96733 25063 60012 46461 -8704 -27953 -24966 -94952 -37589
1086 -37589 45132 -40920 -49145 36645 40764 67339 75590 88336 108580 93678 65236 45591
1074 45591 34797 89232 208383 72322 18638 9587 14684 68639 77793 24586 61309 93538
1062 93538 64123 49380 132814 109823 137648 180782 159267 68082 22524 17386 -7039 516
1050 516 41086 79617 93741 116923 51776 24866 39879 46188 120558 40926 12674 -24255
1038 -24255 -82201 -31299 -33673 -92547 -74378 9488 45377 72652 -25484 -45367 -13698 -67296
1026 -67296 -62739 -52629 -34459 44310 90802 -27008 -126526 -65066 25814 -63202 -85219 -46490
1014 -46490 -30646 -7795 -36796 4296 -35540 42246 36292 25449 -10384 -20328 35991 28775
1002 28775 2723 -26862 -3314 32897 -53554 -86510 -22263 74979 78521 55696 37201 15248
990 15248 43756 27924 10635 -7903 -23700 -77778 -37832 12577 6608 89074 24487 99965
978 99965 189001 41379 -35856 74497 46723 71962 123714 67806 100030 77580 155561 873
966 873 -80271 -29736 40283 68047 90829 68600 21485 -15843 51829 117137 22405 58646
954 58646 90495 27456 -59471 4347 4200 44688 46338 86198 -27685 -63308 -62260 75062
942 75062 116227 39467 7463 71318 79257 70830 46962 57888 95237 80638 -12143 -130105
930 -130105 -96903 -75322 -107236 -111862 -52627 -23190 43345 88895 110537 -275 -77603 37623
918 37623 62233 -35640 -92263 -58641 29373 79096 35687 -40829 41900 72196 103780 34294
906 34294 90643 69403 119003 49778 -38721 5134 50859 -48498 8928 137608 77957 59853
894 59853 47439 30692 52282 59031 120101 125002 -35058 27289 2793 66414 -56300 -70947
882 -70947 78158 31920 37272 -93862 -106494 -88759 -115448 -39274 -32536 -32085 25544 32552 35896
869 35896 78237 54442 -6014 18693 -1589 22208 -17892 -40675 12482 39053 -54967 -73841
857 -73841 15881 45642 67152 -31379 -108450 -56864 -71425 44430 44085 65681 85236 59968
845 59968 167018 102141 51479 108190 60475 68883 24815 -14325 17348 -15614 11517 -38171
833 -38171 -66390 13721 36859 -14473 4358 16173 -154523 -178958 1687 40898 -16361 -74654
821 -74654 -42511 9025 35351 78312 64033 80298 24801 -24860 14075 49735 41867 15352
809 15352 62017 48865 12583 -25501 63989 -29402 -61423 -123955 -82486 -40657 -131296 -75934
797 -75934 -18107 18772 -34910 -37993 2318 -31772 -57938 39955 30893 -58397 4113 -8839
785 -8839 35652 14390 91834 79803 93260 33873 33145 78959 -3088 48438 -44288 25699 139330
772 139330 140072 43476 28671 26830 65982 45543 66671 135771 234160 157546 67374 12214
760 12214 -70370 -18054 -6808 -23412 -82608 -27881 -7424 -96496 -138638 -30168 -33666 -528
748 -528 65969 51895 87136 44047 -65974 4136 5589 -19734 87568 125471 114137 141741
736 141741 31963 37065 9869 -43762 -654 -45370 48129 -2249 -70989 -30959 25254 64251
724 64251 557 82662 127688 8525 -67022 19829 93426 5809 -31322 -39865 -52053 -61685
712 -61685 -10203 31138 49127 -25017 -90998 -101442 -93742 -4319 -66859 -194866 -130288 -43764
700 -43764 21693 69933 123665 70975 -28994 -51116 24789 79508 52514 -38848 -10634 -39607
688 -39607 -70802 5328 120008 101105 17283 -5146 99907 58050 57708 51256 -21399 141780
676 141780 140182 40458 72385 79697 121393 95638 122799 116725 65864 18685 -38937 127084
664 127084 141491 19690 -54648 -42021 44524 55980 44691 153191 153732 73815 -18565 87999
652 87999 93867 60025 -37630 -40373 66456 165881 83743 52735 54915 -1755 74922 4887
640 4887 -57391 -63199 -58447 -68322 -88508 -28259 -14972 -36317 68162 53821 18861 41114 7874
627 7874 33255 -86319 -60485 34099 -33846 -39861 34413 99457 -3859 52593 -25381 5693
615 5693 62105 17996 81138 163220 106830 96140 8028 -22334 84972 91502 -1070 10806
603 10806 -18082 -89828 -25298 -32139 -1368 -35097 -34728 -58217 -66241 -77725 -19701 -32437 -100465
590 -100465 -55561 -9653 61039 129114 -22549 -58640 -30887 30976 -14150 -74071 -112477 -76442
578 -76442 52339 26926 41689 -60558 -21072 29806 -118544 -191497 -221979 -143046 -90422
567 -90422 -150209 -164116 -152831 -139246 -99523 -60541 -115999 -48323 72487 -67500 -13388 -38681
555 -38681 -87780 30675 911 2040 -67941 28630 22814 17296 63464 120951 128924 29207 3886
542 3886 20379 10069 -36917 -44513 -12308 -54516 -33382 32678 -89057 -85291 -21610 92048
530 92048 115827 -16880 -79779 -56708 31647 31302 -19023 43842 28599 -94900 -82052 -56847
518 -56847 18527 33119 -18464 24946 57741 17660 -3151 -67136 -129088 -52250 -4312 14005
506 14005 -11586 6490 -103894 -51888 -104323 -82699 -36892 -42226 -296 -57819 -22790 51446
494 51446 45426 -57651 32780 89864 120435 27752 -87362 -102165 -27373 -9713 -59170 11224
482 11224 -37987 -72985 -27747 -15962 -119249 -90959 -84540 -81965 -48206 -63495 -28579 -39643
470 -39643 36153 1393 20873 65025 -12137 -914 49959 114104 82973 59261 73767 -30984
458 -30984 -8785 -7843 14643 25777 63390 55089 -6032 53289 109641 50749 20167 48467 26433
445 26433 -57287 28490 18748 6849 24148 108357 128119 76730 60338 -14676 -27380 4760
433 4760 22836 92623 105003 99415 117313 52021 43075 99486 63609 108933 32454 -64260 -60586
420 -60586 -3870 554 82792 144900 27994 94886 75315 94426 140121 138465 113208 -5028
408 -5028 -113413 -27522 10502 66036 25157 47681 -25242 -23828 6780 68193 73543 -8133
396 -8133 53332 89389 37214 5642 48760 -39594 -30363 44597 111096 86204 82544 65549 31165
383 31165 7885 -11031 -47217 -42853 -67102 -107375 -48705 -80899 -26763 -8594 -38650 -55187
371 -55187 -23602 -81170 -128699 -81423 -39990 -30267 159690 106008 56963 -71760 -95578 -101576
359 -101576 -28272 79970 9528 56976 46339 6178 -44831 -123726 -95128 -39811 -54715 43736
347 43736 45893 -16475 -9578 -68106 -83279 34707 34117 16041 -24870 65656 12803 -36258 30325
334 30325 -15607 -5859 26543 97171 107859 91001 109785 88194 6946 25297 102810 31360
322 31360 37715 173332 151322 83668 60858 -56590 -35179 -27709 -14552 57356 5402 2657
310 2657 143930 133616 86186 83299 -33875 -94483 -27586 26090 35893 12841 -15146 4819
298 4819 -42252 -45790 -19734 -61264 4983 -36085 -72325 -79170 31348 -39030 28553 20719 77811
285 77811 114557 30716 7511 116755 41358 -19445 23633 -34704 -6427 20182 -7827 69175
273 69175 80678 -65581 -102413 -138863 -140543 -88886 3794 22789 69518 59978 -20451 -2088
261 -2088 40876 22257 -56098 -78400 -81315 -69055 17564 -35700 55823 -41274 -73578 -60603
249 -60603 32411 7502 -78228 9024 -45022 -72674 41289 -5446 -78362 -4141 -23733 -44161
237 -44161 -25515 -27276 -17144 53544 44492 40615 -19903 3386 46977 106948 101503 88246 -5886
224 -5886 31817 88985 72798 69010 -98982 -14064 36063 102616 164724 59149 80671 58097
212 58097 -12139 45007 36900 38001 3915 23833 -65954 33646 -70104 -112376 15821 -37188
200 -37188 -65898 -9828 -85897 -87753 7425 47659 -93869 -79428 -84190 -59342 58918 30704
188 30704 8772 -54898 38547 -49187 -29994 -1041 -66879 48651 10638 8745 -170 -42969
176 -42969 -16187 21038 98545 120840 51091 -17844 -68932 10526 33005 30621 97407 7668
164 7668 -108142 -132979 -63008 -21440 -46019 -45137 -84190 -29844 36650 29029 135437 54837
152 54837 76246 38899 59325 76340 82576 71718 15728 -57800 -19332 59978 53054 859
140 859 18336 20237 -33877 -45004 -31338 -99674 -97179 -57500 -22831 8881 55885 87117 29025
127 29025 37071 93085 45241 -72736 11966 33905 95653 86865 131629 158557 113821 58095
115 58095 -108646 -10789 76583 63756 11030 -20899 19755 50271 65331 85104 23658 -48759
103 -48759 -72275 -54499 -102562 -80602 15176 59883 19567 2540 24882 61025 64800 15674
91 15674 -10541 -66379 -80281 -36553 -59021 -38176 10294 9997 -43952 -71173 -62979 16544 50960
78 50960 -15726 -21370 -14241 2223 12109 -10349 9164 -17553 11587 23065 48968 41373 -22092
65 -22092 16735 14654 23844 49052 -28777 -56603 37014 30577 39644 24057 -13123 21925 24011
52 24011 7746 43610 -29075 -30517 3197 3059 -35215 -102737 -123240 -10800 22807 44271 20399
39 20399 44949 18760 21349 16132 39086 112039 26351 -40653 -31006 -24546 -53048 -19031 7572
26 7572 -29612 -107907 -44311 -12793 -19308 39348 26162 25952 101778 72534 15425 -11392 20974
13 20974 34814 -49360 -18883 -12131 11 54749 29618 10515 7575 9764 7826 -14874 51537
0 51537
$$ Imaginary data points
##PAGE= N=2
##DATA TABLE= (X++(I..I)), XYDATA
16383 -314962 -301583 -238518 -225169 -253975 -149563 -212803 -253237 -256410 -176722 -160986 -184060
16372 -184060 -264261 -248755 -212787 -191753 -185242 -184279 -141448 -141943 -92531 -103863 -166849 -84986
16360 -84986 -62915 -63467 -87454 -131362 -139696 -157282 -143703 -113275 -153106 -137479 -101345 -81364
16348 -81364 -209931 -179535 -42732 -78110 -139020 -44088 60741 82491 21428 11653 -10752
16337 -10752 -65624 -31132 44073 46115 23194 -12638 -40699 -14301 34135 51874 54765 137486
16325 137486 69751 113719 142028 161857 196432 127854 105544 14294 12306 25194 77718 61296
16313 61296 41434 55165 140171 179053 121289 151148 96881 156280 96362 122764 156011 124495
16301 124495 190795 259506 253208 212874 247477 245199 223483 303101 247275 162695 154331 167298
16289 167298 231231 298442 264740 248088 245724 265992 196161 212550 305723 312212 225338 248291
16277 248291 252891 351580 384013 325257 355444 303933 272146 277612 328897 368907 352009 383678
16265 383678 411614 266634 225388 274775 299543 311469 301275 251574 274744 336405 420465
16254 420465 466925 472195 424191 430715 473276 444902 433275 553995 478101 391421 431112 412321
16242 412321 363837 442215 442399 413098 336236 412660 475539 367048 441331 501953 483629 497467
16230 497467 446222 498862 507836 451044 487241 557532 591834 525373 504884 495496 624466 522669
16218 522669 500116 481835 413636 427318 522365 522665 524068 606593 558149 471993 471917 458466 562958
16205 562958 580596 514438 553623 545380 558978 471581 489297 529068 492918 498007 460427 438440
16193 438440 514937 476286 522392 472516 448810 555412 606910 584255 553758 672495 583579
16182 583579 509735 557589 554634 613104 592752 606116 606898 621724 544780 600324 622546 658969
16170 658969 695056 599175 555577 548207 601416 626861 580768 546802 542971 617516 638338 657120
16158 657120 705537 675934 702850 629202 529072 538448 640946 511944 602314 692599 617426
16147 617426 509131 603259 560171 620975 625541 549268 573628 589849 632353 580976 572886 588772
16135 588772 688583 641360 546258 533523 645395 737731 665979 620948 656114 706881 712817
16124 712817 690708 618537 663401 626831 626238 621760 601505 617783 662563 695664 708779 707858
16112 707858 586373 633159 578743 588410 546648 585684 640406 658749 628829 667956 693135
16101 693135 711659 688841 614264 644773 702221 729485 653918 595196 665509 631652 626993 636414
16089 636414 718736 690511 709875 761566 761589 744549 537294 391540 496265 540391 575991
16078 575991 635490 605409 622079 594940 531978 555314 635502 559914 538990 594392 616527
16067 616527 536317 611108 660777 671128 758101 745368 707296 628009 702569 708831 635532 649906
16055 649906 628815 709504 742296 643152 614135 590446 626366 618609 702732 754038 705699 640231
16043 640231 662313 673104 695698 660590 564698 677109 672224 671897 659198 636362 614586 671006
16031 671006 668698 657897 621478 642863 654514 728207 655862 662231 648954 677313 625214 585602
16019 585602 699928 749497 729216 625265 659085 656972 734115 780858 675083 713635 746517
16008 746517 731368 734962 703049 657539 627736 649381 613778 709519 721280 650394 609993 518583
15996 518583 646904 713140 687283 684809 603345 519719 488349 580729 679446 682452 568101
15985 568101 549120 657429 625093 624084 748297 679625 669603 515666 555435 688184 640739
15974 640739 622227 636225 662643 596689 575034 629479 683693 677655 669827 689925 624624 653829
15962 653829 752225 833460 751841 719476 596312 550974 673982 714660 680390 605614 627429
15951 627429 620145 624246 730981 747115 709480 694586 621621 583000 653421 695218 707936 709139
15939 709139 694233 704608 604978 686000 781258 689313 602934 610955 633644 695820 647386 774755
15927 774755 760423 724765 706144 683842 768022 747120 669702 551164 566629 628395 705092
15916 705092 733736 704836 651533 577132 628802 615711 709745 739068 785392 754395 697585
15905 697585 719705 716314 705319 687840 664168 705196 761023 790399 674574 666007 722837 698488
15893 698488 654639 663465 626244 587993 673231 672110 733364 686207 615118 749292 715832 626758
15881 626758 714264 698985 736361 667964 564419 579964 725910 752519 689120 666417 578914
15870 578914 665997 672669 632085 615589 623779 724903 679600 726372 719185 728297 775978 819029
15858 819029 711548 736520 696841 774854 612568 608305 622501 584540 653401 661796 695575
15847 695575 741803 727426 622420 653083 641154 593980 594812 649487 757280 756599 747768 735439
15835 735439 700633 693250 688917 745504 640151 738481 667791 529896 661625 617274 618182 622370
15823 622370 627459 710515 764770 697850 693553 678045 604075 667165 730505 718447 635355 521106
$$ [...]
##END NTUPLES=NMR SPECTRUM
##END=
