##TITLE=1H_EC-3317(2)nky
 DMSO
 8 sc, 
 7.3.2024
##JCAMPDX= 6.0         $$ Bruker NMR JCAMP-DX V2.0
##DATA TYPE= NMR SPECTRUM
##DATA CLASS= NTUPLES
##ORIGIN= UXNMR, Bruker Analytische Messtechnik GmbH
##OWNER= root
$$ XWIN-NMR		Version 3.5
$$ Thu Mar  7 14:12:24 2024 Russian Standard Time (UT+4h)  she@DPX200
##.OBSERVE FREQUENCY= 200.1313
##.OBSERVE NUCLEUS= ^1H
##.ACQUISITION MODE= SIMULTANEOUS
##.ACQUISITION SCHEME= undefined
##.AVERAGES= 8
##.DIGITISER RES= 18
##SPECTROMETER/DATA SYSTEM= spect
##.PULSE SEQUENCE= zg30
##.SOLVENT NAME= DMSO
##.SHIFT REFERENCE= (INTERNAL, DMSO, 0, 15.4593)
##AUDIT TRAIL= $$ (NUMBER, WHEN, WHO, WHERE, WHAT)
$$ ##TITLE= Audit trail, XWIN-NMR		Version 3.5
$$ ##JCAMPDX= 5.01
$$ ##ORIGIN= Bruker BioSpin GmbH
$$ ##OWNER= she
$$ F:/spectra/data/she/nmr/H-F/1/pdata/1/auditp.txt
$$ ##AUDIT TRAIL=  $$ (NUMBER, WHEN, WHO, WHERE, WHAT)
(   1,<2024-03-07 14:11:23.03 +0400>,<she>,<DPX200>,
      <created by zg, POWCHK disabled, PULCHK disabled
       configuration hash MD5:
       00 E9 B6 7A A2 85 ED C7 34 08 36 98 17 FE 4E 26
       data hash MD5: 16K
       73 F0 F9 0C 93 1E 20 DF 0A F3 8E 18 D2 F0 56 C6>)
(   2,<2024-03-07 14:11:25.15 +0400>,<she>,<DPX200>,
      <Start of raw data processing
       efp BC_mod = 2 LB = 0.24 FT_mod = 6 PKNL = 1 PHC0 = -24946.64 PHC1 = 10.18731 SI = 16K 
       data hash MD5: 16K
       D0 87 C2 C8 35 0D 79 45 FC DA 52 1F 15 FE A0 52>)
(   3,<2024-03-07 14:11:39.76 +0400>,<she>,<DPX200>,
      <pk PHC0 = -1.977769 PHC1 = 3 
       data hash MD5: 16K
       75 4A 6D 5E D6 7A 07 D4 85 D1 21 55 7B 0B 69 1E>)
(   4,<2024-03-07 14:11:43.01 +0400>,<she>,<DPX200>,
      <abs ABSG = 5 
       data hash MD5: 16K
       3F 1E AB 78 43 0D BA 33 90 62 EB 8B 9C 49 3C A4>)
$$ ##END=
$$ 
$$ hash MD5
$$ 4D 75 96 5D C1 A1 2B F9 B1 4F 05 C3 F3 37 BB 75
##$RELAX= 
##$RELAX= 
##$RELAX= 
##$RELAX= 
##$RELAX= 
##$RELAX= 
$$ Bruker specific parameters
$$ --------------------------
##$DU= <F:/spectra>
##$EXPNO= 1
##$NAME= <H-F>
##$PROCNO= 1
##$TYPE= <nmr>
##$USER= <she>
##$AMP= (0..31)
100 100 100 100 100 100 100 100 100 100 100 100 100 100 100 100 100 100 
100 100 100 100 100 100 100 100 100 100 100 100 100 100 
##$AQSEQ= 0
##$AQ_mod= 1
##$AUNM= <au_zg>
##$AUTOPOS= <>
##$BF1= 200.13
##$BF2= 200.13
##$BF3= 200.13
##$BF4= 200.13
##$BF5= 200.13
##$BF6= 200.13
##$BF7= 200.13
##$BF8= 200.13
##$BYTORDA= 1
##$CFDGTYP= 0
##$CFRGTYP= 5
##$CHEMSTR= <none>
##$CNST= (0..31)
1 1 145 1 1 1 1 1 1 1 1 1 1 1 1 1 1 1 1 1 1 1 1 1 1 1 1 1 1 1 1 1 
##$CPDPRG= <>
##$CPDPRG1= <>
##$CPDPRG2= <>
##$CPDPRG3= <>
##$CPDPRG4= <mlev>
##$CPDPRG5= <mlev>
##$CPDPRG6= <mlev>
##$CPDPRG7= <mlev>
##$CPDPRG8= <mlev>
##$CPDPRGB= <>
##$CPDPRGT= <>
##$D= (0..31)
0 1.2 0 0 0 0 0 0 0 0.06 0 0.03 0 0 0 0 0.0002 0 0 0 0 0 0 0 0 0 0 0 0 
0 0 0 
##$DATE= 1709806282
##$DBL= (0..7)
120 120 120 120 120 120 120 120 
##$DBP= (0..7)
150 150 150 150 150 150 150 150 
##$DBP07= 0
##$DBPNAM0= <>
##$DBPNAM1= <>
##$DBPNAM2= <>
##$DBPNAM3= <>
##$DBPNAM4= <>
##$DBPNAM5= <>
$$ [...]
##$SUBNAM3= <"">
##$SUBNAM4= <"">
##$SUBNAM5= <"">
##$SUBNAM6= <"">
##$SUBNAM7= <"">
##$SUBNAM8= <"">
##$SUBNAM9= <"">
##$SW= 18.0517328524113
##$SWIBOX= (0..15)
0 0 2 0 0 0 0 0 0 0 0 0 0 0 0 0 
##$SW_h= 3612.71676300578
##$TD= 16384
##$TD0= 1
##$TE= 0
##$TE2= 300
##$TE3= 300
##$TEG= 300
##$TL= (0..7)
0 120 120 120 120 120 120 120 
##$TP= (0..7)
150 150 150 150 150 150 150 150 
##$TP07= 0
##$TPNAME0= <>
##$TPNAME1= <>
##$TPNAME2= <>
##$TPNAME3= <>
##$TPNAME4= <>
##$TPNAME5= <>
##$TPNAME6= <>
##$TPNAME7= <>
##$TPOAL= (0..7)
0.5 0.5 0.5 0.5 0.5 0.5 0.5 0.5 
##$TPOFFS= (0..7)
0 0 0 0 0 0 0 0 
##$TUNHIN= 0
##$TUNHOUT= 0
##$TUNXOUT= 0
##$USERA1= <user>
##$USERA2= <user>
##$USERA3= <user>
##$USERA4= <user>
##$USERA5= <user>
##$V9= 5
##$VALIST= <valist>
##$VCLIST= <CCCCCCCCCCCCCCC>
##$VD= 0
##$VDLIST= <DDDDDDDDDDDDDDD>
##$VPLIST= <PPPPPPPPPPPPPPP>
##$VTLIST= <TTTTTTTTTTTTTTT>
##$WBST= 1024
##$WBSW= 4
##$XGAIN= (0..3)
0 0 0 0 
##$XL= 0
##$YL= 0
##$YMAX_a= 177610
##$YMIN_a= -243674
##$ZGOPTNS= <>
##$ZL1= 120
##$ZL2= 120
##$ZL3= 120
##$ZL4= 120
##$ABSF1= 15.45932
##$ABSF2= -2.592529
##$ABSG= 5
##$ABSL= 3
##$ALPHA= 0
##$AQORDER= 0
##$ASSFAC= 0
##$ASSFACI= 0
##$ASSFACX= 0
##$ASSWID= 0
##$AUNMP= <proc_1d>
##$AZFE= 0.1
##$AZFW= 0.1
##$BCFW= 0
##$BC_mod= 2
##$BYTORDP= 0
##$COROFFS= 0
##$CY= -3
##$DATMOD= 1
##$DC= 0
##$DFILT= <>
##$DTYPP= 0
##$F1P= 0
##$F2P= 0
##$FCOR= 1
##$FTSIZE= 16384
##$FT_mod= 6
##$GAMMA= 0
##$GB= 0
##$INTBC= 1
##$INTSCL= 3.70164e-10
##$ISEN= 128
##$LB= 0.24
##$LEV0= 0
##$LPBIN= 0
##$MAXI= 10000
##$MC2= 0
##$MEAN= 0
##$ME_mod= 0
##$MI= 1.114404
##$NCOEF= 0
##$NC_proc= -7
##$NLEV= 6
##$NOISF1= 3.799351
##$NOISF2= 2.8
##$NSP= 0
##$NTH_PI= 0
##$NZP= 0
##$OFFSET= 15.45932
##$PC= 1
##$PHC0= -24948.62
##$PHC1= 13.18731
##$PH_mod= 1
##$PKNL= yes
##$PPARMOD= 0
##$PSCAL= 0
##$PSIGN= 0
##$REVERSE= no
##$SF= 200.130012484459
##$SI= 16384
##$SIGF1= 3
##$SIGF2= 2
##$SINO= 5.538805
##$SIOLD= 16384
##$SREGLST= <1H.CDCl3>
##$SSB= 0
##$STSI= 16384
##$STSR= 0
##$SW_p= 3612.71676300578
##$SYMM= 0
##$S_DEV= 0
##$TDeff= 16384
##$TDoff= 0
##$TI= <>
##$TILT= no
##$TM1= 0
##$TM2= 0
##$TOPLEV= 0
##$USERP1= <user>
##$USERP2= <user>
##$USERP3= <user>
##$USERP4= <user>
##$USERP5= <user>
##$WDW= 1
##$XDIM= 16384
##$YMAX_p= 445793085
##$YMIN_p= -876983
$$ End of Bruker specific parameters
$$ ---------------------------------
##NTUPLES= NMR SPECTRUM
##VAR_NAME=  FREQUENCY,     SPECTRUM/REAL,   SPECTRUM/IMAG
##SYMBOL=    X,             R,               I
##VAR_TYPE=  INDEPENDENT,   DEPENDENT,       DEPENDENT
##VAR_FORM=  AFFN,          ASDF,            ASDF
##VAR_DIM=   16384,         16384,           16384
##UNITS=     HZ,            ARBITRARY UNITS, ARBITRARY UNITS
##FACTOR=    0.220516191357247, 1,           1
##FIRST=     3093.87391828201, 0,            0
##LAST=      -518.842844723771, 0,           0
##MIN=       -518.842844723771, -876983,     0
##MAX=       3093.87391828201, 445793085,    0
$$ Real data points
##PAGE= N=1
##DATA TABLE= (X++(R..R)), XYDATA
$$ [...]
13988 204515 93084 -51826 -216746 -122422 -312835 -223365 -441415 -77266 117119 72936
13978 72936 -151340 -273179 -299004 -304409 -272040 -180580 186021 72464 -77420 80918 166694
13967 166694 109039 -181234 -141154 239759 140927 -65800 -4758 79624 -65823 -126771 -67639
13956 -67639 213245 -19063 28174 159616 192927 195345 -419630 -343332 -154823 -172866 -120617
13945 -120617 4379 89277 -15648 48670 -204142 -437981 -462745 -81665 112782 93275
13935 93275 205410 18707 -59343 190746 40446 40952 71809 18782 8687 -52575 -158587
13924 -158587 -73766 154514 18146 351767 32078 -414907 -188311 -337491 -155528 17848
13914 17848 -62039 -162626 -243428 -397451 -183235 -102788 -373875 -50104 -79605 153854
13904 153854 112640 142541 272797 116081 268351 151507 45365 190001 -191839 -88083
13894 -88083 154942 201939 302628 175048 -30549 55933 154082 41309 418179 352357
13884 352357 246093 -143319 -297666 -51832 28735 -152136 -125164 -320256 -635216 -530099
13874 -530099 -185827 -41035 -3109 307895 282299 41089 -12924 -27687 116838 144659
13864 144659 144234 165945 -51452 -184536 -63858 -185649 -314061 -354657 -204637 -21988
13854 -21988 -182 -133704 -108116 -257059 65309 372122 313133 164339 -51859 -230997
13844 -230997 -46844 200809 -178917 -435789 -326564 -233729 -242975 -36034 -2077 -289172
13834 -289172 -196356 112237 -68878 143333 267295 299038 149053 97900 152281 -28073
13824 -28073 1283 -215660 -255408 -106310 -285163 -67873 99231 135303 50719 87973 36100
13813 36100 -88159 -191153 -303159 30380 110236 -187736 49531 -321933 -466872 -326838
13803 -326838 -561121 -449556 -393243 -213969 -79820 -226107 -205540 27665 193174 -211912
13793 -211912 -27429 12372 169615 -82381 -161045 30972 -256963 -257499 -358983 -306854 -265292
13782 -265292 -44257 -292110 -312606 43664 -69286 -189002 -17252 -296254 -325551 -115666
13772 -115666 -124553 -333691 -259292 -177514 -436834 -485116 -348555 -204747 -55106 -297922
13762 -297922 -427116 -263952 -191253 -69772 193107 189966 213320 405832 80614 -298378
13752 -298378 -194919 -62538 -114613 -163041 47902 120082 3551 -144160 123211 415031
13742 415031 462991 47253 -170056 -219077 -108952 -21716 69100 86083 245495 99533
13732 99533 82796 -49738 -159724 30395 -16887 -131556 -424470 -114843 107947 182686
13722 182686 -59304 -180474 -525201 -324973 95955 -40577 -159696 114612 67005 261669
13712 261669 21852 76322 1938 -82179 -164663 -182526 125204 196757 324077 -13360 -48972
13701 -48972 -270307 -62880 168245 55796 35346 238470 133062 -14676 -255892 -261725
13691 -261725 -81841 277871 502169 356114 -142747 -8171 131686 -131539 -91366 -135208
13681 -135208 -439992 -425277 -70421 -64655 -98353 59789 -53182 -463100 -415539 -124640
13671 -124640 165310 -450951 -242642 -53549 -185653 64318 83833 9398 -45196 -92281
13661 -92281 -252568 -179068 -225678 -323904 -253357 -148296 -2225 74816 51149 281101 -789
13650 -789 -40402 156406 75584 -11490 -110948 171293 -49734 -65606 -13006 -189164 -207449
13639 -207449 10368 107410 -58283 170105 146364 42677 -74449 -57993 -18479 15267
13629 15267 41384 -58212 7007 29622 37300 -270148 -300740 -202378 -197079 -247750 -162391 -36469
13617 -36469 355965 204384 216908 60000 -321267 -74022 -103439 -55358 -182937 -197357
13607 -197357 -21862 29571 -204810 28304 -220375 -470838 -88020 159676 226062 -91804
13597 -91804 -273315 -197422 -120643 86787 -214505 -158873 10797 -60422 -24209 51057 -147905
13586 -147905 -347406 -212295 -71024 307076 59470 25495 54780 -81460 85973 17897
13576 17897 27584 -151666 -58575 4252 -49756 -102433 167955 350106 406767 147946 -286903
13565 -286903 -388014 -747274 -513119 -148020 -66620 -11919 15651 -248139 -183685 -116454
13555 -116454 -175363 -160089 -241060 -424498 -422562 -239092 23333 184564 342283 226452
13545 226452 -181946 -252836 -384635 -48258 47032 131150 435255 494337 362860 130167
13535 130167 -107697 -372769 -577601 -605566 -400678 -138942 -232342 -82136 -150710 -341861
13525 -341861 81752 90126 -191172 -259989 38075 -236572 -279241 -298485 -325041 -29746 -202569
13514 -202569 -175084 -29333 -261489 -182644 -9040 -38284 222475 88480 3633 -163383
13504 -163383 -168355 65231 251427 -70609 -79805 83319 -53260 -164695 -247838 -69464
13494 -69464 128386 295455 18077 221104 411649 324460 537304 790244 428820 66832
13484 66832 347006 360215 -104435 -271474 -109047 -243058 -443639 -246059 -25493 -96035
13474 -96035 23281 -47871 90946 48901 -209756 -316505 -272360 -137692 -345024 -352896 -144956
13463 -144956 209018 84873 -186754 -74661 -16053 -208514 -23938 -13484 -359644 -226033
13453 -226033 -60041 -82705 76259 76571 377073 131217 171053 121103 -240912 -159081 85330
13442 85330 129902 171836 270483 250875 26730 160163 -35687 -103926 -282539 -107819 -174364
13431 -174364 -464357 -245151 72093 27303 -422806 -105862 -207906 86444 74206 -136913
13421 -136913 -39687 93699 -210297 -65158 257143 374722 262251 535355 90738 75127
13411 75127 -39748 55463 78590 -173438 -10388 -166293 -184159 -86508 257883 148750
13401 148750 73394 -10998 153589 -114479 -8215 186264 201184 -21810 -127644 -25214
13391 -25214 -24331 -30314 -85071 -44135 -41098 -32234 -97806 19497 47982 55539 316492 100119
13379 100119 183561 46026 -103790 119983 -229048 -65811 -221011 -328515 175373 300512
13369 300512 -205054 -11201 -103886 90125 269832 62060 122796 257600 238182 150462
13359 150462 -229275 -182795 -228502 -42186 104044 -114259 -65972 -75424 -122849 -248528 -144296
13348 -144296 -120624 -138303 281547 321370 232399 135439 101760 269187 242689 322044 138010
13337 138010 -120477 -131232 151092 171124 234927 82661 -265267 -288984 -151899 -149553 -14254
13326 -14254 17153 253184 29480 -15733 -15581 88428 -269838 43524 93160 180139 141472
13315 141472 -147119 -108526 -211280 -192270 -12856 -118025 10120 123564 -73599 14044
13305 14044 12231 -71898 -40056 94757 286717 -35595 -121090 -27058 -95833 -91643 -228989
13294 -228989 -181606 92651 80488 -99565 -142047 -135240 56143 103891 2199 -93534 -173066
13283 -173066 -370017 -5919 240059 372650 305261 244451 152930 222204 12963 -331713
13273 -331713 -228343 -186639 -147237 42691 -125068 -73650 -138324 -23899 -180545 -230743
13263 -230743 26711 -32688 -240407 -182628 -59000 62642 4631 183220 -65304 -160090
13253 -160090 -65990 49932 -140217 -280652 68839 210251 2960 -341313 -239732 -298380
13243 -298380 93953 -265216 -499781 -264447 58522 -964 20231 90448 -106258 -752
13233 -752 -321052 -231608 45405 38058 -204799 -154265 41947 -33727 -132880 -135074 -363519
13222 -363519 -420159 -157151 -121207 -94242 -143173 -354208 -274318 -220981 -142162 -269986 -205899
13211 -205899 -52502 -40940 267581 221456 363010 141367 49088 -65766 -320199 -376576
13201 -376576 -151034 -179742 112503 2865 -408368 -586022 -228689 3712 -227043 -178574
13191 -178574 -61550 -82028 -109590 -254657 -116653 7751 -8609 -240805 -575432 -79331
13181 -79331 33322 5603 27567 -55171 -28864 178349 339840 185601 35332 -66284
13171 -66284 -42304 68521 -186406 199914 -112885 -43116 -250474 -576199 -276585 -345760
13161 -345760 -74892 -80238 -205764 -385134 -340557 89367 34438 242076 253623 220763 60107
13150 60107 129410 -68273 -123790 69968 -13521 -200635 -47357 170919 54345 246051
13140 246051 179476 165296 102466 -277182 -473629 -146940 -74898 -76856 -169008 47149 -8502
13129 -8502 -197744 9244 108308 244691 66475 -401581 -140336 -206190 -135298 130027
13119 130027 -26627 -275507 -140904 -67222 -136851 -64721 -124971 12706 79859 46461 -10467
13108 -10467 -206934 -92720 99874 306095 -19975 -205026 -168086 -303619 -336918 -225171
13098 -225171 -14551 -142773 -276665 232446 196549 146340 -69369 49666 -41668 151573
13088 151573 -173942 -354262 -206053 -435852 -383267 -197742 -59146 -436761 10450 216311
13078 216311 197960 128760 -46677 -61833 28075 -294649 -441090 -302295 -234687 -710
13068 -710 127205 -30596 193920 142899 116072 -43902 -35000 -93301 -46367 329274 239982
13057 239982 -37102 -133050 -70382 -25084 -23269 -222902 -509948 -568235 -152601 204872 193959
13046 193959 -230143 -324016 36641 11008 -216990 -389412 -236889 -140605 -257187 -226622
13036 -226622 163751 -100050 -74396 -117171 -30155 -238985 -333138 -313152 -287758 -265525 -481693
13025 -481693 -395651 -173714 -47493 -220945 -253093 -311183 -320521 -114212 -11270 -79736 -37474
13014 -37474 35196 112680 315311 204387 -242363 -155120 -69368 -315557 -248764 -451318 -470935
13003 -470935 -280383 124837 358893 61112 -72696 128508 397935 109974 -217384 -341661
12993 -341661 -193916 118211 -39151 45611 -38435 45543 -188638 -422612 -353881 -332171
12983 -332171 -131271 -33517 -27090 -482191 -560455 -315447 -94307 -169172 -133281 -305053 -262296
12972 -262296 -161151 137306 192913 -27783 -35436 122674 312725 143269 -59659 72754
12962 72754 -47861 185274 131674 108320 -143730 -179966 53411 210249 -82084 43373
12952 43373 -9108 -40280 -254134 -240802 -132233 -269299 -402842 -136781 -416232 -350258
12942 -350258 -234651 -621207 -345784 -102270 10796 -198399 75083 63928 -271962 -195667
12932 -195667 -2406 -81882 149013 -38683 37250 159870 196161 -59836 -498391 -281404
12922 -281404 -194126 -270830 9045 -163582 53501 -33888 -30771 84815 191827 -8681
12912 -8681 33628 316609 168511 -41752 99569 219006 215 115707 -127672 -419291
12902 -419291 -192711 -119604 -140934 -90763 -158818 -251609 51824 231886 -66376 -236294
12892 -236294 -255043 -165226 -185702 -153942 -120601 10216 -62735 -97953 11255 -104942 -129217
12881 -129217 -57382 85418 533232 215100 358492 230495 -5547 4191 -155025 -319738
12871 -319738 -338774 -454845 -386780 36557 -34631 -213289 -448906 -115965 265706 226074
12861 226074 -47308 170119 195393 130952 281704 287070 31365 96538 -99792 41299
12851 41299 253764 118545 -78728 -149712 -10942 180800 169033 266211 111744 -50931
12841 -50931 26176 135940 87072 37952 25221 -86199 -313429 -411652 -260228 3064 135025
12830 135025 -423981 -349638 -81054 -386151 -240859 -161877 -136529 -55588 157374 83347
12820 83347 -28637 -226922 -156834 -54199 -46751 137273 19986 -289408 -273329 57672
12810 57672 -28491 21488 -76275 -473644 -319665 -31741 100414 -134888 -235353 -6989
12800 -6989 -103052 -129798 -29607 28423 -103436 -60889 -180372 -285376 -444537 -73256 68369
12789 68369 -88286 -270114 -140846 222588 10913 -56958 -44119 277877 178986 61127
12779 61127 139169 15769 109957 -92245 -37411 -82567 9047 -124262 113624 -247940 -95432
12768 -95432 52922 274899 188715 73405 124609 177754 401799 547806 53686 70079
12758 70079 332304 8528 275988 34072 244907 347571 298815 82965 -100867 -278057
12748 -278057 -243997 56273 -29957 -146679 -335897 -274019 179433 214382 85042 -1811
12738 -1811 -4512 -109860 18609 240217 84409 -93238 -98237 -36424 226842 74483 166879
12727 166879 552553 317620 171797 34712 -245530 -440255 -211352 -372419 -469475 -176934
12717 -176934 -185152 -77004 -102316 -1275 63345 55702 -214931 22165 352473 242276 113841
12706 113841 -79152 132078 -68741 -132924 -368787 -38145 148113 -60127 -19916 176025
12696 176025 238521 -45948 -99744 89183 -41822 -246751 89532 -75270 -150992 -207200
12686 -207200 -252399 -206601 -550314 -756506 -160682 -38017 -32321 -248058 3085 -12763
12676 -12763 -333892 -80271 -79036 -1365 136781 -117373 -296326 -79212 -58064 -189428
12666 -189428 -229810 -226271 -119057 49452 330121 472422 179316 -65119 -357057 -459659
12656 -459659 -138860 18451 -64809 137190 130388 -150504 -45050 42268 262131 9153
12646 9153 -1105 155007 -24014 -149365 -103004 -448946 -338113 -395293 -207668 134478
12636 134478 105448 -89370 149290 138402 124908 509018 -90207 -358588 -194998 -119460
12626 -119460 -102331 -104608 -183755 -278614 -422900 -173725 -132260 -246027 -115133 -83691 -135381
12615 -135381 175719 72160 -119754 229525 482779 291379 503752 170904 -171428 -84971
12605 -84971 46582 -178700 -153989 -289938 -315721 -11873 -35033 1389 -67827 -170204 118297
12594 118297 184978 87167 601869 230689 -21251 200030 73002 44490 -140484 -797485
12584 -797485 -592004 -212609 69578 78662 141391 73118 21764 -19847 -60538 -117095 -103732
12573 -103732 -20625 123822 170341 19562 -119730 -264259 -151968 -198929 47654 115595
12563 115595 -68713 -234132 83136 203870 85166 -59495 158499 -60258 216920 291107
12553 291107 114734 233870 308146 197891 205575 -180346 191706 262571 101495 138121
12543 138121 193215 63103 182005 108093 73351 49628 -259798 -259711 -426191 -385621 -629499
12532 -629499 -227315 159794 6662 -79264 -16216 -178309 -182476 94228 182497 -142031
12522 -142031 -114213 -184958 -140343 6472 -12759 -122242 179186 66348 41544 -24382 86971
12511 86971 176441 90945 162462 37215 648 103651 65312 -208788 -164585 -330073 -253838
12500 -253838 -312460 -510212 -196372 -19773 -265048 -282801 -169762 -110955 147324 -45819
12490 -45819 -220465 -235896 -396160 -254310 -270227 -298343 -201843 -60287 115686 -4480
12480 -4480 37494 -296465 -104417 89345 156485 -287150 -253073 -318101 -210910 -215614 -291208
12469 -291208 40276 96492 197364 -248447 -315883 -407910 -625306 -381318 73570 -133893
12459 -133893 233722 314685 95152 377815 234730 127295 -269680 -228282 -202799 30713
12449 30713 -87357 -175877 94734 201079 124245 -169400 -172182 -320366 -268629 -368208 -334248
12438 -334248 -207970 -258678 -470492 -675945 -535723 -44046 20260 -343802 -313316 -160470
12428 -160470 -285064 -273337 -212858 -34317 -10426 -348412 -363086 87930 183175 164129 -106709
12417 -106709 28883 199000 293809 304383 20693 116668 -116776 -222439 61125 126759
12407 126759 57504 -63396 -225135 -372870 -301197 -247914 -163441 -221248 -409359 -362167 140204
12396 140204 82516 -34642 -87587 178399 289527 -56829 -332173 -9946 164016 85196
12386 85196 -26015 -259306 -144857 -72942 102314 12781 49411 137929 190456 57624 -71811
12375 -71811 -275877 -110828 45935 3675 -259158 241208 197238 344153 99332 -265086
12365 -265086 14811 -77273 23174 164036 142111 -28101 -119439 -369756 -91474 -42670
12355 -42670 182011 29683 -187165 -278988 -13942 89510 207425 376214 238171 329657
12345 329657 84083 383724 255448 -185766 -382310 -69338 234695 -252349 -460820 -2791
12335 -2791 220724 5867 125284 310814 294817 219427 -130458 -218041 -140806 -139548 -152007
12324 -152007 -100479 195743 197298 -123544 -126604 -164681 58928 349085 188805 344565 -70625
12313 -70625 -201443 -55784 -240984 -96088 253695 81041 -112179 -114681 -174543 -191405
12303 -191405 -207381 53328 108971 17442 -284825 -295049 -60619 -195709 -4420 214833
12293 214833 102565 -27848 -52526 -57323 -243207 15416 -80902 19297 31405 68925 178231
12282 178231 -9263 112460 -388081 -272839 -175145 -47175 116354 -71477 -93882 -127171
12272 -127171 -230577 -195869 -182082 -32954 100478 50708 -89547 -202242 -141669 -146379 -105411
12261 -105411 122612 44115 -46093 -227770 40034 -4113 -197251 -174700 -143226 109462
12251 109462 -17101 88560 110276 141855 45412 347669 171300 -332222 -109500 -373042
12241 -373042 -134316 -113228 -234005 122736 199648 104537 69792 119130 -8646 131679
12231 131679 79267 54282 -353948 -445884 -428860 -65294 368504 112689 34763 -303306
12221 -303306 -96514 76568 86706 223089 -74638 -263305 -181540 150673 -54206 105943
12211 105943 224822 162207 -348085 -317882 -81541 -204943 -273506 -201203 -217053 -67722
12201 -67722 -27270 -84111 -119379 -1169 44815 -5850 168700 64927 -54849 190014 185906
12190 185906 302364 125805 -236528 41976 244428 279819 100629 -35771 146578 233175
12180 233175 92840 61572 352439 391266 345575 232953 -131164 -104819 146432 394157
12170 394157 375232 185508 -4959 39198 -116945 70193 -1724 -131430 -24638 299088
12160 299088 423436 530638 95919 -55370 89045 74920 251378 251615 -10052 -142807
12150 -142807 -176479 -114321 -2057 -90395 -143427 -260439 -493622 159707 293104 85102
12140 85102 109792 -144688 -309566 -205723 -185445 -126588 -111949 11766 372748 301480 39609
12129 39609 -38014 76640 77834 -353703 -347568 -244101 -293925 -174630 -78982 46818 -162644
12118 -162644 -226386 -6064 410458 192898 106790 109300 -76167 -183081 -156435 -147440 -208708
12107 -208708 -6511 32507 -194716 -95365 14198 284508 175233 71506 86883 10897
12097 10897 -177318 -341594 -616354 -278891 -58340 19013 -138273 -51436 -166227 -355304
12087 -355304 52266 86495 401253 280891 29237 -36 -44054 76944 562145 413628
12077 413628 238544 2123 64703 76199 -160395 7148 72303 -192386 -259449 -149307
12067 -149307 -200314 122529 210296 -34114 -287572 -369515 -116879 -353097 -13867 95346
12057 95346 -42353 -271400 -331140 -266756 -217155 -198918 76784 62993 56179 195488 -87281
12046 -87281 177465 530155 563802 506595 414500 384375 234845 85809 122867 169840 86421
12035 86421 49707 65309 85368 141392 -109292 -10896 -141953 -307619 -172890 -28635 -61329
12024 -61329 57835 186144 127330 -177203 -183867 -168843 461952 190906 500 55959 340729
12013 340729 361920 188306 119598 -94160 44343 -45490 -179651 -140214 -258665 -257468 -295939
12002 -295939 -141356 -177832 -472192 -136705 -167319 -28565 61181 -112809 131942 -45415
11992 -45415 -199027 32024 -145946 43891 221995 327523 -13856 -193875 -178128 -106250
11982 -106250 178466 -36040 -103359 95383 202727 177404 73380 -227928 -153666 -19623
11972 -19623 -12925 99650 337101 283780 169743 331010 224634 270068 113873 274045
11962 274045 358762 130303 35638 173401 43949 205250 279107 -45873 -169104 -288422
11952 -288422 -196835 9348 -82107 -438218 -514362 -171584 36656 9363 -328580 -496157
11942 -496157 -350782 -202650 -2184 -165123 -219355 -518637 -447180 -204218 117282 9168
11932 9168 -313301 -205204 -52186 168421 290998 8386 30550 257948 48985 667
11922 667 2969 166532 -130071 -66806 239261 167503 -203088 -317536 -416373 -330224 -159234
11911 -159234 97308 20887 2449 309592 249192 212866 314125 453355 573542 242527
11901 242527 155143 136504 126588 164540 49472 -128387 89088 545843 119500 -167273
11891 -167273 -109438 -163900 13156 -154558 -56598 21857 -163275 -261666 24879 -31437 -94564
11880 -94564 10963 111826 223666 40670 -38474 98535 180452 -186464 -160465 66746
11870 66746 20842 -277570 -354983 -57499 168509 207787 269047 -248767 -373360 -200765
11860 -200765 -79299 48216 113180 117795 -120112 9688 167103 118630 43570 -128502
11850 -128502 26035 -73756 82982 120626 -10361 19035 93838 -87665 -222578 -91227
11840 -91227 167504 72471 -94141 -197600 -72269 63914 -43453 -85203 -236421 -281509
11830 -281509 -451980 -278252 -26468 -150304 -153385 -209399 -231986 -104123 41705 143902
11820 143902 26922 -89251 20779 215227 -19628 -133676 -284630 -133908 194875 60698
11810 60698 -128138 -353396 -269922 -270201 -269338 68930 229920 113572 318656 97914 -13212
11799 -13212 82099 -205000 -34351 132512 216104 208764 -3112 274617 392616 282340
11789 282340 -139555 -421348 -216290 -83673 -296122 -202568 -153445 -383781 -560238 -183095
11779 -183095 -29322 -105429 -161819 -270185 -57082 -69961 -132676 69944 144337 -59936
11769 -59936 108612 405577 -154954 -196116 51070 -89040 -378960 -189976 -81856 -140607
11759 -140607 13628 164529 86187 49328 335037 106385 217955 19175 136767 -87045
11749 -87045 29046 88355 -37628 -161211 -99819 -130281 -79021 -30860 -38490 -12480 32884
11738 32884 40276 27457 -409105 -244926 -104906 -63047 100656 4271 55677 273153 97420
11727 97420 176447 241202 -76148 -54683 -313692 -37426 153172 45769 50750 -118754 -276305
11716 -276305 -450381 -244413 -63210 -174502 -135872 -40322 74039 117665 30319 -262298
11706 -262298 -37475 394042 230107 59368 80786 141121 -38843 -247455 6193 -37267
11696 -37267 3449 152605 -48756 -121805 -207701 -299526 -8879 216081 -120958 -55198 -11787
11685 -11787 -6416 440763 212622 83662 -126483 -222842 266963 249583 175038 189242 67795
11674 67795 234711 547480 450679 329848 143665 -85630 -48946 -148914 3057 359615
11664 359615 353576 445111 227335 25637 186707 41249 122526 22659 143983 109479 -90641
11653 -90641 -102023 124559 -20569 73235 91000 109013 -42575 -53487 69103 101238 258311
11642 258311 158356 68339 200508 162380 306190 42424 -239195 -429612 -60577 9336
11632 9336 -209524 -6738 -161555 -101329 42468 161514 -92413 -266440 -198764 -95228
11622 -95228 157558 331582 127133 166136 320883 147890 -90377 -88727 -291596 37576
11612 37576 241388 -5819 116681 353839 97190 -32899 -93976 56065 359504 101282
11602 101282 129124 149127 78040 -17187 -164003 -242151 -183215 -226044 -115659 37495 -58807
11591 -58807 -37912 23772 24594 -158040 -98545 21734 127609 -46643 -193294 -48353 -130454
11580 -130454 55912 301134 218497 -214548 -209403 -202919 -35059 56429 107971 2177 -58038
11569 -58038 -466845 -197341 -184657 -140389 17802 74449 179536 330126 258981 -136276
11559 -136276 173847 158698 130310 49915 -120961 -89817 -73331 -342066 132668 28209
11549 28209 244600 241457 38878 -18974 112217 -91376 -73834 216604 327206 383669 704391
11538 704391 301057 -66315 243282 596197 125589 -13054 54184 -13491 131159 -173943
11528 -173943 -102964 324960 10810 -68077 10805 -126468 170037 346090 -131614 -58086
11518 -58086 -222753 -615689 -331291 -188600 -40132 198559 330048 81896 -203627 -286054
11508 -286054 -322620 -126578 -158502 -87737 167118 59102 31230 1070 -65561 -252919 -71347
11497 -71347 -181890 -358046 -220968 -149599 -119083 -1472 -164296 230254 364748 246495
11487 246495 489620 142450 140695 292257 216522 133002 188939 431969 160898 -72458
11477 -72458 -122341 135306 -18374 167740 -43249 87155 148506 185890 289346 279276
11467 279276 -20167 105756 293121 -49361 -86462 -75722 38546 -160990 82484 345723
11457 345723 400616 146015 118573 -145973 -10634 -101537 -168927 -175570 -287656 -25249 109533
11446 109533 29061 305760 467797 -46693 192037 75162 64975 65995 43184 66644 96901
11435 96901 314944 221282 6205 -32 -100309 239827 191890 217779 287988 268239 108180
11424 108180 7664 -42429 -6040 236372 245144 197151 234044 -8437 1484 -55373 -187636
11413 -187636 -196464 -76162 116532 -42563 -51715 -47158 -293424 -142103 413503 186085 22550
11402 22550 22530 26942 136926 127075 111348 75331 78351 -758 175436 29202 63289 -65994
11390 -65994 -36562 -21886 282991 462682 141743 371288 339483 331375 235924 53110 -6636
11379 -6636 -18894 135803 218380 241566 206299 266667 482949 189939 225277 -25760 72094
11368 72094 171589 207795 174195 235676 -157835 72918 159070 31567 -131366 -14260 -442011
11357 -442011 -208847 -93194 -153339 -175416 -177546 47900 -36081 -278629 -292977 66461 157457
11346 157457 130419 -247975 -369067 -122355 207134 250428 168547 201995 79422 30197
11336 30197 361717 192627 151937 -71983 -152704 -203000 16456 257467 201421 437561
11326 437561 272683 202662 359590 293442 353181 186059 -237901 -115552 11389 -8153
11316 -8153 24280 -402446 -78116 136213 -82222 67353 19015 29811 -14626 -56056 73227
11305 73227 70875 257485 165677 85214 -56521 -226974 -167736 -84430 -281582 -406795 -416879
11294 -416879 -91941 348538 65415 -278004 -122005 -107476 96415 105819 159156 219301
11284 219301 -254891 -156835 211768 204604 -56782 -34900 6688 129390 132094 462305 450153
11273 450153 382472 461636 156785 257588 377058 247639 265761 18314 -94778 167800
11263 167800 8565 -83496 -144283 -199224 -169475 -310217 -267699 -342504 -201334 242154 380045
11252 380045 487215 431083 278611 -122267 -282294 179093 27711 -83699 31822 -17980
11242 -17980 47473 34193 121073 161273 178933 119033 399754 443440 561223 344557 344217
11231 344217 173388 -50365 -35661 188297 -200276 -268326 -573939 -354114 -169110 -36200
11221 -36200 -85702 -95342 37795 -148031 -73841 88152 336251 230321 41488 193012
11211 193012 443515 216814 282170 34494 -111830 -184944 -76649 39640 174111 255132
11201 255132 31361 -205357 67378 -137709 -171114 315967 192122 137931 -11564 -172793
11191 -172793 291829 368232 157306 267012 299783 33112 321994 426313 459724 471515
11181 471515 220793 255044 506239 375073 489785 164330 -34576 -85233 -94671 -293547
11171 -293547 -243137 -77307 -68888 125226 194194 243536 285649 418066 339543 20445 197976
11160 197976 401440 123572 -126213 30734 155529 355911 364783 49295 -167485 -113995
11150 -113995 255522 276918 391321 350901 227638 204960 -59879 -125675 -198380 -106529 185617
11139 185617 146190 109560 49709 459445 293847 65428 186443 378687 18697 41831
11129 41831 218488 376520 453666 280599 310228 377709 415151 481609 375403 35138 24867
11118 24867 -64297 -60269 203983 163637 146275 -39378 -118892 -186617 -127658 -42526 36416
11107 36416 218858 76848 179294 311361 230787 81283 90517 130649 346690 14219
11097 14219 -96169 -133507 21369 -184414 79870 210793 368153 445696 286633 531255
11087 531255 154434 185610 465105 198905 -97234 391121 390824 586967 449379 157391
11077 157391 58969 157251 394727 -9938 68880 -11744 19277 -86840 115881 361369
11067 361369 285656 370741 278530 125697 43335 -183255 -196592 -234394 -142830 90385 114078
11056 114078 225545 410293 66116 -57990 -71603 -274260 3388 81721 -124870 419922
11046 419922 271957 39403 342438 209282 -9749 56632 -85539 -145713 75582 2044
11036 2044 121246 321240 331286 211956 175008 -111896 34069 459195 343332 -60088
11026 -60088 130276 289774 306032 -29733 -118601 15297 74283 128815 7827 -15752 2683
11015 2683 -46916 -32570 -229618 -71534 108937 89494 -261643 -214038 -79264 -52689 173991
11004 173991 50985 230406 653530 378420 185705 -5765 -152219 59236 226476 227463
10994 227463 366347 353671 329216 -177302 -66140 67014 220780 42170 -118148 111602
10984 111602 91305 207620 160816 173685 339498 -42431 125761 452093 355468 263937
10974 263937 351330 253454 434712 509843 407658 575356 670499 551765 190096 115033
10964 115033 -215580 -1366 -84667 302468 171383 92106 273138 484817 855674 822737
10954 822737 805181 513459 411551 419900 522103 219433 6903 -17811 101425 307307
10944 307307 228642 533305 393140 133511 -58574 101187 403680 202340 142766 45587
10934 45587 301841 411765 264819 -37971 -225858 8840 159416 -348 -263781 79855
10924 79855 324526 385644 83150 347 -286390 33950 340787 175048 -66738 66122
10914 66122 -47138 -49897 -90089 -11912 27896 101384 46064 70842 69095 199535 188427 -122461
10902 -122461 -67533 128785 168850 -3739 -110358 -272225 -177512 96949 286563 408754
10892 408754 65922 160587 11663 -141818 -44046 61560 127733 512389 485112 460420
10882 460420 523232 697141 523596 65166 165764 208514 152925 -39392 253308 168195
10872 168195 410971 489219 257781 301836 293894 384510 386127 -27569 255667 320397 234964
10861 234964 507351 622335 333553 257787 324016 334826 426850 289595 333061 422403 211506
10850 211506 154063 189793 244338 139419 142761 273427 443763 426305 175319 65126 -45704
10839 -45704 -131981 237989 380085 169831 329869 479487 248904 79227 98082 428836
10829 428836 365333 384845 263845 81080 92835 320146 300577 338620 257949 241220 130195
10818 130195 30532 187485 76077 -417434 49019 252955 276885 381971 114483 220556
10808 220556 266224 233936 142054 98834 391051 482090 409082 291477 310657 256306 666273
10797 666273 733706 598754 543288 648899 401959 148915 225310 34660 339359 385747
10787 385747 288747 345466 322239 191561 505065 472094 421847 44639 131933 453944 693383
10776 693383 600591 194209 207020 297282 480891 461600 415514 568622 491899 35898 81044
10765 81044 334729 400284 411192 297323 628466 764481 575950 436979 148794 237831
10755 237831 588502 565828 360317 319586 -29101 150229 386617 5054 194014 323529
10745 323529 165802 67089 -143016 38435 324703 68723 60693 -82255 302385 564906
10735 564906 557861 236853 161864 325388 273236 23822 53332 125634 120927 207409 323027
10724 323027 420227 532968 215352 208690 83206 76628 241476 414034 114366 -69899
10714 -69899 41771 71704 434081 468006 510151 333846 179191 120769 94820 50158 41240
10703 41240 379514 319277 334407 361183 165468 35385 325653 489791 76542 107674
10693 107674 141693 415906 639993 491652 700764 459857 198714 430514 461164 351513
10683 351513 177787 220076 256498 166630 35128 244585 343184 188310 -40664 59166
10673 59166 154534 353259 495254 462767 163181 -5950 341180 454232 462558 465648 159477
10662 159477 141625 160315 234184 40879 357000 564325 490335 444192 108575 161172 282822
10651 282822 419475 744586 466917 268204 306959 302734 142274 141763 654739 606386 514777
10640 514777 651543 549476 455063 304075 -38872 -11109 77516 208819 355482 201255
10630 201255 341487 571006 815508 922380 856579 571781 380732 610048 615806 382234
10620 382234 92947 384412 517269 65094 -91961 -95375 -21940 186433 305460 280887
10610 280887 25324 20283 102774 157404 -27488 133879 118094 402220 580694 754485
10600 754485 604094 165002 174199 65542 182285 203116 362068 486114 396282 160972
10590 160972 203066 98893 179205 459244 678696 676048 738792 422508 399700 422266 437813
10579 437813 373521 299386 265958 529214 481489 100231 141140 222760 255541 98132 136138
10568 136138 426796 687292 639668 395726 97451 321323 404746 298238 160127 273745
10558 273745 834326 377676 45334 230488 366932 671670 664789 166556 222142 249723
10548 249723 260248 69212 180426 254560 14880 448786 536137 665175 474097 365760
10538 365760 396117 213608 51108 173305 89949 330921 353311 298778 355043 289093 201991
10527 201991 295793 132279 261030 265472 233062 511491 356942 223378 387797 451968
10517 451968 389269 762387 814073 603415 374791 381442 519719 327124 186863 260348
10507 260348 355378 48287 256477 453841 414920 594314 421601 509749 535382 260634
10497 260634 211929 238029 145600 333349 855593 913178 640716 276320 76451 82052 405929
10486 405929 754304 337213 215358 161899 51057 153848 322179 286326 251948 345249
10476 345249 280365 441011 509816 608811 646276 458340 473316 556836 566805 210057 352980
10465 352980 310804 546235 236782 192033 365470 29898 449620 579727 467158 500573
10455 500573 561768 483562 810958 623979 485314 262825 510160 751665 834149 468692
10445 468692 802340 676907 383461 464398 346399 358178 604530 910874 837144 718034
10435 718034 218667 390421 579689 436608 166206 333931 307213 274761 500780 707212
10425 707212 269539 549521 661833 660495 862193 793642 546562 322089 575134 209435
10415 209435 249462 622457 531051 471553 215858 324777 411112 337902 582552 311011
10405 311011 52028 222672 505211 670848 378652 394477 349294 440130 423382 382733
10395 382733 368889 418180 425989 573547 765745 793449 758545 498369 488319 174881 220676
10384 220676 131399 370508 292942 419778 533954 543379 431631 462181 469562 635751 535410
10373 535410 586914 467234 232781 510170 477020 233843 331861 448453 161561 414155
10363 414155 655348 784154 344231 390049 504006 249015 569590 588187 433292 846779
10353 846779 563911 667297 499911 552071 779622 423532 532312 503139 630434 685458
10343 685458 501096 510434 790173 832449 547922 559703 440064 542365 579893 428679
10333 428679 408295 576998 597399 690934 627338 295876 350255 379335 193819 430591 772658
10322 772658 749089 605446 593960 312127 153311 171910 569751 468385 516212 481983
10312 481983 312154 555342 600675 575200 450999 374131 671905 645984 446738 524273
10302 524273 580293 508978 267527 645483 341809 390429 271346 134929 276086 360720
10292 360720 478768 521890 676043 595793 636189 653430 452465 546397 687563 706007 404619
10281 404619 369660 194426 214135 520387 490810 661431 700445 736580 925856 699842
10271 699842 654983 562649 223808 330712 561571 542543 521838 555248 560168 423406 466973
10260 466973 683042 841347 869710 664392 705221 682652 741314 824392 924974 920367 862161
10249 862161 957931 784995 795435 501379 233117 295102 438898 559239 457204 274663
10239 274663 510425 722266 502717 390954 276911 323685 545153 794943 686331 803207
10229 803207 853120 881394 851209 852988 664931 522704 123104 95140 264419 459985 863887
10218 863887 519726 675162 630186 610514 988687 1113011 799125 564974 871129 746288
10208 746288 610832 581784 414110 839464 816313 909026 781400 668941 805533 922649
10198 922649 944879 723212 670640 740780 342279 344123 686574 797365 620518 622442 755916
10187 755916 755058 647317 524057 373116 504720 594108 693529 1008718 946030 702743 470637
10176 470637 584314 658773 727793 813230 1071738 905795 745721 896297 968749 757746
10166 757746 867760 783400 833803 884546 672061 732181 836466 888575 842798 686274 927233
10155 927233 775018 733649 712288 738804 1055047 1134899 929346 734448 1023531 920892
10145 920892 812504 537090 663249 848383 709478 686984 796146 702446 306308 634497
10135 634497 677799 980033 833164 723689 817391 1034199 878805 732139 800694 780340
10125 780340 829038 947715 993464 674836 649690 774905 1008967 838717 1022704 969833
10115 969833 854280 909732 1019836 1097916 948206 1163871 1443464 1270134 1265482 951302
10105 951302 818408 991349 971383 776234 1037874 1298048 1467667 1356626 1185077 1508635
10095 1508635 1232966 1270071 1366590 1447662 1337916 961957 916057 1123549 1521524 1511228
10085 1511228 1337896 1322212 1528512 1519587 1497626 1413537 1381350 1491791 1681257 1836289
10075 1836289 1935994 1684031 1465198 1434637 1686295 1768939 1784391 1785980 1458566 1819734
10065 1819734 1641243 1938313 1977040 1909707 1749275 1718470 2108344 1949566 1768668 2036769
10055 2036769 1958577 1727018 1582390 1967963 2170532 2303478 2313287 2339751 2340875 2249567 2477163
10044 2477163 2457734 2564894 2551170 2580982 2606896 2638090 2759049 2843323 2753487 2977193 2873676
10033 2873676 2857659 2772192 2974205 3016659 3124336 3629458 3626665 3323241 3268487 3609987
10023 3609987 3943844 4073964 4051125 3735133 3917706 4354931 4346742 4280786 4282503 4292364 4330556
10012 4330556 4670597 4980693 4959062 5000546 4977091 5050279 5363920 5201061 5529770 5927057
10002 5927057 6037312 6338001 6384979 7045851 7201471 7420985 7742160 8181746 8469324 8861122
9992 8861122 9291349 9771386 10106267 10710902 11173574 12033335 12882412 13763778 14890108
9983 14890108 15878885 17439708 18908781 21058241 23337328 25825770 27945587 30051384
9975 30051384 31410949 31541067 31746561 31986508 31811836 31761215 31753697 31961958 31814948 30489081
9965 30489081 28444077 25845365 23243368 20885416 18409652 16454229 15370893 13868942
9957 13868942 12602201 11630535 10882997 10194349 9440219 8693952 8340797 7934480 7819968
9948 7819968 7088612 6547905 6545546 6393875 6143305 5817387 5558966 5303403 5413578 5221802
9938 5221802 4894099 4354847 4391075 4162915 3926595 3769988 3708316 3691519 3656949 3459465
9928 3459465 3307267 3206549 3174408 3152808 3422673 3349072 2976716 2805600 2821988 3082313
9918 3082313 3235934 2922958 2888572 2305407 2320691 2580992 2225101 2249363 2044490 2255363
9908 2255363 2551931 2507922 2573837 2381301 2565107 2065639 2475338 2393461 2030315 2187001
9898 2187001 1965358 2104548 1964948 2168913 2472628 2342974 2189960 2094907 1918397 1821935
9888 1821935 2026004 1913164 1858774 1853144 1767964 1924262 1945505 1829826 1508590 1570086 1626907
9877 1626907 1623855 1506381 1759508 1613011 1160320 1324537 1331152 1215295 1378170 1561844
9867 1561844 1581433 1448544 1550552 1442147 1365511 1486105 1583203 1476021 1659100 1450145
9857 1450145 1449020 1646191 1899392 1928507 1864143 1816621 1978924 1761311 1627736 1599318 1443467
9846 1443467 1506690 1471045 1378866 1198888 1321461 1240459 1365158 1280435 1209698 1309770 1261689
9835 1261689 1253913 1156567 1155551 1102501 1314147 1365474 1261067 1315670 1174039 1259117 1027867
9824 1027867 849998 913751 944945 919747 698722 700163 1132528 1284734 1157796 1187189 1183488
9813 1183488 1510501 1364771 1330569 985516 799961 1074360 1019802 1085288 1422647 1306435
9803 1306435 944103 1137358 1259327 1288665 1139442 1034838 937528 989574 1201920 1197641
9793 1197641 1242015 1193387 930114 869046 882336 979617 1113707 1496890 1451040 1396237 1001902
9782 1001902 747746 1122566 1010205 945723 972048 1251664 1119523 951746 1237129 1378575
9772 1378575 1193044 913412 881819 1016910 1117889 1200543 1221749 1157452 1179583 1155115 962792
9761 962792 1132378 869647 890239 1118210 1080826 1380201 1508832 1335915 1105387 1061116
9751 1061116 1315169 1373068 1144968 1104638 1237828 1349815 1399523 1483117 1366274 1406361
9741 1406361 1333531 1399379 1320310 1242152 1390935 1035754 1219257 1231770 1097649 1076703 1208160
9730 1208160 923861 966713 1122302 1061155 1244997 1350715 1379927 1257777 1108763 1005124
9720 1005124 1174088 1187134 1313424 1059236 1176740 1336021 1360198 1340179 1477946 1238992
9710 1238992 1198439 1262121 1454222 1422579 1680622 1587756 1491878 1341829 1264375 1209461 1091501
9699 1091501 1300587 1292462 1372543 1552526 1553260 1597800 1445141 1533647 1742844 1567887 1552582
9688 1552582 1175644 1331670 1304982 1391036 1366688 1313457 1479216 1182798 1087844 1150979 1230531
9677 1230531 1054368 917416 1035666 1336128 1634389 1530135 1340724 1232350 1091672 956453
9667 956453 898060 822778 935820 1316141 1507075 1714187 1217683 983698 1293410 959136
9657 959136 1185311 1369782 1292778 1565462 1778291 1551945 1461368 1191673 1184190 975132
9647 975132 1109918 1370010 1428400 1426712 1203527 1282275 1384558 1356154 1307548 1134304 1019018
9636 1019018 1167710 1282389 1535274 1559254 1156638 1113430 1109253 1089200 1159544 1282131 933861
9625 933861 1050060 1432570 1534015 1841009 2048829 1976084 1753074 1606624 1703507 1364924
9615 1364924 1318928 1163819 1090964 1300302 1372450 1777760 1880517 1645721 1304643 1545412
9605 1545412 1669724 1766835 1704160 1329808 1271257 1507666 1511201 1543226 1536146 1819233 1761270
9594 1761270 1566709 1410219 1290153 1487938 1735263 1365831 1689595 2078145 1988874 1790155
9584 1790155 1235405 1486370 1718664 1753164 1852365 1569886 1619426 1427300 1615321 1811419
9574 1811419 1794112 1961698 1883843 1810052 1976689 1513944 1504710 1726531 1765586 1616603 1626709
9563 1626709 1696157 1569364 1753492 1755218 1560734 1527631 1677302 1933913 1882859 1758521
9553 1758521 1700355 1393764 1570524 1574067 1784598 1997225 2095175 2153040 2117475 1773767 1775330
9542 1775330 2148880 2214319 2009683 2346480 2593382 2705890 2381168 2188945 2281117 2535381
9532 2535381 2699505 2721951 2938390 3032158 2812893 2805432 2874129 2893845 2953084 2942588 2362336
9521 2362336 2495059 2284302 2076658 1610134 1743267 1973974 2186205 2248326 2212258 2145226
9511 2145226 2077865 2111699 2043380 2365335 2237407 1989622 1779603 1864055 1786602 1946238
9501 1946238 1843640 1818220 1877301 2073374 1872151 1772481 1742306 1813455 2211012 2253085 1853393
9490 1853393 1806735 1778251 1946508 1928801 1492818 1625706 1678256 1515856 1638756 1824863
9480 1824863 1792701 2057778 1885976 1924290 1759157 1508371 1963468 2177601 2338802 2160467
9470 2160467 2188903 2325516 2284544 1992279 2117397 1774063 1904084 2076546 2276779 2211600
9460 2211600 2176128 2218318 2090707 2205597 2215290 2019808 2358236 2158584 2174811 2135675 2146748
9449 2146748 2090396 2108091 1770960 1787746 2205167 2418245 2116438 1785237 1969688 2131650
9439 2131650 2186181 2013918 2130912 1996365 2060001 1951337 2158177 2119095 2001755 2016889
9429 2016889 2026638 1722283 1802383 1831809 1828322 1787552 2124043 2225079 2223427 2016149 2152416
9418 2152416 2312682 2240917 1967469 1889146 1891344 2047321 2190964 2293328 2132197 1943382
9408 1943382 2026058 2084190 2450645 2496875 2404551 2208646 2243302 2182482 1814412 2017445 2126616
9397 2126616 2074405 2266072 2280948 2240004 2224475 2353863 2559013 2591729 2159626 2049619
9387 2049619 2465446 2297588 2101112 2297580 2325894 2300754 2291478 2353880 2418897 2516272 2330849
9376 2330849 2487512 2303552 2336032 2524644 2241944 2075027 2051156 2276874 2201829 2155270
9366 2155270 2082221 2437113 2378472 2458665 2782899 2682346 2658249 2676986 2800155 2831309 2816231
9355 2816231 2713051 2720789 2638222 2542933 2498703 2587045 2673565 2754035 2417525 2262074 2635685
9344 2635685 2532207 2008644 2432261 2684398 2225206 2195143 2763229 2589933 2360323 2467306
9334 2467306 2792767 3037311 2977459 2718498 2550722 2435133 2344898 2666243 3013232 2904676
9324 2904676 2527159 2797469 2918904 3232042 3354896 3145032 2835340 3006570 3015702 3085872
9314 3085872 2968670 3076070 2972422 2724540 2891736 2905661 2721220 3057105 3564196 3345406
9304 3345406 3251615 3068560 3245985 3325299 3161879 3049833 2794388 3154562 3577300 3366200
9294 3366200 3221171 3061544 3220410 3471644 3414396 3269076 3335866 3658076 3405159 3553278
9284 3553278 3530492 3075017 3219145 3582155 3769275 3609632 3451337 3386050 3514294 3739095
9274 3739095 3318038 3270538 3310457 3213164 3654805 3661883 3579460 3894725 3865029 3658824 3571457
9263 3571457 3691581 3950915 3703326 3690997 3731611 3825378 3981639 4130577 4049731 3960001
9253 3960001 4054945 4082282 3930748 3677901 4006842 4404115 4668387 4549645 4378249 4503688
9243 4503688 4841561 5209426 5142595 5018199 5196557 4941326 4944282 5034970 4974893 5250471
9233 5250471 5629865 5606349 5831346 6455487 6205870 6298986 6340746 6334718 6384911 6537823 6569822
9222 6569822 6372846 6036446 6100562 6377063 6580354 6611317 6695169 6697615 6728159 6890723 6841998
9211 6841998 6885992 7001061 7205005 7183191 7255880 7644483 7585547 7508588 7376808 7444904 7649291
9200 7649291 7541465 8005535 8421883 8648035 8871373 8955630 9023863 9307687 9542011 9672424
9190 9672424 9759636 9664666 9953144 10196834 10051773 9947849 9929399 9926974 10050042 10171967
9180 10171967 10044022 9855453 9804259 9855517 10214318 10278995 9965973 9916289 9900297 9995378
9170 9995378 10134981 10637900 10817575 11149255 11570812 11918151 12361648 12699080 13416320 14067943
9160 14067943 14766616 15663469 15684697 15388977 15321636 15366304 15377289 15357126 15502734 15698282
9150 15698282 15773247 15635601 15430450 15013420 14822921 14418546 14054576 13791012 13736864 13828557
9140 13828557 14078013 14103760 14294552 14788140 15109535 14950968 15157652 15553572 15754616 16449773
9130 16449773 16883655 17458297 18298792 19281085 20314113 21792036 23211897 25286757 26876926
9121 26876926 28634578 30345345 31463901 32077131 31665015 31716941 31539196 31810685 32436010
9112 32436010 32943762 33080978 32342196 30839002 29196751 27243547 25579160 24238061 22984897
9103 22984897 22025403 21717447 21390960 21056322 21067516 20822394 21074305 21640020 22058771 22283646
9093 22283646 23140844 24367678 25994644 27575491 29053997 31380184 33730665 35831415
9085 35831415 37271552 37982073 37884858 36929559 35235823 32605578 29676047 27317276 25479011
9076 25479011 23187026 21477475 20443890 19363944 18598363 17864817 17006535 16521724 15845590
9067 15845590 14972583 14787578 14585994 14227706 14237449 14196621 14030900 13851031 13817836 13674576
9057 13674576 13591510 13728918 13868000 14082811 14174597 14440718 14891984 15037350 15596797 15843996
9047 15843996 16806928 17698951 18039427 17981837 17811117 17552499 16951951 15930495 15294837
9038 15294837 14644232 14069636 12984909 12055109 12007821 11653487 11054648 10736455 10754875 10639335
9028 10639335 10624385 10252542 10010345 9709579 9954172 9811375 9604462 9429318 9611100 9979555
9018 9979555 9901933 9906601 9817242 9591974 9468801 9132466 9481596 9667602 9386755 9496047
9008 9496047 9347785 9188522 9259962 9491304 9730898 9493053 9303800 8953463 8984805 9166487
8998 9166487 9445097 9274128 9228597 9437544 9472064 9416457 9351192 9402183 9448994 9357679 9584538
8987 9584538 9667649 9254327 9158246 8993927 8838367 9075277 9255838 9095045 8965940 9139728
8977 9139728 9015275 9086237 9326406 9589499 9608008 9519689 9672571 9882404 9781267 9474945
8967 9474945 9609293 9576601 9419063 9642514 9944991 10005262 10216921 10318444 10372443 10669775
8957 10669775 10586092 10442670 10270488 10258609 10195806 10114329 10329937 10312902 10184306 10569945
8947 10569945 10515147 10377366 10897988 10864862 10987509 10974643 11363641 11298719 11387650 11489346
8937 11489346 11117743 11101141 11419277 11833216 11680886 11538863 11641502 11730971 11958518 11811370
8927 11811370 11737403 11824110 11898829 12360463 12386240 12361664 12324919 12446032 12500937 12571919 12817253
8916 12817253 12798607 12749630 12921907 13551538 13523611 13418076 13385763 13418492 13545711 13586607
8906 13586607 13699204 13810305 13765340 13967264 13975641 14035841 14176148 14440438 14627333 14790064
8896 14790064 14946609 14750501 14830483 15078367 15160534 15569694 15585208 15309016 15993943 16256016
8886 16256016 15798076 15863798 16164777 16478004 16584348 16428962 16654412 16876335 17218710 17377107
8876 17377107 17440165 17680515 17479113 17467334 18040829 18332180 18192177 18245326 18527306 18702474
8866 18702474 18643930 19095288 19603590 19787416 19861877 20156681 19754644 19998214 20238744 20419670
8856 20419670 20774348 20823837 21218838 21112773 21155309 21278711 21558054 21765914 21997614 22153803
8846 22153803 22493412 22595162 22900884 22929708 23197637 23269242 23306727 23698925 24071929 24271636
8836 24271636 24840643 25137317 25046394 25197122 25196750 25689030 25838381 26404703 26604917 26570427
8826 26570427 26615994 27029878 27592438 27683968 28182992 28560772 28718713 28894035 29376268 29665415
8816 29665415 29841656 30132698 30428507 31182801 31652166 31558810 32122825 32673889 32931458 33335512
8806 33335512 34132218 34474892 34615282 34905869 35648236 36116728 36315718 36657986 37243333
8797 37243333 37783368 38159364 38783011 39151690 39578343 40104866 40509427 41143120 41746248
8788 41746248 42140301 42694478 43309887 44025876 44737555 45467958 46215243 46633823 47106693
8779 47106693 47849912 48718908 49261312 49994324 50797600 51592187 52417168 53118888 54153578
8770 54153578 55054349 55777642 56546429 57113243 57966654 58855998 59908476 61273851 62134604
8761 62134604 63343034 64040875 65218295 66319006 67187711 68510870 69640060 70740120
8753 70740120 71980062 72958771 74336157 75909240 77273281 78608609 79971001 81148604
8745 81148604 82404667 83960575 85797603 87402972 88755105 90436739 92065260 93933430
8737 93933430 95924129 97630754 99192501 101143114 103131187 105216044 107341382 109071808
8729 109071808 111118528 113576569 116050644 118201055 120677727 123272472 125818311 128369595
8721 128369595 130630923 133329387 136097656 138976871 141903312 144870374 147667772 150880540
8713 150880540 154544278 158032254 161151439 164497891 168267139 172323427 175853445 179735516
8705 179735516 183922980 188241081 192939250 197347636 202354477 206885076 211762237 216834944
8697 216834944 222044794 227355542 233048745 238841368 244694936 250585892 256817639 263322400
8689 263322400 269809118 276571125 283516572 290483917 297937152 305717117 313279946 321001280
8681 321001280 328719765 336588967 344550637 352246000 360313071 368421593 376354678 384180481
8673 384180481 391754176 399461728 406367967 412984817 419101881 425076132 430177134 434677122
8665 434677122 438528601 441737141 444021207 445476811 445793085 445668602 444376351 442083557
8657 442083557 439271940 435394221 430605898 424836579 419026435 412668527 405698697 398247632
8649 398247632 390424978 382214492 374024528 365434008 356712540 347675070 338829001 329933906
8641 329933906 321043307 312651696 304483599 296030070 287739876 279585393 271579875 264516424
8633 264516424 257126688 249581339 242311074 235620815 228858261 222581587 216387965 210187876
8625 210187876 204367527 198609253 193201571 187962253 182910446 177944434 173105472 168723668
8617 168723668 164266904 160124667 155669955 151732044 147671148 144000736 140438170 136873749
8609 136873749 133433535 129680626 126937005 123681679 120447859 117750125 114979345 112223914
8601 112223914 109737749 107165529 104854601 102410855 99858667 97637352 95493524 93197134
8593 93197134 91332866 89314267 87243901 85599555 84002888 81943188 80254620 79016274
8585 79016274 77400523 74924819 73580386 72033517 70617352 69422135 67854543 66750833
8577 66750833 65416514 64125541 62904917 61955830 60781184 59470249 58482147 57248499
8569 57248499 56324191 55196381 54039464 53275329 52262609 51207408 50220636 49378612 48507100
8560 48507100 47655783 46646632 45918165 45518063 44661028 43977482 43691336 43090459 42108048
8551 42108048 41318329 40541959 39840178 39324456 38529267 37999587 37314910 36891761 36524438
8542 36524438 35927111 35266475 34843316 34404138 33761138 33348658 32944867 32560924 31933020
8533 31933020 31571458 30857373 30306502 29825187 29530457 29043658 28557020 28176291 27712498
8524 27712498 27552139 27073126 26576901 26291584 26147554 25423104 24959115 24906262 24438068 24022094
8514 24022094 23798019 23446127 23673575 23321496 23070903 22754119 22420669 22078115 21484269
8505 21484269 21661529 21413629 20792378 20545768 20414898 20041839 19646444 19343337 18886680
8496 18886680 19097278 19036402 18660972 18207321 17857604 17731439 17463710 17410842 17231264 16854762
8486 16854762 16785444 16360049 16228562 16105368 15912050 15875777 15644480 15269758 15174338 14933769
8476 14933769 14798109 14682893 14253546 14091474 13899394 13494145 13562880 13647440 13717203 13463427
8466 13463427 13033918 12477546 12483929 12852777 12305219 11883161 11826374 11957108 11727842 11683804
8456 11683804 11396600 11446763 11396824 11604667 11650113 11107150 11000480 10661214 10746917 10669202
8446 10669202 10553981 10334053 10270913 10491769 10258169 10310227 10046425 10030898 9629808 9394486
8436 9394486 9473820 9296490 9225683 9127420 9278051 8981527 8745611 8607626 8359513 8258177
8426 8258177 8134699 7925507 7714695 7765536 8044765 7936867 7876631 7906865 7487308 7607882
8416 7607882 7656340 7552706 7648413 7657942 7528196 7227693 7332768 7533598 7515921 7585077 7490286
8405 7490286 7072477 6917474 6994187 6851969 6652376 6572109 6660155 6719547 6474374 6416548
8395 6416548 6518196 6618373 6485952 6456740 6209282 6012604 6191605 6143835 6012719 5882719
8385 5882719 6085484 5752943 5858210 5600196 5377459 5674166 5650657 5269355 5474741 5430588
8375 5430588 5009113 5121067 4984715 4964360 4904063 4867236 4952646 5085005 5291308 5135596
8365 5135596 4939278 5032875 4941633 5148005 5019543 4858578 4983737 4526612 4422131 4297250
8355 4297250 4250639 4332979 4357888 4293012 4441733 4383218 4394938 4521588 4132053 3932169 4338696
8344 4338696 4134477 4096294 4145394 4077279 4092048 3794200 3383946 3496151 3663513 3540860
8334 3540860 3663193 3590443 3263221 3176993 3038819 3029170 3392916 3259083 3624173 3850672
8324 3850672 3459226 3294533 3253129 3387350 3357771 2978830 3030379 3060656 3371748 3324159
8314 3324159 3051956 2897151 2615763 2705769 2931188 2900132 2966588 2869437 2906106 2756351
8304 2756351 3019259 2898916 2817653 2941614 2746453 2727924 2578150 2551210 2675337 2641428
8294 2641428 2567771 2561617 2515680 2268592 2274671 2279650 2364888 2444497 2253669 2569721 2312358
8283 2312358 2057724 2096317 2108903 2260431 2021979 2183044 2045431 2382152 2709042 2672435
8273 2672435 2436521 2531141 2300762 2301799 2207357 2393889 2471676 2289523 2344589 2236710 2365687
8262 2365687 2544426 2339436 2246711 2239351 2044260 2002339 1958136 2127911 2026014 1986552 1921073
8251 1921073 2074994 1964510 1896534 1691454 1856665 1923927 1903223 1895903 1752337 1664614 1630627
8240 1630627 1307954 1480750 1405253 1222543 1421583 1484190 1494645 1629219 1845135 1660051
8230 1660051 1237390 1342306 1226365 1401456 1542338 1964622 2206159 2125375 1716991 1657514
8220 1657514 1645005 1557848 1554763 1347984 1168800 1218477 1242947 1312960 1343299 1616821 1729021
8209 1729021 1581549 1217754 1146577 1329412 941064 984348 1115199 1120741 1192623 1073162
8199 1073162 812558 869811 661968 803328 871840 1048985 1075295 3448855 2750457 1790498
8189 1790498 1710226 1190080 1553617 1204217 1133631 1131502 1147091 970433 1102358 1058163 876634
8178 876634 730947 1126805 1211143 1196723 1340559 1305174 1366866 1388575 1164989 1054534 1325775
8167 1325775 1370249 1240596 1182625 1155193 1054930 999340 1031191 794037 765663 850944 1092940
8156 1092940 953606 986162 864754 617202 764376 1141697 974464 654257 676241 662421
8146 662421 793144 1118989 1028450 1009041 919124 969983 726303 851667 805654 668853 859086
8135 859086 1051899 978508 698099 911268 1102221 852983 661534 674312 845751 709947
8125 709947 747059 1049697 1044574 794612 937433 544531 461890 688462 433463 275835
8115 275835 343698 346817 393195 647337 846625 959270 940878 635205 456909 617818 417240
8104 417240 546768 543008 430648 332438 335255 330906 501013 700680 870179 905404 851879
8093 851879 617059 574892 290829 372132 441185 523387 800585 644171 864422 396473
8083 396473 100083 285681 610236 674779 329675 170349 92267 258901 51441 177069
8073 177069 337996 510948 648017 572751 422825 457849 70152 267917 473389 604028
8063 604028 379804 375474 664655 182486 -68215 -222135 -18770 164798 295860 262243
8053 262243 129290 180603 -226932 -176860 121390 252140 487328 109147 190980 238700
8043 238700 24833 11341 132569 497925 297296 -92768 -45951 409450 167276 -24288
8033 -24288 165236 105725 -122938 -72028 274455 194542 126636 387753 399118 272050 313413
8022 313413 198858 177715 561953 478431 216737 98767 399030 174632 55932 265163
8012 265163 551609 532227 100821 -17235 89258 142701 5890 212073 137258 1510
8002 1510 342929 414228 496867 462026 305344 288093 211289 488242 314299 358836 87783
7991 87783 77646 234287 371957 361633 274628 124637 -122510 -130991 42381 202305 27148
7980 27148 69365 107749 4155 184007 130051 -110329 210026 347471 338214 185144 173798
7969 173798 277656 349990 11655 -37413 -132954 59685 578578 188747 103030 69820 -1800
7958 -1800 -222095 -220752 -200800 163102 8530 -49536 18852 37027 171666 -37290 -244442
7947 -244442 -142415 51379 16849 37611 -47893 347494 343290 255226 280723 123552 147137
7936 147137 -17963 -67644 -83928 -59479 96114 60266 15602 222725 287862 252774 152911
7925 152911 131222 -123217 228377 143326 -15442 -184010 -71849 29190 361647 591778
7915 591778 363831 272663 355577 197081 38550 -181229 -74143 270198 244126 193857
7905 193857 -250588 -66125 -180683 -333649 -121637 -49138 -77154 -102137 -298270 -574443
7895 -574443 -176703 -112518 -33751 92263 313068 270314 -101535 -217047 -186260 -59723
7885 -59723 -78672 193945 80759 156209 429491 25625 -61888 68159 58116 7269 -239995
7874 -239995 -47152 -152440 -148781 35426 117115 -19327 -165767 -276380 -478154 -469399 -105020
7863 -105020 -50442 -252100 -365687 -123486 -260185 -88495 -184865 -10449 -280588 -40303
7853 -40303 115846 -145997 -162051 -285751 -318960 -9865 -5803 207622 465818 514166 145623
7842 145623 51779 94822 -60090 43680 -76564 -147039 29686 138786 -248174 -259268
7832 -259268 128119 130556 53327 141979 -143421 36082 138758 71222 146403 192375 -143381
7821 -143381 -220412 -234954 135902 -324384 -398797 -142807 -104353 133673 376191 247230
7811 247230 194530 -47409 -176233 -90403 -228349 -280989 -124541 -154962 -127399 252898 152905
7800 152905 590491 -398424 -816756 -493703 -730763 -352750 -237966 -226228 -330511 -171974
7790 -171974 -185671 -229630 -209754 -209116 -302552 -307571 -444674 -558773 -479256 -311949 -297370 -325374
7778 -325374 -131854 -109124 -164220 -470863 -280735 -229637 -365020 -311191 -260108 -80653 -59894
7767 -59894 -33482 -137806 -528919 -185065 -201707 -235781 -70824 -291385 -539940 -22734
7757 -22734 70567 -10469 -45632 35144 -87416 -162592 -344414 -439543 -606917 -876983 -691771
7746 -691771 -506809 -481070 -281148 -180829 -136677 -292832 -382753 -108845 -329685 -42470
7736 -42470 -271046 -154736 -5599 -226858 -243235 -384956 -438313 -25338 -55014 20012 -67231
7725 -67231 -250913 -684691 -389704 -251577 -196881 -45679 -11059 -322384 -325458 -163274 -25819
7714 -25819 -158139 -370202 -431389 -158983 60324 -192735 -303303 -297777 -380657 -508039 -525226
7703 -525226 -553668 -229972 200390 182443 21779 13325 -50479 -32810 -70289 -268895 -307160
7692 -307160 -176247 -223514 57694 146245 1033 -101068 -236690 -231957 -368890 -419266 -482295
7681 -482295 -469544 -121162 86162 -312547 -189737 -137274 -336078 -539680 -504310 -438068
7671 -438068 -198870 37768 -326340 -313342 -275664 -4836 118640 -71374 -93931 -338060
7661 -338060 -361166 -278311 -407691 -269924 -431950 -403693 -159370 -445400 -217832 -338832
7651 -338832 -414203 -425121 -346394 -387395 -408153 -242509 -187394 105580 103132 -56409 -337619
7640 -337619 -128423 -233007 -103015 -33240 -71474 -438754 -645589 -342684 -23447 -142890
7630 -142890 -47695 -51416 29883 45977 33789 -173273 -55298 -130833 -420625 -342138 61600
7619 61600 -21752 -21956 -208444 8409 -191801 -120950 -169306 -104618 185226 98349 -64119
7608 -64119 -179761 -310013 -22208 -345977 -379590 -305432 -66663 119116 -280765 -189343
7598 -189343 -167909 -112459 -345065 -162319 -118480 3341 -40318 64771 -18329 56133 -6692
7587 -6692 -328411 -170820 -85856 -152203 -226442 -158453 -147482 -332038 -228052 -290649 -436407
7576 -436407 -148400 -297674 -185168 -376149 -425110 -283353 -429882 -471285 -436878 -550931
7566 -550931 -452638 -454615 -370861 -220023 -251028 44513 -71780 27370 -74760 -176893 -505947
7555 -505947 -158438 199744 325432 23261 -285166 -335796 -120039 -584962 -366665 -168987
7545 -168987 -114789 -82974 -66146 -276509 24836 114871 -26131 -285339 -120067 -142066 -13157
7534 -13157 -92194 -314989 -220201 -240610 -321755 -321015 -58042 -98123 -103203 158330 -85084 -327460
7522 -327460 -566205 -182222 -108348 -378503 -570561 -126336 48188 -111122 -88795 -321590
7512 -321590 -514947 -354755 -54429 -326940 -407388 -257778 192361 81123 31123 -161440
7502 -161440 50277 -89146 100010 -218501 -120209 -227419 -266952 -185206 -290752 -210046
7492 -210046 -105320 -119979 -405033 -502426 -271572 -298848 -493840 -575181 -101519 -223951
7482 -223951 -494834 -687484 -474089 -269746 -263962 -258484 -548267 -490825 -510162 -572634 -336113
7471 -336113 -50573 -14198 -137414 -202921 -219592 -263605 -333613 -440120 -758789 -595325 -560793
7460 -560793 -570810 -453492 -471603 213761 34182 -42248 -77082 -377654 -278733 -318157 -473815
7449 -473815 -432487 -240075 -213292 -193013 41628 -91537 1417 -30556 -280347 -605991 -522711
7438 -522711 -450235 -254884 -191647 -355074 -215022 -27974 -48304 -355864 -224441 -226184 -117521
7427 -117521 -235508 -247743 -111094 28289 78906 -199657 -119160 -179138 -376897 -78224
7417 -78224 -245889 -374578 -445578 -359333 -376701 -439567 -413318 -123050 -160915 -384186 -113270
7406 -113270 -3268 100447 36168 -322736 -432446 -199327 -395779 -819005 -435581 -368040
7396 -368040 -410910 -572250 -518766 -321827 -574148 -566506 -359243 -485155 -541391 -504201 -368398
7385 -368398 -351479 -263013 -355300 -341235 79428 -245236 -131083 -196043 -152192 -41628 -57885
7374 -57885 -102008 -262424 -700253 -387127 -320870 -313623 -447181 -139288 95769 -14247 -173250
7363 -173250 -256052 -327063 -388733 -479050 -375389 -202568 -53350 -227552 -568411 -555640 -695315
7352 -695315 -411084 -285008 -289001 -323461 -403388 -648287 -432394 -199076 -154707 -253740 -294291
7341 -294291 -246410 -44384 90234 8299 -364408 -280243 -126305 -181983 -272833 -523823 -228005
7330 -228005 -245074 -389053 467 56963 -41329 -161321 -416646 -250470 -501036 -295954
7320 -295954 -253754 -251186 -293606 -40630 31912 -330141 -92479 -170929 -143031 -144594 -231943
7309 -231943 -347584 -130172 -168843 -339632 -427210 -619413 -681165 -165222 -302784 -121480
7299 -121480 -27025 -299944 -135143 -109464 -324325 -26782 18192 -337142 -658666 -386603
7289 -386603 -285165 -119640 80966 41116 -169349 38719 352974 230800 -85233 -194231
7279 -194231 -25109 -263627 -397907 -182001 -118003 -514344 -504717 -485159 -177705 -53233
7269 -53233 8980 -54631 -233143 -406350 -582116 -645457 -207809 -226345 -16864 128497 44286
7258 44286 -228287 -464992 -516194 -360141 -194824 -187394 -108115 -176227 -510662 -314349 -339340
7247 -339340 -316136 -461560 -417476 -138995 -352417 -540149 -536099 -450319 -516214 -453061 -292534
7236 -292534 -475750 -337477 -491825 -518781 -236453 -351731 -160356 -254292 -432810 -467782
7226 -467782 -166344 33859 -155282 -321904 -462921 -485625 -332092 -443419 -553807 -405897
7216 -405897 -394778 -262730 -55416 -378680 -386478 -383940 -18476 -103787 -289366 -442087 -341385
7205 -341385 -105556 3775 -167769 -112576 -28833 15576 -143689 -430352 -84399 259889
7195 259889 -66641 -677481 -742772 -277886 -145501 -289339 -363657 -409001 -545329 -226971
7185 -226971 22299 -202373 -216768 -218553 -206405 -254514 -170908 -252522 -60932 -113004 -169791
7174 -169791 -342001 -569687 -354499 -209204 -389716 -365199 -573655 -444487 -451490 -375294
7164 -375294 -290970 -322751 -228885 -434371 -415076 -201604 -124852 -325068 -350208 -239693 -199711
7153 -199711 -158530 -413125 -116614 -224249 -636645 -456755 -521586 -639763 -121236 233215
7143 233215 6278 -210402 -479097 -472452 -150465 -38477 -307963 -44769 -122871 -404401
7133 -404401 -416316 7279 -21282 -38134 -11035 -87003 -322756 -240921 -183221 -185808 -135567
7122 -135567 -122287 226849 42181 -102846 -275512 -378580 -104553 -269308 -238358 -174163
7112 -174163 -58731 -85684 -39358 38980 27399 -43742 -135722 -115599 -567235 -582733 -209161
7101 -209161 -236795 -220247 34830 89581 96669 -27120 -188593 -206774 -266059 -219614 -335247
7090 -335247 -391595 -297139 -522038 -290432 -596683 -770727 -436695 -583485 -512204 -326747
7080 -326747 -221212 231749 248039 227171 35242 -340855 -262532 -411713 -450794 -315568
7070 -315568 -626389 -390140 -211895 -229517 -245555 73173 1036 -203009 -219450 -403867
7060 -403867 -103252 -320427 -382316 -237462 -51681 -420697 -626149 -681830 -644973 -383195
7050 -383195 -181224 -142795 -358108 -328676 -552892 -364424 -128702 -465431 -434184 -538275
7040 -538275 -406012 -292602 -435586 -254316 -179106 -231094 -110851 -52445 -357144 -240994
7030 -240994 -348147 -602014 -540745 -265614 29826 -247471 -333611 -289318 -280269 -298165 -288177
7019 -288177 -118953 -226169 -256589 -363752 -222877 18709 46893 258015 181637 -175291
7009 -175291 -293486 -440965 -408372 -236466 -371473 -418964 -135245 -313296 -283129 -392358
6999 -392358 -261393 -93110 -247131 2500 4403 252703 140399 -245306 -408984 -352428
6989 -352428 -175999 -7723 -73252 -409832 -1181 239089 47678 -243445 -197244 -292093
6979 -292093 -221487 52152 -4913 4658 35614 -151592 -181357 -88226 -319436 -722371 -449480
6968 -449480 -265259 -328802 -435055 -126787 110032 159152 -267757 -293458 -230381 -174352 -85885
6957 -85885 -237337 -295964 -402603 -265963 -176150 -148696 -293612 -281608 -468565 -329764 -152493
6946 -152493 -113874 -363294 -357270 -705913 -347808 -315154 -290790 -281788 -445182 -439416 -467932
6935 -467932 -325424 -63221 -68054 -101127 -249305 -68176 31193 -211774 -237240 -65333 -145555
6924 -145555 42803 -74566 -51294 201135 220764 -15428 -84311 225382 135455 -105936
6914 -105936 -153832 -387471 -377479 360 84173 75599 -190516 -268718 -99645 -24828 -124376
6903 -124376 -40695 -258785 -531651 -557376 -628347 -557091 -138983 -72916 6536 -226189 -377101
6892 -377101 -160090 21987 -168249 -233615 -492521 -325374 -240072 -213662 -254676 -176539 173471
6881 173471 -36942 -125209 -155331 -231226 -327777 -111570 -131032 -376830 -422271 -19488 55159
6870 55159 -167104 -259593 -299124 -405790 -259655 -226936 -289754 -314386 -335579 -273922 -141267
6859 -141267 -362273 -354632 -231217 -541385 -279894 -484233 -363585 -202288 -103199 -13648
6849 -13648 -46920 -156083 -70911 135877 -228067 -286705 -119638 -23952 -237727 -204703 -242521
6838 -242521 -86635 46205 87444 -174255 -398509 -346187 -120752 -201410 -301920 -77197
6828 -77197 -291196 -152570 89766 -91901 -128627 53073 -115436 -249805 -381103 -321895
6818 -321895 -386095 -180817 92481 -107078 -400591 -478799 -210378 -278992 -119751 68290
6808 68290 -55666 -153445 -238588 -266707 -173315 28117 73606 110107 -52699 -121867 -9810
6797 -9810 -159851 -207929 -138984 -57003 -25321 -316327 328830 511266 321634 107457 -166754
6786 -166754 101551 309776 233519 487564 182186 219515 39773 -267121 47076 -154184
6776 -154184 -339498 55626 229850 -76314 -138507 -245804 -313585 -100050 -15020 -187877
6766 -187877 -170563 -84998 -76508 -359081 -223854 -262839 -464501 -135289 -33358 -107509 -168730
6755 -168730 -293571 -215896 -61224 54244 -163930 -279791 -130025 -161585 -371603 142939
6745 142939 215386 48709 -308460 -305956 -116473 -280662 -216425 -256195 -43809 -291162 -309486
6734 -309486 -290873 -90062 -134922 -406832 -192908 -362550 -197185 -19005 -89037 206756
6724 206756 82952 -53646 -70687 78957 190207 27000 66549 -233337 -129370 112738
6714 112738 177702 219922 -49266 260188 247842 111417 137912 26368 -12960 481330 360833
6703 360833 -164623 -275985 -563880 -475067 -275106 -141560 -330395 -491296 -413652 -139916
6693 -139916 79825 298918 200282 -126749 -253400 -418016 -343131 -83221 88785 200303
6683 200303 137967 47360 41337 -126141 -50348 124364 -36143 -295522 -381179 -245972 -354875
6672 -354875 -167329 9812 178442 -83749 -24858 -116337 -162730 -279107 122817 193911
6662 193911 -77244 35071 -141695 -285763 -207045 -126414 111984 235075 195100 -4193
6652 -4193 -73280 -295480 -228772 -452541 -536417 -231178 -301658 -35510 111496 -89164 -245299
6641 -245299 -154836 134227 -35021 145552 34026 142089 139536 -225992 13392 -123484
6631 -123484 -187360 -358337 -388053 -475202 -524493 -314694 3402 18317 107835 -102810 -28395
6620 -28395 134988 159077 -55741 284799 263122 3868 -269681 66453 161968 99065 -128055
6609 -128055 -430312 14888 -67306 -257729 -210423 -209788 -103574 -91691 -151947 -29806 -91917
6598 -91917 -69711 -54674 -9063 -99136 60153 354705 221564 83796 101757 335805 320223
6587 320223 2565 78202 92783 -155019 -143460 -61942 263053 270767 9834 -204883 -16298
6576 -16298 132137 138027 19908 -24211 162676 367551 452666 155979 -230731 -43298 -65626
6565 -65626 57409 -19652 214564 169088 286004 215544 112379 135775 71651 312952 291291
6554 291291 -133304 32959 410855 359057 339969 394322 234697 22729 123141 549705
6544 549705 382133 345204 140696 34545 182368 220099 69917 602583 570692 228973
6534 228973 615035 334001 373930 166310 197064 155129 225478 130205 341648 166658 190170
6523 190170 146277 170018 125843 304236 282183 138795 90433 313599 463870 355970 235047
6512 235047 364073 400971 413202 257021 186638 219399 606695 542902 472137 405467 194541
6501 194541 198190 63981 32430 245154 105895 310597 348360 478255 203920 171787 406396
6490 406396 445750 271247 224984 242700 1983 199728 165830 404742 371116 418278 369897
6479 369897 442983 304362 587960 516747 439013 483741 466127 543677 271252 651389 455733
6468 455733 539411 700449 439745 616090 820487 1045821 1224732 740340 684107 660722
6458 660722 646956 835322 797884 991919 1051557 1333313 1217391 1090976 981172 916085
6448 916085 831398 1166644 1092588 1174483 1170927 1253705 1438617 1174976 1197837 1452938 1667112
6437 1667112 1689660 1426336 1295243 1212547 1251285 1223417 795097 740105 872284 974913
6427 974913 1046901 1144300 1170447 1205812 1339851 1282042 1080884 1128158 1457489 1658930 1391493
6416 1391493 1524237 1376516 1233481 1322217 1351473 1284740 1167800 1397144 1395197 1426010 1079767
6405 1079767 1075238 1009512 711167 1158154 1270472 1442126 1178759 820387 1151974 1140443
6395 1140443 1136443 1079714 1034789 1156815 1038745 991442 1037676 1104092 1150878 1071443 1150952
6384 1150952 1065113 1141261 1225785 1068287 998882 1025101 963881 909154 934839 910772 1048126
6373 1048126 957719 699963 694595 896533 972032 1032619 942181 1100429 1005376 717189 638021
6362 638021 422635 668606 705311 861348 794950 833679 1002844 1053959 994529 913876 1072136
6351 1072136 1068588 1062552 1110076 866865 1051271 1095577 1254016 1298809 1229664 1191508 1123493
6340 1123493 1216320 1131766 1088832 1174618 978156 1294064 1389418 1164945 1010846 1251670
6330 1251670 1719048 1644577 1678143 1887365 1831508 2099441 1998917 1652442 1752411 1754845 1833793
6319 1833793 1953759 2086055 2206371 2194900 2444376 2277023 2107140 2609011 2635869 2406169
6309 2406169 2637087 2664760 2340893 2487626 2473084 2410889 2714903 3145260 3249423 3183524
6299 3183524 3155967 3242569 3225815 3543991 3831739 4109976 3970412 4009880 4221159 4279565
6289 4279565 4403300 4512359 4789564 5157850 5094639 5172175 5512360 5708976 6064023 6473752
6279 6473752 6501592 7027736 7617883 7991448 8221515 8588548 8899625 9034913 9213847 9716646
6269 9716646 10181805 10598349 10872885 10991447 10990102 10937018 11096025 11127674 11292951 11628481
6259 11628481 12007236 11955702 11834464 12064611 12594131 12751897 13222676 13855580 13955645 14464224
6249 14464224 15040237 15205833 15377166 15551135 15837127 16144324 15775357 15301599 14571901
6240 14571901 14322112 13974557 13365027 12880872 12743387 12307718 11809454 11755200 11572791 11516296
6230 11516296 11272094 11009969 10952696 11087804 11079133 10726022 10579711 10531948 10362966 10141881
6220 10141881 9953559 9615288 9030042 8475009 8325842 7935270 7320193 6814029 6438420
6211 6438420 5822553 5969223 5766165 4969027 4905276 4781411 4598875 4381157 3983572 3888742
6201 3888742 3810980 3229242 3254151 3293140 3106886 2863913 2934957 2830853 2870241 2837799 2672560
6190 2672560 2313292 2112159 2111880 2035988 2015803 2021927 2078328 1742595 1794908 1653729 1603293
6179 1603293 1725144 1853385 1837526 1790528 1911472 1627935 1404025 1315475 1389533 1303710
6169 1303710 1145029 1176925 1154743 897353 1181362 914068 638420 880969 1295926 1118987
6159 1118987 968662 893601 799373 682795 759467 853953 901084 636079 576864 375886 755906
6148 755906 722349 560457 742960 723811 834962 723848 622620 936265 978462 800531
6138 800531 828389 512421 541929 643316 460774 402392 554281 517574 338572 415701 461617
6127 461617 577856 210134 120151 178922 301505 502312 567630 459312 673604 692523
6117 692523 714297 590023 447810 540143 402034 453958 610974 933946 722491 665453
6107 665453 482800 275475 312204 284545 194068 127946 -47475 220976 372486 592196
6097 592196 481099 497725 406721 361110 316051 485013 560183 446013 153066 423527 682135
6086 682135 745397 628571 323604 128899 45729 346958 365459 440705 460473 332752 365911
6075 365911 173875 350946 549990 512609 488174 515407 216593 141928 265465 393875
6065 393875 437627 410255 53678 206308 321514 213611 279598 172741 -19423 58524
6055 58524 567498 335831 248685 118609 15612 312861 272647 320286 294017 297763 320393
6044 320393 490453 191273 -59384 22528 449886 154797 11126 166315 74399 66113
6034 66113 62760 -88200 -73059 148095 216401 21631 105502 144454 199108 254924 -35811
6023 -35811 -69611 -50404 -109651 -215322 7603 -40895 310288 259379 270029 491454 190366
6012 190366 -96054 83391 -38234 54972 82472 244856 4235 -65043 123443 73432
6002 73432 20953 54491 -108717 -174470 -411523 -648636 -93579 180161 194816 -29611 -78476
5991 -78476 -58838 -213818 -170842 -317182 -241883 55277 77371 -179160 19399 159418 28656
5980 28656 120537 -90045 -155034 104604 265971 79693 114930 260991 24268 -108306
5970 -108306 -5114 56682 -136902 -288942 -81616 367129 343964 328750 44992 18990
5960 18990 295232 192280 222586 300721 50834 -20042 63482 52496 50448 -116576 -145352
5949 -145352 153613 242978 292765 290940 120779 207914 106472 215977 255995 354316 355825
5938 355825 137027 -69950 23345 203589 289865 593780 486054 356148 457123 205115
5928 205115 -68631 160752 55185 79754 -161162 32364 -163339 -228609 104145 -100942
5918 -100942 -173336 253906 299355 170052 168029 129399 408138 198177 115020 367867 172615
5907 172615 93820 -282600 -271300 -23423 229477 197008 139394 -40301 -61091 -34315 32613
5896 32613 65072 -37153 112681 -34321 254474 195988 151181 217313 51961 101729 354112
5885 354112 557125 562008 427832 384906 -53084 -175100 -22279 295571 307782 467491
5875 467491 167547 282290 220100 277188 148807 -89168 17401 205574 280370 432777
5865 432777 576535 212317 295011 269558 107362 117601 23099 18546 -18316 195644 231129
5854 231129 381200 362826 116107 307567 528552 252273 125802 202470 238036 460136
5844 460136 247875 153116 359993 414207 484364 313666 352294 177316 -74388 -264623
5834 -264623 100964 -116266 113847 262738 144193 314715 433530 423601 404500 216372
5824 216372 99177 292891 397101 209042 133192 382716 548776 346139 -42012 105152
5814 105152 186305 277163 285902 366276 231657 268940 158710 -266617 -400672 -119164 150652
5803 150652 244977 229095 457606 471689 232130 444977 419153 365146 797300 520483 599316
5792 599316 139641 -25690 29252 145948 15717 -87844 48599 245988 99852 253509
5782 253509 343968 477858 468349 93261 -3765 243547 517915 345304 410765 204880 303871
5771 303871 457275 503375 513365 402037 473633 587514 629035 236057 419196 372823 543306
5760 543306 487701 456810 516152 634862 1071510 1253946 859515 778710 444802 444041 767992
5749 767992 537213 537375 830596 1002072 807908 762853 882590 1002548 845516 1007229
5739 1007229 809046 877372 863635 744024 888359 807637 965275 1385592 1340478 1176615
5729 1176615 1368009 1356382 1467741 1803244 1596621 1635275 1462606 1616724 1792224 1756764
5719 1756764 1409638 1377888 1313367 1479592 1703761 1621600 1567755 1692611 1533271 1645170
5709 1645170 1681101 1539175 1681539 1649992 1737978 1812127 1851697 1832928 1774369 1612819 1702907
5698 1702907 1670509 1757840 1467162 1607301 1804495 1831589 1712538 1663559 1709541 1508689
5688 1508689 1483817 1768486 1966035 2030146 1653787 1538304 1286474 1183634 1156894 1213054
5678 1213054 1247326 1281076 1270436 1082248 1279145 1290368 1570430 1439259 1367823 1051742
5668 1051742 1253880 1202263 826129 1017421 999944 1119428 1242006 1219982 1201125 831089
5658 831089 924262 1141811 972086 1100935 1074827 850971 1113190 1322057 1026432 906088
5648 906088 1088913 1101763 1227225 1164148 969377 887054 1110111 1200413 1555546 1331940
5638 1331940 1249517 1406288 1205482 1349146 1507310 1454978 1736557 1716526 1640524 1480703
5628 1480703 1426326 1475184 1454007 1556348 1487410 1315809 1441410 1014841 1255658 1388388
5618 1388388 1446106 1549366 1438431 1420327 1151770 1482628 1211095 1153229 1449718 1422409
5608 1422409 1171022 1379507 1036081 1125088 1264295 1174943 1105382 1224354 1494536 1528272
5598 1528272 1469113 1542952 1710216 1446383 1730530 1986676 1800206 1677809 1782090 1866930
5588 1866930 1746088 1995801 1982674 1778979 1973630 2286536 2338870 1961420 1602399 2039860
5578 2039860 2247854 2200617 2141888 2485944 2220454 1937586 2174425 2311106 2388104 2379827
5568 2379827 2346960 2523351 2553732 2847217 2917974 3072929 2844620 3025142 3126021 3198082
5558 3198082 2974238 2872867 3385761 3366846 3404169 3573158 3602500 3852049 4080711 4242760
5548 4242760 4062618 4058143 4383159 4494999 4670247 4796851 4971259 4944537 5158272 5738084
5538 5738084 5935136 5969377 6136582 6303694 6855092 7079467 7281502 7558358 8020632 7957740
5528 7957740 8215494 8259328 8576797 9164412 9657768 10172369 10842892 11085156 11434060 12015112
5518 12015112 12296699 12372373 12749593 12857200 12753552 12953835 12925881 12919786 12974711 12848843
5508 12848843 12987963 13361179 13365744 13729700 14471014 15192936 15383116 15643766 16253554 16964173
5498 16964173 17361667 17734906 17679660 17349619 16805142 16492374 15966325 15518200 15096228 14490049
5488 14490049 14085578 13677331 13256186 12660974 12126872 11812862 11820797 11728594 11277955 10958698
5478 10958698 11387091 11383189 11454546 11330280 11406707 10899203 10541691 10095246 9568749 9366611
5468 9366611 9060949 8762249 8471207 7990981 7455774 6988771 6629857 6348798 6322374 6031381
5458 6031381 5475475 5418581 5344139 4978810 5017393 5112622 4738565 4808326 4692203 4555252
5448 4555252 4262879 4429297 4486142 4305873 4045217 3831533 3616813 3741622 3719680 3926460
5438 3926460 3978915 3729074 4041671 3762050 3709132 3777392 3617000 3563744 2976976 3131073
5428 3131073 3622627 3685025 4101227 3913579 3540235 3544756 3814999 3741612 3656832 3655630 3811038
5417 3811038 3671796 3781145 4023437 4012907 4301541 4229247 4410655 4786161 4663554 4530156
5407 4530156 4386511 4404371 4292271 4107109 4095695 4280144 4346708 4339993 4082721 4292135
5397 4292135 4466404 4384157 4149184 3956477 4023174 3809283 3981073 4220615 4484835 4603727
5387 4603727 4530842 4544067 4860177 5152593 5230028 5396115 5319091 5057361 4856101 4550977
5377 4550977 4323933 4210203 4493818 4069285 4088340 4029054 3714706 3540072 3556476 3609248
5367 3609248 3739862 3424570 3731906 3740623 3470476 3525655 3684113 3586311 3906419 3944424
5357 3944424 3824880 4029242 3970189 3912757 3677315 3783177 3948306 3698325 3377733 3395178
5347 3395178 3479794 3157605 3190375 3462755 3385257 3008014 2652644 2967062 2920616 2889502
5337 2889502 2883795 2848025 2833276 3072352 2894531 3151752 3167332 3107321 3293415 3119835 3245027
5326 3245027 3149818 2923596 3003861 3206874 3352543 3214003 3169393 3194124 3184667 2992781 3563170
5315 3563170 3653264 3712548 3766486 3764763 3857514 3749423 3697954 3644674 3449470 3546768 3644751
5304 3644751 3568645 3345225 3125584 3809716 3785266 3703085 3529119 3546924 3711207 3823019
5294 3823019 3906879 3886144 3795367 3751286 4203032 4389845 4160953 4291951 4000423 4224702
5284 4224702 4327812 4397744 4428292 4281164 4396128 4420181 4640955 4803433 5025683 4940247
5274 4940247 5195337 5310552 5503673 5605490 5695607 5703467 5778849 5760051 5907912 6038438
5264 6038438 6274469 6467790 6653800 6909956 7193617 7344041 7678307 8119816 8571869 8742120
5254 8742120 8822733 9051874 9626310 10031490 10412525 10824166 11522568 12645879 13244852 13897660
5244 13897660 14030758 14348646 14241757 14721955 15438280 15756632 16359954 16675072 17207529
5235 17207529 18043865 18882685 20000899 21678181 22632875 24466920 26701728 28343958 29948765
5226 29948765 30721300 31205848 30778824 29267487 27632319 25668897 23549231 21508571 19373436
5217 19373436 17692641 16266812 15007807 13737241 12880084 12131647 11166809 10384236 9778671
5208 9778671 9086737 8867050 8683990 8027229 7836229 7490985 6926390 6506732 6468739 6272766
5198 6272766 5803563 5893983 5671763 5544589 5113083 5015194 5087842 4913690 4514849 4202925
5188 4202925 4426617 4246070 3840889 3702933 3575654 3493632 3725731 3335833 3294315 3220241
5178 3220241 2709768 3042711 2865560 2855011 2983823 2787729 2870213 2676575 2645486 2608262
5168 2608262 2416979 2351275 2233114 2155297 2103006 2298284 2463371 2050871 2002138 1809222
5158 1809222 1813460 2178859 1976079 1681121 1339809 1266243 1435900 1718089 1824425 1959157
5148 1959157 1700591 1492686 1842516 1809995 1715331 1763997 1792206 1920437 1997907 1731416
5138 1731416 1725844 1827539 1892444 1983932 1991638 2033137 1747967 1455911 1438229 1677800 1420403
5127 1420403 1007015 1106479 1211928 1177732 991438 1130463 1285949 1523975 1430918 1135890
5117 1135890 924119 1062061 1318941 1165025 967150 618490 815615 989199 1261385 1015276
5107 1015276 880960 849099 919973 1081456 1067938 981578 964876 1112307 1331407 1248784 913961
5096 913961 855532 557785 517239 478550 683730 1050011 901848 757530 943856 853099
5086 853099 1003742 1003103 980304 781720 1182509 1384425 883252 822325 828651 930442 650391
5075 650391 481724 467146 518687 972817 901999 928592 726215 493155 790584 891032
5065 891032 961769 1225568 927986 932615 933595 732378 738644 811821 792403 890571 851852 543379
5053 543379 466385 427228 385900 381881 301059 438962 649032 922467 863671 617120 662092
5042 662092 774891 773749 678834 567258 587450 552902 467063 642712 537436 407633 523611
5031 523611 673820 290456 472331 545603 817840 785953 772336 840945 804576 641766 506195
5020 506195 406077 413939 500870 304344 221736 488352 800916 946056 514651 576531 662862
5009 662862 562663 711072 617548 488156 371153 433451 715792 820276 628259 832495
4999 832495 776921 823571 537018 643832 653026 977406 1024893 980373 869227 1013001 1104241
4988 1104241 1005755 1103499 1094059 1009967 826900 1034010 1138964 1080199 1004940 930959 1093765
4977 1093765 1300053 1380989 1236168 1145431 1383324 1330737 998633 910245 906551 918954 961267
4966 961267 1268601 1558507 1318355 1448786 1252248 1202698 1459092 1319379 1140567 1531569
4956 1531569 1595474 1732404 1887937 1863490 1508633 1371682 1456854 1700792 2207091 2171568
4946 2171568 2311396 2589368 2552265 2642425 2964249 3132021 3706025 4492129 4926573 5427372
4936 5427372 6287799 7128733 7363497 7080136 6696260 5877785 5179902 4448886 3872182 3313826
4926 3313826 2969894 3022866 2504236 2198195 2467850 1969736 1698143 1907352 1867057 1684797
4916 1684797 1700096 1995687 2074232 2008952 1756901 1749713 1557619 1790965 1789153 1650618 1651173
4905 1651173 1665254 1369302 1087131 1157342 1445396 1289863 1388204 1553507 1425264 1264350
4895 1264350 1188793 1369426 1516875 1411546 1647927 1530003 1327899 1544105 1273503 1311183
4885 1311183 1105621 1216932 968616 720262 1076117 1183622 1275538 1352682 1120741 1287409
4875 1287409 1343572 1176061 937885 973138 976297 958705 1094158 1039423 1107192 1208789 1088008
4864 1088008 1151073 1123509 1153172 1048318 1079297 1384543 1572551 1325639 1135643 1283334
4854 1283334 1407226 1256637 1209945 1274189 1286443 1327804 1344561 1462139 1144159 1012217
4844 1012217 962775 1227561 1250036 1207358 1193873 1289647 1465650 1499118 1331116 1444872 1342786
4833 1342786 1211525 1106286 1198704 1344611 1213314 1038489 861502 846003 1120810 1449350
4823 1449350 1696577 1663645 1171905 1257866 1612428 1648028 1646533 1665759 1565918 1491643 1301665
4812 1301665 1789136 1819912 1996615 2210724 2156998 2027578 1975947 2061309 2114490 2307625
4802 2307625 2515577 2831941 3226126 3484685 3761590 4042641 4560240 5245320 6035949 6541423
4792 6541423 7001053 7429159 7255343 6461210 5852985 5566401 4721780 4115228 3638861 3333085
4782 3333085 3411585 3205297 2687499 2364947 2102885 1846388 1867163 1774153 1638665 1972175
4772 1972175 2080936 1877141 1792343 1677154 1548025 1359961 1218534 1330487 1325747 1616824
4762 1616824 1577096 1549944 1494805 1618230 1774470 1802872 1729558 1416927 1519669 1347995
4752 1347995 1211130 1357457 1369632 1437606 1592090 1555060 1579046 1314843 1309493 1404218 1448126
4741 1448126 1221170 1376512 1585315 1555973 1356158 1549749 1453283 1416004 1720552 1636224
4731 1636224 1564670 1190716 1055754 1235478 1803254 1924192 1992321 1658148 1749971 1639167
4721 1639167 1562671 1753976 1724595 1675526 1737919 1774654 1734933 1899701 2041235 1949792 2153479
4710 2153479 2273056 2481361 2420505 2361182 2617353 2291305 2210396 2184179 2218441 2205431 2173229
4699 2173229 2256376 2296881 2251359 2524198 2507197 2428060 2869797 2820721 2733422 2788270 2681687
4688 2681687 2663675 2575660 2952230 3405646 3485047 3540776 3625747 3903824 3664141 3758610 3912696
4677 3912696 4129722 4120609 3878387 4327537 4394182 4022228 4450712 4682379 4667843 4608061
4667 4608061 4623979 4970332 4743242 4745807 5061304 5386003 5666762 5615946 5727912 5851718
4657 5851718 6208782 6128246 5683279 6058661 6511914 6702582 6963252 7150435 7121947 7501936
4647 7501936 7714272 7797980 7846816 8071828 8353183 8881602 9318000 9295100 9272604 9425817
4637 9425817 9690169 10255275 10563243 11020947 11373823 11786415 12402786 12672579 12736838 13229264
4627 13229264 13846310 14301926 14876630 15327243 16163757 16497031 17365265 18293911 19016579
4618 19016579 20099575 21137486 22591080 23581980 25360812 27215440 29111802 31436030
4610 31436030 34137689 37216574 39721826 42406348 45164155 47144832 49317051 52171770
4602 52171770 55446104 58495923 61832575 64936464 67081965 68017861 68889907 70091245
4594 70091245 71579425 73227931 75461103 77489860 77965809 76833023 74469868 71759048
4586 71759048 69408289 67569922 66412710 65489021 63994103 61891851 58133954 53918854
4578 53918854 50424505 47357247 44583996 42585100 40384799 37832472 35090632 32236282
4570 32236282 29437347 26529867 24221896 22276356 20410748 18969950 17554653 17065107
4562 17065107 15787870 14795516 14118595 13259022 12291553 11600832 11233370 10716036 10142996
4553 10142996 9706223 9306272 9038715 8806960 8568803 8092610 7885354 7816788 7519540 7194382
4543 7194382 6896984 6737104 6835530 6570615 6363720 5844061 5439406 5730783 5542524 5437182
4533 5437182 5234164 4900721 4361461 4155753 4410844 4685031 4582683 4555734 4268857 3984762
4523 3984762 3885795 3580038 3452211 3419581 3231819 3413050 3205700 3005778 3155153 3303607
4513 3303607 3275508 3159432 2949819 2828029 2788072 2726687 2669871 2744702 2567385 2708371
4503 2708371 2540600 2396906 2298862 2452438 2467142 2116498 1883133 1814806 2096303 2113640
4493 2113640 1763763 1775725 1728428 1734886 2002181 1749457 1690201 1720198 1894670 1867755 1906166
4482 1906166 2066747 1588481 1362745 1733081 1731857 1432027 1608382 1300899 1658535 1812712
4472 1812712 1570145 1643686 1537704 1443064 1838959 1739141 982354 1190440 1409745 1176664
4462 1176664 944672 809502 887848 1108280 932894 977689 908772 1187449 1266143 1207620
4452 1207620 1035349 874955 965040 1271176 1148892 841458 933175 813823 869054 742630
4442 742630 647951 583586 661726 1160067 931075 799421 650186 499352 505497 691637 633283
4431 633283 585699 549925 453016 399312 443983 593030 649197 430798 236247 302180 187818
4420 187818 209582 586365 451924 625147 593050 477544 539312 592258 480770 481037 719446
4409 719446 456227 454528 393371 294448 382734 474068 401179 337269 514306 485689 413297
4398 413297 645644 507885 77824 541092 210547 -46247 451805 238808 -152990 -84917
4388 -84917 -168701 98592 472447 460712 524127 279795 381716 120685 42102 -1266 354320
4377 354320 320354 414471 14680 -71715 -62132 -68889 -69424 -45496 147372 333933 464781 -24689
4365 -24689 26541 57730 -6840 1661 89138 144897 419297 373953 457847 501872 462528 95103
4353 95103 331523 680857 398350 216469 48535 169982 397170 631419 622189 696738
4343 696738 470990 190769 388286 383208 213576 389797 243247 228189 -4819 307539
4333 307539 283954 426313 349022 512199 622721 707194 499339 449494 252128 180622 60465
4322 60465 40602 120079 105455 17525 186915 371482 473750 121353 467289 582457 262653
4311 262653 375459 198890 455417 229055 482190 379715 291838 -31492 142101 122839
4301 122839 451536 339812 344029 386724 221097 208470 498960 527183 481714 519262 492412
4290 492412 750628 680659 278888 564802 592147 536053 590846 435470 340571 506878 740840
4279 740840 844445 724845 565891 259746 255458 319804 349045 488719 392001 413724 547551
4268 547551 566103 163893 529739 321267 584902 466393 346577 296795 300641 366275 339786
4257 339786 662912 660628 609045 205740 69682 443612 446621 325621 507835 -24283 495184
4246 495184 373427 127318 12805 -32732 124099 345592 222235 109120 163161 119971
4236 119971 88951 464858 395869 144565 142414 311403 312206 281678 244402 499588 660702
4225 660702 299559 207506 -48147 -46085 34430 -61554 279133 236475 282061 521295 264452
4214 264452 544759 625329 453126 241340 151252 271048 748726 717214 627395 1129245
4204 1129245 1598559 1721340 2197149 2161013 1975923 1603905 1263597 938170 839486 809075
4194 809075 699380 841144 937199 635520 326409 418378 262147 127496 63617 -97960
4184 -97960 343438 462438 377210 78264 200771 154772 355920 334585 199527 346751
4174 346751 345585 359506 356323 347850 74775 183773 234925 369927 31316 -35164 -20574
4163 -20574 -117628 47000 -80191 -25374 481142 353502 462243 331328 64361 236902
4153 236902 195198 493584 124691 16747 -131324 -194482 35895 39585 317977 177539
4143 177539 257979 20970 -273369 -92647 -248975 -158324 -101886 156397 300772 52348
4133 52348 11694 225560 35275 102791 -177300 -249518 -138101 -49132 128742 25812 -72128
4122 -72128 131489 275597 225562 175298 191956 194130 -71646 -47246 59265 16346 35173
4111 35173 -143695 -395025 392 291308 246762 182094 118240 275262 367528 251474 70844
4100 70844 -39468 -45135 -166578 -12326 -33960 -106551 52026 115454 -169061 -7707 -106302
4089 -106302 -304537 -128887 9269 106714 128152 -99447 -208021 27308 -23130 -145835
4079 -145835 -341356 -391768 -52581 70510 71370 -255544 107581 173133 291124 322305 -96634
4068 -96634 -190837 14827 176863 -46466 -32910 60599 227706 294307 90510 142834 29929
4057 29929 -162753 -184935 86577 135972 -125074 -131165 152965 166905 437285 476262 255062
4046 255062 35167 -84850 -246315 -113263 34466 -13368 18759 102538 -77760 43328
4036 43328 416171 16853 9920 219331 -226311 -400032 -7599 -220194 -157506 -73336 9921
4025 9921 -117976 65543 55800 -77175 -255693 -15278 78643 27289 111265 85760 39003
4014 39003 8453 157599 -50448 -357514 -364370 -136279 -76690 -88495 268442 174992 -47849
4003 -47849 -127485 -49478 144888 -66638 -4668 11641 -46650 -70248 213458 177537 -1654
3992 -1654 -103859 -226503 -299445 -216004 -64454 -31423 114396 163044 123970 -24703 110490
3981 110490 37864 113683 -106486 140840 485130 44581 -26452 56016 33252 97247 -147703
3970 -147703 -170048 -37564 -118089 -44315 -29373 20008 162782 405248 -65811 32454 7860
3959 7860 -173752 -143484 -22390 24671 39221 -69177 -56723 -168506 -413093 -67297 133797
3948 133797 -68976 181097 187472 117267 31069 69676 345133 148900 28466 202577 392769
3937 392769 -9576 101901 35859 82115 162123 -168244 -101612 -41663 -164680 34146 -221933
3926 -221933 -8508 -48632 122104 93990 -72884 -237898 -295560 -81563 229689 99812
3916 99812 48227 148636 92545 10087 217699 264102 141151 196001 70495 87566 -13198
3905 -13198 380236 322068 328244 292511 148317 34143 60899 122747 223943 296133 86658
3894 86658 252381 275224 185291 -1504 -186437 293746 304619 -18225 -149643 -150787 -393137
3883 -393137 -201404 -317652 -376786 -287384 -346362 -39036 75527 83741 64750 169580 369438
3872 369438 193361 19822 -155639 199700 17865 -58958 50574 -221681 -431358 -574417
3862 -574417 -579125 -404350 -362006 -184930 -82516 -56960 26735 193931 298298 17365 98959
3851 98959 145702 20977 -199833 99678 163885 -171129 -356800 -254659 80173 253536
3841 253536 41208 175972 163414 151492 149102 -50249 -40905 -16273 87962 82357 44319
3830 44319 147377 96221 174911 263161 380814 201968 162427 241752 174428 -56404 -102899
3819 -102899 -129748 -60224 166294 31597 84949 -4020 88140 68005 84523 34818 240355
3808 240355 403920 70095 231314 14895 273989 429631 502755 329724 230048 403173
3798 403173 190656 49333 276262 244340 81332 -90767 -140784 -70287 45586 50208 -13191
3787 -13191 74384 59266 34146 -18511 59185 212595 170820 195402 326795 340900 272552
3776 272552 246363 270854 -16431 233802 131498 317761 98346 375160 336486 10476
3766 10476 38824 132895 241489 496428 282592 112356 288696 159339 -13260 -94816
3756 -94816 -197531 3058 542 117557 33301 -124080 -159348 -132553 201062 160143 -64462
3745 -64462 1306 -91791 -126077 -135120 -234456 -171260 137005 12336 48621 -16705 -42845 118612
3733 118612 -64148 -41093 -128945 200254 233842 188146 -53431 76881 276632 94322
3723 94322 -195054 60478 81084 -29226 -256221 -224983 -271697 14629 -7314 -73251 112988
3712 112988 166552 356708 321253 106789 66599 35068 78474 -117896 -11397 310173 394107
3701 394107 183610 46135 238464 52695 123451 171158 258213 291908 263827 418560 301665
3690 301665 280876 241194 541747 561538 335239 1045 189676 361495 94671 287806
3680 287806 312919 390777 536787 259878 260563 291947 263537 209941 146472 57400 109414 148306
3668 148306 225872 47835 16428 313991 469520 766241 211478 -198266 -64125 203345
3658 203345 507840 490140 420765 472149 213584 -59523 292807 550394 394943 431324
3648 431324 789136 711334 325074 599518 675750 311663 225086 208577 199233 394711 157512
3637 157512 363527 441003 378475 579349 972502 551508 232606 398301 279226 332252
3627 332252 644587 1060085 964925 783568 428535 577703 500565 474298 747896 656871
3617 656871 588299 619306 821627 896545 631232 442548 818147 848236 865261 783193 975247
3606 975247 992411 844040 1086620 1121822 765628 753799 1004491 780642 864221 875221 665887
3595 665887 702194 682457 645829 877164 950802 1145178 1140747 899147 703998 702194 949272
3584 949272 1215858 1361428 1119419 1068172 936455 993119 1093135 1121898 1054699 986103 1368972
3573 1368972 1359042 1286109 1681654 1711762 1304597 1531507 1618348 1449583 1847199 1424052
3563 1424052 1389063 1391084 1519132 1672551 1529769 1599123 1383003 1411107 1673480 1451489
3553 1451489 1512991 1461098 1460355 1670205 2016731 1793614 1438499 1753167 1946308 1847062 1941198
3542 1941198 2007946 1773502 2048413 1855309 1683647 1573671 1361214 1212358 1375093 1560472
3532 1560472 1752736 1739432 1556732 1690389 1760146 1759997 1605287 1654357 1866952 1872132 1909197
3521 1909197 1502709 1603318 1914500 1772764 1600383 1395329 1816824 1834074 1606910 1613432
3511 1613432 1347444 1447922 1328178 1380852 1345715 1392499 1490755 1570296 1485991 1441602 1557432
3500 1557432 1408716 1545212 1675827 1889550 1716942 1699735 1739143 1608896 1701848 1543496
3490 1543496 1632881 1320574 1273799 1481897 1550144 1267357 1156124 1240866 958511 948060
3480 948060 945029 1069404 1186557 1109594 1221748 1327983 1400114 1295293 1334688 1361729 1323310
3469 1323310 1299151 1369286 1196033 896249 1073872 1185199 1180187 1427624 1125017 1106125
3459 1106125 1326968 1603952 1484564 1220800 1415869 1402118 1217115 1151139 1090522 1055925
3449 1055925 1101712 1356173 1269094 1314249 1767514 1586363 1505194 1496266 1416141 1320303 1364814
3438 1364814 1462672 1720538 1732305 1796163 1659249 1493458 1694797 1857036 1902862 1875703
3428 1875703 1668302 1750737 1969520 1971589 2186228 2011925 1687547 1812841 1940929 1609515
3418 1609515 1379597 1489624 1140703 927236 1247896 1006279 827924 843112 812994 721294
3408 721294 846446 782913 528563 714593 766652 701267 571621 949829 1246710 1243980 847559
3397 847559 879779 706353 438794 448625 723437 701803 835641 888122 720465 430826 501177
3386 501177 434255 423059 457877 526389 731942 654948 811177 693277 651030 650765 736545
3375 736545 883799 787788 458314 602149 571602 393118 644836 681258 900133 1115901
3365 1115901 736277 450201 502689 743324 752084 641418 827605 780509 918982 997533
3355 997533 792085 1235252 1212319 1058297 968848 794556 788368 725332 321601 459321 645206
3344 645206 316762 222087 391625 341353 470086 864895 571136 497332 165627 220375
3334 220375 285373 17916 89390 398160 634951 237220 106135 40752 139948 113947 -93303
3323 -93303 -46551 23240 140231 -25624 245249 277223 130888 -335725 -243150 45365 -167431
3312 -167431 -378078 -341282 -95220 -85944 20843 159363 137220 309083 437739 246249
3302 246249 325372 64220 99457 103755 471621 526576 365198 402291 263026 562742 548709
3291 548709 300813 68957 -22529 -20210 -128648 -84485 -23621 -976 341541 389370 132749
3280 132749 295474 -209261 -179014 9523 -35560 374615 278466 77788 49435 129549 76531
3269 76531 -198581 15785 -112986 67804 171496 -30280 79130 -74928 -149753 249738
$$ [...]
##END NTUPLES=NMR SPECTRUM
##END=
