##TITLE=1H_EC-3317(2)nk
 DMSO
 8 sc, 
 6.3.2024
##JCAMPDX= 6.0         $$ Bruker NMR JCAMP-DX V2.0
##DATA TYPE= NMR SPECTRUM
##DATA CLASS= NTUPLES
##ORIGIN= UXNMR, Bruker Analytische Messtechnik GmbH
##OWNER= root
$$ XWIN-NMR		Version 3.5
$$ Wed Mar  6 17:20:09 2024 Russian Standard Time (UT+4h)  she@DPX200
##.OBSERVE FREQUENCY= 200.1313
##.OBSERVE NUCLEUS= ^1H
##.ACQUISITION MODE= SIMULTANEOUS
##.ACQUISITION SCHEME= undefined
##.AVERAGES= 8
##.DIGITISER RES= 18
##SPECTROMETER/DATA SYSTEM= spect
##.PULSE SEQUENCE= zg30
##.SOLVENT NAME= DMSO
##.SHIFT REFERENCE= (INTERNAL, DMSO, 0, 15.4307)
##AUDIT TRAIL= $$ (NUMBER, WHEN, WHO, WHERE, WHAT)
$$ ##TITLE= Audit trail, XWIN-NMR		Version 3.5
$$ ##JCAMPDX= 5.01
$$ ##ORIGIN= Bruker BioSpin GmbH
$$ ##OWNER= she
$$ F:/spectra/data/she/nmr/H-F/1/pdata/1/auditp.txt
$$ ##AUDIT TRAIL=  $$ (NUMBER, WHEN, WHO, WHERE, WHAT)
(   1,<2024-03-06 17:18:57.04 +0400>,<she>,<DPX200>,
      <created by zg, POWCHK disabled, PULCHK disabled
       configuration hash MD5:
       00 E9 B6 7A A2 85 ED C7 34 08 36 98 17 FE 4E 26
       data hash MD5: 16K
       1D A2 F0 CF 2E 93 40 C7 DA 78 1D C7 A8 7F 78 36>)
(   2,<2024-03-06 17:18:59.79 +0400>,<she>,<DPX200>,
      <Start of raw data processing
       efp BC_mod = 2 LB = 0.24 FT_mod = 6 PKNL = 1 PHC0 = -24949.35 PHC1 = 18.98731 SI = 16K 
       data hash MD5: 16K
       7D D6 04 44 B1 FD C9 9E 80 5F 02 00 CA 5E DE 2E>)
(   3,<2024-03-06 17:19:16.60 +0400>,<she>,<DPX200>,
      <pk PHC0 = -0.5034613 PHC1 = -1.8 
       data hash MD5: 16K
       9D 15 01 30 01 90 71 03 6D D0 6E 3B D3 31 51 19>)
(   4,<2024-03-06 17:19:20.04 +0400>,<she>,<DPX200>,
      <abs ABSG = 5 
       data hash MD5: 16K
       D0 C2 EF D6 D8 DB D8 88 81 01 C2 62 1F FD 01 DF>)
$$ ##END=
$$ 
$$ hash MD5
$$ 0B AC 4D E1 B8 ED 17 43 10 F4 75 BB 56 2A 09 4F
##$RELAX= 
##$RELAX= 
##$RELAX= 
##$RELAX= 
##$RELAX= 
##$RELAX= 
$$ Bruker specific parameters
$$ --------------------------
##$DU= <F:/spectra>
##$EXPNO= 1
##$NAME= <H-F>
##$PROCNO= 1
##$TYPE= <nmr>
##$USER= <she>
##$AMP= (0..31)
100 100 100 100 100 100 100 100 100 100 100 100 100 100 100 100 100 100 
100 100 100 100 100 100 100 100 100 100 100 100 100 100 
##$AQSEQ= 0
##$AQ_mod= 1
##$AUNM= <au_zg>
##$AUTOPOS= <>
##$BF1= 200.13
##$BF2= 200.13
##$BF3= 200.13
##$BF4= 200.13
##$BF5= 200.13
##$BF6= 200.13
##$BF7= 200.13
##$BF8= 200.13
##$BYTORDA= 1
##$CFDGTYP= 0
##$CFRGTYP= 5
##$CHEMSTR= <none>
##$CNST= (0..31)
1 1 145 1 1 1 1 1 1 1 1 1 1 1 1 1 1 1 1 1 1 1 1 1 1 1 1 1 1 1 1 1 
##$CPDPRG= <>
##$CPDPRG1= <>
##$CPDPRG2= <>
##$CPDPRG3= <>
##$CPDPRG4= <mlev>
##$CPDPRG5= <mlev>
##$CPDPRG6= <mlev>
##$CPDPRG7= <mlev>
##$CPDPRG8= <mlev>
##$CPDPRGB= <>
##$CPDPRGT= <>
##$D= (0..31)
0 1.2 0 0 0 0 0 0 0 0.06 0 0.03 0 0 0 0 0.0002 0 0 0 0 0 0 0 0 0 0 0 0 
0 0 0 
##$DATE= 1709731136
##$DBL= (0..7)
120 120 120 120 120 120 120 120 
##$DBP= (0..7)
150 150 150 150 150 150 150 150 
##$DBP07= 0
##$DBPNAM0= <>
##$DBPNAM1= <>
##$DBPNAM2= <>
##$DBPNAM3= <>
##$DBPNAM4= <>
$$ [...]
##$SUBNAM3= <"">
##$SUBNAM4= <"">
##$SUBNAM5= <"">
##$SUBNAM6= <"">
##$SUBNAM7= <"">
##$SUBNAM8= <"">
##$SUBNAM9= <"">
##$SW= 18.0517328524113
##$SWIBOX= (0..15)
0 0 2 0 0 0 0 0 0 0 0 0 0 0 0 0 
##$SW_h= 3612.71676300578
##$TD= 16384
##$TD0= 1
##$TE= 0
##$TE2= 300
##$TE3= 300
##$TEG= 300
##$TL= (0..7)
0 120 120 120 120 120 120 120 
##$TP= (0..7)
150 150 150 150 150 150 150 150 
##$TP07= 0
##$TPNAME0= <>
##$TPNAME1= <>
##$TPNAME2= <>
##$TPNAME3= <>
##$TPNAME4= <>
##$TPNAME5= <>
##$TPNAME6= <>
##$TPNAME7= <>
##$TPOAL= (0..7)
0.5 0.5 0.5 0.5 0.5 0.5 0.5 0.5 
##$TPOFFS= (0..7)
0 0 0 0 0 0 0 0 
##$TUNHIN= 0
##$TUNHOUT= 0
##$TUNXOUT= 0
##$USERA1= <user>
##$USERA2= <user>
##$USERA3= <user>
##$USERA4= <user>
##$USERA5= <user>
##$V9= 5
##$VALIST= <valist>
##$VCLIST= <CCCCCCCCCCCCCCC>
##$VD= 0
##$VDLIST= <DDDDDDDDDDDDDDD>
##$VPLIST= <PPPPPPPPPPPPPPP>
##$VTLIST= <TTTTTTTTTTTTTTT>
##$WBST= 1024
##$WBSW= 4
##$XGAIN= (0..3)
0 0 0 0 
##$XL= 0
##$YL= 0
##$YMAX_a= 116432
##$YMIN_a= -110779
##$ZGOPTNS= <>
##$ZL1= 120
##$ZL2= 120
##$ZL3= 120
##$ZL4= 120
##$ABSF1= 15.43067
##$ABSF2= -2.62118
##$ABSG= 5
##$ABSL= 3
##$ALPHA= 0
##$AQORDER= 0
##$ASSFAC= 0
##$ASSFACI= 0
##$ASSFACX= 0
##$ASSWID= 0
##$AUNMP= <proc_1d>
##$AZFE= 0.1
##$AZFW= 0.1
##$BCFW= 0
##$BC_mod= 2
##$BYTORDP= 0
##$COROFFS= 0
##$CY= -3
##$DATMOD= 1
##$DC= 0
##$DFILT= <>
##$DTYPP= 0
##$F1P= 0
##$F2P= 0
##$FCOR= 1
##$FTSIZE= 16384
##$FT_mod= 6
##$GAMMA= 0
##$GB= 0
##$INTBC= 1
##$INTSCL= 3.70164e-10
##$ISEN= 128
##$LB= 0.24
##$LEV0= 0
##$LPBIN= 0
##$MAXI= 10000
##$MC2= 0
##$MEAN= 0
##$ME_mod= 0
##$MI= 1.114404
##$NCOEF= 0
##$NC_proc= -6
##$NLEV= 6
##$NOISF1= 3.799351
##$NOISF2= 2.8
##$NSP= 0
##$NTH_PI= 0
##$NZP= 0
##$OFFSET= 15.43067
##$PC= 1
##$PHC0= -24949.85
##$PHC1= 17.18731
##$PH_mod= 1
##$PKNL= yes
##$PPARMOD= 0
##$PSCAL= 0
##$PSIGN= 0
##$REVERSE= no
##$SF= 200.130018217855
##$SI= 16384
##$SIGF1= 3
##$SIGF2= 2
##$SINO= 5.538805
##$SIOLD= 16384
##$SREGLST= <1H.CDCl3>
##$SSB= 0
##$STSI= 16384
##$STSR= 0
##$SW_p= 3612.71676300578
##$SYMM= 0
##$S_DEV= 0
##$TDeff= 16384
##$TDoff= 0
##$TI= <>
##$TILT= no
##$TM1= 0
##$TM2= 0
##$TOPLEV= 0
##$USERP1= <user>
##$USERP2= <user>
##$USERP3= <user>
##$USERP4= <user>
##$USERP5= <user>
##$WDW= 1
##$XDIM= 16384
##$YMAX_p= 363267408
##$YMIN_p= -817802
$$ End of Bruker specific parameters
$$ ---------------------------------
##NTUPLES= NMR SPECTRUM
##VAR_NAME=  FREQUENCY,     SPECTRUM/REAL,   SPECTRUM/IMAG
##SYMBOL=    X,             R,               I
##VAR_TYPE=  INDEPENDENT,   DEPENDENT,       DEPENDENT
##VAR_FORM=  AFFN,          ASDF,            ASDF
##VAR_DIM=   16384,         16384,           16384
##UNITS=     HZ,            ARBITRARY UNITS, ARBITRARY UNITS
##FACTOR=    0.220516191357247, 1,           1
##FIRST=     3088.14022509488, 0,            0
##LAST=      -524.576537910905, 0,           0
##MIN=       -524.576537910905, -817802,     0
##MAX=       3088.14022509488, 363267408,    0
$$ Real data points
##PAGE= N=1
##DATA TABLE= (X++(R..R)), XYDATA
$$ [...]
8759A5308p7184L6261N5267O8878r3280J691k1393M1039r891J3816l0692j8202
8747a8382k8143L9772N0615q8580r5543J16646M7064r1182l7057J13427j9759
8736a1122n3075P7026O1926m2608P514r3682R2918L2007p1032P1623n1384J491
8724B1602J4547L9435l5248p7486l0761P7926L9394j5494J3903j6794J2151m5555
8712b380L6443m7290r8173J6596J17242J4554l2095O1761j2337k19149q0014R6569
8700a48273p375N9812K5328J6103k1224K6049r3613M4484J48506L2856p5717n0767
8688d3831m6232Q1399r932R1309k578J0590q5406n7782J3131o7879M5321O4320
8676g570k035J3160M6563j7620R679k9509j006m0782j0895L8402L0645N3863j04745
$$ plain form
8759 15308 -61876 -25615 29652 98530 5250 6941 -14452 26587 16696 30512 -180 -18382
8747 -18382 -46525 -6753 43862 -44718 -140261 -23615 23449 -67733 -104790 8637 -11122
8736 -11122 -64197 12829 74755 32147 39661 -54021 38897 70904 -128 71495 20111 21602
8724 21602 36149 75584 40336 -37150 -67911 10015 49409 33915 47818 31024 43175 -2380
8712 -2380 34063 -13227 -111400 -94804 22438 36992 4897 66658 54321 -164828 -244842 -148273
8700 -148273 -155648 -95836 -70508 -54405 -75629 -49580 -143193 -98709 49797 82653 6936 -43831
8688 -43831 -90063 -8664 -18596 72713 70135 80725 -4681 -62463 -49332 -117211 -71890 -7570
8676 -7570 -9605 3555 50118 32498 42177 12668 11662 -29120 -40015 -1613 29032 82895 -21850
8663b1850p699O3107o8003J09845J7015J6608n3173p4360n0626M5749L2940o3928
8651e4375j43879J70081j5344j32998O2633K212M0124K0154j5604L6362R855m5065
8639f5844O4433j7166r073O7378o4324L6159O2229N6283N930l4157n7196j6099
8627B8553M494m3702l4638k9012J19060j04565K0332n439l085K7069L5908M5820
8615F0795p2885l4521K3959N675M6641n5630j7295l0113n6148j7353L2383R3126
8603b1366n5462K0280R3299n9944p7490L8046Q0641L203q3726j8511M3170J9913
8591a7947k3655N0020n9740L3869m4945o942R1332r4785M2964O5878m4638n587
8579a4176k0009n7262P9394l2875l0540j5723P89j793N648J12315k0709j5292
$$ plain form
8663 -21850 -29549 33558 -34445 75400 92415 109023 55850 -18510 -69136 -23387 9553 -54375
8651 -54375 -198254 -28173 -43517 -176515 -113882 -111670 -71546 -51392 -66996 -30634 -20779 -65844
8639 -65844 -1411 -18577 -27650 39728 -24596 11563 73792 130075 136005 101848 44652 28553
8627 28553 33047 -10655 -45293 -74305 44755 -59810 -39478 -44917 -48002 -20933 14975 60795
8615 60795 -12090 -46611 -22652 -16977 29664 -25966 -43261 -73374 -129522 -146875 -114492 -21366
8603 -21366 -76828 -56548 36751 -23193 -100683 -62637 18004 21207 -62519 -81030 -37860 -17947
8591 -17947 -41602 8418 -51322 -17453 -62398 -69340 21992 -72793 -29829 36049 -8589 -14176
8579 -14176 -34185 -91447 -12053 -44928 -75468 -91191 -90402 -92195 -86547 25768 5059 -10233
8567a0233M2766k266k5331o9491J4416M8872R821r862P4325p1460l4660M0629
8555G526n7015M3977j9294M4539l3253m5688R2819L4237j83908P6940O0706j39690
8543a18104L8313l7884k5385J32080Q3270l1421p3453n446k236L560L0524L2099
8531B5917r535p3160m6808J5225j07374P9248K3948J2176Q4227j10318n4041L9624
8519a20871O6777j6047j10461N229Q5748M30J4173p7699n8135J10151J0159K5433
8507f5113j5822O3164K4405j07666N8911J7687l3846K7830M3654o9249K056q3161
8495a37150K3922O6217R8274L9658o1087j4086k7237j0419o4858j9732Q62M8843
8483e6793N7073k3889J463n9808J7066o430o0768K3092N4668K5001p5085N650
$$ plain form
8567 -10233 32533 30267 4936 -64555 -50139 -1267 8554 -1308 73017 1557 -33103 7526
8555 7526 -49489 -5512 -24806 19733 -13520 -59208 33611 67848 -116060 -39120 21586 -118104
8543 -118104 -79791 -117675 -143060 -10980 72290 40869 -32584 -38030 -40266 -36706 -6182 25917
8531 25917 16382 -56778 -103586 -88361 -195735 -116487 -92539 -80363 3864 -106454 -160495 -120871
8519 -120871 -54094 -70141 -180602 -175373 -89625 -89195 -75022 -152721 -210856 -100705 -90546 -65113
8507 -65113 -80935 -17771 6634 -101032 -42121 -24434 -58280 -30450 13204 -56045 -53989 -137150
8495 -137150 -113228 -47011 51263 90921 29834 15748 -11489 -21908 -86766 -106498 -105636 -56793
8483 -56793 280 -23609 -22146 -81954 -64888 -71318 -132086 -108994 -54326 -29325 -104410 -98760
8471i8760N2958J33594l9330j35471l0660l227M6828J816l2071Q2895J15874k6918
8459F7528p5801j27965n3277J32820p482O4629l4735o4806K4154k4763R0625k3199
8447c2272o1236J6556r972O2838n902K9609L9985m1607j13453m217Q2547N054
8435c2070Q2541K9163r5346P724L2913j20965n8793J4018J15713M8326o4315l2513
8423g3604K547K5517R8580j02243r5297Q9757r1079O8761Q3208m324R7623j39668
8411d0222l9009m7691M5798L4653P04k158J39857K039n6319j19773J4192M8074
8399a9855l5199j3002q1901J19506L4700n7005l075R173J02335M6431j01681m9730
8387d9303P4885Q2013L3351j31142r5234J771o5900J0923P6507J1577q1180P90
$$ plain form
8471 -98760 -45802 87792 48462 -87009 -117669 -120896 -74068 -72252 -104323 -21428 94446 67528
8459 67528 -8273 -136238 -189515 -56695 -64177 452 -34283 -99089 -74935 -99698 -9073 -32272
8447 -32272 -93508 -76952 -86924 -24086 -29988 -379 39606 -2001 -115454 -119671 -37124 -32070
8435 -32070 50471 79634 -15712 -7988 24925 -96040 -154833 -140815 -25102 23224 -41091 -73604
8423 -73604 -71057 -45540 53040 -49203 -144500 -54743 -145822 -77061 6147 1823 99446 -40222
8411 -40222 -79231 -126922 -81124 -46471 -45767 -47925 91932 93971 37652 -82121 -67929 -19855
8399 -19855 -55054 -68056 -149957 -30451 4249 -52756 -55831 -46658 55677 102108 427 -49303
8387 -49303 25582 107595 140946 9804 -85430 -83659 -149559 -138636 -62129 -50552 -131732 -130942
8375a30942p2287k4933J03106J07165m6810Q091P0506j34178j2504J15695k7781
8364d4872j09906M1124J34236j28948Q5885N8784l2569j4850q829K5354n1048
8353d5639k1935Q6424o222N6272o3137p1758O6035L4988M7780l1628r0041q9161
8341a28022k6434J6946j270R3403K5300l3407O9423n6029r6411L6312L8796n381
8329f6774k2975M1286L8549R112K4742p7625o4371M4138k5459M8402o894M1658
8317a6211L7503o594J0002l8011m2675o9416P1921M481o7354J376j3413M989j3814
8304a37216L1314J3680n6889O0163p9822R2872O7119O1591J0255k01972q3664
8293b22569K7058K3200J06339k624j2345J245m1204j0136P8842J92905p3422M3227
$$ plain form
8375 -130942 -203229 -228162 -125056 -17891 -64701 -56610 13896 -120282 -132786 -17091 -44872
8364 -44872 -154778 -113654 20582 -108366 -22481 36303 3734 -11116 -19945 5409 -45639
8353 -45639 -67574 18850 12628 68900 5763 -65995 40 35028 82808 51180 -38861 -128022
8341 -128022 -154456 -137510 -138780 -45377 -20077 -53484 15939 -40090 -136501 -100189 -61393 -66774
8329 -66774 -89749 -48463 -9914 -802 23940 -53685 -118056 -73918 -99377 -50975 -57869 -16211
8317 -16211 21292 14698 24700 -13311 -55986 -125402 -53481 -49000 -116354 -114978 -128391 -123402 -137216
8304 -137216 -105902 -92222 -149111 -88948 -168770 -75898 -8779 52812 63067 -138905 -222569
8293 -222569 -195511 -172311 -65972 -68596 -80941 -79696 -120900 -131036 -52194 140711 67289 110516
8281A10516r5908m8725q7439m1305R7918K5855L5165q7805K5214k8891K9583m7882
8269a13704O0245N7320r5924m7747M9324k8214K7411l3101P4578o2332o4235M6629
8257a29750m6896N7337P5638Q157p6448J08947m670o9319M9850l4577m6999l2734
8245a41464M1226k326q9303M5816P3319J14073l5280p3134O2427o1525N4780j5732
8233b7123o6963j609p1075Q5904O470P9498o0947p4780Q0573K6919n7774j1883
8221i2790J9602K025r005O5434Q2912K5442j20771o5919m56j6467J00640J2743
8209C390j0762o2079k5462k0775n383P1658m1937M27n8688N0330l1254o2364n3967
8196b46866J33262j51209p9838m73151L30575R32442k41685N4392j69533Q9376
$$ plain form
8281 110516 14608 -34117 -121556 -162861 -64943 -39088 -3923 -91728 -66514 -95405 -65822 -113704
8269 -113704 -53459 3861 -92063 -139810 -90486 -118700 -91289 -124390 -49812 -112144 -176379 -129750
8257 -129750 -176646 -119309 -43671 -35514 -111962 -3015 -7685 -77004 -27154 -61731 -108730 -141464
8245 -141464 -100238 -102564 -191867 -146051 -72732 41341 6061 -67073 -4646 -66171 -11391 -27123
8233 -27123 -94086 -95695 -166770 -80866 -74396 5102 -55845 -130625 -50052 -23133 -80907 -92790
8221 -92790 -73188 -71163 -80168 -14734 68178 93620 -27151 -93070 -93526 -109993 -9353 3390
8209 3390 -7372 -69451 -94913 -115688 -121071 -49413 -91350 -90923 -149611 -99281 -130535 -192899 -246866
8196 -246866 -113604 -264813 -344651 -817802 -487227 445215 203530 257922 88389 177765
8186A77765k4543p3717j09018N5718P838n9560k446J07999p3086P563Q0043j66407
8174g1851J9438J02466l3205j17321J2528R1965J01707r7514j5294j8963n711
8163c1755J0428o8285m681J13529j17021k1501K4476P0785M6405R307K7602k2353
8151C6936l694p890j7387K1367j5228J7522l9007n0289j03576J18444J3410O5344
8139C5952R7970j48242M6321j21859m4316R3148K3396q6691l8642k3705M713N9927
8127a02028L5942P3521M2803L1628j57294j0845m897K8038j987r2650q655P2539
8115i3885P3455k1515l1437j9470L6102n8090L7009k511k2622M2990j919N1517
8103a0376Q7832j20933q5864j26835J13546R9891J1165J28730j8137m1474l1120
$$ plain form
8186 177765 153222 79505 -29513 26205 34043 -25517 -27963 80036 6950 14513 94556 -71851
8174 -71851 -52413 50053 16848 -100473 -87945 4020 105727 8213 -7081 -26044 -31755
8163 -31755 -21327 -89612 -94293 19236 -97785 -119286 -94810 -24025 22380 31687 59289 36936
8151 36936 33242 25352 7965 29332 14104 31626 -7381 -57670 -161246 -42802 -29392 35952
8139 35952 133922 -14320 32001 -89858 -134174 -41026 -17630 -104321 -142963 -166668 -161955 -102028
8127 -102028 -66086 7435 50238 81866 -75428 -86273 -91170 -63132 -65119 -157769 -166424 -93885
8115 -93885 -20430 -41945 -73382 -92852 -56750 -114840 -77831 -80342 -102964 -59974 -61893 -10376
8103 -10376 77456 -43477 -129341 -256176 -142630 -42739 -31574 97156 79019 37545 6425
8092F425P519o6708j363J24481r8547K5982K0179r6112l4661L5302N0624P202
8080a9677P7194m0254o8739j00169M8063o3472P8887Q8741n365j0639N054J7008
8068F632n8763k3517m8714L5382K0846K6750l0680J3512R7939m8676j6286l5592
8056f1167K9227M4387n4279n731L2301l6515r9027j5400P5169K923J02611j1122
8044C377p6047L9201o4345k7364m1721Q5274M0789j0363P2585J1688r0247j538
8032e8711q6119M3498L3090j5205Q9340m4065j00385M8378P0304P4081o6336m0590
8020e2720J37713J6593m0917q6842r6191k0049J19936j8525j01550J3480J30986
8009A914K2538o2687K3504N06k9199L0002L1873Q382j03728q4130m4964K02426
$$ plain form
8092 6425 13944 -52764 -54127 70354 -28193 -2211 17968 -78144 -112805 -77503 -26879 -19677
8080 -19677 57517 17263 -51476 -151645 -103582 -167054 -88167 574 -4791 -15430 -10376 6632
8068 6632 -52131 -75648 -124362 -88980 -68134 -41384 -72064 -58552 39387 -9289 -25575 -61167
8056 -61167 -31940 12447 -41832 -47563 -15262 -51777 -150804 -166204 -91035 -88112 14499 3377
8044 3377 -72670 -33469 -97814 -125178 -166899 -81625 -40836 -51199 21386 33074 -57173 -58711
8032 -58711 -144830 -101332 -68242 -83447 5893 -38172 -138557 -90179 -19875 54206 -12130 -52720
8020 -52720 84993 101586 60669 -26173 -122364 -142413 -22477 -41002 -142552 -129072 1914
8009 1914 24452 -38235 -14731 -14225 -43424 -13422 18451 26833 -76895 -161025 -205989 -3563
7997c563M1897j30636k2095N9959K0856L5558m1748l020R1349j01234l4652J21392
7985C4063J2909l8889k8545j5282k7379N8262m0593J8735j5680k5562M2061m0880
7973f6780K94M2903l5466n1004P6666L5148j2051l8093n6219J8357M7866p7046
7961a15425N3311l0698k650M0672R139j8687P8584k5647J7838k7113J9277l7637
7949c9036k7635N645j0868L861L5378j5166j6858J8118Q2924L7268l3224j00009
7937e9602k8238q7842O4478o4254j7791P0036L0637k3521K533O8340o4332n8937
7925a68493L744M2812O0425n613M9172l601r4771P1986n113J9711M9423Q3133
7913A02815j11781l1106J19851Q054j12973Q076q2823K5125j6872k0034R8729
$$ plain form
7997 -3563 38334 -92302 -114397 -54438 -33582 1976 -39772 -42792 48557 -52677 -87329 34063
7985 34063 46972 8083 -20462 -35744 -63123 -4861 -45454 -26719 -42399 -67961 -25900 -66780
7973 -66780 -66486 -23583 -59049 -110053 -33387 1761 -10290 -48383 -104602 -86245 -38379 -115425
7961 -115425 -62114 -92812 -95462 -54790 -45651 -64338 14246 -11401 6437 -20676 -1399 -39036
7949 -39036 -66671 -61026 -71894 -68033 -32655 -47821 -64679 -46561 36363 73631 40407 -59602
7937 -59602 -87840 -175682 -111204 -175458 -193249 -123213 -92576 -116097 -113564 -45224 -109556 -168493
7925 -168493 -164749 -121937 -61512 -67125 -17953 -21554 -116325 -44339 -49452 -29741 19682 102815
7913 102815 -8966 -40072 79779 87833 -25140 -17064 -99887 -74762 -91634 -111668 -12939
7902a2939P8578l3046k0533p7019Q5464P7983j15221n0454M7671O1076o487q7072
7890e1999n5687L1830j9440P025J07500M1253m7961J6062N5705j28233n4748J8065
7878h0628J648j0432N6504K8961j29302J4921J1699m9729j0506O6291n4357k4026
7866a78956J9241O824J17998j08563P0191N2181j5601O5637j22341J19271j1374
7855A4508r3031L5318r643M4721K5530k6845l8197q3263M5013J01238j4265j12827
7843a11743M7418J22813r9779M4549P162l6861J9315n9042K2302K1987j0610P2714
7831D0225J576n9147l1539m6970K9290Q9395n6079l9843l2676K3591o663M9511
7819c9329p571k2164m4556J4429Q941N0398K7526n1921l9164O4308J07889j2622
$$ plain form
7902 -12939 65639 32593 12060 -64959 20505 98488 -16733 -67187 -19516 41560 35073 -51999
7890 -51999 -107686 -75856 -95296 -88271 19229 60482 12521 28583 84288 -43945 -98693 -80628
7878 -80628 -78980 -89412 -32908 -3947 -133249 -118328 -106629 -156358 -166864 -100573 -154930 -178956
7866 -178956 -159715 -152891 -34893 -143456 -73265 -21084 -36685 28952 -93389 25882 14508
7855 14508 -78523 -43205 -52848 -8127 17403 -9442 -47639 -130902 -85889 15349 1084 -111743
7843 -111743 -64325 58488 -41291 3258 10420 -26441 -7126 -66168 -43866 -21879 -32489 40225
7831 40225 41801 -17346 -48885 -95855 -66565 22830 -33249 -73092 -105768 -82177 -88840 -39329
7819 -39329 -46900 -69064 -113620 -99191 -90250 -39852 -12326 -64247 -103411 -39103 68786 56164
7807E6164l8159p3448J6406J16129p8174k7967R3845q762m3537q6190l4808L4586
7795g3915J4369o5567J3823Q5033J4110l3350n993K8034J25242l3584j3950o4798
7783a0546j9734o8402L5267Q6957l7476j24535l4123R0173K2595K3497j7418j21336
7771a75081J49673J4362L345k5986L2850j8767p700L425j900N1248m5991N8782
7759C8260l0165j8702M1267j9811j04450p396J12891l8283l6706O13N895r6477
7747a53064R3368j6564l4141m5070o2550J38892p794m080L6377m624j21356M0506
7735a40100J00691K0384J5421l7642Q6436m2233j12415k0635l2455Q1537k8573
7724a09584K631R1710q981q4122j1033m279J15444l8871N1352m0492k9192L0027
$$ plain form
7807 56164 18005 -55443 -39037 77092 -1082 -29049 64796 56034 12497 -73693 -108501 -73915
7795 -73915 -59546 -125113 -111290 -26257 -12147 -45497 -51490 -23456 101786 68202 54252 -10546
7783 -10546 -30280 -98682 -63415 23542 -13934 -138469 -172592 -82419 -59824 -36327 -53745 -175081
7771 -175081 -25408 -11046 -7701 -33687 -837 -19604 -27304 -23879 -25779 25469 -20522 38260
7759 38260 8095 -10607 30660 10849 -93601 -100997 11894 -26389 -63095 -62482 -56587 -153064
7747 -153064 -59696 -76260 -110401 -155471 -218021 -79129 -86923 -91003 -54626 -59250 -180606 -140100
7735 -140100 -39409 -19025 -3604 -41246 45190 2957 -109458 -130093 -162548 -81011 -109584
7724 -109584 -106953 -15243 -24224 -108346 -119379 -123658 -8214 -47085 4267 -36225 -65417 -35390
7712c5390Q4732o5103m1490L5425k3025K8480j05563k6993R4190n4532n7508L1189
7700a35588P9710J16384l9743j02530q4305M0250q556j6834P5342J4905n0511
7689a11476P6812M3371L4277q0329j9433o0439p8437R6715j2301L9263N492q431
7677g4916M545J0557O3061J158p121l7303L3391j7320l7802K3285k6191L0400
7665c4256P875J4749p8537l9327O6440Q7603o8430j1675r323O2080j5158Q406
7653i553O0210j9581k0858K2639o2187J5784l7229l6373J00114K4302p308R2153
7641A22113l9900j22336J20615n28j73749N8345J32635o8296o034k5644J7014
7630A4235r8615l1692J37442p7362P3187r857m4853K6295R1880K5220p1723n8508
$$ plain form
7712 -35390 49342 -15761 -57251 -21826 -44851 -16371 -121934 -148927 -54737 -109269 -166777 -135588
7700 -135588 -55878 60506 20763 -81767 -166072 -125822 -134378 -151212 -75870 -60965 -111476
7689 -111476 -34664 8707 42984 -37345 -56778 -117217 -195654 -98939 -111240 -71977 -66485 -74916
7677 -74916 -70371 -59814 3247 4405 -2716 -40019 -6628 -23948 -61750 -38465 -64656 -34256
7665 -34256 -26381 -11632 -90169 -129496 -63056 24547 -43883 -55558 -64881 -2801 -17959 -9553
7653 -9553 50657 31076 10218 32857 -29330 -13546 -50775 -87148 12966 37268 29960 122113
7641 122113 82213 -40123 80492 79964 -93785 -35440 97195 28899 22865 -2779 14235
7630 14235 -84380 -116072 21370 -55992 17195 7338 -37515 -11220 80660 105880 34157 -24351
7618b4351n0399m3703p236J11443o4948K7180m8634M9174P006N2086k4166o5299
7606h1847l9735M7975l2317K7548P5029r7730p1552J11835j3298l3595J1698N5434
7594d0555J3822o138O3017n3269l3076R5301M24j02442O1576o0582n1127n3737
7582a66786R2527O4653r5282Q2693M0137L8546l6497r5817M3869R1345o0493j3438
7570a4543L8715M517Q396j19590j5081J92761l6875j88921L6238R6884N5356r7073
7558c9216o3368M4074K5773k6251L64Q2234l2468K2961P298j316j13655l643Q7033
7545a0180j2787J09573q7494O9543r3569k9074P9503k5540o147l6040J08102o8127
7533b237m541o4590M3696O3142p5864n9359O9143K5067p7423R6417J4645o7735
$$ plain form
7618 -24351 -74750 -118453 -125689 -14246 -79194 -52014 -100648 -51474 -44468 7618 -16548 -81847
7606 -81847 -121582 -73607 -105924 -78376 -3347 -101077 -172629 -60794 -74092 -107687 -95989 -40555
7594 -40555 -26733 -32871 30146 -23123 -56199 39102 39526 -62916 -1340 -61922 -113049 -166786
7582 -166786 -74259 -9606 -104888 -22195 17942 56488 19991 -75826 -31957 59388 -1105 -14543
7570 -14543 24172 28689 37085 -82505 -97586 95175 58300 -130621 -94383 2501 57857 -39216
7558 -39216 -102584 -58510 -32737 -58988 -58624 23610 -8858 14103 21401 20085 -93570 -97213 -10180
7545 -10180 -22967 86606 -888 68655 -24914 -53988 25515 -25 -6172 -42212 65890 -2237
7533 -2237 -6778 -71368 -27672 35470 -40394 -99753 -30610 -5543 -82966 13451 28096 -39639
7521c9639r8640P3554m7722M9146L5882l6016n2727K1737j450k5423P6222M6855
7509A779k6326K8921P3394r7579l0400l0775r1402l3079R210O3987K4840J7212
7497i0218J23271j0783j37708Q874L7303Q6617n1970o2149l6673Q3921J09393
7486E9878j0896l4875l8272r204j4045l5556k9667Q5611R535M3979j2136k8994
7474a4642n677j3220J0454N3183q0466P5415M8166p9603l4328n2803j5024R119
7462i9426O7478o8495O5609N63k8356k0882R7408L9827j39806R5424P349J8053
7450C4746J950M1154L5115j31044p3609O1677O844J2271m4634J3842M9484J8226
7438B6022k3369q5586j3980M6948L0118q1832R1704M9241r1323j1603o76O2561
$$ plain form
7521 -39639 -138279 -64725 -112447 -63301 -27419 -63435 -116162 -94425 -95875 -121298 -45076 1779
7509 1779 -24547 4374 77768 -19811 -50211 -80986 -172388 -205467 -196257 -132270 -107430 -90218
7497 -90218 33053 22270 -115438 -106564 -69261 17356 -34614 -96763 -133436 -49515 59878
7486 59878 48982 14107 -24165 -33369 -47414 -82970 -112637 -27026 -17491 26488 14352 -14642
7474 -14642 -20319 -33539 -23085 30098 -50368 25047 73213 -6390 -40718 -93521 -108545 -99426
7462 -99426 -31948 -100443 -34834 -34271 -62627 -83509 13899 53726 -86080 9344 16693 34746
7450 34746 36696 77850 112965 -18079 -91688 -30011 -23167 -10896 -55530 -41688 7796 26022
7438 26022 2653 -82933 -96913 -49965 -19847 -101679 -9975 39266 -52057 -63660 -64336 -1775
7426a775r4798l7187N2770J27504J7928l7828j8533p0036O8814l1195M3786p257
7414A2193J2048J7008K4573l8590j51962k5583K5638J07779q0651p2257J1815
7403a57989K1972Q6610P4501K2865k9796q3764p7695O6442M6106k9532p192k3777
7391i1249N8420q6802K9951J15113p5698Q7997q7657j9779K7281o7988Q7748J5802
7379f861p509m2588J829J0140L4945J0602n4790L460L6187m0949p5079k3133P8673
7366g5073M4769n0867J02019l2675J9056Q8411l7547K9298j969p4613j9521l6542
7354d5254M1086L2551O4083j4708r2282N0990J3589n9357L0387L646J8394j34202
7342i1077R005K84Q7919P7757l2488J1089P197R901m7755l3913m3933J6584L9700
$$ plain form
7426 -1775 -96573 -133760 -80990 46514 64442 26614 8081 -61955 6859 -24336 19450 12193
7414 12193 24241 41249 65822 27232 -124730 -150313 -124675 -16896 -97547 -169804 -157989
7403 -157989 -136017 -49407 25094 47959 18163 -65601 -143296 -76854 -30748 -60280 -67472 -91249
7391 -91249 -32829 -119631 -89680 25433 -50265 37732 -49925 -69704 -42423 -110411 -22663 -6861
7379 -6861 -14370 -56958 -55129 -44989 -10044 558 -54232 -50772 -14585 -55534 -130613 -153746 -75073
7366 -75073 -30304 -81171 20848 -11827 7229 95640 58093 87391 85422 10809 -8712 -45254
7354 -45254 -4168 28383 92466 77758 -14524 36466 50055 -9302 21085 24731 43125 -91077
7342 -91077 -82072 -81788 6131 83888 51400 62489 69686 79587 31832 -2081 -46014 -29430 10270
7329A0270l2155M7901J15514r6570L94j26519m5706J40860M6723m6903j7209J9881
7317A6481N370r4206m5560O873R8903K6636Q8071p9108q9230M0162J6166L867
7305e575N2298q5990n5828N6426p9670N6563J40449m2382m5935O1893j13850l0837
7293i2438K6200n035l8617R5379J6804n8163J9537o4114N9743O2596Q368o9495
7281c9235r2124J06259m7819l892M869J8350L9130k1209O873O5325K3032M6225
7269A05784r9508L0031j2546r561M8560o9157n2153K2364k8546J6263P1728m6589
7257b3330K8350M0021k9382j183l6789m308k6570m1272N9883q3529O8015K8577
7245b1517M526M4489K3445p4699L5699J13017j35188l4360J09252n5036M7727
$$ plain form
7329 10270 -21885 26016 141530 44960 45354 -81165 -126871 13989 60712 13809 -3400 16481
7317 16481 21851 -72355 -117915 -111042 -12139 14497 102568 23460 -65770 -25608 -9442 -5575
7305 -5575 46723 -39267 -95095 -38669 -118339 -61776 78673 36291 -9644 52249 -61601 -92438
7293 -92438 -66238 -71273 -109890 -14511 2293 -55870 -36333 -100447 -40704 21892 30260 -39235
7281 -39235 -131359 -25100 -72919 -76811 -71942 -53592 -14462 -35671 -28798 36527 59559 105784
7269 105784 6276 36307 23761 14200 62760 -6397 -58550 -36186 -64732 -48469 23259 -23330
7257 -23330 5020 45041 15659 14476 -22313 -26621 -53191 -94463 -34580 -118109 -50094 -21517
7245 -21517 -16991 27498 50943 -23756 11943 124960 -10228 -44588 64664 9628 57355
7234E7355j6155K0932k9183n1482j10268N7644J20100q3843j3026O04L0003M966
7222a2353L5315O8332p0343k0823q2395M6613J29239O3793j19415o580J234Q16
7210C3433k7751o3581R612r470P2168k509l0542k0978K8225k8344M1061p3587
7198g2263N7589J11991p5937j0164N8450O7530j5299j03137L249j6057j2411r4740
7186a01199k0384j0162j192J6762j2479J14995K6357o9692M6997q608J8130M1870
7174D1395O1233j47955p385k4531O3624N4695m8812k5864J7388j642L6601M5445
7162F4192j01088O9407k1532O9717L6266q0072j94515P647P7075M7876M5867n7905
7150c7065J6581k9717J4983K0423L939J1490o7051m3778L7620L5785j1797Q7288
$$ plain form
7234 57355 41200 62132 32949 -18533 -128801 -71157 48943 -34900 -47926 -47322 -17319 -12353
7222 -12353 22962 91294 20951 128 -82267 -35654 93585 157378 37963 31383 32617 33433
7210 33433 5682 -57899 -48287 -57757 14411 11902 -18640 -39618 -11393 -39737 1324 -72263
7198 -72263 -14674 97317 21380 11216 69666 137196 121897 18760 22009 5952 -6459 -101199
7186 -101199 -121583 -131745 -132937 -116175 -128654 -13659 12698 -56994 -9997 -18605 -475 41395
7174 41395 102628 -45327 -52712 -77243 -13619 41076 -7736 -33600 -16212 -17854 18747 64192
7162 64192 -36896 32511 10979 80696 116962 36890 -157625 -149978 -72903 -25027 20840 -37065
7150 -37065 -20484 -50201 -35218 -14795 -10856 634 -66417 -110195 -72575 -36790 -48587 38701
7138C8701m8892p3236J1904L6061L9512K8497q8243K1699K4677q6056j4150Q3713
7126b5813L89m6842M8530l8607J620j5985K5640Q6662j4471q4238K6696Q1211
7114D4792n051n1889l480m9694J8510Q6316O419q5284j7386M1950N3247N2j9489
7101A9013Q6948O0070j17509m3554m9342N23J4223j5397M4423Q3111q9049m827
7089a1367J1390m5241R9765L411j08183j03584J8216J46530J6859m1476l367q347
7077b5394K7753l8979l0729k31J06915k802o219K3775j2511p2067n0199m7006
7065a27694Q9022L5953o2520L2305k8037M1235l6042o9953J48383l2390k5290
7054c5028K0230J7667l9458J6688l5526l0505J5173J17578l8464l3037j1980j9238
$$ plain form
7138 38701 -10191 -83427 -71523 -35462 4050 32547 -55696 -33997 -9320 -95376 -109526 -25813
7126 -25813 -25424 -72266 -23736 -62343 -60723 -76708 -51068 35594 21123 -63115 -36419 44792
7114 44792 39741 -12148 -15628 -65322 -46812 39504 45923 -39361 -56747 -14797 38450 38502 19013
7101 19013 105961 166031 48522 4968 -44374 -43851 -29628 -45025 -602 82509 -6540 -11367
7089 -11367 23 -45218 54547 57958 -50225 -153809 -135593 10937 27796 -13680 -17047 -25394
7077 -25394 2359 -36620 -67349 -67580 39335 36533 30314 54089 41578 -30489 -80688 -127694
7065 -127694 -38672 -2719 -65239 -32934 -60971 -19736 -55778 -125731 22652 -9738 -35028
7054 -35028 -14798 2869 -36589 -19901 -55427 -85932 -70759 46819 8355 -24682 -36662 -55900
7042e5900J4699L4549l898k7158q4982n59J02842n0104K351N9372P267n1037K1846
7029c0712l3435M0420p7959l0010J1635M6881L3009P6351O2111m5150l8822M3908
7017E8227P5569j01895m7448K5057P88p9433j367L3203p3801M9027j3194K1407
7005e3860N2236K9866n276O2038k0037l0228P3934m3205j15722l4449n4682n503
6993a44888J1055P7056J832L7032k018n3783l9561J1470O2630N2923N4337K0906
6981H8991j28228L9365R560j13022M8553k4361L7568K6942l3132n1062k292M1689
6969e9429q455M7478q0086q6034L6045J00184M4893k3135j2800n3243J14661K6015
6957D6094J455M5772N7663n9488k8056o3398k6507K89L9235O2173K064p3791j014
$$ plain form
7042 -55900 -41201 -6652 -10550 -37708 -122690 -123249 -20407 -70511 -68160 -8788 -1521 -52558 -30712
7029 -30712 -64147 -23727 -101686 -131696 -120061 -73180 -40171 36180 98291 53141 14319 58227
7017 58227 133796 31901 -15547 9510 10298 -69135 -70502 -37299 -111100 -62073 -75267 -53860
7005 -53860 -1624 28242 22966 85004 64967 34739 108673 65468 -50254 -84703 -139385 -144888
6993 -144888 -133833 -56777 -54945 -17913 -19931 -73714 -113275 -101805 -39175 13748 68085 88991
6981 88991 -39237 128 9688 -103334 -54781 -79142 -41574 -14632 -47764 -98826 -101118 -59429
6969 -59429 -67884 -20406 -100492 -186526 -150481 -50297 -5404 -28539 -41339 -94582 20079 46094
6957 46094 47549 93321 150984 91496 63440 42 -26465 -26176 13059 75232 77296 3505 2491
6944B491l3065k7445K2740r0736R3157O2420L5844l3068k9530M3147o3892l6263
6932e4200K8462J7898q870J56460n0771J8535p7099l4223J18992j0177M116j17150
6920h027l7455p8792M7137j9738R0533J8664n030q2646m5716J11507j6843K9718
6908C312n7626L3915j15170m1676r797P5821J07007P7588j0302r4705k4825M0509
6896a5949M4637j8529Q7130J20523l6069l6281l5097j73930q2773J16855m8083
6885g7566P4770o6788p5614N1572N5537N6813l3255o035J6065j2696k0247L7164
6873b80p734l2985j5300P4547M3985K3213j58160k1676l0157O7517j9628O4895
6861a1763L3792j0901j1596j01410Q692R7654Q584j9411L6341J0144L1424L8009
$$ plain form
6944 2491 -30574 -58019 -35279 -126015 -32858 29562 65406 32338 2808 45955 -17937 -54200
6932 -54200 -25738 -7840 -16710 139750 88979 107514 30415 -3808 115184 105007 109123 -8027
6920 -8027 -45482 -124274 -77137 -96875 -6342 12322 7292 -75354 -121070 -9563 -26406 3312
6908 3312 -54314 -20399 -135569 -177245 -187042 -111221 -4214 73374 63072 -31633 -56458 -15949
6896 -15949 28688 10159 97289 217812 181743 145462 110365 -63565 -146338 -29483 -77566
6885 -77566 -2796 -69584 -145198 -93626 -38089 18724 -14531 -20566 -4501 -17197 -37444 -280
6873 -280 -8014 -40999 -56299 18248 62233 85446 -72714 -94390 -124547 -57030 -76658 -11763
6861 -11763 22029 11128 -468 -101878 -93186 4468 13052 -6359 29982 40126 71550 109559
6849A09559m9025j19804R902L5494N7451P8350j4232j10665o5923J4776L0424
6838b3693P5006j7908o8859p3846L1944Q9283L7298p7446M1888j8126j20841N0849
6826g4451j2163j3165P5752K5030M3494q1554l0573l831m9064M806Q7520N5927
6814B7728J8031J4386j3343M575M566M230O4191o0409o1503O135k2349P079m0444
6801d7127Q6919l7045m2147M3102J295J16296l8591m3338m2393q8575R7952N5814
6789F2162l690q4425o573j2283J22359N0357j25146J5705k9395N7911R929j36220
6777g9309P2709P69K3435L5214o1462p7607R1604J6554N5630p423k9887n0070
6765i843j5443P5582o909o0404O0776j4502L3957k2268n8483p8591K7047M538
$$ plain form
6849 109559 60534 -59270 -49368 -13874 43577 121927 107695 -2970 -68893 -54117 -23693
6838 -23693 51313 33405 -35454 -109300 -77356 11927 49225 -28221 13667 -4459 -125300 -74451
6826 -74451 -86614 -99779 -24027 1003 44497 -37057 -67630 -71461 -120525 -115719 -28199 27728
6814 27728 45759 60145 46802 51377 55943 60173 124364 63955 2452 8587 -13762 -6683 -47127
6801 -47127 39792 2747 -39400 3702 4997 121293 82702 39364 -3029 -91604 6348 62162
6789 62162 58472 -25953 -32526 -44809 77550 127907 2761 18466 -10929 46982 56911 -79309
6777 -79309 -6600 -5831 17604 52818 -8644 -86251 5353 21907 77537 70114 40227 -9843
6765 -9843 -25286 50296 43387 -17017 43759 29257 63214 40946 -17537 -96128 -69081 -64543
6753f4543k6273R9694k533k7060R4611m1025j25063J40486m7421l6632J03693
6742F7934n2222m207J5187m6459L0592m7238J12645M6078j13757m8519M8227M8915
6730E7176K5084J4032m4557j4991j2331J2627Q1328m0557o5545p359M9806j4185
6718D0528n7888J18302j2794p0193j9254q8558l468N9885L7302n3872R4617O8708
6706A13315p5542K10N1370N9995p8117J1646l461j1659K3758n2532m5572M562
6694b027M2931j2291N9733M7040p7738l3912p0531O6805P2921p7619M5645q8321
6682b7364L9249O026N8015O1342m9546R6073l047j42697N384J0193p0400L1537
6670A4765r963J9820J14113k1625L9850q9494L3214q507J5315m3558J728M61l9605
$$ plain form
6753 -64543 -90816 8878 6345 -20715 73896 32871 -92192 48294 873 -35759 67934
6742 67934 15712 11505 26692 -19767 10825 -36413 76232 122310 8553 -39966 8261 57176
6730 57176 82260 96292 51735 36744 24413 37040 118368 77811 12266 4907 54713 40528
6718 40528 -17360 100942 88148 17955 -1299 -89857 -93325 -33440 3862 -50010 44607 113315
6706 113315 37773 37983 89353 149348 71231 82877 79416 67757 91515 38983 -6589 -2027
6694 -2027 40904 28613 88346 135386 57648 23736 -46795 20010 92931 15312 60957 -27364
6682 -27364 11885 17911 75926 137268 87722 183795 180748 38051 43435 53628 -16772 14765
6670 14765 4802 24622 138735 117110 156960 67466 100680 92173 107488 63930 65658 66119 26514
6657B6514L8925p8397L1549L0767j51703O6174R0003K8549M2606k8874k2593J8944
6645I2464k9475m0534n855N0332q3105n7852P5944R5074k7432m8935o7978j0212
6633e7564R2769n3003P0706m677P3110k4081k8630o6103N7554n7390J01121q1118
6621B2694J8472N6685o1144l539M6333K1917k5551Q2671M4607q4206j88969J04221
6609C4191K3095j4454Q377n0797Q0788L8574O4788j30280j398N5609n1534l4563
6597B2396O4384L6611K4478L0362j18288J36364r699o2152p7414J15267q081L762
6585A57990J09821m2041r4054r985N8160r5967M0520O2117o8591n463m5525L4130
6573A01112N7851K4516J2790o5162J00154n7084m2333j8109J37282j07855k1838
$$ plain form
6657 26514 65439 -12958 18591 49358 -102345 -36171 53832 82381 124987 96113 73520 92464
6645 92464 62989 22455 16600 66932 -16173 -74025 1919 96993 69561 20626 -47352 -57564
6633 -57564 35205 -17798 52908 48231 121341 97260 68630 2527 60081 2691 103812 22694
6621 22694 41166 97851 36707 33168 79501 101418 75867 158538 203145 118939 -70030 34191
6609 34191 57286 42832 51209 412 81200 119774 184562 54282 52884 108493 56959 22396
6597 22396 86780 123391 147869 178231 59943 196307 186608 124456 47042 162309 154228 157990
6585 157990 267811 225770 131716 121731 179891 83924 124444 186561 117970 112507 66982 101112
6573 101112 158963 183479 196269 131107 231261 174177 131844 113735 251017 143162 121324
6562A21324N0540m4534P5915L5752l5503K2189n6934l7075R2530L5193J8732o3893
6550B14236k2753k9067M8560K8176p418r0409P9047K4442p7074j8478O2105j266
6538B10101p5313l5059O640L4267J15090m166j5837J05688J146l2941o0930J7211
6526B65897K3073p5870m8394q0858K9511R7134O0904J0383j4029k5216J8010J8253
6514B78798m7012j21574K4535O6379J4439o4907j60585L9361O6992p302P2581
6503A61705J5653N3847L811l2698l5760j3885O6011J3021M314n8942O4280n7917
6491A83440l7797Q2282O0998N8746n377O7048m2475m4636o816j13447J02754O1428
6479C66148m2615n3506j4086L9884J6457l4515Q2189k6369n0994O9159l0227p7075
$$ plain form
6562 121324 171864 127330 203245 238997 203494 225683 168749 131674 224204 259397 278129 214236
6550 214236 191483 162416 210976 239152 231734 141325 220372 244814 167740 149262 211367 210101
6538 210101 134788 99729 106369 140636 255726 251560 235723 341411 342557 309616 248686 265897
6526 265897 288970 213100 164706 83848 113359 210493 271397 281780 267751 242535 260545 278798
6514 278798 231786 110212 134747 201126 215565 150658 -9927 29434 96426 89124 161705
6503 161705 177358 231205 235016 202318 166558 152673 218684 231705 236019 177077 241357 183440
6491 183440 145643 227925 288923 347669 342292 409340 366865 322229 315413 201966 304720 366148
6479 366148 323533 270027 255941 295825 312282 277767 359956 333587 282593 351752 321525 244450
6467B44450J5434J02002O1104J6950K4724R0379l3237k5907j2875N999l8615L1335
6455D81743J20758M0353j481r8152Q3477L7865N4765K744j14392l5363Q4321r820
6443F46818k615n8148m6102o707M0633M4637K0071Q8043k1780m5282J30910l0715
6431G59763r7300O3110K0030k9186m6683L4151k8413j1745M1124Q0986j3531R444
6419G81750j34296N0155K3034o7782J8410k0709n497K5080o4977P4272Q187M6324
6407G33951j00066P1231N1790m0366k0706L3408j2592l4238j6398n8780n2232
6396E55002R4287q601k2416N012k5890m9849Q187J572M0489L6417j63093Q9074
6384E60191L3485N8545p8738J7860j1443J27851m1021m6366o540K866l46J0938
$$ plain form
6467 244450 259884 361886 422990 439940 464664 555043 521806 495899 483024 489023 450408 481743
6455 481743 602501 642854 641373 543221 626698 664563 719328 722072 607680 572317 656638 646818
6443 646818 644203 586055 539953 533246 573879 618516 638587 726630 704850 659568 790478 759763
6431 759763 662463 725573 745603 716417 669734 703885 675472 663727 704851 785837 772306 781750
6419 781750 647454 697609 720643 652861 671271 650562 645065 670145 605168 679440 687627 733951
6407 733951 633885 705116 756906 716540 695834 729242 716650 682412 666014 607234 555002
6396 555002 649289 640688 618272 623284 597394 547545 555732 557304 597793 634210 471117 560191
6384 560191 593676 652221 573483 591343 579900 707751 666730 620364 613824 616690 616344 627282
6372F27282j582Q3089O4457j76217J0523j2213p1059N4808J04164m5542o5311
6361E72399J41399k757K4106J549K0257k5446M895N8489Q086j4381P732j604n879
6348G88845p0963N8406J01498m4970l3883J8432L1728n9355j4829k089Q4627R5467
6336I52914j03184N1856K5543M2480k0353l1271R4929R1211R2657p9562M950n7535
6324A064635L3185J54338K9566j4952L5171J9208Q6644k7359q5639M7537Q5223
6313A427557m440N2557J02850K1123l7304K6483M1079P3105R4866k1895R2132
6302A868113N8453J41826R0401n2831J75576J20374k8898M2074R6643J439J33367
6291B646537J6537J61557J30835J51550J05902J29097O5256P4376K30051K05242
$$ plain form
6372 627282 625700 708789 773246 597029 607552 595339 524280 579088 683252 637710 572399
6361 572399 713798 711041 735147 736696 756953 731507 736402 794891 802977 788596 796328 794724 788845
6348 788845 717882 776288 877786 832816 798933 817365 849093 789738 774909 772820 857447 952914
6336 952914 849730 901586 927129 969609 949256 917985 1012914 1104125 1196782 1117220 1122170 1064635
6324 1064635 1097820 1252158 1281724 1266772 1301943 1321151 1407795 1380436 1294797 1342334 1427557
6313 1427557 1423117 1475674 1578524 1599647 1562343 1588826 1629905 1703010 1797876 1775981 1868113
6302 1868113 1926566 2068392 2158793 2105962 2281538 2401912 2373014 2415088 2511731 2513170 2646537
6291 2646537 2663074 2824631 2955466 3107016 3212918 3342015 3407271 3481647 3711698 3916940
6281C916940N6862Q4357K16369O8437K34309J12670P0562J67439N4198L2912Q3852
6270E098907N4156O0559Q671J39892J05150k222j2504R0806J66794J08794J41164
6259E960167J85132l0063J88046K82471J12125J38459J67719N5713m394r1128
6249F964247o668n0162q4124k32957j60272j20560j45011j89688k32613q1615
6239E660577j46064j53306j87662o0173m1277R047j03170q0952J8245M1457j76081
6228D780641j23577j28939r0339r4201j58305j96379j92436j18411j52149j54878
6218C371027j68813j20327k18028q6278j79337p5822q5414j37517j37050k05675
6208A956766p9699Q913j32457o1911j9783k0374k6967p8362J885n4982q3621r3551
$$ plain form
6281 3916940 3973802 4058159 4274528 4342965 4577274 4689944 4760506 4927945 4982143 5015055 5098907
6270 5098907 5153063 5213622 5222293 5362185 5467335 5465113 5452609 5543415 5710209 5819003 5960167
6259 5960167 6145299 6115236 6303282 6585753 6697878 6836337 7004056 7059769 7055375 6964247
6249 6964247 6957579 6907417 6823293 6590336 6430064 6309504 6164493 5974805 5742192 5660577
6239 5660577 5514513 5361207 5173545 5113372 5072095 5081142 4977972 4897020 4915265 4956722 4780641
6228 4780641 4657064 4528125 4437786 4343585 4185280 3988901 3796465 3678054 3525905 3371027
6218 3371027 3202214 3081887 2863859 2777581 2598244 2522422 2437008 2299491 2162441 1956766
6208 1956766 1877067 1885980 1753523 1691612 1671829 1651455 1624488 1546126 1548011 1493029 1409408 1315857
6196A315857R394q685q8158j86525m9780O7748j3465l9628J3823j2254j9439j16605
6184H72283L3672Q95J4728q5041K5050L750p8749n3530k9739r5975J27939L8673
6172G73956r5522n7203L4062M1252j10057j0879O9490M5246j33069L840K2409
6161E83525o951o3210j8589L7709l1096j22446M9046L1161m8200J10852l1822
6150D89979j1444p4268k9451N0174j03516l1096N2187L4939L5390M9491M2847
6139E05232k278l3710j36614N8741J18934j07481P5493j00328m3893K1028L7400
6128C92524K5437L4906o8777j8172p193m9726O5843R9918m7591o2130j8919P6452
6116D22572m7751k1797M0387j4655N7023j6829n5140n9233L1995l5468j3713M9664
$$ plain form
6196 1315857 1325251 1316566 1228408 1041883 992103 1059851 1046386 1006758 1020581 1008327 988888 872283
6184 872283 905955 906850 921578 836537 861587 865337 786588 733058 703319 607344 735283 773956
6172 773956 678434 621231 655293 696545 586488 575609 645099 690345 557276 561116 583525
6161 583525 576574 513364 494775 532484 501388 378942 427988 459149 410949 521801 489979
6150 489979 478535 404267 374816 424990 321474 290378 342565 377504 412894 462385 505232
6139 505232 502954 469244 332630 391371 510305 402824 478317 377989 334096 355124 392524
6128 392524 417961 452867 384090 365918 358725 308999 374842 474760 427169 365039 346120 422572
6116 422572 374821 353024 393411 378756 435779 418950 363810 304577 336572 301104 287391 337055
6104C37055L4541K1977j37545q1558o1066J06082J23383L9396k2261r1409p6176
6093A92419n1086P2652Q931R9583J8596o9338O6522p2922r7334J19489L5259j8483
6081C04288K4477n0532m4095J07411J09381p5554j07175K3858l2462R550K215
6070B71362J3479k1783j9324J7665P5555K3047q8752L561l5175R3536m3904o4298
6058B24969M2424K3581P611P0907Q415j14428K526j2284J7564J1211M7177k4425
6046C05248l8488n5659J180K9454o1282p1997K4866L5692P1486J02103M08k3086
6034C19925q350j2346l1045N3447p9656n3286k4046J0014K9083R974L4990N7407
6022C06111q7781k8059L0142o305J0805K8000r8507p5575K2491J03442M2924o9371
$$ plain form
6104 337055 371596 393573 256028 174470 113404 219486 342869 382265 360004 268595 192419
6093 192419 141333 213985 222916 322499 341095 271757 338279 265357 168023 287512 322771 304288
6081 304288 328765 278233 234138 341549 450930 375376 268201 292059 259597 269147 271362
6070 271362 284841 263058 243734 261399 336954 360001 271249 274810 239635 333171 289267 224969
6058 224969 267393 290974 298585 369492 377907 263479 266005 253721 271285 282496 329673 305248
6046 305248 266760 211101 212281 241735 180453 108456 133322 169014 240500 342603 343011 319925
6034 319925 311575 299229 268184 321631 241975 188689 164643 174657 203740 213714 248704 306111
6022 306111 218330 190271 220413 214108 224913 252913 154406 78831 101322 204764 247688 178317
6010A78317P9087J7851p6647r729L5130m3564Q9367J8735r7348J5529K6432L327
5998B36487J3723l6110J00227j05566N8696j6258q0769m5210P7473Q9642M7775
5987C40110q0908P5416L6441q6719l9119j8330P0992j0086O7429j542k3813r164
5975C20707j3717n3472m4480p2770N5620J48778J19535r4698K7404m5436o2888
5964B84583l7982M8826N0321P1476p4488l9978L3521j23356j37305R8189J47136
5953C20943l3122L0258L1710j6266j4395j5070J7006j5062o915P4605N69M1952
5941D16213l9817j44646M2570Q6654j04279K2931J4245R4225p4259q377J7673
5930C23133K8201K9899r7978o0351N1167j6878J39563j07191k5465P2981k7781
$$ plain form
6010 178317 257404 275255 198608 188879 224009 180445 269812 288547 191199 206728 233160 236487
5998 236487 250210 214100 314327 208761 267457 251199 170430 125220 202693 292335 340110
5987 340110 259202 334618 371059 284340 245221 226891 297883 287797 355226 353684 329871 320707
5975 320707 306990 253518 209038 136268 191888 340666 460201 365503 392907 347471 284583
5964 284583 246601 295427 345748 417224 342736 302758 336279 212923 75618 173807 320943
5953 320943 287821 318079 349789 333523 319128 304058 321064 306002 299087 373692 374261 416213
5941 416213 376396 231750 274320 360974 256695 279626 293871 388096 313837 305460 323133
5930 323133 351334 381233 283255 222904 274071 257193 396756 289565 264100 337081 309300
5919C09300M2104o6376J8235k3391k4639J5574m3762l3187L2185M0750k232j9322
5907B45239K6894O7023j2640K8766n6054m0578o0399L7671R5181j7387L0240p2947
5895B71009o1413l2376R0013k1260L9901N352k9770J29963J9564l8650J4757n6174
5883C30916Q6138r0104N0299l6751j7843N5246q0665L3069K6389m2692L8854j1525
5871C41331M6583J7172l0891j43130r042O655R2134n9813k7049P1352M0817k0025
5859C26094J20202m5463K8751O7526n5008O1297j40815o6607J3570N2844l0542
5848C31849m3879L7290j16905J04762O9288K3549J9883l3918k7508p1016J23088
5837D16483N1469k3892R882o3087Q330J7398l8397J02054L8690J6703k3503J3053
$$ plain form
5919 309300 351404 285028 303263 279872 255233 270807 227045 193858 226043 266793 264561 245239
5907 245239 272133 339156 326516 355282 299228 258650 198251 235922 331103 313716 343956 271009
5895 271009 209596 177220 267233 245973 285874 291226 261456 391419 410983 372333 387090 330916
5883 330916 417054 326950 377249 340498 322655 377901 297236 330305 356694 314002 352856 341331
5871 341331 387914 405086 374195 231065 222023 228678 320812 260999 233950 305302 346119 326094
5859 326094 446296 400833 429584 497110 442102 503399 362584 295977 309547 362391 331849
5848 331849 287970 325260 208355 313117 382405 405954 425837 391919 364411 293395 416483
5837 416483 467952 444060 453942 390855 399185 416583 378186 480240 518930 535633 512130 525183
5825E25183O875q341m5086N360P305R9861j0043N9280j20818J6080r7848J4242
5813D52050P4429p367N6698o8439j4511J05022j22389L0125k9439P9569N7013
5802F12761q979M1881n2802o1465k6626O4369n7853J32207l5401n039k0262o1255
5790E21536K4063N3245k4305j6764l7327M4926l865N7322N7035O69q515N3213
5778G21233O541n9504l800k5042j5387O4952R5625o5698k5301P2936j9419Q448
5766G55584R0984K5819q736m1796K186M7066m0476l7543M4768J5263L6159l120
5754H86158J01133R0807P1929m0577r6105r2913O4923L1562J9792N6861P6946
5743A170516p1503J9923M026o3430M8237N9676j16825O5123L2423K2462J14133
$$ plain form
5825 525183 532058 523717 478631 483991 491296 591157 581114 640394 519576 535656 437808 452050
5813 452050 526479 519112 575810 507371 492860 597882 475493 505618 476179 555748 612761
5802 612761 603782 645663 592861 531396 504770 569139 511286 643493 608092 603053 582791 521536
5790 521536 545599 598844 574539 557775 520448 565374 561509 618831 675866 676535 668020 721233
5778 721233 727774 668270 664470 639428 624041 688993 784618 718920 693619 766555 747136 755584
5766 755584 846568 872387 863651 821855 824041 871107 830631 793088 837856 853119 889278 886158
5754 886158 987291 1078098 1150027 1109450 1013345 920432 985355 1016917 1036709 1093570 1170516
5743 1170516 1099013 1118936 1122962 1059532 1107769 1167445 1050620 1115743 1148166 1170628 1284761
5732A284761r5287M9143J9884q2144l2906O3954J5184Q1885j9602q2904N6568
5721A258536J87455J8973q6573j2001J045L3735p677Q6506n4471j6077k3054O8900
5709A455297P3206l4070J10512k9920j02784o6334Q9893M5907N5383j42419j06776
5698A347895O5167N4996Q7664l5305l6326N6408J6321O267J19964l9260j44780
5687A499011P8686M3495N0072p8803j0140m7089J14873l5552j6657j0677K9822
5676A617041K5470o0732p3493O0172O8013l2149k319m6737J9042R198L6496r573
5664A610429N3741k4749O6010O8842q2051q1309Q1355M6436l0147O6074k6500
5653A748131p56M7097N1521j07716M6810l9029R6957Q8533o2963O5144J41688
$$ plain form
5732 1284761 1189474 1238617 1258501 1176357 1143451 1207405 1222589 1304474 1284872 1201968 1258536
5721 1258536 1445991 1464964 1378391 1366390 1367435 1401170 1393493 1479999 1425528 1409451 1386397 1455297
5709 1455297 1528503 1494433 1604945 1575025 1472241 1405907 1495800 1541707 1597090 1454671 1347895
5698 1347895 1413062 1468058 1555722 1520417 1484091 1540499 1556820 1563087 1683051 1643791 1499011
5687 1499011 1577697 1621192 1671264 1592461 1582321 1535232 1650105 1614553 1597896 1587219 1617041
5676 1617041 1642511 1581779 1508286 1568458 1636471 1604322 1602003 1555266 1574308 1583506 1620002 1610429
5664 1610429 1664170 1639421 1705431 1774273 1692222 1610913 1692268 1738704 1708557 1774631 1748131
5653 1748131 1747375 1794472 1845993 1738277 1785087 1746058 1843015 1931548 1868585 1933729 2075417
5642B075417J9665p5677m47o808M7804L7151N9612j4555P7906n4514O8281J02805
5630B336640j9148K216L2069q5739J00013J03608L9399P104K7418J3914q4874
5619B472620L1382L978q0326O1109l4439J7436N2405Q8313J52757M0319o6326
5608B739228j533J00909l0033O8697M2976K3540Q7252P7160k8763Q9447J16253
5597C285133L8906K0108p4389Q807l4707N6430N5550K5486P2080o755k2212R6076
5585C520513N695N862K8877J8966J07419O184J80600R6979R4929j6963J55167
5574D204228J26067L4844J11472L6766j6281J8949R1107N6071m1155p0498N4696
5563D606266M3010J22254O8772L3383N7657J12201M3134J36869K32812P4855R4410
$$ plain form
5642 2075417 2095082 2019405 2018958 2012150 2059954 2097105 2156717 2142162 2220068 2165554 2233835 2336640
5630 2336640 2317492 2319708 2351777 2266038 2366051 2469659 2509058 2516162 2543580 2557494 2472620
5619 2472620 2504002 2507980 2427654 2488763 2454324 2471760 2524165 2612478 2765235 2805554 2739228
5608 2739228 2737695 2838604 2808571 2877268 2920244 2943784 3031036 3108196 3079433 3168880 3285133
5597 3285133 3324039 3344147 3269758 3278565 3243858 3300288 3355838 3381324 3453404 3446649 3424437 3520513
5585 3520513 3526208 3532070 3560947 3579913 3687332 3693516 3874116 3971095 4066024 4049061 4204228
5574 4204228 4330295 4365139 4476611 4513377 4497096 4516045 4607152 4663223 4622068 4551570 4606266
5563 4606266 4649276 4771530 4840302 4873685 4931342 5043543 5086677 5223546 5456358 5531213 5625623
5552E625623J45129J12555M9398R2194L0783J47635R4321J17961J78498N456J28303
5541F727856J75017J73970J57166J77003K29490L25912R5754J01931K19880K15023
5531H599002K37319K28448J67408L24213K59141K32722J50322J85768K66141L72436
5521A1022920L18216K35703O0533J45561J31253K20751J97552J00686J48784J54565
5511A2736524J57228K52216K52097K17316K43833K41894L98125L76026L56608
5502A5231867K70878J48608L66973L44962J26011K33860J37314K38474J20354
5493A7219301J33007Q9034J7955O517J18310K7717k3909Q6263Q9285Q1975J38662
5482A7984117J92797J96427L01078L83460K25932K11851K51186K25387L17470
$$ plain form
5552 5625623 5770752 5883307 5932705 6024899 6055682 6203317 6297638 6415599 6594097 6599553 6727856
5541 6727856 6902873 7076843 7234009 7411012 7640502 7966414 8062168 8164099 8383979 8599002
5531 8599002 8836321 9064769 9232177 9556390 9815531 10048253 10198575 10384343 10650484 11022920
5521 11022920 11341136 11576839 11637372 11782933 11914186 12134937 12332489 12433175 12581959 12736524
5511 12736524 12893752 13145968 13398065 13615381 13859214 14101108 14499233 14875259 15231867
5502 15231867 15502745 15651353 16018326 16363288 16489299 16723159 16860473 17098947 17219301
5493 17219301 17352308 17441342 17459297 17465814 17584124 17611841 17587932 17674195 17763480 17845455 17984117
5482 17984117 18176914 18373341 18674419 19057879 19283811 19495662 19746848 19972235 20289705
5473B0289705K29624Q6230Q6088J15398O0416K31209K25146K30515L11732K11915
5463B2077978L67653K92296K42027J75673J47591K89295J94995J36676K35481
5454B4159665L34635K90042L97752M35696M42668N17447O34641O86074O36687
5445B8535307N97010P12308P37376P08042P34591R15394R29366Q12763P34942
5436C5417099R01195R79693R40141J181547J151804J095000J264928J407867J417833
5427D5757107J534815J628156J669863J815829J926367J921032K050592K265265
5419F0569026K408807K565296K828991K838141L232249L505789L887831M431882
5411H6268012N042581N522061O119497O531766P326309Q640449J0345492J2165282
$$ plain form
5473 20289705 20519329 20605559 20691647 20807045 20867461 21098670 21323816 21554331 21866063 22077978
5463 22077978 22445631 22737927 22979954 23155627 23303218 23592513 23787508 23924184 24159665
5454 24159665 24494300 24784342 25182094 25617790 26060458 26577905 27212546 27898620 28535307
5445 28535307 29132317 29844625 30582001 31290043 32024634 32940028 33869394 34682157 35417099
5436 35417099 36318294 37297987 38238128 39419675 40571479 41666479 42931407 44339274 45757107
5427 45757107 47291922 48920078 50589941 52405770 54332137 56253169 58303761 60569026
5419 60569026 62977833 65543129 68372120 71210261 74442510 77948299 81836130 86268012
5411 86268012 91310593 96832654 102952151 109483917 116810226 125450675 135796167 147961449
5403A47961449J4078355J6591826K0380300K5183624L1219459L5788227L4355956
5396C25559196K1434779R006891O551348P15194j5657593k7752600k8372824k5071740
5388B66412651k4472009k6589430k5468869k1753738j7764419j4801008j2265995
5381A23297183j0249346q785843p643364o657912n932797n339309m715004m244071
5373F9729537m022728l429803l434034l142379l037479k736117k410350k229645
5365D5287002k226932j946870j796627j761357j546202j306097j332370j224050
5357C2146497j067642j093870j074185j056824q03291q35324q65773p59466o81547
5348B3908575o75869n79539o00516o73028m51978m18278l96508n36953m19434
$$ plain form
5403 147961449 162039804 178631630 199011930 224195554 255415013 291203240 325559196
5396 325559196 346993975 356000866 362552214 363267408 347609815 319857215 291484391 266412651
5388 266412651 241940642 215351212 189882343 168128605 150364186 135563178 123297183
5381 123297183 113047837 104261994 96618630 89960718 84027921 78688612 73973608 69729537
5373 69729537 65706809 62277006 58842972 55700593 52663114 49926997 47516647 45287002
5365 45287002 43060070 41113200 39316573 37555216 36009014 34702917 33370547 32146497
5357 32146497 31078855 29984985 28910800 27853976 27050685 26215361 25349588 24590122 23908575
5348 23908575 23232706 22653167 22052651 21379623 20927645 20509367 20112859 19575906 19156472
5339A9156472n17051m64262m63205l67671l61990m03898m65326m59951k99937
5330A5353181k94162m18520l61995l66499k64778k48490l13966k77174k42789
5321A2564808k34165k13878k41858k18433k72866k44483j53814j97013k73626
5312A0514672j93666q3458j30525j79451k24141r2602r7842n2711j56692k20945
5302I082639j06553r5539j59304j23046j7920r1680j64497j60175j59479j53010
5292G851436j03843N5469j31540j22419n6977n9335j36027N8837k6881m1294p1819
5281G215607j34816l34K026j09191j9196L498m1233L3165j0847k6695k2802Q5341
5269F974523Q4897j45866J2112O7440K0541r5664R5433J48323M2371J8686L2625
$$ plain form
5339 19156472 18639421 18175159 17711954 17344283 16982293 16578395 16113069 15653118 15353181
5330 15353181 15059019 14640499 14278504 13912005 13647227 13398737 13084771 12807597 12564808
5321 12564808 12330643 12116765 11874907 11656474 11383608 11139125 10985311 10788298 10514672
5312 10514672 10321006 10237548 10107023 9927572 9703431 9610829 9512987 9460276 9303584 9082639
5302 9082639 8976086 8880547 8721243 8598197 8580277 8488597 8324100 8163925 8004446 7851436
5292 7851436 7747593 7803062 7671522 7549103 7492126 7432791 7296764 7355601 7328720 7287426 7215607
5281 7215607 7080791 7080457 7082483 6973292 6954096 6957594 6916361 6949526 6938679 6911984 6889182 6974523
5269 6974523 7059420 6913554 6925666 6993106 7013647 6917983 7013416 7161739 7204110 7222796 7255421
5258G255421M5236J00913P1149O6903K64445J21406J63107J57071J89247J39782
5248H574680K7797J40716R9375J26164J38548M9635J82451K69333K38348J15976
5238I963023K29358M25360L56417M68104M89223N58844M55531O04233O72896M89425
5228A4712414K43622P6902n5673k18280m21342m99451n54350o71144q10594p23508
5218A1078596o19723p85500o23593m57470m55271l86319l47830m12490l31973
5209F658427k31424k74331k07403j20680j78883j87512k70058k21686k2635k82466
5199D661349k03992j23431l9438j32077m8729j43766n9693j28161j50659j32863
5189C498540r4029O897n1544L628o5105r617n8308r8327j23902j24082j739L095
$$ plain form
5258 7255421 7300657 7401570 7472719 7539622 7804067 7925473 8088580 8245651 8434898 8574680
5248 8574680 8602477 8743193 8842568 8968732 9107280 9156915 9339366 9608699 9847047 9963023
5238 9963023 10192381 10617741 10974158 11442262 11931485 12490329 12945860 13550093 14222989 14712414
5228 14712414 14956036 15032938 14977265 14758985 14337643 13838192 13283842 12612698 11802104 11078596
5218 11078596 10458873 9673373 9049780 8592310 8137039 7750720 7402890 6990400 6658427
5209 6658427 6427003 6152672 5945269 5824589 5645706 5458194 5188136 4966450 4943815 4661349
5199 4661349 4457357 4333926 4294488 4162411 4113682 3969916 3910223 3782062 3631403 3498540
5189 3498540 3404511 3411408 3359864 3363492 3298387 3288770 3230462 3132135 3008233 2884151 2882412 2885507
5177B885507n8001r420Q280N8995j91983K0228J0865j9793n0382p0405r5885k3497
5165B464509r6337m8272k0217m5280j5946m6019m0045m8988j13813p708J08685
5154B090569J7897K9081p1777M33O995J956n3359j03893J6264l8522J10985j04226
5142A902403p1487p990K5334L6770p2628l6805k083k0698R1725O841j29312m9108
5130A672962J14523j51102j08700m3884R9258j0425j68129J4618N2272k2534j1846
5119A437013j42914O7143J02249j2044p7679q1111O6030K0083o3737j62740K3442
5108A175735J78749j23433j10387O5669l3367K9107K8861Q1761n5647J1646K7292
5097A275986p2586j07686O8459K7188o8412M9830p555k7247n7690q045j893k8399
$$ plain form
5177 2885507 2827506 2818086 2826366 2885361 2693378 2713606 2724471 2704678 2654296 2583891 2488006 2464509
5165 2464509 2368172 2319900 2299683 2254403 2238457 2192438 2152393 2103405 1989592 1981884 2090569
5154 2090569 2108466 2137547 2065770 2066203 2073198 2075154 2021795 1917902 1934166 1895644 2006629 1902403
5142 1902403 1830916 1822926 1848260 1885030 1812402 1775597 1773514 1752816 1844541 1851382 1722070 1672962
5130 1672962 1787485 1636383 1527683 1483799 1583057 1572632 1404503 1419121 1471393 1448859 1437013
5119 1437013 1294099 1361242 1463491 1451447 1373768 1292657 1358687 1378770 1315033 1152293 1175735
5108 1175735 1354484 1231051 1120664 1186333 1152966 1182073 1210934 1292695 1237048 1248694 1275986
5097 1275986 1203400 1095714 1164173 1191361 1122949 1172779 1165224 1137977 1080287 1072242 1070349 1041950
5085A041950m5212k9798j5934q090M4478q2187Q5338m5879o9213R4633O0998J502
5073A032586l8657n8284n1609k4658k8622O6163M2907J6174k6129k7425K3553
5062I25999j21216o4458l2003K9545j7660J10085N3422j32774L2881N8787j12827
5051G29781q334M885p9045j9797J68964N1916k5007o0969K9602L1686M9894J690
5039H75266j18023O2112j00548J5371n7087l2217j02720L7315J39521k3118N3808
5028G49680j8985R2728q274N6752n5871N23O314j19377J9344Q0581l4832J9613
5016G88196l82n2755J2068L1973j06331M4933M2167P6272q8200N037R3495o5976
5004G80497m8153l0460j9337N9632q636l0432J2524O8206M4004l1975m102r135
$$ plain form
5085 1041950 996738 966940 951006 942916 987394 905207 990545 944666 875453 970086 1031084 1032586
5073 1032586 993929 935645 884036 859378 830756 896919 939826 956000 929871 902446 925999
5062 925999 804783 740325 708322 737867 720207 830292 883714 750940 783821 842608 729781
5051 729781 721447 726332 647287 627490 796454 848370 823363 762394 791996 823682 873576 875266
5039 875266 757243 819355 718807 734178 677091 644874 542154 579469 718990 695872 749680
5028 749680 730695 823423 815149 871901 816030 816553 822867 703490 722834 803415 768583 788196
5016 788196 787814 735059 747127 779100 672769 717702 759869 836141 747941 752978 846473 780497
5004 780497 732344 701884 682547 742179 733543 703111 715635 783841 827845 795870 791768 782633
4992G82633M2958l9014k0784O5121r2722K5578j0308q234M2014P6843k4380o1685
4980G78020O8406k1479P2367p2401J4599J2222k8604L9997o1816n2112P2068P558
4968H28825M7512K8328n2697p3028K9579Q3298L0210n8168n5383m4846K42302
4957A005932k4908m052p8521J428M2156Q4903M8704R967J13160J14336P0639J18315
4945A502059J26767J40653J32276J59855J12343L8147M8309K9710j5508j95337
4935B079274j40854k45213j01866o6995j22044R8210j02856j95002n7525p3283
4925A071846r5352l6943p9079J4869j04493M8908Q5821m8357K6298l9064r2454
4914G52000k1427P0695k1835k0684l9368q400P3027p9793k7021o0122L7566l5067
$$ plain form
4992 782633 825591 786577 765793 830914 738192 763770 753462 745228 787242 864085 839705 778020
4980 778020 846426 824947 897314 824913 839512 851734 823130 863127 801311 749199 821267 828825
4968 828825 876337 904665 851968 778940 808519 891817 922027 863859 808476 763630 1005932
4957 1005932 981024 976972 898451 899879 942035 1026938 1075642 1085609 1198769 1313105 1383744 1502059
4945 1502059 1628826 1769479 1901755 2061610 2173953 2212100 2260409 2290119 2274611 2079274
4935 2079274 1938420 1693207 1591341 1524346 1402302 1500512 1397656 1202654 1145129 1071846
4925 1071846 976494 939551 860472 875341 770848 819756 905577 857220 883518 844454 752000
4914 752000 730573 801268 779433 758749 719381 710981 784008 704215 677194 617072 654638 619571
4902F19571j054n2295J8154M0647k4387J02980j02577J06442o8742K9250J51307
4891H19296j874j07327r3680l3544P7760J06249j36997O4005r454m2988J4592
4880F56038j57851J37348L3518o4406q5809m1272r396J49344j3140j7361N7625
4869F44638r321L7678k6473N1415J8534m0917p5821j7705k2375O440Q7501j09529
4857E44065m9632o4034M4631J19195K287m6013n776n1189j07048J5968N2616R5154
4845E50224Q6548r9556k0723K44Q3619R450l061m7474r707P4895m1677M7144p6134
4832E53792k1816K0126N9463J4054l5200k8241R334J604K2727P3016j18471J42491
4820F92879m5515K4460L3044q6880N7831K4567J11546n0267M4387k9668N1960
$$ plain form
4902 619571 618517 566222 584376 625023 600636 703616 601039 707481 638739 667989 819296
4891 819296 817422 710095 616415 582871 660631 766880 629883 693888 684434 641446 656038
4880 656038 498187 635535 669053 604647 518838 477566 468170 617514 604374 587013 644638
4869 644638 635317 672995 646522 697937 716471 675554 599733 582028 559653 566093 653594 544065
4857 544065 494433 430399 475030 594225 596512 550499 544723 493534 386486 402454 455070 550224
4845 550224 636772 537216 516493 516737 600356 609806 606745 559271 549564 624459 582782 629926 553792
4832 553792 531976 552102 611565 625619 590419 562178 571512 573116 595843 668859 550388 692879
4820 692879 647364 671824 704868 617988 675819 700386 811932 761665 806052 776384 828344
4809H28344N3889r1413J21893j7964L0742Q5814L3785J49040P9415J95138K43437
4798A712120Q1286J56066J71851P8117p6963j12843j17461j01047o7271j50940
4788A572915n2835j44266j08153j39284q1920j9309m2772o1102j7408r897M4508
4777I40477R558j03696p3419o0490m7352L3198n1159m595M5723k9523p9120M7539
4765F27141r489j23564J7503J17247M5172n4757j7853O0362p0032R03J64388j30322
4753F26699o3298n8715K622Q5024K5522j30026r2999J20430J54989R7986j1083
4742G57151k2610j54947k9161k2664M035J636K6023N9581N6843L8294J2789P1131
4730G98101j28783m3162O2481j8312p6389Q0632P9709l475J1751n5969n391O3896
$$ plain form
4809 828344 882233 790820 912713 894749 925491 1011305 1045090 1194130 1273545 1468683 1712120
4798 1712120 1793406 1949472 2121323 2199440 2122477 2009634 1892173 1791126 1723855 1572915
4788 1572915 1520080 1375814 1267661 1128377 1046457 1027148 984376 923274 905866 895969 940477
4777 940477 950035 846339 772920 712430 665078 698276 647117 642522 688245 658722 579602 627141
4765 627141 617652 494088 511591 628838 674010 619253 601400 661762 591730 592633 757021 626699
4753 626699 563401 504686 507308 592332 617854 487828 394829 515259 670248 768234 757151
4742 757151 734541 579594 550433 527769 531804 533440 559463 619044 675887 714181 726970 798101
4730 798101 669318 626156 688637 670325 593936 674568 754277 750802 762553 706584 701193 765089
4718G65089N8424j01533r1241R2871J0398M6243J45828J24364j48659q7630M7417
4707H61571P368l1897O3526L3334m71M4080K800l8684k0970J10205N9409J1035
4695A101306J1478o6672k3571Q3705J4144O1961q7572J44475N9998J35358j12935
4684A321675M7639J6511J1164Q785k2266R9959m7035P0781P7113K3006J4369J1342
4672A633043P4649o1355k2502R4579M2956j7768J05732L4531j05465J00204j1116
4661A867488M0617J7729M6798K191j6960p294J70010K3363K5443J56363J2817
4650B338565m0079J37969O3159J56343M1309j19760M9541R0640Q2210L3058M8266
4639B881221K14897M5722R4091J82642q6087J06281J75138J57154K58028J48293
$$ plain form
4718 765089 823513 721980 630739 723610 734008 780251 926079 1050443 901784 814154 861571
4707 861571 868939 837042 900568 933902 933431 977511 980311 941627 920657 1030862 1090271 1101306
4695 1101306 1112784 1046112 1022541 1106246 1120390 1182351 1094779 1239254 1299252 1434610 1321675
4684 1321675 1369314 1385825 1396989 1405774 1383508 1483467 1436432 1507213 1584326 1607332 1621701 1633043
4672 1633043 1707692 1646337 1623835 1718414 1761370 1743602 1849334 1883865 1778400 1878604 1867488
4661 1867488 1908105 1925834 1972632 1974823 1957863 1950569 2120579 2143942 2169385 2325748 2338565
4650 2338565 2298486 2436455 2499614 2655957 2697266 2577506 2627047 2717687 2799897 2832955 2881221
4639 2881221 3096118 3141840 3235931 3418573 3332486 3438767 3613905 3771059 4029087 4177380
4629D177380L0346K3341J81933J54188J63513J69043J89104J81012K28620J96502
4619E694982K85953K99518K58081K44473M83865M66492O21465N78859O06873P14805
4609A0255366O53574P11378P54690O97407P27418Q09921P67496Q78764N99769
4600A6855783O59082O41199N87603M47543M45071N64976M83003N03137L82579
4591B1569976Q1151J44939k34796l30308l30564l84476l15794l82011n96109o63276
4581A8558732n77854p95885q67034q30556p61581p59176p81189q40899p71110
4572A1573448p25437o85469p05086p53076o53987n79050m78979m89663n29524
4563E973177l67611l21454l29892l16376j92147j97662k44477k56313k30629j22945
$$ plain form
4629 4177380 4207726 4231067 4413000 4567188 4730701 4899744 5088848 5269860 5498480 5694982
4619 5694982 5980935 6280453 6538534 6783007 7266872 7733364 8354829 8933688 9540561 10255366
4609 10255366 10908940 11620318 12375008 13072415 13799833 14609754 15377250 16256014 16855783
4600 16855783 17514865 18156064 18743667 19191210 19636281 20201257 20684260 21187397 21569976
4591 21569976 21651127 21796066 21561270 21230962 20900398 20515922 20200128 19818117 19222008 18558732
4581 18558732 17980878 17184993 16317959 15487403 14725822 13966646 13185457 12344558 11573448
4572 11573448 10848011 10162542 9457456 8704380 8050393 7471343 6992364 6502701 5973177
4563 5973177 5605566 5284112 4954220 4637844 4445697 4248035 4003558 3747245 3516616 3393671
4553C393671j10564r9989j21974k18975j40452L5371j29771p2236K3357k02058
4543B356380j16440M5627p0143j78687r4793K2964M7214p9525o5004M4576n0107
4532A862062l8994q8366o2652p8777n0820m9096j19441J5159l7341j08702m0049
4521A202983M9388J16410n1014j1769o9401p9912J8710o8225l9783K962K5228
4510A095577o5135r3701l0834m5308N7065O741r5222K0550n2410j45695J03677
4499G55305N089P8979Q974j17299N047o7309K3461k6901j3425J6759L7348l2660
4487F73368q2125P8134j14296m1946J99741Q449j00356o1269o301P854k734L9429
4475E97948j9955M3333l0849j44097n259n3951J6330P3076r0923L6799J3348k6996
$$ plain form
4553 3393671 3283107 3183118 3061144 2842169 2701717 2737088 2607317 2535081 2558438 2356380
4543 2356380 2239940 2285567 2215424 2036737 1941944 1964908 2012122 1932597 1867593 1912169 1862062
4532 1862062 1823068 1734702 1672050 1593273 1542453 1493357 1373916 1389075 1351734 1243032 1202983
4521 1202983 1252371 1368781 1317767 1305998 1236597 1156685 1175395 1107170 1067387 1070349 1095577
4510 1095577 1030442 936741 905907 860599 917664 924405 829183 849733 797323 651628 755305
4499 755305 760394 839373 848347 731048 736095 668786 692247 665346 651921 668680 706028 673368
4487 673368 591243 669377 555081 513135 712876 721325 620969 559700 553399 561253 558519 597948
4475 597948 577993 621326 590477 446380 441121 387170 403500 476576 385653 422452 435800 408804
4463D08804N8140k0474P9538o9885j13216m1302N3839J3988j7815l799O7115R4109
4451E09042p2918n0459l5246j3119N4729L2886j0992k2581j13125O8653J1593
4440C58463j2931K4072r404l2020J5130J05650j09049J1239j1662m1232L9890
4429C38146K5325M2116p1331n5878L0525q7377K3677P8923M3571l0442M9561j9474
4417C67342p216k7897L6413R2229l7332p4709q8334m7994N1227k993o3327Q2214
4405B79623K3148L1269N36M5683p1574K2922j4360r5440N519P9010Q997r2084
4393B23249n3834k774O1902L2457m8774O726j6390K5103L6198o1554K4723j1748
4381B15284q5697k3287J51259J3723l5879o5407j6304J818j0730r838N5652m1943
$$ plain form
4463 408804 466944 446470 526008 456123 342907 301605 355444 369432 351617 347818 414933 509042
4451 509042 436124 385665 350419 337300 392029 424915 413923 391342 278217 346870 358463
4440 358463 345532 369604 360200 328180 343310 448960 339911 351150 339488 298256 338146
4429 338146 363471 405587 334256 278378 308903 221526 245203 324126 367697 337255 386816 367342
4417 367342 360126 332229 368642 460871 423539 348830 260496 212502 263729 260736 197409 279623
4405 279623 302771 334040 334576 380259 308685 331607 317247 221807 227326 306336 315333 223249
4393 223249 169415 166641 228543 261000 212226 218952 202562 227665 263863 202309 227032 215284
4381 215284 129587 106300 257559 271282 235403 169996 153692 155510 144780 134942 190594 148651
4369A48651J9457M0713j35382n8725J7387p6865N4735J62076n3725J05844N8624
4358B82790m2594l4806N02J11578j06336l2316R7213L4368j04400j67330N6656
4347I5325m7228k2827J54348j0215L3144K498n9060p0914Q3481J2372j6769R6383
4335B50538j10893L7516k584n250l0013J7751j3562M5329n2095k3919J54626m7418
4323B20026n9958N3553p6119K6595L0846n6217k2316O1134k3219o1066O7155j05071
4311E5343K9871M7993Q0876J29226n4761j37587M3097l1371j4722R8857q1356
4300A65466j11839j00167O2682J15424K2511P2439O8847n2373p6525L4223j7827
4289A82861j0721J09612j4340q6853J1979N2181n0792p409M1816R341O5507l8516
$$ plain form
4369 148651 168108 208821 73439 14714 32101 -44764 9971 172047 118322 224166 282790
4358 282790 240196 205390 205892 317470 211134 178818 276031 310399 205999 38669 95325
4347 95325 48097 25270 179618 169403 202547 205045 145985 75071 158552 170924 154155 250538
4335 250538 139645 177161 174577 169327 139314 157065 143503 188832 136737 112818 267444 220026
4323 220026 160068 213621 137502 164097 194943 138726 116410 177544 154325 93259 160414 55343
4311 55343 85214 133207 214083 343309 288548 150961 194058 162687 147965 246822 165466
4300 165466 53627 -46540 16142 131566 154077 226516 295363 242990 166465 200688 182861
4289 182861 172140 281752 267412 180559 192538 244719 193927 186518 228334 237675 303182 264666
4277B64666p5111l0223M8509r967p5374P8784P012L864m8490j88721Q9141P9322
4265A43412P1300L5850r5850N2736j0421o6177K8684J00244j07982j8669M0475
4254A73602r659K1158l3010m9525K282M1568k538j28798M6074N1074L2606K5058
4242A69892L5460q2369L1653j5260J6388J5360K924o235p8893O0255l253J51952
4230B97874n0596j6689m7934r10j5540j5320p1021m2372M5984L4519N8330L84
4218A76709L8050j8937k0860o0209M5668J61101K5428R78n2343J5364j75064r807
4206A26078N2035m7853P2573K8398q4835m7061Q6934p6231l3051J56886l1761
4195B02112j5152J20630j5178p4260o1007m0470m7878K4156M7015n2200O3624
$$ plain form
4277 264666 189555 159332 207841 197874 122500 201284 208296 212160 163670 -25051 64090 143412
4265 143412 214712 250562 154712 207448 197027 130850 159534 259778 151796 133127 173602
4254 173602 163943 185101 152091 102566 104848 146416 143878 15080 61154 112228 144834 169892
4242 169892 205352 122983 154636 139376 155764 171124 174048 167813 88920 149175 145922 297874
4230 297874 247278 230589 182655 181745 166205 150885 79864 37492 83476 117995 176325 176709
4218 176709 214759 195822 174962 114753 160421 321522 346950 347928 295585 310949 135885 126078
4206 126078 178113 130260 202833 231231 146396 99335 186269 110038 76987 233873 202112
4195 202112 186960 307590 292412 218152 157145 116675 68797 92953 139968 87768 151392
4184A51392K4579l4847O175l685P4361m1574j15465N5275k9947r5007J49865l7709
4172A03413Q8305j18782n7543L7340n9967P6110O8013j12494Q864O0384m0983
4161E2660j3287N666P6785l414n7443k3851Q3174q2862J3866q0539R027O2971
4149D2753K2382j1214n9p1324M6351p180L5849n1941K2260n9417R322N3603O3540
4136I4925l9389m6088M2511J6680l3830M6531K4342Q5247l4258j89088J3529l7100
4124e5988O9261N0137l5551p4325J21499m3238L1370p6393k8206J4979J11193
4113H4738p787L6343k7632n0808k8983N554r909n292k752o507j3324m4597o551
4100g7507J12414j5809l1057M6905K8908K365l9470j9743k6887j8795O4114M0224
$$ plain form
4184 151392 175971 141124 147299 143614 217975 176401 60936 116211 86264 -8743 141122 103413
4172 103413 191718 72936 15393 52733 -7234 68876 136889 24395 33259 93643 52660
4161 52660 39373 45039 121824 118410 60967 37116 120290 37428 51294 -29245 -20218 42753
4149 42753 65135 53921 53862 -17462 28889 21709 57558 5617 27877 -31540 -22218 31385 94925
4136 94925 55536 9448 51959 68639 34809 81340 105682 190929 156671 -32417 -18888 -55988
4124 -55988 13273 63410 27859 -46466 75033 31795 63165 -13228 -41434 -26455 84738
4113 84738 76951 113294 85662 34854 5871 11425 1516 -3776 -6528 -13035 -26359 -70956 -77507
4100 -77507 34907 19098 -11959 34946 63854 66219 26749 7006 -19881 -38676 25438 65662
4088F5662M0022p1942q4345N4894n3750J1831J6963M0525j49126k6023K38512
4077H3223K1136m6091o6311L9354P1149j36519K0105J0592q415J07795J781n3202
4065D4597n6074J06785L2994q992o760l7938m3650m0488n6377q5473J11757P0380
4053C0761n9778K7501l481k4852J0963m1303M9010l5573o2614L5211J03177P8575
4041A07597m9875m8499j2611J4493J6111L6406J7300j02602j6209K6370P0096
4030E8577l4474l4740m614J28578j01537k9968J15240J8907p5519p2792l0420
4019f2762P5886K2967Q305p2181L999J3183l6330J3196l4669N3923k7637Q169
4007c3951L0207K1845K8753K7152j897r5374o0440Q6460L476p1328J06373J04582
$$ plain form
4088 65662 105684 33742 -50603 4291 -49459 -37628 -20665 19860 -129266 -155289 83223
4077 83223 104359 58268 -8043 31311 102460 -34059 -13954 -3362 -11777 96018 97799 44597
4065 44597 -11477 95308 128302 119310 112550 74612 30962 -9526 -65903 -151376 -39619 30761
4053 30761 -29017 -1516 -4997 -29849 -18886 -60189 -11179 -46752 -109366 -74155 29022 107597
4041 107597 57722 9223 -3388 11105 27216 63622 80922 -21680 -37889 -11519 58577
4030 58577 24103 -10637 -15251 113327 11790 -18178 97062 115969 40450 -32342 -62762
4019 -62762 13124 36091 44396 -27785 -23786 -10603 -46933 -33737 -68406 -14483 -42120 -33951
4007 -33951 -3744 18101 46854 74006 72109 -23265 -83705 2755 6231 -65097 41276 145858
3995A45858j03491O1733j44456L7904R5526j8648K2134J0315K6025o8954M3602
3984A07548j05923n2106p345O2856J01421j09050M7859k7228J8816Q378m1351
3973C875K556l9802k3662Q4323k241q9881R2164J6348j18187k0859J03719N0963
3961E9316J6092J6892k0476P7291J4807r5109o2755N9959N3720J9927l1365J8550
3949A26849o3621l5903o0506k285K2714j697M1187l8274k8033l928J13727p771
3937F2459N2376l6466m0588P6218J5822j18892P3168l1406j5356O223L1339m3858
3925C1039m3125M3390L376o0155N0360J36311n373q0610j7053l650j05487J178
3913d9799m460Q906K02435J48231r2242q2544L7883m6719m8537n4804L7346J60518
$$ plain form
3995 145858 42367 104100 -40356 -2452 93074 74426 96560 106875 132900 63946 107548
3984 107548 1625 -50481 -57826 5030 106451 -2599 45260 18032 36848 45226 3875
3973 3875 6431 -33371 -57033 27290 25049 -64832 27332 43680 -74507 -95366 8353 59316
3961 59316 75408 92300 71824 149115 163922 68813 6058 66017 119737 139664 108299 126849
3949 126849 63228 27325 -33181 -35466 -12752 -14449 26738 -11536 -39569 -43497 70230 62459
3937 62459 114835 78369 37781 113999 129821 10929 84097 52691 37335 43558 74897 31039
3925 31039 -12086 31304 34680 -25475 24885 161196 155823 75213 58160 54510 -50977 -49799
3913 -49799 -54259 -45353 157082 305313 213071 130527 168410 121691 73154 18350 55696 216214
3901B16214J8765p0513q2471J959N4347r725J0099m5910j04332Q8109Q2958m4295
3889A15205k1392l898k9870j06099R0693P7927j3773M8912j7487j12788N2991
3878H0421O2358N911J9020j7203k1316J5763J2926l2751j3475M5282o4357n8150
3866C4429l7498p8925J61725k8654m5580k7408M6644p8263J79525k3171J4146
3855A16970R4231J911j38099q1486O5299K1771J644n5792o5799q540q9432J4308
3843a23014N2438N1952J3656N4982l7311N5415k9656Q616O0773j10747O7576k5012
3831C9668R2911l0477j1329o9145N8720M8524m4476k367k0634j00965J26960P8791
3819A66181j17134L1858L1396J2671m2883M1316j8371r7571m1388R5635K3970
$$ plain form
3901 216214 234979 164466 81995 83954 138301 128576 138675 92765 -11567 76542 159500 115205
3889 115205 93813 89915 60045 -46054 44639 122566 108793 157705 140218 27430 80421
3878 80421 142779 148690 167710 150507 129191 144954 157880 125129 111654 156936 92579 34429
3866 34429 -3069 -81994 79731 51077 5497 -21911 24733 -53530 125995 102824 116970
3855 116970 211201 213112 75013 -6473 58826 80597 82241 26449 -39350 -47890 -137322 -123014
3843 -123014 -70576 -18624 -4968 50014 12703 68118 38462 47078 107851 -2896 64680 39668
3831 39668 132579 102102 90773 21628 80348 128872 84396 82029 61395 -39570 87390 166181
3819 166181 49047 80905 112301 124972 82089 123405 105034 7463 -33925 61710 85680
3808H5680j07743N9432Q0349o0868K2498L2276J07685J4202j08369L715k8256
3797A00601P892j5796J5528O6940q5506j36121J12184N5806n1542M6337p0990
3786D5333q3423J38985j6034m8174n307K1419L4752Q9510j45003n2042J47304
3775A27320k7782m8337J7716j3880k2608q5128P6920M6630K1013m197k1212k743
3763F3712J4499j3805M3908N0864J9052p870l9435p2335j732R8370m0597l146
3751A11485r783L5111k0978l2128n1061M4732M739r1186L1373K236K4295j3810
3739C5025L4040m2066N9267p6226O3930J825r9885n4912n852M6742N7363Q7194
3727A06445l6909L7464j05933K6413J11296j09082m5242J24146O2222j4358n0842
$$ plain form
3808 85680 -22063 37369 117718 56850 79348 111624 219309 233511 125142 128857 100601
3797 100601 108493 92697 108225 175165 89659 -46462 65722 121528 69986 116323 45333
3786 45333 -38090 100895 84861 36687 31380 52799 87551 177061 32058 -19984 127320
3775 127320 99538 51201 68917 55037 32429 -52699 24221 70851 91864 87667 66455 63712
3763 63712 78211 64406 108314 159178 178230 170360 130925 58590 56858 155228 114631 111485
3751 111485 101702 136813 115835 83707 32646 77378 82117 -9069 22304 24540 48835 35025
3739 35025 69065 26999 86266 10040 73970 75795 -24090 -79002 -84854 -38112 19251 106445
3727 106445 69536 107000 1067 27480 138776 29694 -15548 108598 170820 156462 105620
3716A05620l6291l8678r3560k181P9797L5874O8182J7229l6593m2491m1781q9705
3704g4578J2556K2809O1398R7784L9308j28487o4187M7818k5971r4445J18624
3693A2629K0700k9442j0731L4073Q1921l3743k4339K9506L2614Q6835m2217K7106
3681A84912p7560n9581O733p1588k4379J51414j9042J086r120K1409J1264j22519
3669f971M6261O9010J00802n6419j4175Q3575m832l6021n1904k3936M8810P839
3657A62039M4220r074j6007o6761l9995j769M5752N3053l1496j356L069l7095
3645A04580P1332l2528L3965K7978K4207L2480j9674m006k5486M0483k8064J2875
3633B38142j18412k0616N6879l3592j054J22414R20p3302j2451k6592K13414P1545
$$ plain form
3716 105620 69329 30651 -62909 -65090 14707 50581 118763 135992 99399 56908 15127 -74578
3704 -74578 -62022 -39213 22185 119969 159277 30790 -33397 14421 -11550 -105995 12629
3693 12629 33329 3887 -6844 27229 109150 75407 51068 80574 113188 200023 157806 184912
3681 184912 107352 47771 54504 -17084 -41463 109951 90909 91995 82875 104284 115548 -6971
3669 -6971 39290 108300 209102 152683 138508 222083 217251 181230 129326 105390 154200 162039
3657 162039 206259 197185 181178 114417 74422 72653 118405 171458 139962 138606 141675 104580
3645 104580 175912 143384 177349 205327 229534 262014 242340 238334 212848 253331 225267 238142
3633 238142 119730 99114 155993 122401 121347 243761 244681 171379 158928 132336 345750 417295
3621D17295j56332m9798P2006j4426N66O7422o5000l7407M3220l3995n9960O1061
3609B44652L8046N107l6225P0546J5108L5370n8422l8204O2391O6086n1356q7196
3597B65903R36m6375J5926O7306j5287o0210J01764O3901J32212q4296j17520
3586C24260O6499N1952q3819k0466L4574j8637k0852J19752N2065j26515L4645
3575D13458J60597M4399l618j7619k6292l662Q271p7441J20929k4486k4669m3895
3563E25972j6979n5635j00949P0468O2720k4574k021K3739J5548k2998Q7199l2412
3551E30078n3496O1048J01583j54119j3760J7513m5765J15236J4011Q8453r3984
3540E66798Q7772p4802l6174K2514M7772M8871L3798m6998l3913J8393l6455k6090
$$ plain form
3621 417295 260963 211165 283171 268745 269311 336733 271733 234326 277546 243551 183591 244652
3609 244652 282698 287805 251580 322126 337234 372604 314182 275978 338369 404455 353099 265903
3597 265903 266839 220464 236390 303696 288409 228199 329963 393864 526076 441780 324260
3586 324260 390759 442711 358892 338426 373000 354363 333511 453263 505328 378813 413458
3575 413458 574055 618454 614836 597217 570925 567263 575534 498093 619022 594536 569867 525972
3563 525972 508993 453358 352409 422877 485597 461023 459002 482741 498289 475291 562490 530078
3551 530078 476582 537630 639213 485094 471334 488847 443082 558318 572329 660782 566798
3540 566798 654570 579768 543594 566108 613880 662751 696549 649551 615638 634031 597576 571486
3528E71486L689K1695j12733j07364J41536K2246q1127O1775L5134J4299j14491
3517D56145M1988p9668j5021Q2964J1277N9987o6110j1234Q7759o718O6414n9156
3505E68627n9829M6799j04969K2719L3071J8546l1996P3084m7560j2807k9620
3494D76065m7515p3116J08577j0104o3145L5165R235k5571M7468J6950q87K2755
3482D95877o3121K4464P3781J16601j4641p5064m3791L1260R964q3385l8193p7840
3470C55912M7074N2859L169O2127p3634n1944n417K5923j6548K5303m4720P2836
3458D52940J0611J6697L5265j9444n6988J9402j9026j1038J8909L6836O6166M0533
3446E90863j03438q5508m6011J1604O2766M0185J7491l4228M2094j449P5205l0500
$$ plain form
3528 571486 575175 596870 484137 376773 518309 540555 459428 521203 556337 570636 456145
3517 456145 498133 418465 403444 486408 497685 557672 491562 480328 568087 561369 627783 568627
3505 568627 508798 555597 450628 473347 506418 524964 492968 566052 518492 505685 476065
3494 476065 428550 355434 464011 453907 390762 425927 435162 409591 457059 474009 473122 495877
3482 495877 432756 457220 531001 647602 632961 557897 514106 545366 555330 471945 433752 355912
3470 355912 402986 455845 459014 521141 447507 395563 390146 416069 399521 424824 380104 452940
3458 452940 463551 480248 515513 496069 439081 458483 439457 428419 447328 484164 550330 590863
3446 590863 487425 401917 355906 367510 430276 470461 487952 453724 495818 494369 569574 539074
3434E39074p5348L9120L3818m5547J2405l4456k7345K3787r693j33461O9908N5506
3422D47768j18620M923M1069o9090K7018j40412L81J64187k1985p4389n238M7632
3410C03244j00718k7760P655O3608M9394o1550o6999J12624K1643N151k9978m8529
3398B27785L2771m6415L1438j6526o1363l4778l9890Q113J21773j6661j5219R061
3386B00089n839J26514m466j4173m2685P3578k801r0099p6160j877M454k8175
3374A38360Q3790O2210K3054k3852k2484R035J74542M7231j15581k16392k8424
3363A31489L4206J25679K0849P9447n5093n6544J07865R835K8361n5016q5133
3352B85945m3885L8617L7324K1857M2613m7371r5239R7830o2682l6430k8928K0477
$$ plain form
3434 539074 463726 502846 536664 491117 503522 469066 441721 465508 455815 322354 392262 447768
3422 447768 329148 334071 375140 306050 333068 192656 193037 357224 335239 260850 255612 303244
3410 303244 202526 174766 182421 246029 295423 233873 166874 279498 301141 306292 276314 227785
3398 227785 260556 214141 245579 229053 167690 132912 93022 101135 222908 206247 191028 200089
3386 200089 194250 320764 316298 302125 259440 333018 330217 240118 163958 162081 166535 138360
3374 138360 222150 284360 307414 283562 261078 270113 444655 491886 376305 159913 131489
3363 131489 165695 291374 312223 391670 336577 280033 387898 397733 426094 371078 285945
3352 285945 242060 280677 318001 339858 382471 335100 239861 337691 275009 238579 209651 230128
3340B30128q1140r6434n7143J12796P5815j3556k7117K4587K0787J5380q2859
3329A21244q8721J22108Q0541r7596O2651n721r6194J13965N1759j87015j00670
3318b3649J6516k470J23411N184Q745N275n5374K2204k6092J3457q437k4180n035
3305D9555K2925L7852N169l0035M3967N1121j42887J2064J16266p3021N6785M121
3293A53882l8700L3764j16288r736N0207j903l3198K4146j08466O0773J32630
3282A47111l6971n183j9523p0349O476n3987O9120J00591K3318o8222L4559Q969
3270A35909j7138O0905p2783M1084l8919j4760M116j02479K2260O0668K1234K1153
3258A21250J03722j797j60069j9287P9036K3160j1051k7891J3494l442L225J34
$$ plain form
3340 230128 148988 52554 -4589 108207 184022 170466 143349 167936 188723 204103 121244
3329 121244 32523 154631 235172 137576 200227 194506 98312 212277 264036 77021 -23649
3318 -23649 -7133 -9603 113808 118992 127737 133012 77638 99842 73750 87207 78770 54590 49555
3305 49555 72480 110332 115501 85466 129433 180554 37667 49731 165997 92976 149761 153882
3293 153882 115182 148946 32658 22922 73129 71226 38028 62174 -46292 14481 147111
3282 147111 110140 104957 85434 15085 21561 -32426 36694 137285 160603 92381 126940 135909
3270 135909 118771 179676 106893 147977 109058 94298 98414 -4065 18195 78863 100097 121250
3258 121250 224972 223175 63106 43819 122855 146015 134964 107073 120567 117125 120350 120484
3246A20484r7637P5115O0655K8137q4966J5354P41o6209R6650q934k9741J7108
3234A26757P8754o919l4236m7221j4699R3042p4033J1879o914j04344J06342L1881
3222A60289j24544L2078Q4907J14039J0428j45463L4424j1130L2292q4914j4295
3211H8111m1091K5950M7920l2567j5419N37L6900R7781M365p7070k6012j7905
3199I1500k2963J9596r8163Q0275k7322J6338Q0740J6245p8201j15230O8236N3572
3187H4623N6923k5647J5145n3642M1319P9811r8794l6300n3301m773Q9331N8446
3175A53141j1775k4778R6706k8554r968l1434P873l7998J40401N1929r6092l8478
3163A70973L1320p5907l0142M9775J1095j2928M5181p7348q2313J38475L1645
$$ plain form
3246 120484 22847 97962 158617 186754 101788 117142 117883 51674 148324 139390 109649 126757
3234 126757 205511 198592 164356 117135 102436 195478 121445 133324 126410 22066 128408 160289
3222 160289 35745 67823 152730 266769 277197 131734 166158 155028 187320 102406 88111
3211 88111 47020 72970 120890 88323 72904 73441 110341 208122 212487 135417 109405 91500
3199 91500 68537 88133 -10030 70245 42923 59261 140001 156246 78045 -37185 31051 84623
3187 84623 141546 115899 131044 77402 118721 198532 99738 63438 10137 5364 94695 153141
3175 153141 141366 116588 213294 184740 174772 143338 151211 113213 253614 305543 209451 170973
3163 170973 202293 126386 96244 146019 157114 144186 189367 112019 29706 168181 199826
3152A99826j0333M187N1583L4620n4351L509Q8431N4472O8619j9406r9073M7528
3140C69612k3474L2310J30222J5038r2310J06150R3892m8589O2902o404n1311
3129E88038R8550k3286Q5475n7220M0750k4615j42568K0631n7354L218J8281j8089
3117E31811o8250q74O5390M1602o0737J4328L0450M2323O9703L682k0092M0033
3105F89369n4493Q2120K03385r031N3058j9338k1052K7292O3481K7865o4625m8003
3093I30028j35269k1185k2869o9880l1067l7111o4772m6754j22006L5679L8590
3082D53384L4206J9445k9334n7230k2535L4626J19492m6814n1198m471M6153M8315
3070E44039N851N0686j32681k9014Q3039n5552n8498J20579M0366l3446j04712
$$ plain form
3152 199826 189493 193680 245263 279883 225532 229041 317472 371944 440563 421157 322084 369612
3140 369612 346138 378448 508670 523708 431398 537548 631440 582851 645753 639349 588038
3129 588038 686588 663302 748777 691557 732307 707692 565124 585755 528401 531619 549900 531811
3117 531811 463561 462687 528077 569679 508942 523270 553720 596043 665746 669428 649336 689369
3105 689369 634876 716996 920381 911350 964408 945070 924018 951310 1014791 1042656 978031 930028
3093 930028 794759 773574 750705 680825 649758 612647 547875 501121 379115 414794 453384
3082 453384 487590 507035 477701 420471 397936 432562 552054 505240 454042 449571 495724 544039
3070 544039 549890 600576 467895 438881 521920 466368 407870 528449 568815 535369 430657
3059D30657j46058r956R6797L5883j2256L4133j20458j85715J410M0884K1608
3048A86929K4222j1105j2694K2224N4014j31176j1499R578P6968m8732R379N3936
3036B22044j23066L4871J01660J5867j32674J6287k7623K5953J09609o3886o1433
3025A17609k2350M8636p1888R515M2654J4364K8038n3887K0801k3230p266P151
3013A10147N2508j63362L3039M2742m7731L6552J6165r6534j612N2225j8653k5374
3001i888K5876N0115j7115m9859o089N1283L9149K4730q1547j9962j4270N3775
2989D6198Q6470r796q0793k1012q5075M5221J7384M712P7266K9714j1282J0433
2977A09440l9177k3050J3231l6240J4597J2039R9046r3939j29865J09105k9005
$$ plain form
3059 430657 284599 274643 371440 407323 395067 429200 308742 123027 124437 165321 186929
3048 186929 211151 200046 187352 209576 263590 132414 120915 130493 207461 158729 168108 222044
3036 222044 98978 133849 235509 251376 118702 134989 107366 133319 242928 179042 117609
3025 117609 95259 143895 72007 81522 124176 138540 166578 112691 133492 110262 102996 110147
3013 110147 162655 -707 32332 75074 27343 63895 80060 -16474 -18086 34139 15486 -9888
3001 -9888 15988 66103 48988 -871 -6960 44323 83472 108202 26655 6693 -7577 46198
2989 46198 132668 122872 42079 21067 -64008 -18787 -1403 3309 80575 110289 99007 109440
2977 109440 70263 47213 60444 24204 38801 50840 149886 55947 -73918 35187 6182
2966F182n0063N0338Q891l3855m89N0804l6906p6349L1408R0992L3409L0618k3577
2953H1403K9839K6746o8776m6364k0822K9394L3494m7198M7176K3365M1701o2826
2941F7132j46854L4484l292k1521M7012J9095o181q61l3043n2979O9914K3844
2929c250j1657L800P2641M5700K0031j00087j57134j9702J68227K5720j06713
2918f2424O9776K2637L2232P9341k4052o992P330q7106q2988J7411L5044j10173
2906a09964r754L1023L9224j4375j4212n1537l5964J35197R8564p6960r67m764
2894a4489M406N8410m9513j36368j0997p783J14108l2671q7622P9671O8090R6803
2882H2045p4042K4180O435j74832p5639R5831Q4397M158l8560j1717k8932J24417
$$ plain form
2966 6182 -43881 6457 15348 -18507 -18996 31808 -5098 -81447 -50039 40953 74362 104980 81403
2953 81403 111242 137988 69212 22848 2026 31420 64914 17716 64892 88257 129958 67132
2941 67132 -79722 -45238 -48530 -70051 -23039 -3944 -10125 -10986 -44029 -97008 -27094 -3250
2929 -3250 -14907 -11107 61534 107234 127265 27178 -129956 -149658 18569 44289 -62424
2918 -62424 7352 29989 62221 141562 117510 110518 117848 30742 -52246 -34835 209 -109964
2906 -109964 -119718 -88695 -49471 -63846 -78058 -129595 -165559 -30362 68202 -8758 -9725 -14489
2894 -14489 -10083 48327 -1186 -137554 -148551 -156334 -42226 -74897 -162519 -82848 -14758 82045
2882 82045 8003 32183 38618 -136214 -211853 -116022 -31625 -27467 -66027 -77744 -106676 17741
2870A7741j14958m539P9551o864R7750l9912n1889Q2519P6805J9593l2706n1894
2858G1197Q7813j4149P303j17901q6601n0997J26336M4568q6429o4950M069M7121
2846c2620k5807P6890r5400M0193J23481j6242n0420K5156n5297J3752J24028
2835A27714q4475r7466q560J7653M0175k4824k4294M3865l6844j0312L5173n7802
2823g9997m2483N6103J12014l5216R382O224J8480J46045m2796j17389J2303J3294
2811E5964m1541l0258n3581N3007N4628N3920j06795j4097J2926N0289J2728m8593
2799a403M6410l4960j49375R4589k2573m6705Q6129k1290J12392J06570o7498
2788A02286p1296Q692n7066r0101M4401O7656j923O274l5833m7076p8045O4868
$$ plain form
2870 17741 -97217 -101756 -22205 -29069 68681 28769 -23120 59399 136204 155797 123091 71197
2858 71197 159010 144861 152164 34263 -52338 -103335 23001 67569 -18860 -83810 -79741 -32620
2846 -32620 -58427 18463 -76937 -36744 86737 70495 20075 45231 -10066 3686 127714
2835 127714 43239 -54227 -62787 -45134 -4959 -29783 -54077 -10212 -47056 -57368 -22195 -79997
2823 -79997 -122480 -66377 45637 10421 19803 26027 44507 190552 147756 30367 42670 55964
2811 55964 14423 -15835 -69416 -16409 38219 92139 -14656 -28753 -15827 34462 47190 -1403
2799 -1403 45007 10047 -139328 -44739 -67312 -114017 -27888 -49178 63214 169784 102286
2788 102286 30990 39682 -17384 -107485 -63084 4572 2649 8923 -26910 -73986 -152031 -87163
2776h7163M5534J64801j13436k5247k4873M1824K215p9510j29717J13198O7987
2765b4387l0369J21174O5289j7887j7066n9701r5732Q21J2278l8774K3939q866
2753f9281j7547O6289k0232L0667o1986o3305k98j6720N5636N4882M1335N0779
2741E0219q4142p9720J01846m3867r8826P9477n415P989j1326n8913P9614J08640
2729D5576l8762m2190q838M6093r685M8669n1020j9312o883m2281M7855m3396
2717g4174l3877n7842J4029M9049P4865Q0308n4231N153k771L2402n6500M4455
2705B0866n2851o0465p269J03834N3619o1803n4552O0772L4879Q887J8819n2273
2693A2463p3635J22557J4861r9003k9942k6903K956O2554J7905m6330J6636J7098
$$ plain form
2776 -87163 -41629 123172 9736 -15511 -40384 1440 3655 -75855 -205572 -92374 -24387
2765 -24387 -54756 66418 131707 113820 96754 37053 -58679 -57858 -45580 -84354 -60415 -69281
2753 -69281 -86828 -20539 -40771 -10104 -72090 -135395 -135693 -152413 -96777 -41895 -560 50219
2741 50219 -33923 -113643 -11797 -55664 -154490 -75013 -80428 -72439 -83765 -142678 -63064 45576
2729 45576 6814 -35376 -44214 1879 -7806 40863 -10157 -29469 -36352 -78633 -30778 -74174
2717 -74174 -108051 -165893 -151864 -102815 -27950 52358 -1873 3280 509 32911 -23589 20866
2705 20866 -31985 -92450 -99719 4115 57734 -4069 -58621 2151 37030 45917 64736 12463
2693 12463 -61172 61385 76246 -22757 -52699 -79602 -76646 -14092 3813 -42517 -25881 -8783
2681h783j7944m6089P611N7319n4771p4066P7256Q8434n7505K0816J7881J6172
2669B6331J7748m1443n9785j66R755J3794l8383P115l7420M396k576J5383J34853
2656D9602l5734o3995k0511M6885J6587k0818K7005Q0812k5126J8464j02158k1705
2644e0692P7117r9441o288J18774m57j4341q4009Q6451l8484j6220q3753o133
2632a17476Q6564l1029O0770p961m6566N7931L9624K6000m0063l9140N2724J03867
2620A45245j60142r6489k1590K3264J60988j13360L1254N7642j18491l1792N276
2609a18195K2984J9815j7583K6247P445o0068P8134k8496L395K6302o9592j4237
2597a23849P6088K715M8015r7980q2852o2688M7886R8828L8530K7734O2327Q941
$$ plain form
2681 -8783 -26727 -72816 -65205 -7886 -62657 -136723 -59467 28967 -28538 -7722 10159 26331
2669 26331 44079 2636 -57149 -57315 -47560 -33766 -72149 -65034 -102454 -98058 -100634 -85251 49602
2656 49602 13868 -50127 -70638 -23753 -7166 -27984 -979 79833 54707 73171 -28987 -50692
2644 -50692 26425 -73016 -79304 39470 39013 24672 -59337 27114 -11370 -27590 -111343 -117476
2632 -117476 -30912 -61941 -1171 -9132 -55698 2233 41857 67857 27794 -11346 41378 145245
2620 145245 -14897 -111386 -132976 -109712 51276 -62084 -30830 26812 -91679 -123471 -118195
2609 -118195 -95211 -75396 -92979 -66732 -59287 -119355 -41221 -69717 -66322 -40020 -109612 -123849
2597 -123849 -47761 -45046 2969 -95011 -177863 -240551 -192665 -93837 -55307 -27573 34754 43695
2585D3695r1594m7248l0994n6241M7535K3504N4282N8938q0752m4775J08079M6613
2573C1042m2126J11543J4145n1746O7924j15326n7629k5462N575L2398Q715R6229
2561G5282k3076k9234j3266k3318j43824R4490R6851m3790q2365n3599O8133J14828
2549C7112J419m7379j37967P1103P4321N8862r631k373m2443j927j7181L6122
2537B0038N4901N2316P869q1776l8988N9158j10873M1765q4922m4632Q7635L4746
2525b763N6755q3020M969N7491J5001O402m6403L8225j2700o9178m3552p4190
2513a52963K5558N5134L2340k3657M5828O4283j5083k0930r6249k9167M2562J19658
2501D7314j6806j34624J3399l8551m1921J20328M3859r2869J08229N486o6447
$$ plain form
2585 43695 -47899 -95147 -126141 -182382 -134847 -111343 -57061 1877 -78875 -123650 -15571 31042
2573 31042 -11084 100459 114604 62858 130782 15456 -42173 -67635 -62060 -29662 -20947 75282
2561 75282 52206 22972 9706 -13612 -157436 -62946 33905 -9885 -92250 -145849 -77716 37112
2549 37112 38531 -8848 -146815 -75712 -1391 57471 47840 45467 3024 1097 -16084 20038
2537 20038 74939 127255 135124 53348 14360 73518 -37355 4410 -80512 -125144 -37509 -2763
2525 -2763 53992 -29028 -24059 33432 48433 54835 8432 46657 33957 -35221 -78773 -152963
2513 -152963 -127405 -72271 -39931 -63588 -17760 46523 31440 10510 -85739 -114906 -72344 47314
2501 47314 30508 -104116 -90717 -129268 -171189 -50861 -7002 -99871 8358 13844 -52603
2490e2603K6804l2214J3876r5308K355M8113k1598k1223O3509K4524n4274L9246
2478e8793J5346J1806r4615K6382K0488P5520n5675l4338M3804k0513o5806K4436
2466a11958O7144j70010j3060Q7365Q2462Q8699n9398m7565O3322k0123m4254
2455g7376R7850L5988M7650o1327j32605k8631M8062j3657P9732R0649r8739p9547
2443i1951j0088P9640O469K5956j2074j13551m8217O1454J16051m8187o8632Q4961
2431a8169M8362j11454J13646m2845j09937K8341M524M5026O5940j1444j3596
2420a606K1569J00386p1082q8732L984N5217o9022n7493L7995m8800O9876Q5455
2408C7747O167q1582n1452N2190L2096J6980J2345L7211j06212j3404O5323M743
$$ plain form
2490 -52603 -25799 -58013 -44137 -139445 -137090 -88977 -110575 -131798 -68289 -43765 -98039 -58793
2478 -58793 -43447 -31641 -126256 -99874 -79386 -3866 -59541 -93879 -50075 -70588 -136394 -111958
2466 -111958 -44814 -214824 -227884 -140519 -58057 30642 -28756 -76321 -12999 -33122 -77376
2455 -77376 20474 56462 104112 42785 -89820 -118451 -70389 -84046 -4314 86335 -12404 -91951
2443 -91951 -102039 -22399 -15930 10026 -2048 -115599 -163816 -102362 13689 -34498 -103130 -18169
2431 -18169 30193 -81261 32385 -10460 -120397 -92056 -87532 -42506 23434 11990 -1606
2420 -1606 19963 120349 49267 -39465 -35481 19736 -49286 -106779 -68784 -117584 -47708 37747
2408 37747 43914 -37668 -89120 -36930 -4834 12146 24491 61702 -44510 -57914 7409 12152
2396A2152J9332j3388l4635L2384j086j29866K4335J02221j4673o1257N8998o3369
2384f8852q5080O5937N7092K652k6435P081k2907P0367O344m143l4107r1232P4696
2371d8587L5641r8176O0803l1834K218J20677o5807o5626j22522J4745J82212
2360a6256J01946r5220J0632R4110j44908J4025Q2469m1390J4351q9211M4807
2349b4645J9800K2362r9855l1661Q3225J04004L5036j25233J976K0684k8312O2826
2337D0207J2205K68n1937J2833m8945k6821O4895L3452j4574j4873j5354p523
2325a6167j3700k1037J3899m3513M5861J9255Q846j5694j7455J515P8764J4113
2313E4687p0475k2257J3774m1679J28734L7879p0160L8115o0335J2983j7990L1770
$$ plain form
2396 12152 31484 18096 -16539 15845 14759 -115107 -90772 11449 -3224 -64481 -5483 -68852
2384 -68852 -153932 -87995 -30903 -28251 -54686 -47605 -70512 -145 6199 2056 -32051 -123283 -48587
2371 -48587 -12946 -111122 -50319 -82153 -79935 40742 -25065 -90691 -213213 -198468 -16256
2360 -16256 85690 -9530 1102 95212 -49696 -35671 46798 5408 19759 -69452 -24645
2349 -24645 -4845 17517 -82338 -113999 -30774 73230 108266 -16967 -14991 5693 -22619 40207
2337 40207 52412 52680 743 13576 -35369 -62190 2705 36157 21583 6710 -8644 -16167
2325 -16167 -29867 -50904 -37005 -80518 -34657 -15402 -6556 -22250 -39705 -38190 40574 54687
2313 54687 -15788 -38045 -24271 -65950 62784 100663 30503 68618 8283 21266 3276 35046
2301C5046l9699O121o2659J14235l4169n5681J07962n5373l0476o838k2813p0969
2289a15313p8976O7168p234M1254J7098R0340k2870k2861R2581k5009l9815j2902
2277a6539M6449P8575q3307o0811K4538l8493M8818k5260K6940L6731o73j8054
2265A8914q0075j1069K2091l99Q2316l5988j3713k2599N633m3469Q1682J12409
2253A15733m6515j76924l0224J14170p970p3465M2153Q9485l6050m9259L871q7103
2241a42098J6981K6422J12955L1314r9955p560N847L6652K854n1124L930m5690
2229a09472L1038m0218N512N5818k4282p7417J11035M2462L1379J05285p3139
2218E8001n8294j67042j5685J32239q032r1719N3276M3906J08935R211j14130
$$ plain form
2301 35046 -4653 1468 -61191 53044 18875 -36806 71156 15783 -14693 -21531 -44344 -115313
2289 -115313 -194289 -127121 -134355 -93101 -76003 14337 -8533 -31394 61187 36178 -3637 -16539
2277 -16539 29910 108485 25178 -35633 -11095 -49588 -770 -26030 910 37641 36968 18914
2265 18914 -61161 -72230 -50139 -50538 31778 -4210 -17923 -40522 -34889 -78358 3324 115733
2253 115733 69218 -107706 -137930 -23760 -31730 -105195 -63042 26443 -9607 -58866 -54995 -142098
2241 -142098 -125117 -98695 14260 45574 -54381 -61941 -56094 -19442 -16588 -67712 -63782 -109472
2229 -109472 -78434 -118652 -113140 -57322 -81604 -159021 -47986 -5524 25855 131140 58001
2218 58001 -293 -167335 -183020 -50781 -58813 -150532 -97256 -53350 55585 64796 -49334
2207d9334n1103K808N7570K0603R679L1968Q3061o1669j94000K5869J01599M2296
2195A9347m9908l7640r932J6850k265O5272L6074k3172j3175l120r9974K7457
2183g4186L4942m7108J8734J09676K0343j06173N3537p7755N8259K8800p667j0738
2171F64L8862p7224j07040J22615j2455k4110J22905n5852k8291L719k2631k6138
2159f4976j3343j00274L4621L4908n4901L7789J12845L5821n2177q8938J8734
2148i9891P382J8071K5784N1280L2604L0n0681n3621R8217P4531o1710r8215o140
2135f2359J4233N2551m5456m1467K3866l4517m5210J03159j709K0409J3231O2594
2123E9325r9583j6564M3984j3020m6849N0245J2012j9779L1174l5681p6709K8086
$$ plain form
2207 -49334 -100437 -97629 -40059 -19456 -9777 22191 105252 43583 -150417 -124548 -22949 19347
2195 19347 -30561 -68201 -78133 -61283 -63548 1724 37798 14626 1451 -1669 -101643 -74186
2183 -74186 -39244 -86352 -67618 42058 62401 -43772 9765 -67990 -9731 19069 11402 664
2171 664 39526 -37698 -144738 -22123 -34578 -58688 64217 8365 -19926 -16207 -38838 -64976
2159 -64976 -78319 -178593 -143972 -109064 -163965 -126176 -13331 22490 -29687 -118625 -99891
2148 -99891 -92509 -74438 -48654 2626 35230 35260 -15421 -69042 29175 103706 41996 -56219 -62359
2135 -62359 -48126 4425 -41031 -82498 -58632 -93149 -138359 -35200 -36909 -16500 -3269 59325
2123 59325 -40258 -56822 -12838 -25858 -72707 -22462 -10450 -30229 945 -34736 -111445 -83359
2111h3359L2882o7146l3218Q8446J23098k6012n9684k3623l7601N0559k5428P5109
2099A4023j8715n6153R999J5840n465K4324l4471p606K5825J6093m6496M5545
2087a7257J8035O6791q376j75433N0609n2922O9585O1462J9647N4897m3863m8026
2075d851j404p3782l7702p393l2064R506P5269p1313N0099J7142R740Q7397M6184
$$ plain form
2111 -83359 -50477 -117623 -150841 -62395 60703 34691 -24993 -48616 -86217 -35658 -61086 14023
2099 14023 -4692 -60845 -50846 -35006 -40471 -16147 -50618 -58224 -32399 -16306 -62802 -17257
2087 -17257 778 67569 59193 -116240 -65631 -118553 -48968 12494 32141 87038 43175 -4851
2075 -4851 -6255 -80037 -117739 -125132 -157196 -147690 -72421 -143734 -93635 -76493 -66753 20644 66828
$$ [...]
##END NTUPLES=NMR SPECTRUM
##END=
