##TITLE=1H_EC-3317(2)
 DMSO-d6
 8 sc, 
 5.3.2024
##JCAMPDX= 6.0         $$ Bruker NMR JCAMP-DX V2.0
##DATA TYPE= NMR SPECTRUM
##DATA CLASS= NTUPLES
##ORIGIN= UXNMR, Bruker Analytische Messtechnik GmbH
##OWNER= root
$$ XWIN-NMR		Version 3.5
$$ Tue Mar  5 14:06:02 2024 Russian Standard Time (UT+4h)  she@DPX200
##.OBSERVE FREQUENCY= 200.1313
##.OBSERVE NUCLEUS= ^1H
##.ACQUISITION MODE= SIMULTANEOUS
##.ACQUISITION SCHEME= undefined
##.AVERAGES= 8
##.DIGITISER RES= 18
##SPECTROMETER/DATA SYSTEM= spect
##.PULSE SEQUENCE= zg30
##.SOLVENT NAME= CDCl3
##.SHIFT REFERENCE= (INTERNAL, CDCl3, 0, 15.4064)
##AUDIT TRAIL= $$ (NUMBER, WHEN, WHO, WHERE, WHAT)
$$ ##TITLE= Audit trail, XWIN-NMR		Version 3.5
$$ ##JCAMPDX= 5.01
$$ ##ORIGIN= Bruker BioSpin GmbH
$$ ##OWNER= she
$$ F:/spectra/data/she/nmr/H-F/1/pdata/1/auditp.txt
$$ ##AUDIT TRAIL=  $$ (NUMBER, WHEN, WHO, WHERE, WHAT)
(   1,<2024-03-05 14:04:55.96 +0400>,<she>,<DPX200>,
      <created by zg, POWCHK disabled, PULCHK disabled
       configuration hash MD5:
       00 E9 B6 7A A2 85 ED C7 34 08 36 98 17 FE 4E 26
       data hash MD5: 16K
       11 27 98 56 82 1E AD 7F D7 A9 C9 06 0D 73 91 DC>)
(   2,<2024-03-05 14:04:58.65 +0400>,<she>,<DPX200>,
      <Start of raw data processing
       efp BC_mod = 2 LB = 0.24 FT_mod = 6 PKNL = 1 PHC0 = -24945.31 PHC1 = 7.65264 SI = 16K 
       data hash MD5: 16K
       33 E0 25 1D 53 26 FE 00 F2 12 ED 42 44 87 B1 82>)
(   3,<2024-03-05 14:05:16.23 +0400>,<she>,<DPX200>,
      <pk PHC0 = 0.9687909 PHC1 = 2.980232e-08 
       data hash MD5: 16K
       F1 57 B8 78 4C 09 4B 13 19 54 C0 87 04 2E 41 0B>)
(   4,<2024-03-05 14:05:20.29 +0400>,<she>,<DPX200>,
      <abs ABSG = 5 
       data hash MD5: 16K
       E7 B7 23 14 5F D5 22 6F AB D9 BA 7D 5C BC 1C 22>)
$$ ##END=
$$ 
$$ hash MD5
$$ BB B0 C3 24 7E 7D 7C 20 AC E1 B2 BF 11 B1 BF BF
##$RELAX= 
##$RELAX= 
##$RELAX= 
##$RELAX= 
##$RELAX= 
##$RELAX= 
$$ Bruker specific parameters
$$ --------------------------
##$DU= <F:/spectra>
##$EXPNO= 1
##$NAME= <H-F>
##$PROCNO= 1
##$TYPE= <nmr>
##$USER= <she>
##$AMP= (0..31)
100 100 100 100 100 100 100 100 100 100 100 100 100 100 100 100 100 100 
100 100 100 100 100 100 100 100 100 100 100 100 100 100 
##$AQSEQ= 0
##$AQ_mod= 1
##$AUNM= <au_zg>
##$AUTOPOS= <>
##$BF1= 200.13
##$BF2= 200.13
##$BF3= 200.13
##$BF4= 200.13
##$BF5= 200.13
##$BF6= 200.13
##$BF7= 200.13
##$BF8= 200.13
##$BYTORDA= 1
##$CFDGTYP= 0
##$CFRGTYP= 5
##$CHEMSTR= <none>
##$CNST= (0..31)
1 1 145 1 1 1 1 1 1 1 1 1 1 1 1 1 1 1 1 1 1 1 1 1 1 1 1 1 1 1 1 1 
##$CPDPRG= <>
##$CPDPRG1= <>
##$CPDPRG2= <>
##$CPDPRG3= <>
##$CPDPRG4= <mlev>
##$CPDPRG5= <mlev>
##$CPDPRG6= <mlev>
##$CPDPRG7= <mlev>
##$CPDPRG8= <mlev>
##$CPDPRGB= <>
##$CPDPRGT= <>
##$D= (0..31)
0 1.2 0 0 0 0 0 0 0 0.06 0 0.03 0 0 0 0 0.0002 0 0 0 0 0 0 0 0 0 0 0 0 
0 0 0 
##$DATE= 1709633095
##$DBL= (0..7)
120 120 120 120 120 120 120 120 
##$DBP= (0..7)
150 150 150 150 150 150 150 150 
##$DBP07= 0
##$DBPNAM0= <>
##$DBPNAM1= <>
##$DBPNAM2= <>
##$DBPNAM3= <>
##$DBPNAM4= <>
$$ [...]
##$SUBNAM3= <"">
##$SUBNAM4= <"">
##$SUBNAM5= <"">
##$SUBNAM6= <"">
##$SUBNAM7= <"">
##$SUBNAM8= <"">
##$SUBNAM9= <"">
##$SW= 18.0517328524113
##$SWIBOX= (0..15)
0 0 2 0 0 0 0 0 0 0 0 0 0 0 0 0 
##$SW_h= 3612.71676300578
##$TD= 16384
##$TD0= 1
##$TE= 0
##$TE2= 300
##$TE3= 300
##$TEG= 300
##$TL= (0..7)
0 120 120 120 120 120 120 120 
##$TP= (0..7)
150 150 150 150 150 150 150 150 
##$TP07= 0
##$TPNAME0= <>
##$TPNAME1= <>
##$TPNAME2= <>
##$TPNAME3= <>
##$TPNAME4= <>
##$TPNAME5= <>
##$TPNAME6= <>
##$TPNAME7= <>
##$TPOAL= (0..7)
0.5 0.5 0.5 0.5 0.5 0.5 0.5 0.5 
##$TPOFFS= (0..7)
0 0 0 0 0 0 0 0 
##$TUNHIN= 0
##$TUNHOUT= 0
##$TUNXOUT= 0
##$USERA1= <user>
##$USERA2= <user>
##$USERA3= <user>
##$USERA4= <user>
##$USERA5= <user>
##$V9= 5
##$VALIST= <valist>
##$VCLIST= <CCCCCCCCCCCCCCC>
##$VD= 0
##$VDLIST= <DDDDDDDDDDDDDDD>
##$VPLIST= <PPPPPPPPPPPPPPP>
##$VTLIST= <TTTTTTTTTTTTTTT>
##$WBST= 1024
##$WBSW= 4
##$XGAIN= (0..3)
0 0 0 0 
##$XL= 0
##$YL= 0
##$YMAX_a= 136308
##$YMIN_a= -162297
##$ZGOPTNS= <>
##$ZL1= 120
##$ZL2= 120
##$ZL3= 120
##$ZL4= 120
##$ABSF1= 15.40643
##$ABSF2= -2.645417
##$ABSG= 5
##$ABSL= 3
##$ALPHA= 0
##$AQORDER= 0
##$ASSFAC= 0
##$ASSFACI= 0
##$ASSFACX= 0
##$ASSWID= 0
##$AUNMP= <proc_1d>
##$AZFE= 0.1
##$AZFW= 0.1
##$BCFW= 0
##$BC_mod= 2
##$BYTORDP= 0
##$COROFFS= 0
##$CY= -3
##$DATMOD= 1
##$DC= 0
##$DFILT= <>
##$DTYPP= 0
##$F1P= 0
##$F2P= 0
##$FCOR= 1
##$FTSIZE= 16384
##$FT_mod= 6
##$GAMMA= 0
##$GB= 0
##$INTBC= 1
##$INTSCL= 3.70164e-10
##$ISEN= 128
##$LB= 0.24
##$LEV0= 0
##$LPBIN= 0
##$MAXI= 10000
##$MC2= 0
##$MEAN= 0
##$ME_mod= 0
##$MI= 1.114404
##$NCOEF= 0
##$NC_proc= -5
##$NLEV= 6
##$NOISF1= 3.799351
##$NOISF2= 2.8
##$NSP= 0
##$NTH_PI= 0
##$NZP= 0
##$OFFSET= 15.40643
##$PC= 1
##$PHC0= -24944.34
##$PHC1= 7.65264
##$PH_mod= 1
##$PKNL= yes
##$PPARMOD= 0
##$PSCAL= 0
##$PSIGN= 0
##$REVERSE= no
##$SF= 200.130023068741
##$SI= 16384
##$SIGF1= 3
##$SIGF2= 2
##$SINO= 5.538805
##$SIOLD= 16384
##$SREGLST= <1H.CDCl3>
##$SSB= 0
##$STSI= 16384
##$STSR= 0
##$SW_p= 3612.71676300578
##$SYMM= 0
##$S_DEV= 0
##$TDeff= 16384
##$TDoff= 0
##$TI= <>
##$TILT= no
##$TM1= 0
##$TM2= 0
##$TOPLEV= 0
##$USERP1= <user>
##$USERP2= <user>
##$USERP3= <user>
##$USERP4= <user>
##$USERP5= <user>
##$WDW= 1
##$XDIM= 16384
##$YMAX_p= 288508497
##$YMIN_p= -196704
$$ End of Bruker specific parameters
$$ ---------------------------------
##NTUPLES= NMR SPECTRUM
##VAR_NAME=  FREQUENCY,     SPECTRUM/REAL,   SPECTRUM/IMAG
##SYMBOL=    X,             R,               I
##VAR_TYPE=  INDEPENDENT,   DEPENDENT,       DEPENDENT
##VAR_FORM=  AFFN,          ASDF,            ASDF
##VAR_DIM=   16384,         16384,           16384
##UNITS=     HZ,            ARBITRARY UNITS, ARBITRARY UNITS
##FACTOR=    0.220516191357247, 1,           1
##FIRST=     3083.28924022789, 0,            0
##LAST=      -529.427522777893, 0,           0
##MIN=       -529.427522777893, -196704,     0
##MAX=       3083.28924022789, 288508497,    0
$$ Real data points
##PAGE= N=1
##DATA TABLE= (X++(R..R)), XYDATA
$$ [...]
8814B65468p424l4950j3143K5692J3253o3751J6370k1328j7387K52o3450J9488
$$ 265468 258044 223094 209951 235643 248896 185145 201515 180187 162800 163052 99602 119090
8802A19090O6330j5850j3625l4465K7982k185j5646N6644L6208K8921q3785j3476
$$ 119090 185420 169570 155945 121480 149462 147277 131631 188275 224483 253404 169619 156143
8790A56143J1898L578l864L9404q2035m8368j8580O935k5018M7163L1824j9968
$$ 156143 168041 171619 167755 207159 125124 76756 58176 65111 40093 87256 119080 99112
8778I9112m4512N4376j3043O655j6462j5178n502K3869j387J7980k8015J112k3413
$$ 99112 54600 108976 95933 102588 86126 70948 65446 89315 87928 105908 77893 79005 55592
8765E5592k2078K3394N572j0022j9349N5119m8343J6639J2609P684J2426m7942
$$ 55592 33514 56908 62480 52458 33109 88228 39885 56524 69133 76817 89243 41301
8753D1301l9879m3070k5423Q4309k383p566l3696k875M5970N0022M4353Q553m3021
$$ 41301 1422 -41648 -67071 17238 14855 7289 -26407 -29282 16688 66710 111063 119616 76595
8740G6595L062j6554n2152l3678L0191j4956M2209Q0251j080l8360O260n427n0683
$$ 76595 79657 63103 10951 -22727 7464 -7492 34717 114968 113888 75528 81788 76361 25678
8727B5678M3345L939l7612K6774j3344q083M534P244l8273j063l2268O2395J0075
$$ 25678 69023 72962 35350 62124 48780 40697 45231 52475 14202 13139 -19129 43266 53341
8714E3341L2158o865k64m7285j4734j1148K7131L3189J746L1963j12082j3622
$$ 53341 85499 78634 78370 31085 16351 5203 32334 65523 67269 99232 -12850 -26472
8702b6472N9683K8074K1311l485q764k9202l0733j8816N1001K133j9743j3753
$$ -26472 33211 61285 82596 79111 70347 41145 10412 -8404 42597 44730 24987 11234
8690A1234k4729M1572l3599k6835N2956L8979L3152j3660p88l2019j5426J4464
$$ 11234 -13495 28077 -5522 -32357 20599 59578 92730 79070 78282 46263 30837 45301
8678D5301p8909K637N1850M7828k3660L294m7546L3423M7464k4797m5655n5799
$$ 45301 -33608 -30971 20879 68707 45047 48341 795 34218 81682 56885 11230 -44569
8666d4569l3527O9451R694k65J6639n9004K8929J2543j839L402j4102K2571l6094
$$ -44569 -78096 -8645 1049 784 17423 -41581 -12652 -109 -1948 1454 -12648 9923 -26171
8653b6171j2218O9423l1020l6219M0095K4385q948m378K7234k6057k6238j6875
$$ -26171 -38389 31034 14 -36205 3890 28275 19327 14949 42183 16126 -10112 -26987
8641b6987j2659j4043k5537J7915K1642j9458K8167J00519o2474j6763L1926p4136
$$ -26987 -39646 -53689 -79226 -61311 -39669 -59127 -30960 69559 7085 -9678 22248 -51888
8629e1888J6240J5433K7646m796K6340L7210m2511j7375k0123J9174J3390k9322
$$ -51888 -35648 -20215 7431 2635 28975 66185 23674 6299 -13824 5350 18740 -10582
8617a0582k7297K9387p3590K2667j5006J5345l5766m81K0145J6565L1140l1586
$$ -10582 -37879 -8492 -82082 -59415 -74421 -59076 -94842 -95323 -75178 -58613 -27473 -59059
8605e9059L7729l963O4343o5410k8154J8882P8413m367n3071R502n9444l3313
$$ -59059 -21330 -25293 39050 -26360 -54514 -35632 42781 38414 -14657 -5155 -64599 -97912
8593i7912J00176m1411K5828j2789p6050j7216L605M4889N0067L2126m2284j4372
$$ -97912 2264 -39147 -13319 -26108 -102158 -119374 -115769 -70880 -20813 11313 -30971 -45343
8581d5343J6536p8926J6367M3579k265K3659M0252n7459k7647K2143J3670j8405
$$ -45343 -28807 -107733 -91366 -47787 -50052 -26393 13859 -43600 -71247 -49104 -35434 -53839
8569e3839j1985L9159J4932k0057l9448P5061m079o1848L0033K402p597J2986
$$ -53839 -65824 -26665 -11733 -31790 -71238 3823 -256 -62104 -32071 -29669 -37266 -24280
8557b4280K539l7228K5178M6035k6543p6499K5461L2755j5060l515J9254J2486
$$ -24280 -21741 -58969 -33791 12244 -14299 -90798 -65337 -32582 -47642 -51157 -31903 -19417
8545a9417k3609N9165J7254j06291j0842J9758N5522L426l9472K6111L129K4298
$$ -19417 -43026 16139 33393 -72898 -83740 -63982 -8460 -5034 -44506 -18395 -15266 9032
8533I032o9332J5334O750L5491l4790k1118M6829K5817l6733q78R843M7964m809
$$ 9032 -60300 -44966 -38216 -2725 -37515 -58633 -11804 14013 -22720 -23598 -13755 34209 29400
8520B9400j5249p1207O3845o715n5624k0236l837O1604l4618J1003J1028K6K6429
$$ 29400 14151 -57056 6789 74 -55550 -75786 -79623 -18019 -52637 -41634 -30606 -30580 -4151
8507d151n597o294R172m4370L3759L0465L747N915p1950k2180j2532R8034M6412
$$ -4151 -9748 -16042 -6870 -51240 -17481 12984 16731 22646 -49304 -71484 -84016 14018 60430
8494F0430p5095q5787M4992K8322p205L686R956o1083J3295k0707K5287P0896
$$ 60430 -14665 -100452 -55460 -27138 -34343 -30657 -20701 -81784 -68489 -89196 -63909 6987
8482F987R525j5609o1026o76L743J0557k7187M6527r503K2021k7675k8163M8218
$$ 6987 16512 903 -60123 -60799 -57056 -46499 -73686 -27159 -36662 -14641 -42316 -70479 -22261
8469b2261l8052J310k1768R041L4180M8727n9578j7632K4110p960K0769l4254
$$ -22261 -60313 -59003 -80771 -71730 -37550 11177 -48401 -66033 -41923 -49883 -29114 -63368
8457f3368M4354k4281K2410l9598O7446n3165j1408L8721j232j255K3545K4447
$$ -63368 -19014 -43295 -20885 -60483 6963 -46202 -57610 -18889 -20121 -21376 2169 26616
8445B6616k9562j358J841j4893j5308q290k7643o331m733K4887M7560J1780k3046
$$ 26616 -2946 -4304 -2463 -17356 -32664 -40954 -68597 -74928 -79661 -54774 -7214 4566 -18480
8432a8480l5617K9841k1400j7548K7849N0100l2341q0222j440P7437N800l6746
$$ -18480 -54097 -24256 -45656 -63204 -35355 14745 -17596 -97818 -99258 -21821 -16021 -52767
8420e2767m938N7298M365L816o7403j8669L6056l6579J7302n4928N0468J10412
$$ -52767 -57705 -407 3958 7774 -59629 -78298 -42242 -78821 -61519 -116447 -65979 44433
8408D4433l7698l3308L352K4347J4359J0209n6744N829j4557j1961M2406l8073
$$ 44433 6735 -26573 -23221 1126 15485 25694 -31050 -25221 -39778 -51739 -9333 -47406
8396d7406p323L882m5087j0540K0522L5647L8330p6205K1504K8444J669J2330
$$ -47406 -54729 -50847 -95934 -106474 -85952 -50305 -11975 -88180 -66676 -38232 -36563 -24233
8384b4233m5542k9152m6649L8445J12056j8243o601j5572m608j3473k1836L3595
$$ -24233 -69775 -98927 -145576 -107131 4925 -13318 -19919 -35491 -40099 -53572 -75408 -41813
8372d1813l0408o1989N2775J3247J2562m220O9584k5610r6941P7828Q706n6151
$$ -41813 -72221 -134210 -81435 -68188 -55626 -59846 9738 -15872 -112813 -34985 -26279 -82430
8360h2430R141L1400l3004o3181N9322K6718J9259J1254n0115n4970L306P4599
$$ -82430 -73289 -41889 -74893 -138074 -78752 -52034 -32775 -21521 -71636 -126606 -123300 -48701
8348d8701j3495n2725K1903r219O3011n0949J2979M6096M73k624m1624l397r072
$$ -48701 -62196 -114921 -93018 -102237 -39226 -90175 -77196 -31100 -30627 -33251 -74875 -78272 -87344
8335h7344Q0411J779P789R489l6255L1842k2565P7193k1427l6256L4478j8272
$$ -87344 -6933 -5154 2635 12124 -24131 7711 -14854 62339 40912 4656 39134 20862
8323B0862K3477N134n3463j3705l6037L3547J805k287K9417l7349M0581j4847
$$ 20862 44339 49473 -3990 -17695 -53732 -20185 -18380 -20667 8750 -28599 11982 -2865
8311b865K4236M8597n2797L479N9789k1494k3662k9326m5119l4754L9990j21K2577
$$ -2865 21371 69968 17171 20650 80439 58945 35283 5957 -39162 -73916 -33926 -34047 -11470
8298a1470N520J4810q910j3818l6937K4288L0481m9670j7582K2301l074R756n0472
$$ -11470 -5950 8860 -50 -13868 -50805 -26517 3964 -45706 -63288 -40987 -44061 -34305 -84777
8285h4777k6628P4821Q8174o8453p0097P5218K2732k594m0078P883L3632M8934
$$ -84777 -111405 -36584 51590 -16863 -86960 -11742 10990 8396 -31682 -23799 9833 58767
8273E8767m4254o0851N56l2659K5423J841M7342k3798l8528O5080O2623J5836
$$ 58767 14513 -46338 -45782 -78441 -53018 -51177 -3835 -27633 -66161 -1081 61542 77378
8261G7378j8790o3944j1662L9147K165m5518L96M759r6628M2650M3792l456L0258
$$ 77378 58588 -5356 -17018 22129 24294 -21224 -20828 -16069 -112697 -70047 -26255 -29711 547
8248E47J8515o0863K816K4702N826N8567R17m4676o7339K3943J0782J2494p5553
$$ 547 19062 -41801 -38985 -14283 -8457 50110 51027 6351 -60988 -37045 -26263 -13769 -89322
8235h9322M5953P7543k5498o6755k3249M6352k1393P432p395J3227L1305j6084
$$ -89322 -43369 34174 8676 -58079 -81328 -34976 -56369 -48937 -56332 -43105 -11800 -27884
8223b7884j5812j4284K687J1755R3484k2154o2501J5091O84k6068O598L3178j1348
$$ -27884 -43696 -57980 -55293 -43538 49946 27792 -34709 -19618 -18934 -45002 -38404 -5226 -16574
8210a6574o851L586J222n5350j3520J4532J3091r715M195K7569m8098j10791J0607
$$ -16574 -23425 -19839 -18617 -73967 -87487 -72955 -59864 -69579 -65384 -37815 -85913 -196704 -186097
8197a86097O2983M4222o8613o56K5018L91003K1990j77821j1348q9308K6316J2203
$$ -186097 -123114 -78892 -147505 -148161 -123143 267860 289850 112029 100681 11373 37689 49892
8185D9892P2393k6317k3421l9227l3889O7703N465o7447k124l346N2200o6175
$$ 49892 122285 95968 72547 33320 -569 67134 72599 5152 3028 -318 51882 -14293
8173a4293j9915k1682M3595J0198K947L0138J2204K003O68o2854l7955M0137K0864
$$ -14293 -34208 -55890 -12295 -2097 850 30988 43192 45195 45863 -16991 -54946 -14809 6055
8160F055M5142k5767K318k5942m242N2602p010n3661J5006K6003j6867l0526P424
$$ 6055 51197 25430 27748 1806 -2436 50166 43156 -10505 4501 30504 13637 -16889 -9465
8147i465l590q675J0414l836l0387l2716N6179K4588n7394M6369l957m1594L8691
$$ -9465 -13055 -21730 -11316 -15152 -45539 -78255 -22076 2512 -54882 -8513 -12470 -54064 -15373
8134a5373K2506n539q289j2703M8523k0963K3648l3743j026K3768J5101J8969
$$ -15373 7133 1594 -6695 -19398 29125 8162 31810 -1933 -2959 20809 35910 54879
8122E4879n9872K7840M6762l4363l0694m6695L2449Q016p8944N2219J7275j426
$$ 54879 -4993 22847 69609 35246 4552 -42143 -9694 -1678 -80622 -28403 -11128 -12554
8110a2554m039m3160L4232k1924l9473L6609M9073K0927j8688l1525k560j4551
$$ -12554 -16593 -59753 -25521 -47445 -86918 -50309 -1236 19691 1003 -30522 -33082 -47633
8098d7633p596k4303k5369j0750N7374M9154R857J5373p9956M3942j3071j1126
$$ -47633 -55229 -79532 -104901 -115651 -58277 -9123 734 16107 -63849 -19907 -32978 -44104
8086d4104J4801K5739K8635l2058J031J6859l4299k2308J3934Q5963q5939j6001
$$ -44104 -29303 -3564 25071 -6987 -5956 10903 -23396 -45704 -31770 54193 -31746 -47747
8074d7747O6604o1305l0601N4680j5401l4412N0687n7027N9831K9583j3088n0759
$$ -47747 18857 -42448 -73049 -18369 -33770 -68182 -17495 -74522 -14691 14892 1804 -48955
8062d8955J6312k3675k438K7433K7221K1364j0512M1112l0609j6888N0028k913
$$ -48955 -32643 -56318 -58756 -31323 -4102 17262 6750 47862 17253 365 50393 47480
8050D7480q1127J6331j8272K3437J5023p0784K973K2242p6595O1538K4896k2031
$$ 47480 -33647 -17316 -35588 -12151 2872 -67912 -64939 -42697 -119292 -57754 -32858 -54889
8038e4889k3556J1548L4136K805K8845N738m3962Q91Q089j0339p7723O0345N2875
$$ -54889 -78445 -66897 -32761 -29956 -1111 4627 -39335 -38444 -30355 -40694 -118417 -58072 -5197
8025e197L4220J2547n5060J8848n8628k2070Q5466l074m8630J8215M7075K4791
$$ -5197 29023 41570 -13490 5358 -53270 -75340 10126 7052 -41578 -23363 23712 48503
8013D8503n2979m2706k9119K1663j6075K8998K7430m1037M5619P390k8202N020
$$ 48503 -4476 -47182 -76301 -54638 -70713 -41715 -14285 -55322 -9703 -2313 -30515 -25495
8001b5495j3258j5901J5994J8989J0997k9120r581O157l6729J858N8596k3763
$$ -25495 -38753 -54654 -38660 -19671 -8674 -37794 -47375 -41218 -77947 -76089 -17493 -41256
7989d1256p399J0466p0540O6232O447L4072M5830j0509K2019k7593k1135K8156
$$ -41256 -48655 -38189 -108729 -42497 -36050 -1978 43852 33343 55362 27769 6634 34790
7977C4790m8328M5303L7280j8980n1934j8547M035Q3122l9912l0547M6482l185
$$ 34790 -13538 31765 69045 50065 -1869 -20416 -16381 66741 26829 -3718 42764 39579
7965C9579o6486n2332P786P8582k8285j1899J3485K4160J032k8581l5382K7672
$$ 39579 -26907 -79239 -71453 7129 -21156 -33055 -19570 4590 5622 -22959 -58341 -30669
7953c0669K7636l8669j3743K7791K2714K8179J6815n5219J6790j5623K273n7396
$$ -30669 -3033 -41702 -55445 -27654 -4940 23239 40054 -15165 1625 -13998 -11725 -69121
7941f9121L6945O8589O524m3132K663l3795j1943K3681n3534o8775R2801M9444
$$ -69121 -32176 36413 42937 -195 2468 -31327 -43270 -19589 -73123 -141898 -49097 347
7929C47j8505m202O119M3607n8585n0115O0708M31k7456K6284K5726m2148j5443
$$ 347 -18158 -22360 -16241 27366 -31219 -81334 -20626 -20195 -47651 -21367 4359 -37789 -53232
7916e3232k5304K7733M3714k6096N5465j4311j9092n0064J7025N2019l8552J7380
$$ -53232 -78536 -50803 -7089 -33185 22280 7969 -11123 -61187 -44162 7857 -30695 -13315
7904a3315L2648n5752K3088L1484k1882N4294k1680J7911r3853j9909k7849k8090
$$ -13315 19333 -36419 -13331 18153 -3729 50565 28885 46796 -47057 -66966 -94815 -122905
7892a22905M4975L4334m3069j842M3432L7531k5256l8661L7290J3049M8432q4244
$$ -122905 -77930 -43596 -86665 -88507 -45075 -7544 -32800 -71461 -34171 -21122 27310 -56934
7880e6934k9004L3185J5288O6650l3471n1698M2721M4130p3238j996J07546K424
$$ -56934 -85938 -52753 -37465 29185 -4286 -55984 -13263 30867 -42371 -44367 63179 65603
7868F5603l6343M643m2697j8799M4591j5706k840L1249O94O524m081K3148l1817
$$ 65603 29260 33903 -8794 -27593 16998 1292 -1548 29701 30395 36919 32838 55986 24169
7855B4169j00550K728K3370j4555l6840O9557j2091J4722R625R977j3229j3543
$$ 24169 -76381 -73653 -50283 -64838 -101678 -32121 -44212 -29490 -19865 -9888 -23117 -36660
7843c6660L6285R032J0877n9238k7556j3236L6853L5566k8244K7708l637K592
$$ -36660 -375 8657 19534 -39704 -67260 -80496 -43643 -8077 -36321 -8613 -12250 -9658
7831i658J700M4238l4737k1762P1584K0946p8401j7445K4578J9349M7985l8953
$$ -9658 -7958 36280 1543 -20219 51365 72311 -6090 -23535 1043 20392 68377 29424
7819B9424l1824m5128K5968J5114l676L8142k9492k5387M0252l6005J7427j8674
$$ 29424 -2400 -47528 -21560 -6446 -10122 28020 -1472 -26859 13393 -22612 -5185 -23859
7807b3859J1427k0539L7403L9712q3047J9093K6763l1156K6430j5052p4554L9411
$$ -23859 -12432 -32971 4432 44144 -38903 -19810 6953 -24203 2227 -12825 -87379 -47968
7795d7968J8273L0769m278k9325J2405o2597K4864J0022l6067L9289o501M7821
$$ -47968 -29695 1074 -3204 -32529 -20124 -82721 -57857 -47835 -83902 -44613 -51114 -3293
7783c293L0146J0797o2492J9907M1214m3914l0473M8810j5280m7141k4207K818
$$ -3293 26853 37650 -24842 -4935 36279 -7635 -38108 10702 -4578 -51719 -75926 -73108
7771g3108N2980o440n4734K1172j448J3796K3998l2558k353K2147J6855l671k5898
$$ -73108 -20128 -26568 -81302 -60130 -61578 -47782 -23784 -56342 -58695 -36548 -19693 -23364 -49262
7758d9262J6645K956K2864k7484j2742J9527K9752j4876J6982N821m9466M9937
$$ -49262 -32617 -29661 -6797 -34281 -47023 -27496 2256 -12620 4362 10183 -39283 10654
7746A0654n5426J7243j2072O2898L6605j7793p0554n6518J09626J9903l1985P217
$$ 10654 -44772 -27529 -39601 23297 59902 42109 -28445 -84963 24663 44566 12581 19798
7734A9798k0641P276J1108k8215k3193j7832m1629L3311m4899R5469K0595k9578
$$ 19798 -843 6433 17541 -10674 -33867 -51699 -93328 -60017 -104916 -9447 11148 -18430
7722a8430J5940R902j2212j2350m4589J5200J3425P428n484l49j821n7473J7572
$$ -18430 -2490 7412 -4800 -17150 -61739 -46539 -33114 -25686 -31170 -31519 -33340 -90813 -73241
7709g3241J981o247N0351K6218m0073j4793j1513K9428O287M690N11L6153J2716
$$ -73241 -71260 -77507 -27156 -938 -41011 -55804 -67317 -37889 -31602 -26912 -26401 9752 22468
7696B2468n0863J260K9307l3661n7162J2998J6920p385J1767L8921L1819Q844
$$ 22468 -28395 -27135 2172 -31489 -88651 -75653 -58733 -66118 -54351 -15430 16389 25233
7684B5233O5896m1174k4560J5874n2162l0509K7359r231L467M7225j3417l6605
$$ 25233 91129 49955 25395 41269 -10893 -41402 -14043 -23274 -19807 27418 14001 -22604
7672b2604K3621l8519k0705N2278N6456r0577L7140l589j3784R445k9372N9913
$$ -22604 1017 -37502 -58207 -5929 50527 -40050 -2910 -6499 -20283 -10838 -40210 19703
7660A9703l7739L8359J5824j5491n7802M3606K4774l4824m1490J4740P7845l7478
$$ 19703 -18036 20323 36147 20656 -37146 6460 31234 -3590 -45080 -30340 47505 10027
7648A0027K0063k6813J0500p0487Q040l680J4338L493N2428K0890l7498k4975
$$ 10027 30090 3277 13777 -56710 -48670 -52350 -38012 -34519 17909 38799 1301 -23674
7636b3674l155P7593q2900n1460N0272q229l9871k1439K5444J1909J1089M9952
$$ -23674 -26829 50764 -32136 -83596 -33324 -41553 -81424 -102863 -77419 -65510 -54421 -4469
7624d469m1892p416J5779L9128k5934M5195L6905n2935k3528L3869j1378n6677
$$ -4469 -46361 -53777 -37998 1130 -24804 20391 57296 4361 -19167 14702 3324 -53353
7612e3353J9074j2657j6839P1802M6933l7661o5974O457O0891j0585K0435J9803
$$ -53353 -34279 -46936 -63775 8027 54960 17299 -48675 -42218 18673 8088 28523 48326
7600D8326J2974k4026l6651r327n3249j9986k0722j125R4215J6086k9804M707
$$ 48326 61300 37274 623 -8704 -61953 -81939 -102661 -103786 -9571 6515 -23289 -18582
7588a8582j1389M4554l0919l0404N3014l1743l4082j863j3811L9614K7233k344
$$ -18582 -29971 14583 -16336 -46740 6274 -25469 -59551 -61414 -75225 -35611 -8378 -10722
7576a0722L1912o657l2199K8137j1577J3607J5171l1312j8552N228J2546J1887
$$ -10722 21190 14533 -17666 10471 -1106 12501 27672 -3640 -22192 -16964 -4418 7469
7564G469M418m0324J9243p410l0187L4136M030l0772L649N3957k9752k8716M9680
$$ 7469 11887 -28437 -9194 -16604 -46791 -12655 -8625 -39397 -35748 18209 -11543 -40259 9421
7551I421J8010n4718m0192l3217J8238J3901M0396n16K0893K8630L1094m5704
$$ 9421 27431 -27287 -67479 -100696 -82458 -68557 -28161 -28677 -7784 20846 51940 6236
7539F236o0012J2345K6660k2611j9643K2100Q923j7522j161j3772M4140l4006
$$ 6236 -53776 -41431 -14771 -37382 -57025 -34925 -26002 -43524 -44685 -58457 -14317 -48323
7527d8323j7913L7393p4621L0894P3703K7638M535n8389j0717J4462q3609J7371
$$ -48323 -66236 -28843 -103464 -72570 1133 28771 33306 -25083 -35800 -21338 -104947 -87576
7515h7576Q5020Q8649P441k5800n2889o0265L2369J7795l7637k1680R688K8744
$$ -87576 -2556 86093 93534 67734 14845 -45420 -13051 4744 -32893 -54573 -44885 -16141
7503a6141m0244L4629J6673k9280K4433N671m521R060Q540l57k9396j4306j0526
$$ -16141 -56385 -21756 -5083 -34363 -9930 -4259 -8780 280 8820 8463 -20933 -35239 -45765
7490d5765j3594m690N4547m533m8829M6137n592k9443p179N6989P9251k3800o7313
$$ -45765 -59359 -64049 -9502 -14035 -62864 -16727 -22319 -51762 -58941 -1952 77299 53499 -13814
7477a3814p604K7282K0045M0875m5902j9859Q183o0919P313M849L6227J3509k5302
$$ -13814 -21418 5864 25909 66784 20882 1023 9206 -51713 -44400 -39551 -3324 10185 -15117
7464a5117p4655K8449P2187m475J2001J3978J329k6949m3716P43K339K6601J7693
$$ -15117 -89772 -61323 10864 6389 18390 32368 33697 6748 -36968 -36225 -33886 -7285 10408
7451A0408L3033N5662l6199n6532m182L5251p9763K829Q2923o5790K7548M5355
$$ 10408 43441 99103 62904 6372 2190 37441 -42322 -39493 43430 -22360 5188 50543
7439E0543k7093J1601m8755K4577l187j8155L3048n2053J2728J3371j4377K2015
$$ 50543 23450 35051 -13704 10873 7686 -10469 22579 -29474 -16746 -3375 -17752 4263
7427D263J6460j920m2742L0592k6609K146j1459K2339L2142r326n5295K435k7942
$$ 4263 20723 18803 -23939 6653 -19956 -17810 -29269 -6930 25212 15886 -39409 -36974 -64916
7414f4916R744k0599O0589J4314M769j04829M1213P4999n3889J5218j078J914
$$ -64916 -55172 -75771 -15182 -868 3901 -100928 -59715 15284 -38605 -23387 -24465 -22551
7402b2551O4581K1379q7232p237l9960L0126R690J2049k3552O417L2827J2840
$$ -22551 42030 63409 -23823 -31060 -71020 -40894 -31204 -19155 -42707 -36290 -3463 9377
7390I377k5453n1612O0485J0509j0386M847j0890J6125J9377j926o066J0263k4227
$$ 9377 -16076 -67688 -7203 3306 -7080 -2233 -13123 3002 22379 20453 14387 24650 423
7377D23N033m7859L9849J91k6175K7986m6914k6101r743K3202P9275n2428k9391
$$ 423 5456 -42403 -2554 -2363 -28538 -552 -47466 -73567 -83310 -60108 19167 -33261 -62652
7364f2652M7824J8371J551O8196L7737l5973k0252r323j9760J1010K6516J9350
$$ -62652 -14828 3543 5094 73290 111027 75054 54802 45479 25719 36729 63245 82595
7352H2595k8123K6067m9250J0769L4477k6676p3160O348P1758j0081l5316q595
$$ 82595 54472 80539 31289 42058 76535 49859 -23301 -16953 54805 44724 9408 813
7340H13l2925q160N500K9649L9562k4141j1107K2205L698j5082K4484J6568o993
$$ 813 -32112 -40272 -34772 -5123 34439 10298 -809 21396 25094 10012 34496 51064 44071
7327D4071Q209n2295O1971l3241j6398o4196K1772N9422k618Q78P3032o1309n1766
$$ 44071 52280 -15 61956 28715 12317 -51879 -30107 29315 26697 27575 100607 39298 -12468
7314a2468K2422m8092M6319K9566j6438L6987L3722m2227l6753J4148K5364m5630
$$ -12468 9954 -38138 8181 37747 21309 58296 92018 49791 13038 27186 52550 6920
7302F920k6893O2542p329K7513k9592q7272K0623r185L2345n3553O9256J3579
$$ 6920 -19973 42569 35240 62753 33161 -54111 -33488 -42673 -10328 -63881 5375 18954
7290A8954l6308J4264M3147O021K4365J2062J8047r9746K8358N689j1594j3521
$$ 18954 -17354 -3090 40057 46078 70443 82505 100552 806 29164 34853 23259 9738
7278I738l2914j6433l198P190J7298n45R401j801L3662q8692P4356Q9778l6912
$$ 9738 -23176 -39609 -42807 -35617 -18319 -18864 -9463 -11264 22398 -66294 8062 97840 60928
7265F0928l9522M3883j3309j4943N9277r9917k4367K3929k9628M5385K3390o17
$$ 60928 21406 65289 51980 37037 96314 -3603 -27970 -4041 -33669 11716 35106 34489
7253C4489J5865m6834j3144p885M6339l1959J4823L4268p7096P168K6051K5372
$$ 34489 50354 3520 -9624 -17509 28830 -3129 11694 45962 -31134 -23966 2085 27457
7241B7457K72K3454m3341k3406J153L1902N047j6922K1070n9469O8974k1990M1465
$$ 27457 27729 51183 7842 -15564 -14411 17491 22538 5616 26686 -32783 36191 14201 55666
7228E5666K2694L4594r0799l0328N1755L3626l9861j8551J6591K2937J4018k0405
$$ 55666 78360 112954 22155 -8173 43582 77208 37347 18796 35387 58324 72342 51937
7216E1937j4782n5180O9803n48j3832J4647p1326J1186j7691J3262P521K8322
$$ 51937 37155 -18025 51778 51230 37398 52045 -19281 -8095 -25786 -12524 -5003 23319
7204B3319j9967l9692R7042j4122N5966o9687J2041j4681Q305k1037r858O560
$$ 23319 3352 -36340 60702 46580 102546 32859 44900 30219 38524 17487 7629 14189
7192A4189L0402K8058K747j1201p7808J6054J3864R0788n756q0689Q874N3395
$$ 14189 44591 72649 75396 64195 -13613 2441 16305 107093 101337 20648 29522 82917
7180H2917j3240m1043k4964k625l7458O4197L455k1352l2425n8489O448O4481
$$ 82917 69677 28634 3670 1045 -36413 27784 31239 9887 -22538 -81027 -74579 -10098
7168a0098P8519n2410J8710N673p5979j633k9392N8242J4734j0455N0346k2682
$$ -10098 68421 16011 34721 40394 -35585 -37218 -66610 -8368 6366 -4089 46257 23575
7156B3575n8434k9321N5180l1360j6104J6800L3495J0047J774K3705p015o1797
$$ 23575 -34859 -64180 -9000 -40360 -56464 -39664 -6169 3878 5652 29357 22342 -39455
7144c9455P4667j7011p4890N5827p846j4776k0487P1840l1435J5347l893l7767
$$ -39455 35212 18201 -56689 -862 -8708 -23484 -43971 27869 -3566 11781 7888 -29879
7132b9879j6860M6762l0123k119l942j9681O5483j2433r20J1282L5954O4751k0730
$$ -29879 -46739 23 -30100 -32219 -36161 -55842 9641 -2792 -3712 7570 43524 108275 87545
7119H7545m0980k9037k6178k050j203J2898m1571J5278O8699N788J7512L2105
$$ 87545 46565 17528 -8650 -10700 -11903 995 -40576 -25298 43401 49189 66701 98806
7107I8806l8748n9955k402l5203N915l0406K2378J1488J9503K4333N0077L6850
$$ 98806 60058 103 -2299 -37502 -31587 -61993 -39615 -28127 -8624 15709 65786 102636
7095A02636k6024k1362J7404j01258M3163M8156l7130L1193k2239J8314n7863
$$ 102636 76612 55250 72654 -28604 14559 62715 25585 56778 34539 52853 -5010
7084e010k2789k7790L2576K6626P5527j8566k8847O0331n3384l6071q3478L9889
$$ -5010 -27799 -55589 -23013 3613 79140 60574 31727 92058 38674 2603 -80875 -40986
7072d0986M1310r182k1714o2025J44508l1331r143j2672J140L2845m5350K2331
$$ -40986 324 -8858 -30572 -92597 51911 20580 11437 -1235 -95 32750 -12600 9731
7060I731p087n653L1456m3716k7047P5396m7643k708K7823m1010M651N4582l9301
$$ 9731 2644 -3009 28447 -15269 -42316 33080 -14563 -17271 10552 -30458 -25807 28775 -10526
7047a0526k7877Q3131L3062m5341q2239M1615N6883O476m3322J4393j3322K4130
$$ -10526 -38403 44728 77790 32449 -49790 -8175 48708 55184 11862 26255 12933 37063
7035C7063M073o437m9467j3133j662M376K3710M9840J21m4814l0218L3827j2152
$$ 37063 41136 34699 -14768 -27901 -29563 -25187 -1477 48363 48484 3670 -26548 7279 -4873
7022d873P6109k2342m7472q266O3449O345n2888J8469L5979J4586p8729j494k3186
$$ -4873 71236 48894 1422 -6844 56605 62950 10062 28531 64510 79096 367 -1127 -24313
7009b4313M5417L208l5483N2349L6119l8596p631l463k4101j7346K1656l5114
$$ -24313 21104 24312 -11171 41178 77297 38701 31070 27607 3506 -13840 7816 -27298
6997b7298K1888j0744l70M9133m9704l7475K156M9548q628K0544J1929j5949l3913
$$ -27298 -5410 -16154 -16524 32609 -17095 -54570 -52414 -2866 -11494 9050 20979 5030 -28883
6984b8883j6348P3462n2119L4461m244K4321M2053J7847n6807o6962k3208O0416
$$ -28883 -45231 28231 -23888 10573 6329 30650 72703 90550 33743 -33219 -56427 3989
6972C989R7749k8565J2068J1991l4954K326K9169k6273k431l2963k7505K2830
$$ 3989 101738 73173 85241 97232 62278 64604 93773 67500 65069 32106 4601 27431
6960B7431j9750L559k4977n0994P3007L7448Q0509j5936o3801K4689n094j8996
$$ 27431 7681 11240 -13737 -64731 8276 45724 126233 110297 46496 71185 66091 47095
6948D7095K8340n663m3852j5462m9973L3223J0410O2007j5784k2663K3497l1218
$$ 47095 75435 69772 25920 10458 -39515 -6292 4118 66125 50341 27678 51175 19957
6936A9957n6885l5586L080J3432l5894N6738k6770M3549O287J6597K8557k8811
$$ 19957 -36928 -72514 -69434 -56002 -91896 -35158 -61928 -18379 -12092 4505 33062 4251
6924D251J6371N1367m7578L0926M5893l4790j127J4931o7685o746j1312l6730
$$ 4251 20622 71989 24411 55337 101230 66440 65313 80244 12559 5813 -5499 -42229
6912d2229L3437J1720k8858K5932l0984M0595M0076q9878R737K7218M2103l8976
$$ -42229 -8792 2928 -25930 2 -30982 9613 49689 -40189 -30452 -3234 38869 -107
6900a07r394k6971J0236k7024O831L7514k0552R730k0247k5638P5541j8360q492
$$ -107 -9501 -36472 -26236 -53260 -46429 -8915 -29467 -19737 -39984 -65622 9919 -8441 -16933
6887a6933M3989o458J3767P6443l5433k6245j602k88j3992L8727k1573O715K3286
$$ -16933 27056 20598 34365 110808 75375 49130 47528 47240 33248 71975 50402 57117 80403
6874H0403n8383l6078j0044r797O8288K3797Q01m0259l168J7897K5159j5084O011
$$ 80403 22020 -14058 -24102 -33899 34389 58186 58987 18728 15560 33457 58616 43532 49543
6861D9543O1646N14l0423j4349k7979l5728N3879K0684l0881p014l8741m7036
$$ 49543 111189 111703 81280 66931 38952 3224 57103 77787 46906 39892 1151 -45885
6849d5885J9003L4296M9381k5953J9878j0638m8103j5649K6458N3843k1755q997
$$ -45885 -26882 7414 56795 30842 50720 40082 -8021 -23670 2788 56631 34876 25879
6837B5879N3678N318j933L9684o3301k6675q719j3255J5650O1767J6810M669k9703
$$ 25879 79557 84875 82942 122626 59325 32650 23931 10676 26326 88093 104903 109572 79869
6824G9869j378j719n4701n6303J0344O972P7402M255j6625r927j556L5065n4601
$$ 79869 78491 76772 22071 -34232 -23888 -16916 60486 64741 48116 38189 36633 71698 17097
6811A7097m0509k4896L0695k7327J3993N0710O2612j5312k1479J4620Q128k8570
$$ 17097 -23412 -48308 -17613 -44940 -30947 19763 82375 67063 45584 60204 68332 39762
6799C9762J6093M1035J419j00471J3961J8524j9389k630j2070j4110L3195j8078
$$ 39762 55855 96890 98309 -2162 11799 30323 10934 8304 -3766 -17876 15319 -2759
6787b759N4389J6389o9988m6852Q75P0330K9826n588l086n4307K6065J26236k5588
$$ -2759 51630 68019 -1969 -48821 -47946 22384 52210 46622 43536 -10771 15294 141530 115942
6774A15942l7420J9615o3368l5966J7010N5437l1971l0640M8292M3845N0772l6423
$$ 115942 78522 98137 34769 -1197 15813 71250 39279 8639 56931 100776 151548 115125
6762A15125j06671K309N2786o3501O9187L172k0228K1702k4579L3784M3839m2250
$$ 115125 8454 10763 63549 48 69235 72407 52179 73881 49302 83086 126925 84675
6750H4675q1200M800L9375L1083j1764R60j6812J4466J4071m2201p330J6503K3063
$$ 84675 3475 8275 47650 78733 66969 67929 51117 65583 79654 37453 30123 46626 69689
6737F9689q188j3348l9593m759O4815r5079l082R7059k4669j0654K927l2486j349
$$ 69689 61501 48153 8560 3801 68616 -26463 -29545 67514 42845 32191 35118 2632 1283
6724A283Q640j790M9080J9663K5613k1691j4050j557j0616M0064j5600Q497K3106
$$ 1283 9923 8133 57213 76876 102489 80798 66748 65191 54575 94639 79039 87536 110642
6711A10642m5334j6j5538j6330O3987l7180j3342P591j2515J9337l1638N5971
$$ 110642 65308 65292 49754 33424 97411 60231 46889 54480 41965 61302 29664 85635
6699H5635J3207l1789J334j346m829j690m0706P8119N7899k8810k7438j401j8772
$$ 85635 98842 67053 68387 67041 62212 60522 19816 97935 155834 127024 99586 98185 79413
6686G9413j0529J2055K5275p4804j0328k9421j9783P657J9106O8070n363P4674
$$ 79413 68884 80939 106214 31410 21082 -8339 -28122 -20465 -1359 66711 61348 136022
6674A36022M7390p3706J5728r830l7676j4025R726k55j9727n007J735N7441M168
$$ 136022 183412 109706 125434 115604 77928 63903 73629 73374 53647 48640 50375 107816 111984
6661A11984R807n7836l2494L1152L1712L6322o864l5160K1226j5312l7594L5600
$$ 111984 121791 63955 31461 62613 94325 130647 123783 88623 109849 94537 56943 92543
6649I2543J9697l5053K2361N2898m0274J6167j928P687N9209K3264p0875l7153
$$ 92543 112240 77187 99548 152446 112172 128339 126411 134098 193307 216571 145696 108543
6637A08543O7946J3918n6061o7848R0207k8135N437m3075K1686L4652m6179j9025
$$ 108543 176489 190407 134346 66498 156705 128570 134007 90932 112618 147270 101091 82066
6625H2066K4697J8271p901J4118k6685J9396q7313L9216O9044j5725L3454j6126
$$ 82066 106763 125034 117133 131251 104566 123962 36649 75865 144909 129184 162638 146512
6613A46512L5051L6105J880m9465r872M5663k4062m6452O980J8883l7851j9833
$$ 146512 181563 217668 219548 170083 160211 205874 181812 135360 142340 161223 123372 103539
6601A03539K9092j3745J3831L4145M9923n3103K2968j4280Q358m3937o5468J8012
$$ 103539 132631 118886 132717 166862 216785 163682 186650 172370 180728 136791 71323 89335
6589H9335N3454P5356q0503K1516o836K5032O4918n7687r770j2969R016L9199
$$ 89335 142789 218145 137642 159158 152322 177354 242272 184585 174815 161846 170862 210061
6577B10061o6154j8804M7219o1370k9962j7312N2574O2176J5110Q230l1727O7972
$$ 210061 143907 125103 172322 110952 80990 63678 116252 178428 193538 201768 170041 238013
6565B38013j7896p1430j4126M1790j1567q917M6879O5475n747p3808L2919l1625
$$ 238013 220117 148687 134561 176351 164784 155867 202746 268221 262474 188666 221585 189960
6553A89960l531l5674J9474M4232j7504J4418K7346L7461L1627j6871k3072k9787
$$ 189960 186429 150755 170229 214461 196957 211375 238721 276182 307809 290938 267866 238079
6541B38079p8365L8989K324O0264n337O29J7583J9914N0266R062j24280J2730
$$ 238079 159714 198703 201027 261291 255954 256583 274166 294080 344346 353408 229128 241858
6529B41858m046m7804K5970L1169O8347K5687o4872n6695k4616L6341N8270M7293
$$ 241858 237812 190008 215978 247147 315494 341181 276309 219614 194998 231339 289609 336902
6517C36902k4230p447n0278K3892k5802K2034J0990o2196P958R2947K7043m2637
$$ 336902 312672 305225 254947 278839 253037 275071 286061 223865 231823 324770 351813 309176
6505C09176M7205n3525J2717M5644p483k5256n830l648L0333Q6085L9178k9439
$$ 309176 356381 302856 315573 361217 353734 328478 322648 319000 349333 435418 474596 445157
6493D45157P016K4605k2481k6414l262Q1811L9015k3641K3623N235O5041k0135
$$ 445157 452173 476778 454297 427883 424621 506432 545447 521806 545429 550664 615705 595570
6481E95570l7740J6651L6116O7103J02847J0229n6742K577M9874l9952L056M3160
$$ 595570 557830 574481 610597 677700 780547 790776 734034 736611 786485 746533 749589 792749
6469G92749N7722N0776j7994J2474M1735j8027p5804M4347J4140N8025L6526M6857
$$ 792749 850471 901247 883253 895727 937462 919435 843631 887978 902118 960143 996669 1043526
6457A043526k0936P238O5030P840L4515l7001J5723O9139P6011k9745J0141K8987
$$ 1043526 1022590 1029828 1094858 1102698 1137213 1100212 1115935 1185074 1261085 1231340 1241481 1270468
6445A270468J6397R100j3767r3136K8174q749J6822l3294k4538j9601M7500L7504
$$ 1270468 1286865 1295965 1282198 1189062 1217236 1208487 1225309 1192015 1167477 1147876 1195376 1232880
6433A232880j9181R6582Q5m5106k3715O7760Q156j8788q298j6836j40l3159m9274
$$ 1232880 1213699 1310281 1310366 1265260 1241545 1309305 1317461 1298673 1290375 1273539 1273399 1240240 1190966
6420A190966l3242l75N9651M4240j2831n0230o1628J4067n5726l1246K7599q9885
$$ 1190966 1157724 1157349 1217000 1261240 1248409 1198179 1136551 1150618 1094892 1063646 1091245 1001360
6408A001360l5040L9047j05459o250K4870j6611K0626J883r1014L867L5162l0476
$$ 1001360 966320 1005367 899908 893658 918528 901917 922543 924426 833412 837279 872441 841965
6396H41965q6999P0306K4571n3794l7229Q924l0356l0345L2514L1324q5003M2617
$$ 841965 754966 825272 849843 796049 758820 767744 737388 707043 739557 770881 685878 728495
6384G28495k7718P518p71m9600Q6776r5570n0064n1707L7793L250P7510n5702
$$ 728495 700777 708295 707524 657924 744700 649130 599066 547359 585152 588402 665912 610210
6372F10210K723k906n9067n6112J7953L0605L6406j1285j2465k6426J0021N1072
$$ 610210 612933 610027 550960 494848 512801 543406 579812 568527 556062 529636 539657 590729
6360E90729k2899o7922Q7923j3407q409K4686J1882N950P743m478J5388j5007
$$ 590729 567830 499908 587831 574424 566015 590701 602583 608533 616276 611798 627186 612179
6348F12179o0306J4258O6493J353J7887R623l5243k4791K3890P6314k9796N884
$$ 612179 551873 566131 632624 633977 651864 661487 626244 601453 625343 701657 671861 677745
6336F77745K2557r161j6549L9059N2960k188M5696l5329N4698O6470m7453K6317
$$ 677745 700302 691141 674592 713651 766611 764423 810119 774790 829488 895958 848505 874822
6324H74822j2516L0629N6184K6708J3959N666j678N4896j8555n368O212K4258
$$ 874822 862306 892935 949119 975827 989786 995452 993774 1048670 1030115 1024747 1030959 1055217
6312A055217K5116J5043M8141O8471J953j7464M7658J8953l1352P7623J5150K885
$$ 1055217 1080333 1095376 1143517 1211988 1213941 1196477 1244135 1263088 1231736 1309359 1324509 1327394
6300A327394P6343J02568K4079K917J15783M3492O6549j5686M4165M5566J05228
$$ 1327394 1403737 1506305 1530384 1533301 1649084 1692576 1759125 1743439 1787604 1833170 1938398
6289A938398N7398M4986K0882P0600J18548J06810O7141Q2559J06866R2475J03116
$$ 1938398 1995796 2040782 2061664 2132264 2250812 2357622 2424763 2507322 2614188 2706663 2809779
6278B809779J02964J38914J10520J83403O5801J50636R2518J08498N4965N7222
$$ 2809779 2912743 3051657 3162177 3345580 3411381 3562017 3654535 3763033 3817998 3875220
6268C875220L8456O7362P2548O8980M1437K5265M761Q6371L660N1378Q6476Q2698
$$ 3875220 3913676 3981038 4053586 4122566 4164003 4189268 4194029 4280400 4284060 4335438 4421914 4504612
6256D504612J44199P2659J28036J11749J74512J01006Q8225N9495n64O9055m2408
$$ 4504612 4648811 4721470 4849506 4961255 5135767 5236773 5324998 5384493 5383929 5452984 5410576
6245E410576J5025o311j47266j37583j63108k08158j31025q8293j25057j54364
$$ 5410576 5425601 5419290 5272024 5134441 4971333 4763175 4632150 4543857 4418800 4264436
6235D264436j43453r5351r6289j1844n8421k9746k9701l4315n9574r7102l7603
$$ 4264436 4120983 4025632 3929343 3917499 3859078 3829332 3799631 3765316 3705742 3608640 3571037
6224C571037l1069p6150j71668j12773l7686j68865p5444j75215j95479j34423
$$ 3571037 3539968 3463818 3292150 3179377 3141691 2972826 2897382 2722167 2526688 2392265
6214B392265j09485j46315j17922j18884p6733o8370j46054p9703j2964n8506
$$ 2392265 2282780 2136465 2018543 1899659 1822926 1754556 1608502 1528799 1515835 1457329
6204A457329q0738n5189q0691j2657o8100k4573k9584q7457m1501n7657Q965M585
$$ 1457329 1376591 1321402 1240711 1228054 1159954 1135381 1105797 1018340 976839 919182 928147 932732
6192I32732n8177j4603o6408m4534j0201m399o222K2214n2474o8268j6045k7048
$$ 932732 874555 859952 793544 749010 738809 734410 728188 750402 697928 629660 613615 586567
6180E86567M8260K3198k0957k6824m8078M7487k7426j2687K4701p8159L2749L3492
$$ 586567 634827 658025 637068 610244 562166 609653 582227 569540 594241 516082 548831 582323
6168E82323j10173J0458Q20J1620J7062l6203l3992n7083K7368o852O48J1898
$$ 582323 472150 482608 483428 495048 512110 475907 441915 384832 412200 405348 405996 417894
6156D17894k5747L0667r378K231j7820r5640N0895M6796j164J6663m9261l7547
$$ 417894 392147 422814 413436 415667 397847 302207 353102 399898 398734 415397 366136 328589
6144C28589n036J9294j8312L2039J88N4193n1930l1402M1115l5557N0163j6094
$$ 328589 323553 342847 324535 356574 356762 410955 359025 327623 368738 333181 383344 367250
6132C67250l9911j3357L269L9184L5745l7308o1338J6889M4273n067L9230q151
$$ 367250 327339 313982 317251 356435 392180 354872 293534 310423 354696 349629 388859 380708
6120C80708O6187r057P574M8886k0344r261o377M0123N37n5241K4314n0928n501
$$ 380708 446895 437838 445412 494298 473954 464693 458316 498439 498976 443735 468049 417121 411620
6107D11620N4675J6142o9555l9029L2287Q1469j8858k5380N4592K3460j7992L3147
$$ 411620 466295 482437 412882 373853 406140 487609 468751 443371 497963 521423 503431 536578
6095E36578J9228k3114p3410k7853K1431l5508N3375k5188m3823m922M2773j0937
$$ 536578 555806 532692 459282 431429 452860 417352 470727 445539 401716 396794 439567 428630
6083D28630N4442m6924l9744K7110k0935L9315j7818l346O154k6833N3401j783
$$ 428630 483072 436148 396404 423514 402579 441894 424076 420730 426884 400051 453452 451669
6071D51669o8220k822M2499p9594M063O4952j2625l5018m1648q3344J6057n758
$$ 451669 383449 380627 423126 343532 347595 412547 399922 364904 323256 239912 255969 250211
6059B50211K1983O6755m1740M330j3296k1681k385M9346j7953k8116o177m99R3502
$$ 250211 272194 338949 297209 301539 288243 266562 264177 313523 295570 267454 261277 260778 354280
6046C54280L3612r6383j1550N812k2779M4832K7789j0323j7097j2987m9930m9281
$$ 354280 387892 291509 279959 285771 262992 307824 335613 325290 308193 295206 245276 195995
6034A95995K589L6793k702k2114L3311k213M1845k8994R325m2282Q704N3951n2205
$$ 195995 198584 235377 232675 210561 243872 241659 283504 254510 263835 221553 230257 284208 232003
6021B32003K0045j6313k3581N850M6469l9459K5766k2274J6938n826J1950J2640
$$ 232003 252048 235735 212154 218004 264473 225014 250780 228506 245444 239618 251568 264208
6009B64208m9589K5415l742m5009j127L5473m3140J9127K4879K5281k9776O3984
$$ 264208 214619 240034 236292 191283 190156 225629 182489 201616 226495 251776 222000 285984
5997B85984k8475J3904L4391o184k0325l9096l3731K9100M1119J1572j9754l7837
$$ 285984 257509 271413 305804 299620 279295 240199 206468 235568 276687 288259 268505 230668
5985B30668k6592K7116l9544L8789P6242J7245r4303m3462l8362M9225O2197k7168
$$ 230668 204076 231192 191648 230437 306679 323924 229621 186159 147797 197022 259219 232051
5973B32051k7994M1765L8671o2907N6138p9357L6405m325K0165K0512M3500m4978
$$ 232051 204057 245822 284493 221586 277724 198367 234772 230447 250612 271124 314624 269646
5961B69646K9803n1881l432J8053l7077o84K128N7444j9026l526k4631k6464N7857
$$ 269646 299449 247568 244136 262189 225112 224428 226556 284000 264974 261448 236817 210353 268210
5948B68210O4539m077M2375j6434M160n4844m6766M0603j8761l5000L5434M3963
$$ 268210 332749 328672 371047 354613 358773 303929 257163 297766 279005 244005 279439 323402
5936C23402k716n340k8921L5349l3997l389l306k8245K18O5132l0458K042p7628
$$ 323402 320686 315346 286425 321774 287777 284388 281082 252837 253055 318187 287729 289771 212143
5923B12143Q6963K7220m5169l750K0742Q887K2474J4292k3737j00770L2876M8299
$$ 212143 299106 326326 281157 277407 298149 307036 329510 343802 320065 219295 252171 300470
5911C00470m7012K2513N4811L165k5748k828n757o863m6045M8750o681M4370l6567
$$ 300470 253458 275971 330782 333947 308199 305371 299614 292751 246706 295456 288775 333145 296578
5898B96578P493l9321N27L7016p252j1452j7128J0257O2814k8051k0654J8738
$$ 296578 304071 264750 265277 302293 295041 283589 266461 276718 339532 311481 290827 309565
5886C09565M0492l3150K9088J6075j416n5760M1357K6690o6571k0313j1405j47
$$ 309565 350057 316907 345995 362070 360654 304894 346251 372941 306370 286057 274652 274505
5874B74505N0614K0112P852K8118m234K0961Q551q528J3960r114n4877K4602K794
$$ 274505 325119 345231 353083 381201 376967 397928 406479 397951 411911 402797 347920 372522 375316
5861C75316k4045k1599m1359L1996K3126L3910o1159J2458j4421J6853N9079l8909
$$ 375316 351271 329672 288313 320309 343435 377345 316186 328644 314223 331076 390155 351246
5849C51246J8268J878m76J3156j0649r056J8590o560M4694P3769q7157q6647Q751
$$ 351246 369514 371392 370916 384072 373423 364367 382957 376397 421091 494860 407703 321056 329807
5836C29807O1806O974n373J533O6721j6968n9647L9911q354P1414k2514j0594
$$ 329807 391613 398587 393214 394747 461468 444500 384853 424764 416410 487824 465310 454716
5824D54716k2191L3769n427l9728k0683J4180N0465J5735j931j2898M8650k4574
$$ 454716 432525 466294 460867 421139 400456 414636 465101 480836 478905 466007 514657 490083
5812D90083M1632q0527k6818P0987L3091J4423J4050l9551N003K7441O150K8180
$$ 490083 531715 451188 424370 495357 528448 542871 556921 517370 522373 549814 555964 584144
5800E84144j5356M137k124L4934K4607n2460J0048l5078L3588M7980j9819M4121
$$ 584144 568788 572925 570801 605735 630342 577882 587930 552852 586440 634420 614601 658722
5788F58722m4201o684N1373J2338Q898k1087k014r029M5225L3699j091Q410k1336
$$ 658722 614521 607837 659210 671548 680446 659359 657345 648316 693541 727240 726149 734559 713223
5775G13223N1468m2104R011R3647K7617k4028M4071L2079p0829l0188M3682k7310
$$ 713223 764691 722587 731598 825245 852862 828834 872905 904984 834155 803967 847649 820339
5763H20339K3966M8120N2165k7001N7982J4044k4230Q5267O2149K2457L2398L1660
$$ 820339 844305 892425 944590 917589 975571 989615 965385 1050652 1112801 1135258 1167656 1199316
5751A199316M9662o903j220j3074M7761Q1040p7648n6036P3835J8560J01559j5708
$$ 1199316 1248978 1242075 1240855 1227781 1275542 1356582 1278934 1222898 1296733 1315293 1416852 1401144
5739A401144M1249K9257L100J5037N6591M2388N0562j3116k0705l260N1620J5074
$$ 1401144 1442393 1471650 1474750 1489787 1546378 1588766 1639328 1626212 1605507 1602247 1653867 1668941
5727A668941n8477O8989J1809J1943k6037J3703l4479M555o8964J6045P3106m6994
$$ 1668941 1610464 1679453 1691262 1703205 1677168 1690871 1656392 1660947 1591983 1608028 1681134 1634140
5715A634140L6220J4595J705k5861j8025m498j0903P1032L4667P422m2266J8015
$$ 1634140 1670360 1684955 1686660 1660799 1642774 1638276 1627373 1698405 1733072 1740494 1698228 1716243
5703A716243N1534J0912k9008l0464j0892o8986j8388n7902k6782N130j7381k1564
$$ 1716243 1767777 1778689 1749681 1719217 1708325 1639339 1620951 1563049 1536267 1541397 1524016 1502452
5691A502452P346o5147m0898n437N3111j6545p6062r413J1332k7278O506K4820
$$ 1502452 1509798 1444651 1403753 1398316 1451427 1434882 1358820 1349407 1360739 1333461 1339967 1364787
5679A364787k1406L1643p766N3010K854r163k7931m1213K2373j8061Q37O553l2422
$$ 1364787 1343381 1375024 1367258 1420268 1423122 1413959 1386028 1344815 1367188 1349127 1349964 1356517 1324095
5666A324095K8910j4035N8293r407l4785m6391J8219R8829J9092n9738n0268n948
$$ 1324095 1353005 1338970 1397263 1387856 1353071 1306680 1324899 1423728 1442820 1383082 1332814 1326866
5654A326866O1704k3086q588m1354O3481J7229J159L066M2960P527L3757L4893
$$ 1326866 1388570 1365484 1356896 1315542 1379023 1396252 1397411 1400477 1443437 1450964 1484721 1519614
5642A519614K896j1497n1606O9475j8098k7152M4651J5491M3251j0186M7235J3869
$$ 1519614 1522510 1511013 1459407 1528882 1510784 1483632 1528283 1543774 1587025 1576839 1624074 1637943
5630A637943j1621L0450l790j9749q648L7528k6865m9082J32332k6308j084O4225
$$ 1637943 1626322 1656772 1652982 1633233 1624585 1662113 1635248 1586166 1718498 1692190 1691106 1755331
5618A755331j3824J9680j3762k1052M4491l5547L853L2256O4078N3008k2125m0423
$$ 1755331 1741507 1761187 1747425 1726373 1770864 1735317 1739170 1771426 1835504 1888512 1866387 1825964
5606A825964q457R0098J1560j2621O2943J0423r8373P5194N5552J9767K5300R78
$$ 1825964 1817507 1907605 1919165 1906544 1969487 1979910 1881537 1956731 2012283 2032050 2057350 2058328
5594B058328q7361P7592O6303K5548N803q467N4180L8646j9262R8406N6306o4752
$$ 2058328 1970967 2048559 2114862 2140410 2146213 2137746 2191926 2230572 2211310 2309716 2366022 2301270
5582B301270J3388R0849j0641Q4502R6970k5860N5226Q3062l7882N9124J63138
$$ 2301270 2314658 2405507 2394866 2479368 2576338 2550478 2605704 2688766 2650884 2710008 2873146
5571B873146M5371M1969L1538O5465R8734L5054J9867J29601N7399Q6082M6937
$$ 2873146 2918517 2960486 2992024 3057489 3156223 3191277 3211144 3340745 3398144 3484226 3531163
5560C531163Q4773N4242M2553N0465O760k9524J6935O2283J18142R4124K4084
$$ 3531163 3615936 3670178 3712731 3763196 3769956 3740432 3757367 3819650 3937792 4031916 4056000
5549D056000L7601R0231M0168N1007R0485Q8314J15245J22088J75319K7350Q8635
$$ 4056000 4093601 4183832 4224000 4275007 4365492 4453806 4569051 4691139 4866458 4893808 4982443
5538D982443J72733O7925j3791J37323O5101J31141J19929N1239J06183J60412
$$ 4982443 5155176 5223101 5209310 5346633 5411734 5542875 5662804 5714043 5820226 5980638
5528E980638J68336J93585J54044K02129J56356K54684J97376K84729J65173J20054
$$ 5980638 6148974 6342559 6496603 6698732 6855088 7109772 7307148 7591877 7757050 7877104
5518G877104K03841J43766J04576J09384O1192J9063O5118J56570P8204J21146
$$ 7877104 8080945 8224711 8329287 8438671 8499863 8518926 8584044 8740614 8818818 8939964
5508H939964M4259O5742J63555J90511J90617J08542K12491K84739K78385K33674
$$ 8939964 8984223 9049965 9213520 9404031 9594648 9703190 9915681 10200420 10478805 10712479
5498A0712479K56926J55826K47727J61748R5874J64439Q3843L7461j1519q2103
$$ 10712479 10969405 11125231 11372958 11534706 11630580 11795019 11878862 11916323 11904804 11822701
5488A1822701p6045n224o5679l8746j3008M8891R3525L9968J19287J07416R3296
$$ 11822701 11746656 11741432 11675753 11637007 11623999 11672890 11766415 11806383 11925670 12033086 12126382
5477A2126382P5505J26843J51018J54185J89275J32514M0252J18907Q7898Q1086
$$ 12126382 12201887 12328730 12479748 12633933 12823208 12955722 12995974 13114881 13202779 13283865
5467A3283865O4678O0399J22446R5356J47206J07854N5567J28281J25428J62134
$$ 13283865 13348543 13408942 13531388 13626744 13773950 13881804 13937371 14065652 14191080 14353214
5457A4353214K09369J25718J92659K23051J69677K98223L19925K75445L06154
$$ 14353214 14562583 14688301 14880960 15104011 15273688 15571911 15891836 16167281 16473435
5448A6473435L69877L79866L07462K89849L34977M75918N13306N51539O28123
$$ 16473435 16843312 17223178 17530640 17820489 18155466 18631384 19144690 19696229 20324352
5439B0324352N88714N97177O03306P20189P64562Q68551P81066Q23396R12360
$$ 20324352 20913066 21510243 22113549 22833738 23598300 24466851 25247917 26071313 26983673
5430B6983673R41209R14406J022962J086481J050238J011031J191437J161101
$$ 26983673 27924882 28839288 29862250 30948731 31998969 33010000 34201437 35362538
5422C5362538J125191J143069J180768J248539J345261J474465J666938J808157
$$ 35362538 36487729 37630798 38811566 40060105 41405366 42879831 44546769 46354926
5414D6354926K100102K302241K620812K948870L379590L806719M625556N288547
$$ 46354926 48455028 50757269 53378081 56326951 59706541 63513260 68138816 73427363
5406G3427363O039276O775683P409065Q295179R634389J0965113J3151385J6622539
$$ 73427363 79466639 86242322 93651387 101946566 111580955 122546068 135697453 152319992
5398A52319992K0947923K4211182K6505901K7358691K4674857J2489951n684091
$$ 152319992 173267915 197479097 223984998 251343689 276018546 288508497 282824406
5391B82824406k7703746m2834215l9117136k9542113k1626611j6420206j2878491
$$ 282824406 255120660 212286445 173169309 143627196 122000585 105580379 92701888
5384I2701888j0520787q666975p274190n844122m819315m057616l558043l031434
$$ 92701888 82181101 73514126 66239936 60395814 55576499 51518883 47960840 44929406
5376D4929406k783033k468211k297480k072241j949581j677126j596297j448949
$$ 44929406 42146373 39678162 37380682 35308441 33358860 31681734 30085437 28636488
5368B8636488j342787j266180j208629j068581r03401q95825r86987r56965r59362
$$ 28636488 27293701 26027521 24818892 23750311 22846910 21951085 20964098 20007133 19047771
5359A9047771q71047p67888p69097p20120n77293n24103n46064m65251m44793
$$ 19047771 18176724 17408836 16639739 15919619 15342326 14818223 14272159 13806908 13362115
5350A3362115m22039l69260l43869l94561l52298l20883l06088k00913k71836
$$ 13362115 12940076 12570816 12226947 11832386 11480088 11159205 10853117 10652204 10380368
5341A0380368k58521l82362k84655k80759l58255k24094k55499j99686j90460
$$ 10380368 10121847 9739485 9454830 9174071 8815816 8591722 8336223 8136537 7946077
5332G946077k42418k35624j77601j51730j73198j54606j66349j65957j12273j48221
$$ 7946077 7703659 7468035 7290434 7138704 6965506 6810900 6644551 6478594 6366321 6218100
5322F218100j45072j02183j06717j58324j03672r8667q7980l0704q9288j35059
$$ 6218100 6073028 5970845 5864128 5705804 5602132 5503465 5415485 5384781 5295493 5160434
5312E160434j03834n7841p8141j06108j00650j06077m6427q9600o496n8549k449
$$ 5160434 5056600 4998759 4920618 4814510 4713860 4607783 4561356 4471756 4465260 4406711 4404262
5301D404262O938m8941k7789m0946j810r852o5459j3946J7522o8551k1987m1928
$$ 4404262 4411200 4362259 4334470 4293524 4291714 4281862 4216403 4202457 4219979 4151428 4129441 4087513
5289D087513k0566l3264l4344m1178m7816K3223J3856j1965q0689m2273K702m8332
$$ 4087513 4066947 4033683 3999339 3958161 3910345 3933568 3947424 3935459 3854770 3812497 3815199 3766867
5277C766867N2604K6396r6859P2009L1031n9890P4002O9516n4250m4748P3149
$$ 3766867 3819471 3845867 3749008 3821017 3852048 3792158 3866160 3935676 3881426 3836678 3909827
5266C909827J23722Q8136L5393N4366J65771L0222N9661Q7320R1897J70266J68305
$$ 3909827 4033549 4121685 4157078 4211444 4377215 4407437 4467098 4554418 4646315 4816581 4984886
5255D984886O9838R3472J4971O2014J73535J58731J19335J16970Q5746J0231K2065
$$ 4984886 5054724 5148196 5163167 5225181 5398716 5557447 5676782 5793752 5879498 5889729 5911794
5244E911794k1556k2796O3599M7092P6968P4068J41654J40537J54597K43111J73206
$$ 5911794 5890238 5867442 5931041 5978133 6055101 6129169 6270823 6411360 6565957 6809068 6982274
5233F982274K06428L40923L19285L79144L85389M22201M52875M87982M28913K50713
$$ 6982274 7188702 7529625 7848910 8228054 8613443 9035644 9488519 9976501 10405414 10656127
5223A0656127o0459l68596n48074o79112p54356o89510o21535o00226n60349m53597
$$ 10656127 10595668 10227072 9678998 8999886 8245530 7556020 6934485 6334259 5773910 5320313
5213E320313l55635l48952l46689k42572k27817k19865j59495j61220j96175j12920
$$ 5320313 4964678 4615726 4269037 4026465 3798648 3578783 3419288 3258068 3061893 2948973
5203B948973n1025j03193j23551r0433p2994o4459j50108p6949q4051j28548k3434
$$ 2948973 2897948 2794755 2671204 2580771 2507777 2443318 2293210 2216261 2132210 2003662 1980228
5192A980228n8464k3374m5548m0432n0623l4575n5581o8397p2528n00n3402j9821
$$ 1980228 1921764 1898390 1852842 1812410 1761787 1727212 1671631 1603234 1530706 1530206 1476804 1456983
5180A456983n9256k4536l905q1860J3277Q136m0621k2403k2935l9357M0279M3363
$$ 1456983 1397727 1373191 1369286 1287426 1300703 1308839 1268218 1245815 1222880 1183523 1223802 1267165
5168A267165o3626j1887j4692L3474J011J3508o858J4318k982j0369k277M6528
$$ 1267165 1203539 1191652 1176960 1210434 1211445 1224953 1218095 1232413 1229431 1219062 1216785 1263313
5156A263313J39207R7571J44538N5290P7350l1177j14033j68545j31409q6472
$$ 1263313 1402520 1500091 1644629 1699919 1777269 1746092 1632059 1463514 1332105 1245633
5146A245633j00039j09902m2464J8536n9867o0128o9627o1945p858J3312o5676
$$ 1245633 1145594 1035692 993228 1011764 951897 891769 822142 760197 752339 765651 699975
5135F99975N2778l5332R781j2173q2585O545j7169j6263J6847k3597n2138k5898
$$ 699975 752753 717421 727202 715029 632444 638989 621820 605557 622404 598807 546669 520771
5123E20771j9075M556k322n783M4392n3488M2342M4336p2989k4097p615p4623
$$ 520771 501696 506252 503930 498147 542539 489051 531393 575729 502740 478643 471028 396405
5111C96405j7880L7969M1193m1418k6981K9024j2513K1695K6764o9042R875j7500
$$ 396405 378525 416494 457687 416269 389288 418312 405799 427494 454258 385216 395091 377591
5099C77591m3187J3779k8667N0856j8512p4078M5011l2431J7523n0774L4772J0031
$$ 377591 334404 348183 319516 370372 351860 277782 322793 290362 307885 257111 291883 301914
5087C01914J509O2147p4305l4098K6372q37N4990n6795m5391k8785M7006j2157
$$ 301914 303423 365570 291265 257167 283539 282702 337692 280897 235506 206721 253727 241570
5075B41570J2118l5678k0262R090n8882N9184o867l5796j0624N932J3516R0644
$$ 241570 253688 218010 197748 206838 147956 207140 200273 164477 153853 159785 173301 263945
5063B63945l5487n8512l292K5707J4130K7914J8706L4724q9918K9321K1000n192
$$ 263945 228458 169946 166654 192361 206491 234405 253111 287835 197917 227238 248238 243046
5051B43046l7334l5959n4113P9195o8697J2289J5737K6484J8687O6788p241k1025
$$ 243046 205712 169753 115640 194835 126138 138427 154164 180648 199335 266123 258882 237857
5039B37857K6606k4309r7530r639K1412R380N6033m3481k6326N4551L3250L6015
$$ 237857 264463 240154 142624 132985 154397 163777 219810 176329 150003 204554 237804 273819
5027B73819k6384m1960j4101J7228P740o7838K2710j29j0659k9906L0271L7866
$$ 273819 247435 205475 191374 208602 216342 148504 171214 171085 160426 130520 160791 198657
5015A98657k3570K4381o1337m1977K4604j3887M7004L4103j0348p413p475O993
$$ 198657 175087 199468 138131 96154 120758 106871 153875 187978 177630 170217 162742 169735
5003A69735K8934r125j0813J1824L3391J937R632j22k7114l6258J6576M907P6956
$$ 169735 198669 189544 178731 190555 223946 225883 235515 235393 208279 172021 188597 193504 270460
4990B70460j7918o1050J4400M3809r7944M5071O1369P738l727m8930M2310M7654
$$ 270460 252542 191492 205892 249701 151757 196828 258197 265935 262208 213278 255588 303242
4978C03242M963k9026J7817l704j9223P375r2728M5507O6021K6421N1221m2733
$$ 303242 308205 279179 296996 293292 274069 281444 188716 234223 300244 326665 377886 335153
4966C35153J1319R038L931N3p7978k9962O56k0074K842o526L6892m462m024k5838
$$ 335153 346472 355510 359441 359494 281516 251554 252210 232136 234978 228452 265344 260882 256858 231020
4952B31020O9103O3247P7823m5465n8032N2577L5890M8823Q427R3937N8053O8506
$$ 231020 300123 363370 441193 395728 337696 390273 426163 474986 483413 577350 635403 703909
4940G03909P6621J24489O8420J8116o0525m6924j56125j25074m4796j32513p6998
$$ 703909 780530 905019 973439 991555 931030 884106 727981 602907 558111 425598 348600
4929C48600p0936O7331j5280j9640m027l9448O845k8436J3727K5612l3560J9004
$$ 348600 277664 344995 329715 310075 306048 266600 273445 245009 258736 284348 250788 269792
4917B69792K954k6540o305j3527J3883L3972k2869M0164J7114j8158k4430j4421
$$ 269792 272746 246206 239901 226374 240257 274229 251360 291524 308638 290480 266050 251629
4905B51629N2476l6880k7367m310L0002j8091K4161n815j3576j3556K5052R215
$$ 251629 304105 267225 239858 235548 265550 247459 271620 265805 252229 238673 263725 272940
4893B72940p187q038L2252L8365m3089J8873j3656p4774n2330K6034k810N8730
$$ 272940 265753 257715 289967 328332 285243 304116 290460 215686 163356 189390 186580 245310
4881B45310M494J5102M8434Q803k4592n1745K0502m6715L4271J7269J2310Q7280
$$ 245310 249804 264906 313340 322143 297551 245806 266308 219593 253864 271133 283443 370723
4869C70723j6914p3060Q1030M0871J1487n4408O8472L8058m8486J255j5409m5212
$$ 370723 353809 280749 361779 402650 414137 359729 428201 466259 417773 419028 403619 358407
4857C58407m5024J5004L5379K2264m9032J5664j5375M0223j2094r2027j3704L4032
$$ 358407 313383 328387 363766 386030 336998 352662 337287 377510 365416 273389 259685 293717
4845B93717O222O9992k5040J0302o422l7216Q806J5142l7104R517O577n5144K6161
$$ 293717 299939 369931 344891 355193 348771 311555 320361 335503 298399 307916 314493 259349 285510
4832B85510K6238l6963J4184j8455j307O3934j9226j4351J4018m1829r286J2621
$$ 285510 311748 274785 288969 270514 269207 333141 313915 299564 313582 271753 262467 275088
4820B75088L4421J6131o4350j6784J8990L2197J5751l206j859J30K4457K8441
$$ 275088 309509 325640 261290 244506 263496 295693 311444 308238 306379 306509 330966 359407
4808C59407q2014M3869J844Q325M2257O552N6763K1433O8794k7995R5410J07424
$$ 359407 277393 321262 323106 331431 373688 380240 437003 458436 527230 499235 594645 702069
4796G02069J14484J11248K9667q0208r7118l3851q2922j05298q6688k6505o8569
$$ 702069 816553 927801 957468 877260 780142 746291 663369 558071 471383 444878 376309
4785C76309m9624l580k654l9726J0361j8302q908q0037o3369Q2158K6960p924
$$ 376309 326685 323105 320451 280725 291086 272784 263876 183839 120470 202628 229588 221664
4773B21664L3583R86n233n1154K9855K9196O467l3107m4166J9552J1023K4184
$$ 221664 255247 256233 251000 199846 229701 258897 265364 232257 188091 207643 218666 242850
4761B42850p571J4745n8327M864l5230K0854M8518j1524l4747Q4327K8797K3861
$$ 242850 235279 250024 191697 196561 161331 182185 230703 219179 184432 268759 297556 321417
4749C21417k5664l4541j8997m505L6275n3907N5753j3999l2466Q111J2089J5576
$$ 321417 295753 261212 242215 237710 273985 220078 275831 261832 229366 237477 249566 265142
4737B65142m7304m781K8964J161P10J5466K2595l8771o1949N7074p850l1969O7386
$$ 265142 217838 213057 242021 243182 243892 259358 281953 243182 181233 238307 230457 198488 265874
4724B65874r013L5420l3139L751N9360K5735m4491N4944j1577L6355k7390j9380
$$ 265874 256861 292281 259142 262893 322253 347988 303497 358441 346864 383219 355829 336449
4712C36449Q2872N4276K9177m8240l2518j2680Q840k899Q0220k7060J9175j9129
$$ 336449 419321 473597 502774 454534 422016 409336 418176 415277 495497 468437 487612 468483
4700D68483K2598J5095k2797k1825k8572N3246L4774L6342L985O8137O173o3149
$$ 468483 491081 506176 483379 461554 432982 486228 521002 557344 561329 629466 635639 572490
4688E72490n641M0737m6246p890J23054j6285M7562K1537k6730j5412k0944L9852
$$ 572490 566849 607586 561340 553450 676504 660219 707781 729318 702588 687176 666232 706084
4676G06084O5927L3768J3427P0800N682J908m3965J7685P511k7700P0489N7573
$$ 706084 772011 805779 819206 890006 895688 897596 853631 871316 878827 851127 921616 979189
4664I79189l724P8036j330k256k5157L4671p439k691Q0418j7265L9449M3085L6143
$$ 979189 975465 1053501 1052171 1049915 1024758 1059429 1051990 1049299 1129717 1112452 1151901 1194986 1231129
4651A231129J5047N4268K6359Q3967j0389O9236R0455N2396M8993j7291N7094
$$ 1231129 1246176 1300444 1326803 1410770 1400381 1469617 1560072 1612468 1661461 1644170 1701264
4640A701264Q3145K0491J12179O6078J8581P8090R0545P9443L2027P7596P5451
$$ 1701264 1784409 1804900 1917079 1983157 2001738 2079828 2170373 2249816 2281843 2359439 2434890
4629B434890J03573J22064J42234N4092R3397J33124J68163O7085J55486J91188
$$ 2434890 2538463 2660527 2802761 2856853 2950250 3083374 3251537 3318622 3474108 3665296
4619C665296J00747K44915K78131J71026K86961L05430L21243M52092M30211M76054
$$ 3665296 3766043 4010958 4289089 4460115 4747076 5052506 5373749 5825841 6256052 6732106
4609F732106N80171N55461N61472M80131M70676M19292L80638N64519O12436O62404
$$ 6732106 7312277 7867738 8429210 8909341 9380017 9799309 10179947 10744466 11356902 12019306
4599A2019306O79728O52609L82139J51531N9227J2275K61424L78268M25028L28744
$$ 12019306 12699034 13351643 13733782 13885313 13944540 13956815 14218239 14596507 15021535 15350279
4589A5350279P2446k14822o01907o70422o47683n20900k41283j44336k29362m62176
$$ 15350279 15422725 15207903 14605996 13935574 13287891 12766991 12525708 12381372 12152010 11689834
4579A1689834o88054q42076q51114p12864n52275l86529m03658m45617n25939
$$ 11689834 11001780 10159704 9308590 8595726 8043451 7656922 7253264 6807647 6281708
4570F281708n47735n34289n92862n18485l99192k92825k43262k10633j56870j38739
$$ 6281708 5733973 5199684 4606822 4088337 3689145 3396320 3153058 2942425 2785555 2646816
4560B646816j70727j49009p0254j69554j12499r3991j15098j38878O364n0461
$$ 2646816 2476089 2327080 2256826 2087272 1974773 1880782 1765684 1626806 1633170 1582709
4550A582709n9064j15466j4777j00720n5977j1948l2263k7588n4764l8034q0188
$$ 1582709 1523645 1408179 1393402 1292682 1236705 1224757 1192494 1164906 1110142 1072108 991920
4539I91920m28q2436k603l6624p8772j5280M9456l4315o3623K9202m708o6383
$$ 991920 991492 909056 906453 869829 791057 775777 825233 790918 727295 756497 751789 685406
4527F85406m5294o1843j1855m779L7821k9319k3358n3638J9954m1440j6388N4702
$$ 685406 640112 578269 566414 561635 599456 570137 546779 493141 513095 471655 455267 509969
4515E09969n1889m7288J3433p164k7396r185l2266L5061j2824l8914j8879L7738
$$ 509969 458080 410792 424225 417061 389665 380480 348214 383275 370451 331537 312658 350396
4503C50396m8698k7625K687j4506J8369K1500k0129j3138k865k4626K1853q0506
$$ 350396 301698 274073 276760 262254 280623 302123 281994 268856 265991 241365 263218 182712
4491A82712O5081L187j0332j5038m2518j3495L7257K7474k5553j8473J1478l0704
$$ 182712 247793 250980 240648 225610 183092 169597 206854 234328 208775 190302 201780 171076
4479A71076l3163M1345P9974o2159n3246M4647j0812J6616k158j3158K9700n4555
$$ 171076 137913 179258 259232 197073 143827 188474 177662 194278 192120 178962 208662 154107
4467A54107M705n2054k6740O2261j3363M0682L9797J3660o6827j742M0749j7983
$$ 154107 158812 106758 80018 142279 128916 169598 209395 223055 156228 154486 195235 177252
4455A77252r2735K6660K9573N1230l8849j5673l8619J9643K1621L4567k3271j0654
$$ 177252 84517 111177 140750 191980 153131 137458 98839 118482 140103 174670 151399 140745
4443A40745p210O5437j0803q9458j2612j2372j0331J4692j8819L6685p650j9259
$$ 140745 133535 198972 188169 98711 86099 73727 63396 78088 59269 95954 88304 69045
4431F9045L9350p947O5565l3188l1765j1899K867L9972M4493j6511o820o2637
$$ 69045 108395 100448 166013 132825 101060 89161 92028 132000 176493 159982 153162 90525
4419I0525M8739J5179n573r222k3246L0723Q9819J5078J3182J147N5616J32995
$$ 90525 139264 154443 148870 139648 116402 147125 236944 252022 265204 266351 321967 454962
4407D54962m9727o1882K2976j06172p838j8899l4598j7280l3961R657j5464M7971
$$ 454962 405235 343353 366329 260157 252319 233420 198822 181542 147581 157238 141774 189745
4395A89745j7782n8606n5265n78M046P931K0135j0408M122m567m6852J2907L9822
$$ 189745 171963 113357 58092 57514 61560 69491 89626 79218 83340 78773 31921 44828 84650
4382H4650n614L402p220m4702r319k8989J8646K6889q759P3398q6813L09Q1818
$$ 84650 79036 82438 75218 30516 21197 -7792 10854 37743 28984 102382 15569 15878 97696
4369I7696K7791L2864p0525l7638J4785l4822K2356J2997L293j0626n125k3782
$$ 97696 125487 158351 87826 50188 64973 30151 52507 65504 68797 58171 53046 29264
4357B9264n7176K1710P6770r804o8754q575p48K5690j5998L5625K1513k06L3633
$$ 29264 -27912 -6202 70568 60764 -7990 -16565 -17313 8377 -7621 28004 49517 49311 82944
4344H2944n864j1925N7823j2307j8970n349l0564m1953L703N1264K2143K7997
$$ 82944 77080 65155 122978 110671 91701 86352 55788 13835 17538 68802 90945 118942
4332A18942o4608j8150j5397J3726j2121K8206K7035j5810j7031K7389L0095j8951
$$ 118942 54334 36184 20787 34513 22392 50598 77633 61823 44792 72181 102276 83325
4320H3325r248m5482P2833J7212J8747k8714J4205k5469N0437j0808N378m3437
$$ 83325 74077 28595 101428 118640 137387 108673 122878 97409 147846 137038 142416 98979
4308I8979l4988O980k472M170n4051m671J9502L7519L5444L121O37L3922l1730
$$ 98979 63991 70971 68499 72669 18618 13947 33449 70968 106412 109533 110170 144092 112362
4295A12362L6573J0821m6274j7225l3284O1829N938j4035j0468P616J6109l048
$$ 112362 148935 159756 113482 96257 62973 124802 130740 116705 106237 113853 129962 126914
4283A26914O2249L531J001m1265N3231o042p7679M8073J9519k1884m8428q0009
$$ 126914 189163 192694 193695 152430 205661 199619 121940 170013 189532 167648 119220 39211
4271C9211N8855J3472J2090J4717L3397K4965l8653p4851M6757j6715J0300j2527
$$ 39211 98066 111538 123628 138345 171742 196707 158054 83203 129960 113245 123545 111018
4259A11018r90K3661r0036L4391l1127q912L0543J5314j0089J6745k8390P378
$$ 111018 110028 133689 43653 78044 46917 38005 68548 83862 73773 90518 62128 69506
4247F9506k4874n2754N3617P00K0517J9501L1332k0175j0175k7048m5600K0327
$$ 69506 44632 -8122 45495 46195 66712 86213 117545 97370 87195 60147 14547 34874
4235C4874n279N8032m1590L83k6613j9827J17806J5667r7669M8701l5060r58M6383
$$ 34874 29595 87627 46037 46420 19807 -20 117786 133453 35784 84485 49425 48467 94850
4222I4850l5215j9659l1347R8315j383n4425l7777N6869N423J3633m8233l9568
$$ 94850 59635 39976 8629 106944 105561 51136 13359 70228 75651 89284 41051 1483
4210A483N5210N7013k707k2580P6271p045n905l2123j256L1136J8760J2131o1948
$$ 1483 56693 113706 110999 88419 164690 157645 151740 119617 118361 149497 168257 180388 118440
4197A18440k3133J6621K184L7605n1745l1357J8726l1223p18K5585M0856j3127
$$ 118440 95307 111928 114112 151717 99972 68615 87341 56118 55400 80985 121841 108714
4185A08714L5122k7876m5811L1762j8725K5103O9760J1643R180J1658M055K8689
$$ 108714 143836 115960 70149 101911 83186 108289 178049 189692 198872 210530 214585 243274
4173B43274P414j4818K9491n6441n8906k8246J9412N2627n2549l9365O2960k8327
$$ 243274 250688 235870 265361 208920 150014 121768 141180 193807 141258 101893 164853 136526
4161A36526l6607q067p009m902m0510N1392M7932r1455j0349P7349L2876n4566
$$ 136526 99919 91852 84843 79941 39431 90823 138755 47300 36951 114300 147176 92610
4149I2610m4213J5476L6087k887n425M4039k9005m542m4201J8010L7662l8778
$$ 92610 48397 63873 99960 97073 91648 135687 106682 102140 57939 75949 113611 74833
4137G4833j9143K0297l4075O867L8890Q245j5928r620j08348L2400O6086M0222
$$ 74833 55690 75987 41912 48779 87669 95914 79986 70366 -37982 -5582 60504 100726
4125A00726k4734l4494L4034N1889J1861o6420L5858n096m7218L4892L837j3273
$$ 100726 75992 41498 75532 127421 139282 72862 108720 103624 56406 91298 95135 81862
4113H1862j9673k0102j8289K2190P7854J0502j5453l512L197L6099j732p1951
$$ 81862 62189 42087 23798 45988 123842 134344 118891 115379 118576 154675 152943 80992
4101H0992P6257L9494j8006m0913K1894j5496k8695K2942K2807l9458q5332J0985
$$ 80992 157249 196743 178737 137824 159718 144222 115527 138469 161276 121818 36486 47471
4089D7471N9585K0442M2124l9918K5478L6524m9368m2847K8469L4126n7236J652
$$ 47471 107056 127498 169622 129704 155182 191706 142338 99491 127960 162086 104850 106502
4077A06502m815J4485K2860l584j2375M3943K0408K0927m0836r6012J8296R973
$$ 106502 101687 116172 139032 135448 123073 167016 187424 208351 167515 71503 89799 99772
4065I9772L6007Q1945k9235m311m41m7703j8950O9157l4124l6103L4859J7261
$$ 99772 135779 217724 188489 184178 183737 136034 117084 186241 152117 116014 150873 168134
4053A68134p696m23k0864n389j6752J1535N9822m0531L271N4620n229j7807m9421
$$ 168134 160438 160015 139151 133762 117010 128545 188367 147836 151107 205727 200498 182691 133270
4040A33270K5289K5972k9135l6865n675L3116O0841P639J463J2352r7164L166
$$ 133270 158559 184531 155396 118531 112856 145972 206813 214452 215915 228267 131103 134269
4028A34269K0369L3438P6235p1574j02400O7127L0037J1681k7636l11k0321K4387
$$ 134269 154638 188076 264311 192737 90337 157464 187501 199182 171546 171235 150914 175301
4016A75301K1198n0769M3928L7749j3723L693j6549M864L0923l0448k114n1787
$$ 175301 196499 145730 189658 227407 213684 217377 200828 205692 236615 206167 204053 152266
4004A52266N5937L2481p1993P2036j8281j1989K656m4382J1821O2665m3608m2009
$$ 152266 208203 240684 168691 240727 222446 210457 213113 168731 180552 243217 199609 157600
3992A57600K2011L5941k6995m8981N0520P5092J5094r289l9054n5796J9166j0093
$$ 157600 179611 215552 188557 139576 190096 265188 280282 270993 231939 176143 195309 185216
3980A85216k1576O0832N6680j4819k1712P450K8968m4921k190K651k2177q1108
$$ 185216 163640 224472 281152 266333 244621 252071 281039 236118 233928 236579 214402 133294
3968A33294J01206M0435l7731k7017m420j949M3891K1492k6941P901r370l16n6328
$$ 133294 234500 274935 237204 210187 205767 203818 247709 269201 242260 250161 240791 240475 184147
3955A84147K7746K0904j0079Q066k2252j6976M6371L1123J3234N663l9178k6471
$$ 184147 211893 232797 222718 230784 208532 191556 237927 269050 282284 287947 248769 222298
3943B22298o114M7798J006K5920m4253j060J15219L25n7641O413j1282l6794k4097
$$ 222298 216184 263982 264988 290908 246655 245595 360814 361139 303498 309911 298629 261835 237738
3930B37738n2272M4005j0982M5249K0534K1503l1100O4499j2785n6054K6290L9576
$$ 237738 185466 229471 218489 263738 284272 305775 274675 339174 326389 270335 296625 336201
3918C36201j7945p4875N1310K5471n598K7229K8838n414Q579J3393p3036L3495
$$ 336201 318256 243381 294691 320162 314564 341793 370631 365217 373796 387189 314153 347648
3906C47648Q993M616q731j9424J2598l0572K71J3900P0064J1157n4965K5555r204
$$ 347648 356641 361257 352526 333102 345700 315128 315399 329299 399363 410520 355555 381110 371906
3893C71906m0928l8909L8927L0499K52J0908m2545J3910J0179L9413j7677R41
$$ 371906 330978 292069 330996 361495 361747 372655 330110 344020 354199 393612 375935 376876
3881C76876q100K3721k8980M575K1317L359P3554J0728m5077l1936P803M464R679
$$ 376876 368776 392497 363517 368092 389409 392768 466322 477050 431973 400037 407840 412304 421983
3868D21983n5909l2373O6563j1467M2345l36j7633P7607l8973o0443L005J3255
$$ 421983 366074 333701 400264 388797 431142 430806 413173 490780 451807 391364 394369 407624
3856D07624O0693j1649m5842l3784K8614P2802m8765J4666k7242L6731L0740O454
$$ 407624 468317 456668 410826 377042 405656 478458 429693 444359 417117 453848 484588 491042
3844D91042K4114k6296o5321l4022O1272L4874k044m5557r020N6653L1082J4177
$$ 491042 515156 488860 423539 389517 450789 485663 483619 438062 429042 485695 516777 530954
3832E30954l2181J3326R047j9791J3510l4840R76m7501K7657M7128K976p7670
$$ 530954 498773 512099 521146 501355 514865 480025 481001 433500 461157 508285 511261 433591
3820D33591K1692j4888J6456n5323Q1510M2422N8797J7403k155k4394l6993k3516
$$ 433591 455283 440395 456851 401528 483038 525460 584257 601660 599505 575111 538118 514602
3808E14602q2472N212J8838N5893l9785p489j3768k0227L4292N2039J9635k876
$$ 514602 432130 437342 456180 512073 472288 464799 451031 430804 465096 517135 536770 533894
3796E33894o7446O3601m7059J1731P98k1589J0314L961P7711J6480K2252j9260
$$ 533894 466448 530049 482990 494721 495519 473930 484244 488205 565916 582396 604648 585388
3784E85388l7447J9286P9115N888q4256M92P9101N074j20286j3630L1449M7555
$$ 585388 547941 567227 646342 652230 567974 568466 647567 652641 532355 518725 550174 597729
3772E97729N1224J6251n5978O332l4892K2707J02M528l56J2281P5225N2305o2600
$$ 597729 648953 665204 609226 615558 580666 603373 603475 608003 607647 619928 695153 747458 684858
3759F84858n2224j2187K8402k1526L8239k9229n4096K1889N625M6495L6663O0468
$$ 684858 632634 620447 648849 627323 665562 636333 582237 604126 609751 656246 692909 753377
3747G53377m3655l2065k8897J616j1866j8639L0187L517M1879j2325l9382M8737
$$ 753377 709722 677657 648760 650376 638510 619871 650058 653575 695454 683129 643747 692484
3735F92484o2476L2630J9745m1824K5627L4285q4417J2877N5998j3522p1960n652
$$ 692484 630008 662638 682383 640559 666186 700471 616054 628931 684929 671407 599447 593795
3723E93795K2499J16850k8643R683m1611N4231K0203R22M3307m4740m2792k8930
$$ 593795 616294 733144 704501 714184 672573 726804 747007 747929 791236 746496 703704 674774
3711F74774P7522J0921p6015J1098j2004r473J8291L5666O8171Q257M2738l0716
$$ 674774 752296 763217 687202 698300 686296 676823 695114 730780 798951 807208 849946 819230
3699H19230J4821o1921n7140M6663L2710L410j1060M1917K6988m6366n9377M2313
$$ 819230 834051 772130 714990 761653 794363 797773 786713 828630 855618 809252 749875 792188
3687G92188P0865n6657m5432P80J13302J3277J0656n5909o1703L7688L8738M512
$$ 792188 863053 806396 760964 761744 875046 888323 898979 843070 781367 819055 857793 862305
3675H62305r242J9412M0475o1212l1419M4901L8039r6953K0042K842L3767N0560
$$ 862305 853063 872475 912950 851738 820319 865220 903259 806306 826348 829190 862957 913517
3663I13517L5765o8878m2653r20l7833J7934Q5701L1992k4656K5228J1117k000
$$ 913517 949282 880404 837751 836831 798998 816932 902633 934625 909969 935197 946314 944314
3651I44314J4504l4050k0144j2141j5583J3710K3251L2225M8003L7296M1459j666
$$ 944314 958818 924768 904624 892483 876900 890610 913861 946086 994089 1031385 1072844 1071178
3639A071178n2520l3793K8106L1047l6321m7861K5626r332L4415M8005K6158L9728
$$ 1071178 1018658 984865 1012971 1044018 1007697 959836 985462 976130 1010545 1058550 1084708 1124436
3627A124436j02289K3856m0584k766Q3807m5994r388P8336o44L6547o1003k2088
$$ 1124436 1022147 1046003 1005419 1002653 1086460 1040466 1031078 1109414 1108770 1145317 1084314 1062226
3615A062226n483K320l3866Q7068K6790j4221l7462j4846O6835M3363p8989M4364
$$ 1062226 1056743 1059063 1025197 1112265 1139055 1124834 1087372 1072526 1139361 1182724 1103735 1148099
3603A148099J3238l3588k0446j0690N872O8313J5321J3078p297P7081K2863j05871
$$ 1148099 1161337 1127749 1107303 1096613 1102485 1170798 1186119 1199197 1191900 1268981 1291844 1185973
3591A185973L0049o121j4278R778j5667K4486J7570j3485Q2209m534k6842N5406
$$ 1185973 1216022 1209901 1195623 1205401 1189734 1214220 1231790 1218305 1300514 1295980 1269138 1324544
3579A324544M3779k2404k3063p553N1904l4728K9143J4951n6798P6937j9998l3206
$$ 1324544 1368323 1345919 1322856 1315303 1367207 1332479 1361622 1376573 1319775 1396712 1376714 1343508
3567A343508N1328l103K6915j0745k1114K468L055J7643L6761j1912L30M8337
$$ 1343508 1394836 1391733 1418648 1407903 1386789 1389257 1392312 1409955 1446716 1434804 1435134 1483471
3555A483471P7383p710r0877K2085N3267n634L8036N9216o5616j7956k3613O6814
$$ 1483471 1560854 1553144 1462267 1484352 1537619 1531985 1570021 1629237 1563621 1545665 1522052 1588866
3543A588866M7250O431K0751k6313Q0840k1897K685l7027L936K8856J9168M6284
$$ 1588866 1636116 1642547 1663298 1636985 1717825 1695928 1698613 1661586 1665522 1694378 1713546 1759830
3531A759830K0986n4014N6015L4733N2205L563K7317j7298l601M4837p6647k3966
$$ 1759830 1780816 1726802 1782817 1817550 1869755 1873318 1900635 1883337 1879736 1924573 1847926 1823960
3519A823960P9176K1735J8472M8494n776K3800M2470L6175m9541j3723L6977M2293
$$ 1823960 1903136 1924871 1943343 1991837 1986061 2009861 2052331 2088506 2038965 2025242 2062219 2104512
3507B104512K9530j7586L367l910j1444K6828M1861k764L505L3757O7484j0113
$$ 2104512 2134042 2116456 2119823 2115913 2104469 2131297 2173158 2170394 2173899 2207656 2275140 2265027
3495B265027K120M8798L6578L0643m3205K6560K6911L389M3744M401j9423K9184
$$ 2265027 2267147 2315945 2352523 2383166 2339961 2366521 2393432 2396821 2440565 2444966 2425543 2454727
3483B454727L971J15640j4186K4168Q3305M1709k5689l0128o6632L8161J11200
$$ 2454727 2458698 2574338 2560152 2584320 2667625 2709334 2683645 2653517 2586885 2625046 2736246
3472B736246M1855J483l6015k4370K007N2681P2843K7625k9524O6126j4158M6931
$$ 2736246 2778101 2779584 2743569 2719199 2721206 2773887 2846730 2874355 2844831 2910957 2896799 2943730
3460B943730l8456M9210J52929J7667n3777j1678P0438K1586O2651k119o817L9425
$$ 2943730 2905274 2954484 3107413 3125080 3071303 3059625 3130063 3151649 3214300 3212181 3205364 3244789
3448C244789m3457P4001L5118N3592P2017l3563k6670M2166O1582L5946P495M3024
$$ 3244789 3201332 3275333 3310451 3364043 3436060 3402497 3375827 3417993 3479575 3515521 3523016 3566040
3436C566040Q4309J8978p424K949L4651L5965N0611N7642Q2865M3935M141J2024
$$ 3566040 3650349 3669327 3661903 3664852 3699503 3735468 3786079 3843721 3926586 3970521 3974662 3986686
3424C986686P7171L1142l7593P4848M3697M3463K1388L724o5124N6452N8582k6935
$$ 3986686 4063857 4094999 4057406 4132254 4175951 4219414 4240802 4244526 4179402 4235854 4294436 4267501
3412D267501m4047m8771n731n9610M1429O350K7411J3430J104O43r448K6569J61
$$ 4267501 4223454 4174683 4168952 4109342 4150771 4157121 4184532 4197962 4199066 4199709 4190261 4216830 4216991
3399D216991J3723j03029n0206L5870L1896l0058m516J9703Q256M1921n4912p315
$$ 4216991 4230714 4127685 4077479 4113349 4145245 4115187 4110671 4130374 4138630 4180551 4125639 4118324
3387D118324P5562m2722n5455J3687r600j0718n3289K827j0113L1832n8222K1708
$$ 4118324 4193886 4151164 4095709 4109396 4099796 4089078 4035789 4038616 4028503 4060335 4002113 4023821
3375D023821R06m6139j3206K1989j5150l532k0261o3892k2345L8368K6378n211
$$ 4023821 4024727 3978588 3965382 3987371 3972221 3968689 3948428 3884536 3862191 3900559 3926937 3921726
3363C921726m7176l383J7118N6930m4626r7355n988m1028l5231J0239k3494l4732
$$ 3921726 3874550 3871167 3888285 3945215 3900589 3803234 3797246 3756218 3720987 3731226 3707732 3673000
3351C673000K6057m8378M7948p607q3377n8792N041n2858m0888N9880r1551k9592
$$ 3673000 3699057 3650679 3698627 3691020 3607643 3548851 3553892 3501034 3460146 3520026 3428475 3398883
3339C398883j0963k3702o3944p4564n7602M3979k1634O160l8449l5607J8230n0147
$$ 3398883 3387920 3364218 3300274 3225710 3168108 3212087 3190453 3196613 3158164 3122557 3140787 3090640
3327C090640K6133o1651j0835J0338K4382L6908j8112j06287m1237J2948l6760
$$ 3090640 3116773 3055122 3044287 3054625 3079007 3115915 3097803 2991516 2950279 2963227 2926467
3316B926467O331l4340m9688p0279m6419k4946M935O7000k3346N902l6990J7080
$$ 2926467 2932798 2898458 2848770 2778491 2732072 2707126 2712061 2779061 2755715 2761617 2724627 2741707
3304B741707l527o1284l1464k3444k5336j5101M882K0738m0024J9055k6835o9693
$$ 2741707 2738180 2676896 2645432 2621988 2596652 2581551 2586433 2607171 2567147 2586202 2559367 2489674
3292B489674n0166L888J1492m7526J9652P4687r7818n5555J409n0423j7373K0438
$$ 2489674 2439508 2443396 2454888 2407362 2427014 2501701 2403883 2348328 2349737 2299314 2281941 2302379
3280B302379J2805R787q5102q385P728m1544K4615L7791j9894M4109K2402n2559
$$ 2302379 2315184 2324971 2239869 2231484 2239212 2197668 2222283 2260074 2240180 2284289 2306691 2254132
3268B254132p5212m6267J4296k5547K2572r662J6939N33j2139n1930q3860K5051
$$ 2254132 2178920 2132653 2146949 2121402 2143974 2134312 2151251 2151784 2139645 2087715 2003855 2028906
3256B028906P185k6043j7791Q1628l8669j2993j0650l8538j2580L2488k1836k7488
$$ 2028906 2036091 2010048 1992257 2073885 2035216 2022223 2011573 1973035 1960455 1992943 1971107 1943619
3244A943619l2971o7553j4102L4264K5324l6065R0602M1618K0101j34590l2993
$$ 1943619 1910648 1843095 1828993 1863257 1888581 1852516 1943118 1984736 2004837 1870247 1837254
3233A837254m7246l2570M1926K4708l3531J9322j0046j2775M5007j9583n0581
$$ 1837254 1790008 1757438 1799364 1824072 1790541 1809863 1799817 1787042 1832049 1812466 1761885
3222A761885j2323L8504j5939j3763J8265k87k821M6153j0176j2199o268l9857
$$ 1761885 1749562 1788066 1772127 1758364 1776629 1776342 1773521 1819674 1809498 1797299 1791031 1751174
3210A751174P3095l3383k9621k943p4603j0203M838r187Q194q986j3387n4466
$$ 1751174 1824269 1790886 1761265 1758322 1683719 1673516 1678354 1669167 1677361 1668375 1654988 1600522
3198A600522k572O3128K8448J0851k7210k1105L1733n6682j9753k477l0977O9196
$$ 1600522 1597950 1661078 1689526 1700377 1673167 1652062 1683795 1627113 1607360 1604883 1573906 1643102
3186A643102j732N5609L0365o3819k0723l2029L9363m951j7811p142l6417q618
$$ 1643102 1641370 1696979 1727344 1663525 1642802 1610773 1650136 1645185 1627374 1620232 1583815 1575197
3174A575197K3998q845j09215L8960N8196j1929J2896M3028l9019L0736J8096
$$ 1575197 1599195 1590350 1481135 1520095 1578291 1566362 1579258 1622286 1583267 1614003 1632099
3163A632099k2688K0052N2893L9502p2616n1771K9487l999j9772R823M5093P928
$$ 1632099 1609411 1629463 1682356 1721858 1649242 1597471 1626958 1622959 1603187 1613010 1658103 1666031
3151A666031l7690K4375K2129N4934m0780j5802K5471L969n761j1344K0500m373
$$ 1666031 1628341 1652716 1674845 1729779 1688999 1673197 1698668 1702637 1696876 1685532 1706032 1701659
3139A701659j5664N7496J360o682M1738K6466p5756k5311K1329L592K4563j479
$$ 1701659 1685995 1743491 1744851 1738169 1779907 1806373 1730617 1705306 1726635 1730227 1754790 1753311
3127A753311J5810k7086j7892J1527l6499N5193L9805L3900L941J476K6496k2575
$$ 1753311 1769121 1742035 1724143 1735670 1699171 1754364 1794169 1828069 1832010 1833486 1859982 1837407
3115A837407o657k069k436O127R364O2783Q0393m0659k3590M4788k339l985J3493
$$ 1837407 1830750 1828681 1826245 1832372 1841736 1904519 1984912 1944253 1920663 1965451 1963112 1959127 1972620
3102A972620O683m7994P5012L3496n1167L9278K2499k8995L1927r45j0309P6139
$$ 1972620 1979303 1931309 2006321 2039817 1988650 2027928 2050427 2021432 2053359 2052414 2042105 2118244
3090B118244L3000k2951m5817m710J839R2469M2582K6408J8503M2794L5782n3854
$$ 2118244 2151244 2128293 2082476 2077766 2079605 2172074 2214656 2241064 2259567 2302361 2338143 2284289
3078B284289l6379J1147m8069M6488K5520O1211k461m6253m4617K2917L4881M8895
$$ 2284289 2247910 2259057 2210988 2257476 2282996 2344207 2341746 2295493 2250876 2273793 2308674 2357569
3066B357569m6423p0514M0394J8936L5380Q2560K6199J7899J9434j4381O836k0719
$$ 2357569 2311146 2240632 2281026 2299962 2335342 2417902 2444101 2462000 2481434 2467053 2473889 2453170
3054B453170M0754n917m8610o1369o7665j8110J0224p911l5464J1156N7409j0419
$$ 2453170 2493924 2488007 2439397 2378028 2310363 2292253 2302477 2294566 2259102 2270258 2327667 2317248
3042B317248l3452N6712M1364K0611j8710P727m92r759M8056l7657q706K9243
$$ 2317248 2283796 2340508 2381872 2402483 2383773 2391500 2391008 2381249 2429305 2391648 2382942 2412185
3030B412185K1903m129k6003n8449J941J00516k2607j0290p2146j9968n558m3657
$$ 2412185 2434088 2429959 2403956 2345507 2347448 2447964 2425357 2415067 2342921 2322953 2317395 2273738
3018B273738K2678m8552k1449M2927M147p4384j11073O2507j4204N5921J6877
$$ 2273738 2296416 2247864 2226415 2269342 2273489 2199105 2088032 2150539 2136335 2192256 2209133
3007B209133n5649r973m5694O9139m2684J3563M131n7068K7628R691k4908r389
$$ 2209133 2153484 2143511 2097817 2166956 2124272 2137835 2141966 2084898 2112526 2122217 2097309 2087920
2995B087920l0418j4454J7215q91P643m5816k7706k4948n0211M4891k561m0975
$$ 2087920 2057502 2043048 2060263 2059372 2067015 2021199 1993493 1968545 1918334 1963225 1960664 1919689
2983A919689l0524M75j498j9189l1939m5646l7098N7303m3807n1065R189L456
$$ 1919689 1889165 1889640 1888142 1868953 1837014 1791368 1754270 1811573 1767766 1716701 1725890 1729346
2971A729346o9264P073l9944m971O532K6198j7446n3192m9580K3709p5057M7355
$$ 1729346 1660082 1667155 1627211 1622240 1628772 1654970 1637524 1584332 1534752 1558461 1483404 1530759
2959A530759k9915K1184m5834j5854k7471q0055R5146n7868m417K9836L683o2209
$$ 1530759 1500844 1522028 1476194 1460340 1432869 1352814 1447960 1390092 1385675 1415511 1419194 1356985
2947A356985M8272o2923n1302K1512l788m6609L0879J4077n1028k3938m0776L7589
$$ 1356985 1405257 1342334 1291032 1312544 1308756 1262147 1293026 1307103 1256075 1232137 1191361 1228950
2935A228950J3090l6853n4578K9204M1087l9914l2470j4336j8342M5047q075R590
$$ 1228950 1242040 1205187 1150609 1179813 1220900 1180986 1148516 1134180 1115838 1160885 1152810 1162400
2923A162400n0215p7844j7161k5699J9679k1298L4261M3777k6746j8102k8211
$$ 1162400 1112185 1034341 1017180 991481 1011160 989862 1024123 1067900 1041154 1023052 994841
2912I94841j307k8209L675K9991m1791m4777k6570O1175n6464k2357K9138L170
$$ 994841 993534 965325 969000 998991 957200 912423 885853 947028 890564 868207 897345 900515
2900I00515n5290N6996j1917j0623q436k1679o2926l0621N1543q4300K8565J7317
$$ 900515 845225 902221 890304 879681 871245 849566 786640 756019 807562 723262 751827 769144
2888G69144j9293L213m4124L5214j7819P821j01696j5934J1478M8224O796J6494
$$ 769144 749851 753064 708940 744154 726335 734156 632460 616526 628004 676228 683024 699518
2876F99518j2127l8961K6516k8127L522R862j296J9088n6539J1731r244p0319
$$ 699518 687391 648430 674946 646819 650341 660203 658907 677995 621456 633187 623943 553624
2864E53624M8457O541j9163l2516J5532J5653m6430k5738j1138P438Q3196l9241
$$ 553624 602081 608622 589459 556943 572475 588128 541698 515960 504822 512260 595456 556215
2852E56215j7859O277J0588j1982K024j6679j255J4083l0297M8552o576l0565
$$ 556215 538356 544633 555221 543239 545263 528584 527329 541412 511115 559667 553091 522526
2840E22526j7198j4948J0958o786K6450J7012L780k0020k2899k3146l9913j5316
$$ 522526 505328 490380 501338 494552 521002 538014 541794 521774 498875 475729 435816 420500
2828D20500Q2374l8760o7965l3517P721L8665P962n3122J8640j6413J3538N5047
$$ 420500 502874 464114 396149 362632 370353 409018 416980 363858 382498 366085 379623 434670
2816D34670l2979N6489j5821j04771m8280j8313K3783M3888j2530k9763N2082
$$ 434670 401691 458180 442359 337588 289308 270995 294778 338666 326136 296373 348455
2805C48455O009M480K2329o8246L6457l8768J7426K8534j3921J7881L2198m3982
$$ 348455 354464 358944 381273 313027 349484 310716 328142 356676 342755 360636 392834 348852
2793C48852j8230j3158M724K5236n7203j0334M134N8367K1520o2939l272J5215
$$ 348852 330622 317464 322188 347424 290221 279887 284021 342388 363908 300969 297697 312912
2781C12912k976k8048J0286L1670k3609j7068P5161J6646m9664m5112l9010P5792
$$ 312912 309936 281888 292174 323844 300235 283167 358328 374974 325310 280198 241188 316980
2769C16980m3132l5259K9479J2316N3672J9316m4300m9197k5755J211P2329K1725
$$ 316980 273848 238589 268068 280384 334056 353372 309072 259875 234120 235331 307660 329385
2757C29385p3244J4830o060Q42m7773K4162j642j8046O9309l2127m6269p1723
$$ 329385 256141 270971 264911 265753 217980 242142 240500 222454 291763 259636 213367 141644
2745A41644k575N4755m830k0410L7125J880Q321j33M7439k4872M255m229J7690
$$ 141644 139069 193824 188994 168584 205709 207589 215910 215777 263216 238344 242599 238370 256060
2732B56060P8690j17676j7918O403N6553j5754l4276o157j7411l7092o196O8550
$$ 256060 334750 217074 199156 205559 262112 246358 212082 205925 188514 151422 145226 213776
2720B13776l2781j7081J07011k2455l5873j4049J0941L097P5J6198n4453j189
$$ 213776 180995 163914 270925 248470 212597 198548 209489 212586 212661 228859 174406 173217
2708A73217N486n0308R4397k6055l3913L5527j7748k0672J4479n07j1583p36j9792
$$ 173217 178703 128395 222792 196737 162824 198351 180603 159931 174410 173903 162320 161584 141792
2695A41792N0566K2760j731l4795k6699J0539j5685j0003k270n741R247K1169
$$ 141792 192358 215118 213387 178592 151893 162432 146747 136744 134474 128733 137980 159149
2683A59149N6242m4770J2944k5906J1436r734j2193k7355J9336J0941J6908M946
$$ 159149 215391 170621 183565 157659 169095 159361 147168 119813 139149 150090 166998 171944
2671A71944l2237k768k8606J4565O3497k045m0759R005J1824l0121M4705L253
$$ 171944 139707 136939 108333 122898 186395 184350 143591 152596 164420 134299 179004 182257
2659A82257m7483N7657M3333n5607j5582n5848n36N2818o4548P006j6301k6769
$$ 182257 134774 192431 235764 180157 164575 108727 108191 161009 96461 103467 87166 60397
2647F0397M3870l9617n515l7639O1002N2326l3392K5961m1243l071R4186l6558
$$ 60397 104267 64650 59135 21496 82498 134824 101432 127393 86150 83079 177265 140707
2635A40707m4271M9939k6301n3474k490O827L2850k4344R953o587J12790J5246
$$ 140707 96436 146375 120074 66600 64110 70937 103787 79443 89396 82809 195599 210845
2623B10845q8373o248M8542j7982p5461k406k2680N4387K2921q8563K1835M8845
$$ 210845 122472 116224 164766 146784 71323 68917 46237 100624 123545 34982 56817 105662
2611A05662r542l7715o575J1864J1673R823Q335K9891j9357L1672l7438k0502
$$ 105662 96120 58405 51830 63694 75367 85190 93525 123416 104059 135731 98293 77791
2599G7791j7676K5149l3934J7578j4669J3963q15L924l2548K4762k0170j6232
$$ 77791 60115 85264 51330 68908 54239 68202 67387 71311 38763 63525 43355 27123
2587B7123L0235N6646N505m8509m645J7770n1231k1285M7768j4666k3203K3279
$$ 27123 57358 114004 119509 71000 66355 84125 32894 11609 59377 44711 21508 44787
2575D4787M2196j5673N8700p59r3268k8207K512M4243J2022J4144l6703m9331
$$ 44787 86983 71310 130010 129251 35983 7776 10288 54531 66553 80697 43994 -5337
2563e337Q4920K3118m3858P93K6600K7055o3772m3274N428k7027K371N5552m5926
$$ -5337 79583 102701 58843 59636 86236 113291 49519 6245 11673 -15354 -12983 42569 -3357
2550c357O9257J1133K1986l0049K1838K2880k9462l9683k5756r197K1167R1852
$$ -3357 65900 77033 99019 68970 90808 113688 84226 44543 18787 9590 30757 122609
2538A22609o3436k3652M9625L8226n5195n8510j6621M052p6283J05549q477K6414
$$ 122609 59173 35521 85146 123372 68177 9667 -6954 -2902 -79185 26364 17887 44301
2526D4301J8417j9227o2635k7226O3996P2155J693P071l8921q363o932l9178N1666
$$ 44301 62718 43491 -19144 -46370 17626 89781 91474 98545 59624 51261 44329 5151 56817
2513E6817O163R224J7814m5374m6358L3137J3737M2874k7927k2734R836j1595
$$ 56817 62980 72204 90018 44644 -1714 31423 45160 88034 60107 37373 47209 35614
2501C5614M9249j4702o3875N1776L9526r8045j3J0493O577m1118M872J8114k7487
$$ 35614 84863 70161 6286 58062 97588 -457 -470 10023 16600 -24518 -19646 -1532 -29019
2488b9019M0906J8538p016R298r973j4126m1106k3357P5809M1974M965J7135o1723
$$ -29019 11887 30425 23409 32707 22734 8608 -32498 -55855 19954 61928 66893 84028 22305
2475B2305k6578j4187J0561N9952K2593K349m0840J897m072J0067K9966J0220
$$ 22305 -4273 -18460 -7899 52053 74646 76995 36155 38052 33980 44047 74013 84233
2463H4233p8835k6933N2748k7883o956L1706k3833J1288N7670R144j4333K3944
$$ 84233 5398 -21535 31213 3330 -3626 28080 4247 15535 73205 82349 68016 91960
2451I1960o5653M7998L9376m8778l8620j2688R828J792j5207K3362j7080J190
$$ 91960 26307 74305 113681 64903 26283 13595 23423 25215 10008 33370 16290 17480
2439A7480k3570n0671N3554M825m712K2480J8646Q558m7137l4259k3361J8015
$$ 17480 -6090 -56761 -3207 1618 -3094 19386 38032 46590 -547 -34806 -58167 -40152
2427d0152Q0570l529k882o616n790J787P1321L1829m7396J8491m1325n0312O092
$$ -40152 40418 36889 34007 27391 21601 23388 94709 126538 79142 97633 56308 5996 12088
2414A2088R888j1000k406j5071j7697K4194K2403K8688l2779l8333m5347L3633
$$ 12088 21976 10976 8570 -6501 -24198 -4 22399 51087 18308 -20025 -65372 -31739
2402c1739J09469k0381J7647N849n3452O324j2016m1330K0211N720M1459L7581
$$ -31739 77730 57349 74996 80845 27393 33717 21701 -19629 582 6302 47761 85342
2390H5342k9824K7574L551l1830l9412p0812J675M3799M1650l326l6604j383M3090
$$ 85342 55518 83092 86643 54813 15401 -55411 -53736 -9937 31713 28387 -8217 -9600 33490
2377C3490J814L9704l4214j5306M4702n3607K4336l4685K369O9412k8609p3082
$$ 33490 35304 75008 40794 25488 70190 16583 40919 6234 8603 78015 49406 -23676
2365b3676j9277L2894L5155l0507J4762O5869M253q1386K5441m5258N1267K9881
$$ -23676 -42953 -10059 25096 -5411 9351 75220 79473 -1913 23528 -21730 29537 59418
2353E9418k4802m155p300P77L4827Q183K621m6639m607P4450o5638l150K1442
$$ 59418 34616 30461 23161 23938 58765 66948 69569 22930 18323 92773 27135 23985 45427
2340D5427J1697o9881K8867j4970m29L7860j1435N273J5666l4113J172j3604j6814
$$ 45427 57124 -12757 16110 1140 711 38571 27136 32409 48075 13962 15134 1530 -15284
2327a5284M9395l7079L7314O2785q8462j15645R203O3033K0466L2552n2098J9506
$$ -15284 34111 -2968 34346 97131 8669 -106976 -97773 -34740 -14274 18278 -33820 -14314
2315a4314O0315j770K239N5312n2374J2211n455p0971K2722l3671j7878J5806
$$ -14314 46001 44231 46470 101782 49408 61619 56164 -14807 7915 -25756 -43634 -27828
2303b7828N1577j3264L5778M9234q2439n7963L7790K3319M1775K5019l2578m7483
$$ -27828 23749 10485 46263 95497 13058 -44905 -7115 16204 57979 82998 50420 2937
2291B937N3898n4655M7911O889l1820k883l5170K0331l1875l776O2008N8538k4797
$$ 2937 56835 2180 50091 56980 25160 22277 -12893 7438 -24437 -28213 33795 92333 67536
2278F7536n6631O28J9375L2160L9168n8571l7579P007L9784J1169L3393j3024
$$ 67536 10905 11533 30908 63068 102236 43665 6086 13093 52877 64046 97439 84415
2266H4415n7519k9979O3097q0892O531O3865q38p4698L437J5581j0493m437J8984
$$ 84415 26896 -3083 60014 -20878 -14347 49518 48680 -26018 -22581 -7000 -17493 -21930 -2946
2253b946J7890l8334q795L1136J8575l4288M61J9415K4986P3167m5571o8663o638
$$ -2946 14944 -23390 -32185 -1049 17526 -16762 -16301 3114 28100 101267 55696 -12967 -19605
2240a9605R285k370l6978J7625K5616j6425l4028Q8639J1635o512k3813n4883
$$ -19605 -10320 -12690 -49668 -32043 -6427 -22852 -56880 31759 43394 36882 13069 -41814
2228d1814n564L8679n0550j2106O6208M4371m2779J1682J9944M6424j0182k8684
$$ -41814 -47378 -8699 -59249 -71355 -5147 39224 -3555 8127 28071 74495 64313 35629
2216C5629Q279k5176o3227K223P962N3093N1757l9308o5493k3438m62M5886k9616
$$ 35629 43908 18732 -44495 -42272 -34310 18783 70540 31232 -34261 -57699 -58161 -12275 -41891
2203d1891J4788M4158l7847k2628q165M9479o639k7592n738j375n127J8578K6005
$$ -41891 -27103 17055 -20792 -43420 -51585 -2106 -8745 -36337 -42075 -43450 -48577 -29999 -3994
2190c994j7925q908j642Q7316M2j4103K8965m4822J6508n4560j7288P2921K0081
$$ -3994 -21919 -30827 -32469 54847 54889 40786 69751 24929 41437 -13123 -30411 42510 62591
2177F2591l829j0842j8241j9607K9311L9207l2268M083l4241O943m713l1554j8102
$$ 62591 58762 47920 29679 10072 39383 78590 46322 50405 16164 23107 18394 -13160 -31262
2164c1262K5592k9266M7898M9711k1495M4875o5266k6391J9154p769R580m9391
$$ -31262 -5670 -34936 12962 62673 41178 86053 20787 -5604 13550 5781 15361 -34030
2152c4030M260K3865L2928k6762j9696M7532J0709m9996l8760k5649K5482O2817
$$ -34030 -29770 -5905 27023 261 -19435 28097 38806 -11190 -49950 -75599 -50117 12700
2140A2700l2276J4772Q370j7427R394N3118Q641q2350K6722J8490j1222J6966
$$ 12700 -19576 -4804 3566 -13861 -4467 48651 57292 -25058 1664 20154 8932 25898
2128B5898L4528k1082o2227j5056O587n3367K5819J0380r609J4189q5738N1421
$$ 25898 60426 39344 -22883 -37939 -31352 -84719 -58900 -48520 -58129 -43940 -129678 -78257
2116g8257O5144l0026k3226N628O4296m4898m5719K8109K2694L2450j0641l7019
$$ -78257 -13113 -43139 -66365 -60737 3559 -41339 -87058 -58949 -36255 -3805 -14446 -51465
2104e1465L3371K3157n1916L1070J8299o0074M5699l0153k6998N4919j175n5627
$$ -51465 -18094 5063 -46853 -15783 2516 -57558 -11859 -42012 -69010 -14091 -15266 -70893
2092g0893N6319K2609j9729J2548k5533L5371K3592l3612n3571L0653M1511K5186
$$ -70893 -14574 8035 -11694 854 -24679 10692 34284 672 -52899 -22246 19265 44451
2080D4451j6717l8164k8500O1140J8069l1655m150k0393J7908l365J2817j4210
$$ 44451 27734 -10430 -38930 22210 40279 8624 4474 -15919 1989 -1376 11441 -2769
2068b769o5901L6838J4458J1744j5412o334J4983p2772l264J6261l815Q360Q7553
$$ -2769 -68670 -31832 -17374 -5630 -21042 -27376 -12393 -85165 -88429 -72168 -75983 -67623 19930
2055A9930M328j09131J8577j7816j8378L5424o449O189K1978j847l183j1106J5566
$$ 19930 24258 -84873 -66296 -84112 -102490 -67066 -73515 -67326 -45348 -47195 -50378 -61484 -45918
2042d5918O942K4273j1729l6124l6209l2402R4854j160o252L0664j5237k2110
$$ -45918 -38976 -14703 -26432 -62556 -98765 -131167 -36313 -37473 -43725 -13061 -28298 -50408
2030e0408N5343Q6887q1195m4498n7330m5559M2686O9540p600k2510m3535M7384
$$ -50408 4935 91822 10627 -33871 -91201 -136760 -94074 -24534 -32134 -54644 -98179 -50795
2018e0795L8654J3631j7706K8454n75m6539J2115n1699K4330K4661l111l0674
$$ -50795 -12141 1490 -16216 12238 11663 -34876 -22761 -74460 -50130 -25469 -28580 -59254
2006e9254k7826M6039l197M6933K306r76l3868j8697K8465L0978K1067k4232K7677
$$ -59254 -87080 -41041 -44238 2695 5001 4025 -29843 -48540 -20075 10903 31970 7738 35415
1993C5415n0987M4545K1931k5847m6619n7624Q9450O556n8910L0943J9614P317
$$ 35415 -15572 28973 50904 25057 -21562 -79186 10264 16820 -42090 -11147 8467 15784
$$ [...]
##END NTUPLES=NMR SPECTRUM
##END=
