##TITLE=1H_EC-3316(II-31)
 CDCl3
 8 sc, 
 27.11.2024
##JCAMPDX= 6.0         $$ Bruker NMR JCAMP-DX V2.0
##DATA TYPE= NMR SPECTRUM
##DATA CLASS= NTUPLES
##ORIGIN= UXNMR, Bruker Analytische Messtechnik GmbH
##OWNER= root
$$ XWIN-NMR		Version 3.5
$$ Wed Nov 27 13:49:53 2024 Russian Standard Time (UT+4h)  she@DPX200
##.OBSERVE FREQUENCY= 200.1315
##.OBSERVE NUCLEUS= ^1H
##.ACQUISITION MODE= SIMULTANEOUS
##.ACQUISITION SCHEME= undefined
##.AVERAGES= 8
##.DIGITISER RES= 18
##SPECTROMETER/DATA SYSTEM= spect
##.PULSE SEQUENCE= zg30
##.SOLVENT NAME= Acetone
##.SHIFT REFERENCE= (INTERNAL, Acetone, 0, 19.4754)
##AUDIT TRAIL= $$ (NUMBER, WHEN, WHO, WHERE, WHAT)
$$ ##TITLE= Audit trail, XWIN-NMR		Version 3.5
$$ ##JCAMPDX= 5.01
$$ ##ORIGIN= Bruker BioSpin GmbH
$$ ##OWNER= she
$$ F:/spectra/data/she/nmr/H-F/1/pdata/1/auditp.txt
$$ ##AUDIT TRAIL=  $$ (NUMBER, WHEN, WHO, WHERE, WHAT)
(   1,<2024-11-27 13:48:40.48 +0400>,<she>,<DPX200>,
      <created by zg, POWCHK disabled, PULCHK disabled
       configuration hash MD5:
       00 E9 B6 7A A2 85 ED C7 34 08 36 98 17 FE 4E 26
       data hash MD5: 16K
       5D 0B B1 96 5E 53 B5 49 05 BB 3B 17 45 34 BB 68>)
(   2,<2024-11-27 13:48:42.96 +0400>,<she>,<DPX200>,
      <Start of raw data processing
       efp BC_mod = 2 LB = 0.24 FT_mod = 6 PKNL = 1 PHC0 = -26751.07 PHC1 = 72.38745 SI = 16K 
       data hash MD5: 16K
       E2 30 51 DC 8F 6C AA 6C 6C 1B C0 88 02 CF C0 C6>)
(   3,<2024-11-27 13:49:07.56 +0400>,<she>,<DPX200>,
      <pk PHC0 = 36.22398 PHC1 = -63.6 
       data hash MD5: 16K
       0B 40 C8 A8 98 E2 19 01 1B 49 BB 8B 9F F3 45 FA>)
(   4,<2024-11-27 13:49:11.21 +0400>,<she>,<DPX200>,
      <abs ABSG = 5 
       data hash MD5: 16K
       E2 49 AB 0E 59 BA D8 7A 24 5F EE 1A A1 30 ED C6>)
$$ ##END=
$$ 
$$ hash MD5
$$ FF 4A 25 35 FD D0 AC EC 35 27 01 4A 1C 0B 1F 11
##$RELAX= 
##$RELAX= 
##$RELAX= 
##$RELAX= 
##$RELAX= 
##$RELAX= 
$$ Bruker specific parameters
$$ --------------------------
##$DU= <F:/spectra>
##$EXPNO= 1
##$NAME= <H-F>
##$PROCNO= 1
##$TYPE= <nmr>
##$USER= <she>
##$AMP= (0..31)
100 100 100 100 100 100 100 100 100 100 100 100 100 100 100 100 100 100 
100 100 100 100 100 100 100 100 100 100 100 100 100 100 
##$AQSEQ= 0
##$AQ_mod= 1
##$AUNM= <au_zg>
##$AUTOPOS= <>
##$BF1= 200.13
##$BF2= 200.13
##$BF3= 200.13
##$BF4= 200.13
##$BF5= 200.13
##$BF6= 200.13
##$BF7= 200.13
##$BF8= 200.13
##$BYTORDA= 1
##$CFDGTYP= 0
##$CFRGTYP= 5
##$CHEMSTR= <none>
##$CNST= (0..31)
1 1 145 1 1 1 1 1 1 1 1 1 1 1 1 1 1 1 1 1 1 1 1 1 1 1 1 1 1 1 1 1 
##$CPDPRG= <>
##$CPDPRG1= <>
##$CPDPRG2= <>
##$CPDPRG3= <>
##$CPDPRG4= <mlev>
##$CPDPRG5= <mlev>
##$CPDPRG6= <mlev>
##$CPDPRG7= <mlev>
##$CPDPRG8= <mlev>
##$CPDPRGB= <>
##$CPDPRGT= <>
##$D= (0..31)
0 1.2 0 0 0 0 0 0 0 0.06 0 0.03 0 0 0 0 0.0002 0 0 0 0 0 0 0 0 0 0 0 0 
0 0 0 
##$DATE= 1732700919
##$DBL= (0..7)
120 120 120 120 120 120 120 120 
##$DBP= (0..7)
150 150 150 150 150 150 150 150 
##$DBP07= 0
##$DBPNAM0= <>
##$DBPNAM1= <>
##$DBPNAM2= <>
##$DBPNAM3= <>
##$DBPNAM4= <>
$$ [...]
##$SUBNAM3= <"">
##$SUBNAM4= <"">
##$SUBNAM5= <"">
##$SUBNAM6= <"">
##$SUBNAM7= <"">
##$SUBNAM8= <"">
##$SUBNAM9= <"">
##$SW= 24.0689530833862
##$SWIBOX= (0..15)
0 0 2 0 0 0 0 0 0 0 0 0 0 0 0 0 
##$SW_h= 4816.95568400771
##$TD= 16384
##$TD0= 1
##$TE= 0
##$TE2= 300
##$TE3= 300
##$TEG= 300
##$TL= (0..7)
0 120 120 120 120 120 120 120 
##$TP= (0..7)
150 150 150 150 150 150 150 150 
##$TP07= 0
##$TPNAME0= <>
##$TPNAME1= <>
##$TPNAME2= <>
##$TPNAME3= <>
##$TPNAME4= <>
##$TPNAME5= <>
##$TPNAME6= <>
##$TPNAME7= <>
##$TPOAL= (0..7)
0.5 0.5 0.5 0.5 0.5 0.5 0.5 0.5 
##$TPOFFS= (0..7)
0 0 0 0 0 0 0 0 
##$TUNHIN= 0
##$TUNHOUT= 0
##$TUNXOUT= 0
##$USERA1= <user>
##$USERA2= <user>
##$USERA3= <user>
##$USERA4= <user>
##$USERA5= <user>
##$V9= 5
##$VALIST= <valist>
##$VCLIST= <CCCCCCCCCCCCCCC>
##$VD= 0
##$VDLIST= <DDDDDDDDDDDDDDD>
##$VPLIST= <PPPPPPPPPPPPPPP>
##$VTLIST= <TTTTTTTTTTTTTTT>
##$WBST= 1024
##$WBSW= 4
##$XGAIN= (0..3)
0 0 0 0 
##$XL= 0
##$YL= 0
##$YMAX_a= 262941
##$YMIN_a= -148065
##$ZGOPTNS= <>
##$ZL1= 120
##$ZL2= 120
##$ZL3= 120
##$ZL4= 120
##$ABSF1= 19.56792
##$ABSF2= -4.501213
##$ABSG= 5
##$ABSL= 3
##$ALPHA= 0
##$AQORDER= 0
##$ASSFAC= 0
##$ASSFACI= 0
##$ASSFACX= 0
##$ASSWID= 0
##$AUNMP= <proc_1d>
##$AZFE= 0.1
##$AZFW= 0.1
##$BCFW= 0
##$BC_mod= 2
##$BYTORDP= 0
##$COROFFS= 0
##$CY= -3
##$DATMOD= 1
##$DC= 0
##$DFILT= <>
##$DTYPP= 0
##$F1P= 0
##$F2P= 0
##$FCOR= 1
##$FTSIZE= 16384
##$FT_mod= 6
##$GAMMA= 0
##$GB= 0
##$INTBC= 1
##$INTSCL= 2.524811e-10
##$ISEN= 128
##$LB= 0.24
##$LEV0= 0
##$LPBIN= 0
##$MAXI= 10000
##$MC2= 0
##$MEAN= 0
##$ME_mod= 0
##$MI= 1.114404
##$NCOEF= 0
##$NC_proc= -8
##$NLEV= 6
##$NOISF1= 3.799351
##$NOISF2= 2.8
##$NSP= 0
##$NTH_PI= 0
##$NZP= 0
##$OFFSET= 19.47537
##$PC= 1
##$PHC0= -26714.85
##$PHC1= 8.787453
##$PH_mod= 1
##$PKNL= yes
##$PPARMOD= 0
##$PSCAL= 0
##$PSIGN= 0
##$REVERSE= no
##$SF= 200.130010871448
##$SI= 16384
##$SIGF1= 3
##$SIGF2= 2
##$SINO= 5.538805
##$SIOLD= 16384
##$SREGLST= <1H.CDCl3>
##$SSB= 0
##$STSI= 16384
##$STSR= 0
##$SW_p= 4816.95568400771
##$SYMM= 0
##$S_DEV= 0
##$TDeff= 16384
##$TDoff= 0
##$TI= <>
##$TILT= no
##$TM1= 0
##$TM2= 0
##$TOPLEV= 0
##$USERP1= <user>
##$USERP2= <user>
##$USERP3= <user>
##$USERP4= <user>
##$USERP5= <user>
##$WDW= 1
##$XDIM= 16384
##$YMAX_p= 486203688
##$YMIN_p= -1659667
$$ End of Bruker specific parameters
$$ ---------------------------------
##NTUPLES= NMR SPECTRUM
##VAR_NAME=  FREQUENCY,     SPECTRUM/REAL,   SPECTRUM/IMAG
##SYMBOL=    X,             R,               I
##VAR_TYPE=  INDEPENDENT,   DEPENDENT,       DEPENDENT
##VAR_FORM=  AFFN,          ASDF,            ASDF
##VAR_DIM=   16384,         16384,           16384
##UNITS=     HZ,            ARBITRARY UNITS, ARBITRARY UNITS
##FACTOR=    0.29402158847633, 1,            1
##FIRST=     3897.6060912993, 0,             0
##LAST=      -919.349592708411, 0,           0
##MIN=       -919.349592708411, -1659667,    0
##MAX=       3897.6060912993, 486203688,     0
$$ Real data points
##PAGE= N=1
##DATA TABLE= (X++(R..R)), XYDATA
$$ [...]
7783C1037024p83609j84237k64488J193144M32867J110984J757677K680077K307433
7774C9286872J898443L750789N370832M974554M642112L445827P86313j813903
7766F2341839l169534k692943j545841M88454R81957J365137o68045m059725m844797
7757D8196502n381694m795605l096622k581915k314606k011648j469147j199428
7749B5345837o45691q49686K9654M73344k00042N47611J025736J039674J630243
7740B8396680J568012K388498R02312m65888j192772k323428j418449n28179K77514
7731B7604300j37396O50126o37636j988165k519442k504300k202041j466266j306730
7722A5492450j578268o12278o29159p31142k8016m03907r23552R1577j371782
$$ plain form
7783 31037024 30253415 30069178 29804690 30997834 31430701 32541685 34299362 36979439 39286872
7774 39286872 41185315 44936104 50306936 55281490 59923602 63369429 64155742 62341839
7766 62341839 59172305 56479362 54933521 55421975 56403932 57769069 57101024 53041299 48196502
7757 48196502 42814808 38019203 34922581 32340666 30026060 28014412 26545265 25345837
7749 25345837 24700146 23850460 23880114 24353458 24153416 24701027 25726763 26766437 28396680
7740 28396680 29964692 32353190 33255502 32789614 31596842 29273414 27854965 27326786 27604300
7731 27604300 27466904 28117030 27479394 25491229 22971787 20467487 18265446 16799180 15492450
7722 15492450 13914182 13301904 12672745 11941603 11913587 11509680 10586128 10677705 9305923
7713I305923m31646O28262p67312l82013L7758q5750k67888n65917j65309N47949
7703G854057N85424k92042o42648l1695q25002j142960m8701m02983l9560N38439
7693E552329m32605o08849L698j29159q89968L6225R1995m1132Q30292o00070
7683C812756J56909J39960j285652L60138J081365p94548m07885q6020j01343
7674B875680L91657J67982j115o54451j010220K29822L28270K11113n10014L17235
7664B345959j88692k47414M90984o60590j17046O69956M25840L8949m65547j21389
7654B171010p38015J40392N34522o60761j6733K02990N34278r2085l40344p14566
7644A020688k16125O63316Q7089J67279L10149k64113o0986p13221M08154J91714
$$ plain form
7713 9305923 8874277 9502539 8735227 8353214 8390972 8305222 8037334 7471417 7306108 7854057
7703 7854057 8439481 8147439 7504791 7473096 6648094 5505134 5456433 5053450 5013890 5552329
7693 5552329 5119724 4510875 4514573 4385414 3495446 3531671 3623666 3582534 4412826 3812756
7683 3812756 3969665 4109625 2823973 3184111 4265476 3470928 3063043 2977023 2875680
7674 2875680 3267337 3435319 3434204 2779753 1769533 1999355 2327625 2538738 2028724 2345959
7664 2345959 2157267 1909853 2400837 1740247 1623201 2293157 2718997 2757946 2292399 2171010
7654 2171010 1432995 1573387 2107909 1447148 1430415 1633405 2167683 2075598 1735254 1020688
7644 1020688 804563 1467879 1554968 1722247 2032396 1768283 1707297 994076 1402230 1593944
7634A593944l03063q137j79159J09184L51736L79225o4059k97807n70415M235
7624A015684N92361J68315n31701m47241M1780P83887o23038m5586r5322J87481
7614A046620N83370N40793p41895k89029K26616o64P00613j210203K88074m14344
7604G29951J69108N56630l18113k88698n19396M49418l36324L59043L29179l57692
7594G73106L53071k55120L23840p6752j05618l67491J36207L58180L06546q68640
7584E77329k13396R14436k87780j55250K44707m32869K17654M96104O44955n90032
7574A415858k91929O85254K30995k29181n2573j45221O69467L51879q2665L54527
7564B906411k85403m75764l61137L16398k29860l44366K68554l33437m27991O2475
$$ plain form
7634 1593944 1290881 1282744 1103585 1212769 1564505 1943730 1879671 1581864 1011449 1015684
7624 1015684 1608045 1776360 1244659 797418 839198 1623085 1000047 954461 859139 1046620
7614 1046620 1629990 2170783 1428888 1139859 1366475 1365811 2066424 856221 1144295 729951
7604 729951 899059 1455689 1137576 848878 329482 778900 442576 801619 1130798 773106
7594 773106 1126177 871057 1194897 1118145 1012527 645036 781243 1139423 1445969 577329
7584 577329 363933 1278369 990589 835339 1080046 647177 864831 1360935 2005890 1415858
7574 1415858 1123929 1809183 2040178 1810997 1758424 1613203 2282670 2634549 2551884 2906411
7564 2906411 2621008 2145244 1784107 2100505 1870645 1526279 1794833 1461396 1033405 1095880
7554A095880j61537j67778L33346k14130n17212j29218L80689k38293j70553L05825
7544E17019J7932M40835n66805M6335j74980L3397Q9186l54966K35168l87783
7534a04662m79179L20383M34005J74757j99164L60650R4920q63798K1337N51263
7524C10512K2458J28972m21591j02402J68684j20226l82812K00176N44786J81300
7514E29857j80355J24180l09747p73506l994R54239m52993P36368K04893q69593
7504d0651R3455P8069L75799o58770M5012Q4676N23316K16024p00851p1820n79392
7493f35133K33067N96141n54876J017600J66261o5357l71314m56984O70846k07875
7483C92376j26627p98565P25734k46211l92281M57552R505n62297Q95920j96534
$$ plain form
7554 1095880 934343 766565 1099911 885781 368569 239351 620040 381747 211194 517019
7544 517019 534951 975786 408981 455316 280336 313733 402919 47953 283121 -104662
7534 -104662 -583841 -263458 170547 345304 146140 506790 601710 -262088 -240751 310512
7524 310512 332970 461942 40351 -62051 106633 -13593 -396405 -196229 348557 529857
7514 529857 349502 473682 163935 -609571 -613565 340674 -112319 624049 828942 -40651
7504 -40651 52804 130873 506672 -152098 -107086 -22410 500906 716930 16079 -55741 -635133
7493 -635133 -402066 194075 -360801 656799 823060 757703 386389 -70595 600251 392376
7483 392376 265749 -532816 192918 -53293 -445574 11978 21483 -540814 355106 158572
7473A58572m62529L76371M38239K02416J81998r29720q16584M68525L59871N88488
7463E65647p53906p4451M52431M02442o91580o5898O13104K23863k57126l55167
7453E9359l28074M52009N62200o65264K57433m91171K69250O5520r3530k26863
7443a39131R136L29030N2017l18487K35675L80515l35143k20264K52007k40387
7433D968l07215P43286L70164j193l44917P8101r87142Q3168O38957o64852m70667
7422h57342L68871O75992j19924m19576M84850k70898M88639J26105n68331m34248
7412e25862l50204J38532O62740M8549J05449p08488L39305J79621l67539m35172
7402i13069o1473P21884M06614k92029j90958m09282M3889K26139l10475O8754
$$ plain form
7473 158572 -303957 72414 510653 713069 895067 -34653 -851237 -382712 -22841 565647
7463 565647 -188259 -262710 189721 592163 -99417 -165315 447789 671652 414526 59359
7453 59359 -268715 183294 745494 80230 337663 -153508 115742 181262 87732 -139131
7443 -139131 -129995 199035 251052 -67435 168240 548755 213612 -6652 245355 4968
7433 4968 -302247 441039 811203 810010 465093 543194 -443948 -360780 278177 -386675 -857342
7422 -857342 -488471 187521 67597 -351979 132871 -138027 350612 476717 -91614 -525862
7412 -525862 -876066 -737534 -74794 -26245 79204 -629284 -289979 -110358 -477897 -913069
7402 -913069 -974542 -252658 153956 -138073 -329031 -738313 -694424 -468285 -778760 -710006
7392g10006R1253L61910K92752J95255r4808l32744j12702j85573N31781n05583
7382d68465L02112k238j96577M06794l56223J20869j6967M42980J79594k57081
7372A54798n25789J88197K23462K72390m27130R8750L12775k35255M0297o39240
7362e36745Q3390K69031J18212m23214L59521k751K21432l21247k28147m6259
7352e06777m05853j32615L49388J263129l72067k02040R4817j11141m3591J53194
7342H6444Q6902n74995r5570P08743N0239m54113o32571J81900J93147M59562
7332I688K77172N57828l52803m17452k84534K35043J08872j116400J180603O6127
7322B64144o57970O72334k73071J09076n33129j89735N34714m06405J78324m4555
$$ plain form
7392 -710006 -618753 -256843 35909 231164 136356 -196388 -309090 -494663 37118 -468465
7382 -468465 -166353 -168591 -365168 41626 -314597 -193728 -210695 232285 411879 154798
7372 154798 -370991 -182794 40668 313058 -114072 -15322 297453 62198 102495 -536745
7362 -536745 -453355 -184324 -66112 -489326 -129805 -132556 88876 -232371 -460518 -506777
7352 -506777 -912630 -1045245 -695857 567272 195205 -6835 87982 -23159 -66750 86444
7342 86444 173346 -401649 -497219 211524 261763 -192350 -824921 -643021 -449874 9688
7332 9688 286860 844688 491885 74433 -210101 24942 133814 -982586 198017 264144
7322 264144 -393826 278508 5437 114513 -418616 -608351 -73637 -480042 -301718 -346273
7312c46273J97626l58870J31550m3153p2539j64222M7190K50202l80713M46679
7302b92523l03921p645P18061l800l51923j89723J59280J70867L87392m8159q0422
7291A57484M7648j84570l50530o57981M80031L22055J22901k84742M24627l76116
7281b99193k31295K9911N60243M40390l76297k70537j09965L81296m38993l51659
7271f66099O64670m05422K11588N7558P0798m63238M12127K66583p09818q2034
7261f43287J22663K71056Q78372l52142n84612K29016R2264m69065P52933J30226
7251D27424o9835P2200j95171p02097M01378J92038j101030K65236M3844N03598
7241a62415Q3190J72628M70786p09726k01433J18292o1142l76901O26982J29282
$$ plain form
7312 -346273 -148647 -507517 -375967 -419120 -491659 -655881 -608691 -358489 -739202 -292523
7302 -292523 -596444 -604089 113972 110172 -241751 -431474 -272194 -101327 286065 237906 157484
7291 157484 205132 20562 -329968 -987949 -507918 -185863 -62962 -347704 76923 -299193
7281 -299193 -530488 -500577 59666 500056 123759 -146778 -256743 124553 -314440 -666099
7271 -666099 -1429 -406851 -195263 -137705 -66907 -530145 -118018 148565 -561253 -643287
7261 -643287 -520624 -249568 628804 276662 -307950 -78934 13330 -455735 297198 427424
7251 427424 357589 429789 234618 -467479 -66101 125937 -975093 -709857 -666013 -162415
7241 -162415 -79225 93403 564189 -145537 -346970 -228678 -289820 -666721 -39739 89543
7231H9543m73945Q4820k73113K50264n52687P50320k17996j22772k6093k63157
7221g54816N91428J37248l85037q585k14969P24308m1650p2415M55782p9528L29444
7210F81210n67353o43073K46372l0273M69258m44450k0962M9208L14293k67794
7200b13564o41326K77659K92501J04013L25087k75045N24475m6960j30472L92513
7190F08881M2053q87074K45282k23681L51379n7865o48074K49425L52537L03736
7180C36599m41928K04398n02933n21477P65086p8089J99224j08726l01852Q99595
7170D49897p11399J47846N7085J75405j00093k28369N31868Q7019l39457j03587
7160c3785q720k01932j31444Q38779K9175o20167N83340Q11758k36855j371797
$$ plain form
7231 89543 -384402 -299582 -572695 -322431 -875118 -124798 -342794 -465566 -491659 -754816
7221 -754816 -163388 -26140 -411177 -419762 -634731 89577 47927 -24488 431294 351766 681210
7210 681210 113857 -529216 -282844 -313117 156141 -288309 -309271 -260063 54230 -213564
7200 -213564 -854890 -577231 -284730 -180717 144370 -130675 393800 346840 216368 608881
7190 608881 650934 -236140 9142 -214539 136840 78975 -569099 -319674 32863 336599
7180 336599 -105329 99069 -403864 -925341 -160255 -238344 -39120 -147846 -449698 449897
7170 449897 -261502 -113656 -56571 118834 18741 -209628 322240 409259 69802 -33785
7160 -33785 -42505 -244437 -375881 462898 492073 -128094 455246 1267004 1030149 -341648
7150c41648M11179K44479p42975L12274j65166J76923j05309K15193J9436P738
7140C2124m12700J00602j17386p22691O58880L01677n90747J15370L78538k43150
7130d99483M13068L2602l55669N48187j70273k23142K31202j31339k72601n17211
7120i44659O95709K84486L1339j48675L75113p12637l78031O91975k03034J06895
7110b01519M73914k51068K11570P5464o51119j31400M7820j30251J74021N80572
7100A98004m84848K10249M93967n41228k03009K3102M14593Q34858j40118n70547
7090B35023m43025l96199K56250Q6518o05164J005790q59291P20288K7680n2514
7080b4644L03853O1625n1684q18818J59313j96759K28665Q65692n4o68347j90851
$$ plain form
7150 -341648 69531 314010 -428965 -116691 -281857 -104934 -210243 4950 24386 32124
7140 32124 -380576 -279974 -397360 -1120051 -461171 -159494 -750241 -634871 -256333 -499483
7130 -499483 -86415 -53813 -409482 138705 -31568 -254710 -23508 -154847 -427448 -944659
7120 -944659 -248950 35536 66875 -81800 293313 -419324 -797355 -105380 -308414 -201519
7110 -201519 272395 21327 232897 308361 -342758 -474158 -426338 -556589 -382568 198004
7100 198004 -286844 -76595 417372 -123856 -326865 -303763 110830 945688 805570 235023
7090 235023 -208002 -604201 -347951 -261433 -866597 139193 -720098 190 27870 -24644
7080 -24644 279209 340834 289150 -529668 -370355 -567114 -338449 527243 527189 -141158 -332009
7069c32009J97097j95386M21353k02107J47745P71907p72831k32438M27186n42859
7059c12342o61057O95338j21531Q3415J86426O203J07702n5587r47044N61187
7049d57290M96851K29795p6874L03960l31363j24963j90551l90495L28991l83197
7039e95136J51868L86635n7404J14687M42400l19861m0410m85654N89892N1042
7029B38059o28560l62719L28668Q83314j67299j77037p41087M14979j83416J31015
7019b64083j89850N7176o9399N10788R53940o02595P7191J54463l92052n65472
7009c29893M36738m07653J57425l1437O1086J59581o76199L42842J9396m3964
6999c12078L48375m54862K96706L11370L86330n2392l11668l14352M12396k0379
$$ plain form
7069 -332009 -134912 -330298 91055 -111052 36693 808600 35769 -196669 230517 -312342
7059 -312342 -973399 -278061 -399592 -316177 -129751 -123548 -15846 -71433 -1018477 -457290
7049 -457290 39561 269356 192482 496442 165079 40116 -150435 -540930 -211939 -595136
7039 -595136 -443268 -56633 -114037 650 443050 123189 82779 -402875 187017 238059
7029 238059 -390501 -753220 -424552 458762 291463 114426 -626661 -211682 -395098 -264083
7019 -264083 -453933 -396757 -466156 44632 998572 395977 473168 627631 235579 -329893
7009 -329893 106845 -300808 -143383 -174820 -113734 45847 -630352 -287510 -268114 -312078
6999 -312078 36297 -418565 -121859 189511 575841 523449 211781 -102571 309825 289446
6989B89446o77513J41764l28829M18668k47217Q1246K7733N57614K85833J00779
6979F49524K34071j232758L92786K20873l20704J78386M00523k91613Q1562Q2144
6969C94794K85503N60734q59974Q3884K80488q4068k14939l6555P0348j26334
6959C53881K92252l37169j5176l68713J5842J76468o07189k02108O14383J67934
6949I0405L52549K23855m32050l16655J83186k58766K61510k18179K2044J185844
6939A093743k10543l35022J35322j020760j95005K08767L138Q38182L58448j50304
6929G25966l47750J61903O39611n66508k98563J08023k26328M89008j22918J31501
6919F93945q4451j68623n96749J37369M18966k37779j31661K5295J90785k0315
$$ plain form
6989 289446 -388067 -246303 -575132 -156464 -403681 -322435 -294702 262912 548745 649524
6979 649524 883595 -349163 43623 264496 -56208 122178 522701 231088 312650 394794
6969 394794 680297 1241031 381057 464941 745429 661361 446422 409867 480215 353881
6959 353881 646133 308964 293788 -74925 -59083 117385 -489804 -691912 -77529 90405
6949 90405 442954 666809 234759 -81896 101290 -157476 104034 -114145 -92101 1093743
6939 1093743 883200 548178 683500 -337260 -532265 -323498 -320360 517822 876270 725966
6929 725966 378216 540119 1179730 613222 314659 422682 196354 685362 562444 693945
6919 693945 609494 440871 -155878 -18509 400457 162678 31017 56312 247097 226782
6909B26782j07047J16359k3478O46001m96203L4103k43788r62514M81456J08173
6899b20156K00734o5586m78070J58896J69059O40059j35960j23539M45357p30395
6889a39601l1836N98416k55015j26799N2669K78532L94856l82447j34141K97761
6879E52395J48345q99081K37701K97207p09176N93490L34378j47430K44854l91563
6869B61120n7462k48534m01760L19644j53320J24788j37026K25647M41457N7232
6859D31786L9022j6895J04944j43633j04873K42663m90635O10730j35637Q0049
6849F17521j73926O89762l33451p60152J95818N8466J36660k8329k44273N10983
6839F69079l04323K29085J59108l37820k15727m73359N53372K67506l97862K74457
$$ plain form
6909 226782 119735 236094 212616 858617 362414 396517 152729 -809785 -328329 -220156
6899 -220156 -19422 -85008 -563078 -404182 -235123 404936 268976 145437 590794 -139601
6889 -139601 -171437 426979 171964 45165 97834 376366 771222 388775 254634 552395
6879 552395 700740 -198341 39360 336567 -372609 220881 555259 407829 652683 261120
6869 261120 203658 -44876 -446636 -126992 -280312 -155524 -292550 -66903 374554 431786
6859 431786 470808 453913 558857 415224 310351 553014 62379 673109 537472 617521
6849 617521 443595 1133357 799906 39754 235572 294038 430698 402369 158096 669079
6839 669079 364756 593841 752949 415129 199402 -273957 279415 546921 149059 423516
6829D23516j52681J80205j63335j30591K38145k99574L42341o2040k39664L55087
6819D91409m25586j84650M28677J20178O25130K21518m07218o06477J71029M96391
6809I30401m50456m09519j94894l83509P84470P6253n18058K5381M59173j78227
6799A41015j30087j04375K39924j66694R59306m77947L76397J34652o1587l33805
6789E76799k05479L54056l5828J7481j43629m00737R02743o00419K80649N1029
6779G96665k96996L40993k36654K16330m9634m58813m02821N355j31923N22255
6769C04757N75297n36056r286k94051j88972O5054L13862k10890N82198j21148
6759D80765k05772j28403N11938m54428R5183n7658m1357J23650J66583L858n50536
$$ plain form
6829 423516 270835 451040 287705 157114 395259 95685 438026 375986 136322 491409
6819 491409 65823 -118827 309850 430028 1055158 1276676 869458 262981 434010 930401
6809 930401 479945 70426 -124468 -507977 276493 352746 -165312 -139931 319242 141015
6799 141015 10928 -93447 146477 -20217 939089 461142 837539 972191 910604 576799
6789 576799 371320 725376 689548 707029 563400 162663 1065406 464987 745636 796665
6779 796665 499669 840662 604008 820338 770704 311891 -90930 -85575 -217498 304757
6769 304757 880054 343998 334712 40661 -148311 -83257 230605 19715 601913 480765
6759 480765 274993 146590 658528 204100 299283 241625 200268 323918 490501 494359 -56177
6748e6177M59043J83730L2994k45260L29340O969k28245Q9689k95372M42684L40865
6737A060260o40049L08074m42189K28583L34897n0317k99253N42637j55963l23637
6727E63043j60889J29443k38762J97002L52712Q2880m57311m29801j16622M64773
6717C86468k30331J55177J71212K34919M22948j01661l77975j30999K11311L85321
6707A126390l48299N5036l05938N14548k64463j85610P32536k78270o56178K40118
6697F29870J45511K21107j84844J95470J31727p80486L17486p9999J22869J87564
6687I06275l93247L40979J72575L84286l21826n82598J85130m13028j67365J33110
6677B44291J33728M68836r4023K19525n98164M47676J21000k80592j75722j4402
$$ plain form
6748 -56177 402866 586596 619590 374330 703670 710639 482394 572083 276711 719395 1060260
6737 1060260 420211 728285 286096 514679 849576 799259 500006 1042643 886680 563043
6727 563043 402154 531597 292835 489837 842549 925429 468118 38317 -78305 386468
6717 386468 156137 311314 482526 717445 1140393 1038732 660757 529758 741069 1126390
6707 1126390 778091 833127 527189 1041737 777274 591664 1324200 1045930 389752 629870
6697 629870 775381 996488 811644 1007114 1138841 358355 675841 595842 718711 906275
6687 906275 513028 854007 1026582 1410868 1089042 506444 691574 278546 111181 244291
6677 244291 378019 846855 752832 972357 374193 821869 942869 662277 486555 472153
6667D72153j72194O85243p9073q53892r7258P19245N53638j10815L64596q54587
6657F27056p18065O66990n8892L66704O3912K16127N14546m96232K99363P04990
6647B186499l33679j057302P84587k07577q16101N39585Q88373o01415R77237
6638B360207n55196j19155R77679P7961K45112K04441J91460p10273l85287J20187
6628B407136K83231M84135k75739p59394j46763O47530k05365l83271P82473k4861
6618B809112o05533O85545m96599l95130K979n13595o38820J15855L90606p2478
6608A281942L03279n3255K20221k17890J54223m01438K49039m75689o57571M8961
6598D51822K82159L39169J84188N38294k18150K4797p63600J161987Q5415k66781
$$ plain form
6667 472153 299959 985202 906129 52237 -45021 674224 1227862 1117047 1481643 627056
6657 627056 -91009 575981 517089 883793 947705 1163832 1678378 1182146 1481509 2186499
6647 2186499 1852820 795518 1580105 1372528 556427 1096012 1984385 1382970 2360207
6638 2360207 1805011 1685856 2663535 2741496 2986608 3191049 3382509 2672236 2286949 2407136
6628 2407136 2690367 3174502 2898763 2139369 1992606 2640136 2434771 2051500 2833973 2809112
6618 2809112 2203579 2889124 2392525 1997395 2000374 1486779 847959 963814 1354420 1281942
6608 1281942 1585221 1531966 1752187 1534297 1688520 1287082 1536121 1060432 402861 451822
6598 451822 733981 1073150 1257338 1795632 1577482 1602279 838679 2000666 2086081 1819300
6588A819300O4282P8624j39832L84961j066595N89273j35001p77519J46493L0221
6578I94207o3137L11148l68207L085N44777p30756p14117K65716N10624m05001
6568C48339m21368N91014P83236k36171k05247r66893O41169O40885k42458o0
6558I32446J19576j069119N6550J90476P47709l77981N261Q38931q53779n75173
6548A4897j55283k52601O33833K70562m71435M90937P1911P1312l19524l44709
6538I900K90487J89487Q5253J030m2724N67461M4671k50098j63939L04036q0694
6527I54870o42168N89391n70252J31761R59633j92477r62644j60827M93178Q28559
6517A429024l31878M52926m75657n3715m21322o9212L09033J45772n57985J94320
$$ plain form
6588 1819300 1883582 1962206 1822374 2207335 1140740 1730013 1595012 817493 963986 994207
6578 994207 931070 1242218 874011 877096 1421873 691117 -23000 242716 753340 348339
6568 348339 -73029 517985 1301221 1065050 859803 -107090 534079 1174964 932506 932446
6558 932446 1052022 -17097 39453 229929 977638 599657 604918 1443849 590070 14897
6548 14897 -140386 -392987 240846 511408 39973 530910 602821 674133 354609 9900
6538 9900 300387 489874 575127 576157 533433 1100894 1145565 895467 731528 1035564 954870
6527 954870 312702 902093 331841 463602 1423235 1230758 268114 107287 600465 1429024
6517 1429024 1097146 1550072 1074415 1020700 599378 530166 839199 984971 426986 621306
6507F21306J27156l17514p5453l71279J76599K67854K06395J5715L02765j08956
6497H44588P377j81088L97253n796N46375k59226q12655n32987O78148l28966
6487C53023N03871m64014K49225O25276j88383P5108l44161K17401R3051l54627
6477G65770J23039n148j13110M87819N8900m78936L2896K92270p70000N22240
6467I15740j91942j05003o5731K92861L33405J72073r83606q3451k13482L66977
6457D37841L52611K99490M16984o79516L37226j48510P15753m91744k89100l99009
6447E52026P70763m75464j30424k21301l15649J015781j91865L65872j02080o69220
6437E98439O41455N04063o53960K78204p01499L33116k46564M1055M18633n15868
$$ plain form
6507 621306 748462 430948 355495 -15784 160815 428669 635064 650779 953544 844588
6497 844588 851965 670877 1068130 1062334 1608709 1349483 536828 3841 681989 353023
6487 353023 856894 392880 642105 1267381 1078998 1154106 809945 1027346 1120397 765770
6477 765770 888809 883661 770551 1258370 1317270 838334 871230 1163500 393500 915740
6467 915740 723798 618795 553064 845925 1179330 1351403 367797 284346 70864 437841
6457 437841 790452 1089942 1506926 827410 1164636 1016126 1731879 1240135 951035 552026
6447 552026 1322789 847325 716901 495600 179951 1195732 1003867 1369739 1267659 598439
6437 598439 1239894 1743957 1089997 1368201 666702 999818 753254 794309 1212942 697074
6427F97074J55035L79242l45053k03189Q09952n96594R5269m18646k09869J71984
6417E35205J97544J99839J26391L61935l53824R8171L17801m27655j65005K40924
6407A131326J37486j41976J15538N5425l66177q6321K7276N02865J62665p1045
6397A467062O79763n71960l43684P52346m59699k83335n86725K21058P59566j01410
6387A532982O79827L01166n78510p8259p57472K60094j25222m53812K02057m3527
6377I39324j21238O42777K92668K71843Q9354r316n6120j95646N0012l75252l58756
6366A169650k97839R0517L49333K31554j88274P18701J36479L21854k23242l45221
6356A963512p1694L18744J10565k90759M3604k45472o6206o98749O46120O76775
$$ plain form
6427 697074 852109 1231351 886298 683109 1493061 896467 991736 573090 363221 535205
6417 535205 732749 932588 1058979 1420914 1067090 1165261 1483062 1055407 890402 1131326
6407 1131326 1268812 1126836 1242374 1297799 931622 845301 872577 1375442 1538107 1467062
6397 1467062 2146825 1574865 1231181 1983527 1523828 1240493 653768 874826 1634392 1532982
6387 1532982 2212809 2513975 1935465 1857206 1099734 1359828 1234606 780794 982851 939324
6377 939324 818086 1460863 1753531 2025374 2114728 2105412 2049292 1853646 1903658 1528406 1169650
6366 1169650 871811 962328 1311661 1543215 1354941 2073642 2210121 2531975 2308733 1963512
6356 1963512 1891818 2210562 2321127 2030368 2073972 1828500 1762294 1063545 1709665 2386440
6346B386440n33393L60468m9969j87657J68875Q3191K11100l39152o70835J17336
6336A546404L77779L78861j23400K80783q7277K5108j24996l54246J68700q7343
6326B000373M6256l00567K31701Q3580L37076p173l06139j91400J46810k19783
6316A820734k89815J106448L3646m03924M27589j060448J003028N69593n03720
6307B703131L779j83954O6237m97489R191M03341M0389M74599n98521l90076P00179
6296B730806P61908l95080r79324K13791K63169N4542m81781M85502p9759M83878
6286C057652N2333P0370k09704l38663K55258K22388L94124j68514l49779k19498
6276B765967J15465K21311K84048k19923j13418M0366J09429Q7227O73288m25031
$$ plain form
6346 2386440 1853047 2213515 2163546 1975889 2144764 2227955 2439055 2099903 1429068 1546404
6336 1546404 1924183 2303044 2179644 2460427 2373150 2398258 2273262 1919016 2087716 2000373
6326 2000373 2046629 1746062 1977763 2061343 2398419 2391246 2085107 1893707 2040517 1820734
6316 1820734 1530919 2637367 2671013 2267089 2694678 1634230 2637258 3206851 2703131
6307 2703131 2706910 2522956 2589193 2091704 2100895 2504236 2544625 3019224 2420703 2030627 2730806
6296 2730806 3492714 3097634 2118310 2332101 2595270 2649812 2168031 2653533 2573774 3057652
6286 3057652 3109985 3180355 2970651 2631988 2887246 3109634 3503758 3335244 2985465 2765967
6276 2765967 2881432 3102743 3386791 3166868 3053450 3093816 3203245 3290472 3963760 3538729
6266C538729p3043K98484o45565J45320O885J79313J2458l31387J10846K68930
6256C510970m67381k50290L77771N99561l31899j53188K1022M52263k3855O5635
6246C800609L76048j9687K1696J17518L67888J29061p36159J9587N48367k64635
6236D360293O42540k1849q3411R8776m18927K29395N38336M89298l38836M5841
6226E541456J14200R85320n8070j038793O36461P19054P37977p66500j98624P72470
6216G444951K9771K76734L23038L56476J142992m38460J89899P43329N93692L34332
6206A0996754n0880j46168J77778N64687j76990N85770M45526N02183P68055N51164
6196A4217879M40726O70900J073155P54923R72394R22944M50925J226752K24707
$$ plain form
6266 3538729 3465686 3764170 3118605 3263925 3270810 3450123 3462581 3131194 3242040 3510970
6256 3510970 3043589 2793299 3171070 3770631 3438732 3285544 3306566 3758829 3734974 3800609
6246 3800609 4176657 4156970 4178666 4296184 4664072 4793133 4056974 4076561 4624928 4360293
6236 4360293 5002833 4980984 4897573 4996349 4577422 4806817 5345153 5834451 5495615 5541456
6226 5541456 5655656 6640976 6582906 5544113 6180574 6899628 7637605 6871105 6672481 7444951
6216 7444951 7474722 7751456 8074494 8430970 9573962 9135502 9325401 10068730 10662422 10996754
6206 10996754 10945874 10799706 10977484 11542171 11365181 11950951 12396477 12898660 13666715 14217879
6196 14217879 14658605 15329505 16402660 17157583 18129977 19052921 19503846 20730598 20955305
6187B0955305l35076J041168L07938L46542J289970P53646j55933J239429J580865
6178B7023854J467661O44236K079233K003016J933081K437991K943743K441965
6170D2974780L575659M058454L482631M638846N262068O436049O707621P913376
6162H5049484N579536J996915k053390l763142n129974m146608k341775k130982
6154G3060064j057638R26874K145251M211953M553998N078982O408571Q958898
6146A04286953R739118J1947928J4762515J4274320J0126888O93862r526571j6042599
6138A40262414j6726304j3815516j0560968q281300o013820m175233l674002r11315
6130G6103956l5090L59997K167922L646498L734580N760080N180568N031152K002043
$$ plain form
6187 20955305 20620229 21661397 21969335 22315877 23605847 24359493 24203560 25442989 27023854
6178 27023854 28491515 29135751 31214984 33218000 35151081 37589072 40532815 42974780
6170 42974780 46550439 50608893 54091524 58730370 63992438 70428487 77136108 85049484
6162 85049484 90629020 92625935 90572545 86809403 81679429 77532821 75191046 73060064
6154 73060064 72002426 72929300 75074551 79286504 83840502 88919484 95328055 104286953
6146 104286953 114026071 125973999 140736514 155010834 165137722 165831584 156305013 140262414
6138 140262414 123536110 109720594 99159626 90878326 84864506 80689273 77015271 76103956
6130 76103956 76068866 76428863 78596785 82243283 85977863 91737943 96918511 101949663 103951706
6121A03951706k626501o157551r726915r761645r350095p365335n676781m770449
6113D8516434l201663k680105k999122j592244j747859n17017j243062j587008
6105C2948354n18543r01628j335439m87970j724788j102379j198775j938867q56241
6096B2883724q78394j241072p34362p27957m88866l61811q23330p62400k43806
6087A6621726r28899N23115q93417M82187j152514j82899j15724p80259n3597
6078A3519719l79957q32051m03984n8538p05825m31713p21058J95897p45506N11689
6068I948673j122500m10908l41034L38268l14953n44896M55917p88918J01252
6059G320901L79252L93474m2551p97349m02714k40186o35800K61128J26968j9878
$$ plain form
6121 103951706 101325205 95167654 85440739 75679094 66328999 58963664 53286883 48516434
6113 48516434 45314771 42634666 39635544 38043300 36295441 35778424 34535362 32948354
6105 32948354 32429811 31528183 30192744 29704774 27979986 26877607 25678832 23739965 22883724
6096 22883724 22005330 20764258 20029896 19301939 18813073 18451262 17627932 16865532 16621726
6087 16621726 15692827 16215942 15322525 15804712 14652198 14469299 14353575 13573316 13519719
6078 13519719 13139762 12307711 11903727 11845189 11139364 10707651 9986593 10182490 9436984 9948673
6068 9948673 8826173 8415265 8074231 8412499 8097546 7552650 8008567 7219649 7320901
6059 7320901 7700153 8093627 8051076 7253727 6851013 6610827 5975027 6236155 6363123 6343245
6049F343245o4180N3789l37097L53891l95131L2813K44331o60756L38301R308
6039E918514l40030M3776k9216k70403j3836m3933P8438K07242R7618n937m58912
6028E183321M50702l38779p72770Q71496J69008Q6506L175j50142k8941K91607
6018E765183n42332k51806N37838o02203j44104Q28625p74437L47515M81391j07446
6008E538224n20849M79398o2590j16459L64382j44744l42124Q68373M3074l86386
5998E720299Q24395j93466L72201M27233K155P41924L14720l00418L59851N48876
5988H817770j6112m89387k3667J32729m65082k669L31132L06179p961J25369J006157
5977I714458R1020n8943J429326J21846M42156L67788M9835m9294k16734j140699
$$ plain form
6049 6343245 6279065 6332854 5995757 6349648 5954517 5987330 6231661 5570905 5909206 5918514
6039 5918514 5578484 5622260 5593044 5322641 5308805 5264872 5343310 5550552 5648170 5642233 5183321
6028 5183321 5634023 5295244 4522474 5393970 5562978 5649484 5652659 5502517 5473576 5765183
6018 5765183 5222851 4971045 5508883 4906680 4762576 5591201 4816764 5164279 5645670 5538224
6008 5538224 5017375 5496773 5434183 5317724 5682106 5537362 5195238 6063611 6106685 5720299
5998 5720299 6544694 6351228 6723429 7150662 7152817 7894741 8209461 7909043 8268894 8817770
5988 8817770 8801658 8312271 8288604 8421333 7956251 7953582 8284714 8590893 8582932 8708301 9714458
5977 9714458 9805478 9746535 11175861 11297707 11739863 12107651 12157486 12108192 11891458 10750759
5967A0750759n89906p68915p32632j73543K16086m7748k7997N06878n45517L49051
5957H936516m05877Q85687k6286J3758J57714Q0769J10130l82054M7885K54836
5947I673078j068973q36199l25839L65912k94138J28488j55319k85954O37589
5938G838645p80097M04549O07154n23834K23909L85241j44535K40778p39647O2911
5928G575074k17188Q1338n59296L32496K87411o07392R1504O18991k2897n81755
5918F998286M59777P172l71479R3923K60961K25516n8092R4564m68019M7902J70998
5907G461509K1662M2424J53507j448l63804k6572l7740L33901l46048r0974R35973
5896H082390j24698R1979L39617K27316M4926q58695J170920j1037j47724K53745
$$ plain form
5967 10750759 10160853 9391938 8659306 8485763 8701849 8654101 8626104 9132982 8587465 8936516
5957 8936516 8530639 9416326 9390040 9403798 9561512 9642281 9752411 9370357 9418242 9673078
5947 9673078 8604105 7767906 7442067 7807979 7513841 7642329 7487010 7201056 7838645
5938 7838645 7058548 7463097 8070251 7546417 7770326 8155567 8011032 8251810 7512163 7575074
5928 7575074 7357886 7439224 6879928 7212424 7499835 6892443 6983947 7602938 7580041 6998286
5918 6998286 7458063 7465235 7093756 7187679 7448640 7674156 7616064 7710628 7242609 7290511 7461509
5907 7461509 7483171 7525595 7679102 7677654 7313850 7287278 7249538 7583439 7237391 7146417 8082390
5896 8082390 7957692 8049671 8389288 8616604 8661530 7802835 8973755 8962718 8814994 9068739
5886I068739j82261J02214N4018L3725M70084l04400K47748J77261L61254j83090
5876I845292r2908R45001k92818P37417P24111J51833M13727J69147Q18680j39351
5866A3280131L79278P07628m79786K99186O28630O21345L31574P58388K94033
5857A6820407J874543P34472J45248N23765P20250J479539J272676P30215J081206
5848B5382321K25966N8261J138774R28451K134544P55664J633084J580180J877993
5839C5715238K317045K653978K169874M239083M213787M289194N066503M787551
5831F5452253N938105P116453O585677L624463J807795k75730l051814m195802
5823H3001400l396107k074680j798564J51050J157175K255765L224331M380175
$$ plain form
5886 9068739 8886478 8988692 9042710 9076435 9546519 9242119 9489867 9667128 10028382 9845292
5876 9845292 9752384 10697385 10404567 11141984 11866095 12017928 12431655 12600802 13419482 13280131
5866 13280131 13659409 14367037 13887251 14186437 14815067 15436412 15767986 16526374 16820407
5857 16820407 18694950 19429422 19574670 20098435 20818685 22298224 23570900 24301115 25382321
5848 25382321 25608287 25666548 26805322 27733773 29868317 30623981 32257065 33837245 35715238
5839 35715238 38032283 40686261 42856135 47095218 51309005 55598199 60664702 65452253
5831 65452253 71390358 78506811 85092488 88716951 90524746 90249016 87197202 83001400
5823 83001400 79605293 77530613 75732049 75883099 77040274 79296039 82520370 86900545
5815H6900545M977734P211700Q694451R507863J1962672J2171341J1006760O561693
5807A58994759j151384r713227j3794552j3837779j2193450r126539p359896n919639
5799H5898293m027968j863654j184182k3641J108402J829139L361853N119394
5791I0217636M603226L659109K386622j112943m261898p665123q523921q236047
5783G1066661o871058n347795m592168l776322l425889k738148k538463k055977
5775C9720841j851417j682077j074547j220456n54594j672682q07966p46967r66584
5766B9143551j414588q26752j64321O62491l72499m83012K73086j25647k59190
5757B6433119m48832P2389J03872l24520M38183r1169m5088l40936M4392q56688
$$ plain form
5815 86900545 91878279 99089979 107784430 117292293 129254965 141426306 152433066 158994759
5807 158994759 157843375 148130148 134335596 120497817 108304367 99177828 91817932 85898293
5799 85898293 81870325 80006671 78822489 78798848 79907250 81736389 85098242 90217636
5791 90217636 94820862 98479971 100866593 99753650 95491752 87826629 79302708 71066661
5783 71066661 64195603 58847808 54255640 50479318 47053429 44315281 41776818 39720841
5775 39720841 37869424 36187347 35112800 33892344 33337750 31665068 30857102 30110135 29143551
5766 29143551 27728963 26902211 26737890 27400381 27027882 26544870 26817956 26692309 26433119
5757 26433119 25984287 26056676 26160548 25836028 26274211 26183042 26137954 25797018 25841410 24984722
5747B4984722j89208J73228P11132K009J83851L53506R7780K05470P68122Q32105
5737B8122717M07701J55456J289297O01645O12695L26189O88273J009474J014007
5728C4227454R03925N28707J744604R58822J767796J368819J988524K514303K443904
5719D8446858K722887L707568L617344M207634N429748O348368P257474Q258897
5711H9996778R276601P829410L935761j227778n203653o648880n851627m766011
5703H7340601l164661j395389m46934J857613K068469L160793N052039N854374
5695A00326905P284749J0474979J2265560J4962656J5677612J1767883J988309
5688A74748653q552611j6297701j6237008j5064918j1666552r212419p180928
$$ plain form
5747 24984722 24795514 24968742 25679874 25681883 25865734 26219240 26317020 26522490 27290612 28122717
5737 28122717 28530418 28685874 29975171 30576816 31189511 31515700 32203973 33213447 34227454
5728 34227454 35131379 35660086 37404690 38363512 40131308 41500127 43488651 46002954 48446858
5719 48446858 51169745 54877313 58494657 62702291 68132039 74480407 81737881 89996778
5711 89996778 99273379 107102789 111038550 109810772 104607119 97958239 92106612 87340601
5703 87340601 84175940 82780551 82333617 84191230 86259699 89420492 94472531 100326905
5695 100326905 107611654 118086633 130352193 145314849 160992461 172760344 174748653
5688 174748653 166196042 149898341 133661333 118596415 106929863 97717444 90536516
5681I0536516m830631l606716k184644m23629R80867R23502J627163L260749N124154
5672I1407331M871827M964967K437685M21251n024685p147867p733578p720231
5664G6476700n970026n124417n331697l638195k998487k760862k273473k438158
5656D5941385l24715j127032p89085m78674q95945p25740O57766K93943O87440
5647D3239343N07930J090816J562891O80920j208621k046828l127188k735900
5639C7963363k188863j183601r95466j175544p31894o9407r0929m60186l06044
5630C0761429k51112P25646l7796O08015O94238N93774K97459L89505J32283J58978
5620C4072419K2994Q88201j27291j777246q21909n54024j038644J84351n13148
$$ plain form
5681 90536516 85705885 82099169 79914525 79490896 80471763 81395265 83022428 86283177 91407331
5672 91407331 96279158 101244125 103681810 104103061 99078376 91930509 84196931 76476700
5664 76476700 70506674 65382257 60050560 56412365 53413878 50653016 48379543 45941385
5656 45941385 45616670 44489638 43700553 43221879 42325934 41600194 42257960 42551903 43239343
5647 43239343 43747273 44838089 46400980 47081900 45873279 43826451 40699263 37963363
5639 37963363 35774500 34590899 33595433 32419889 31687995 31618588 31527659 31067473 30761429
5630 30761429 30510317 31235963 31198167 31806182 32500420 33094194 33391653 33781158 33913441 34072419
5620 34072419 34095413 34983614 34856323 33079077 32257168 31703144 30664500 30848851 30335703
5611C0335703Q1595L55215O21214k44548N51637J03391J15593R41443N81539J019564
5601C4462346N37584J213780O63326R55610O48423J738393J531500J108655J333706
5592D4193323J118240J226446J618968R17880J151235Q95185R32045J576441K241670
5583E5871433J911657J557583J773907J578254K273524K306087J855930J048979
5575G0177354K046806J461514J389326J648331J632719K720829L304129L550384
5567H7931392M568687N590069O695527P139824Q267840J0437136J1672877J2587044
5559A54890396J4132675J6004882J6101504J5693362J5573587J4172277J0992223
5552B57560906O822697l33018p951231j3943424j6722277j6474570j5881012j5249542
$$ plain form
5611 30335703 30417298 30772513 31393727 31149179 31700816 31804207 31919800 32861243 33442782 34462346
5601 34462346 34999930 36213710 36877036 37832646 38481069 40219462 41750962 42859617 44193323
5592 44193323 45311563 46538009 48156977 49074857 50226092 51121277 52053322 53629763 55871433
5583 55871433 57783090 59340673 61114580 62692834 64966358 67272445 69128375 70177354
5575 70177354 72224160 73685674 75075000 76723331 78356050 81076879 84381008 87931392
5567 87931392 92500079 98090148 104785675 111925499 120193339 130630475 142303352 154890396
5559 154890396 169023071 185027953 201129457 216822819 232396406 246568683 257560906
5552 257560906 264383603 264050585 256099354 242155930 225433653 208959083 193078071 177828529
5544A77828529j4115329j2421852j1058773q614328p198153o032810l625740m091029
5536A10670515j648981l08456M35853J077117J582469O34819O36881Q48050J195615
5527A15123882K454469K886058J069111q17175k369482m176211l617611l953405
5519A06599636k472922k911561k899076k481109l822226l232332r60009r43918
5511H6876483j260900j067630r6945n78763k07252k98071K44282o79084p41972
5502H2190148J43237J32108P7373J610069K297641K530962K993744L784452N112838
5493A00872572O252410P285555P687370O804725N312865K231775k496713n355589
5485A28594970n839184m909837m545836j935114j273177J52007K030362K700410
$$ plain form
5544 177828529 163713200 151291348 140232575 131618247 124420094 118387284 114761544 110670515
5536 110670515 109021534 108713078 109148931 110226048 111808517 112443336 113080217 113928267 115123882
5527 115123882 117578351 120464409 121533520 120716345 118346863 114170652 110553041 106599636
5519 106599636 104126714 101215153 98316077 95834968 92012742 88780410 87820401 86876483
5511 86876483 85615583 84547953 84451008 83872245 83664993 83366922 83611204 82932120 82190148
5502 82190148 82333385 82465493 82542866 84152935 86450576 88981538 91975282 95759734 100872572
5493 100872572 107124982 114410537 122097907 128902632 134215497 136447272 133950559 128594970
5485 128594970 122755786 117845949 113300113 111364999 110091822 110243829 112274191 114974601
5477A14974601M114588N792472P557527R570271J1416364J3220306J4427414J2139067
5469A93212610L857992n297412j1203107j3704708j2359516q819442o949404m789469
5461A33947544k787226j854602l010520l238357j305866q69865J246696L321898
5453A25449702L825775N389824N604450L715910R76907j004175k948033l458394
5445A37551966k801240k176913k288947o67811j64185k03611O24692R0758J643953
5436A31608662K465145M719992N204089N018319K277832p65063k016758o95409
5428A47816809R09470O21414N70246O60371J425049M006807N852369O103757M542718
5419A72509010J389343J236729L445863M099377M137266J675435j750865n930114
$$ plain form
5477 114974601 119089189 124881661 132439188 142009459 153425823 166646129 181073543 193212610
5469 193212610 197070602 191773190 180570083 166865375 154505859 145686417 138737013 133947544
5461 133947544 131160318 129305716 126295196 123056839 121750973 120881108 122127804 125449702
5453 125449702 129275477 134665301 140269751 143985661 144962568 143958393 141010360 137551966
5445 137551966 134750726 132573813 130284866 129617055 129452870 129249259 129873951 129964709 131608662
5436 131608662 134073807 138793799 143997888 149016207 151294039 150528976 148512218 147816809
5428 147816809 148726279 149347693 149917939 150578310 152003359 156010166 161862535 167966292 172509010
5419 172509010 173898353 175135082 178580945 182680322 186817588 188493023 186742158 180812044
5411A80812044j0056246j1935309j1733672j0782872q640979o051865m087258
5404A17523843k915539j838461l93882J247649J846733K999854M059858N506156
5396A28036211Q165183Q289103J0522081J0793179R923868O769954K110748j826957
5388A82783370n607936o532120n698768l857867k411594l521042o440518n783039
5380A42930486n176430l780802j561982j894384j627727j388575j367457K65071
5372A26398200N14946k066949n124187o911525o712150n808388m400424l416881
5364I2472642k356276k527723l046245l836357l646309l012110k938045l798446
5356F7311131n237812m155098l956555l517471k863477l035250k577951j510696
$$ plain form
5411 180812044 170755798 158820489 147086817 136303945 127662966 121611101 117523843
5404 117523843 114608304 112769843 112375961 113623610 115470343 118470197 122530055 128036211
5396 128036211 136201394 144490497 155012578 165805757 175729625 182499579 184610327 182783370
5388 182783370 177175434 170643314 164944546 161086679 158675085 155154043 148713525 142930486
5380 142930486 137754056 133973254 132411272 130516888 128889161 127500586 126133129 126398200
5372 126398200 126913146 124846197 119722010 112810485 106098335 100289947 95889523 92472642
5364 92472642 90116366 87588643 84542398 80706041 77059732 74047622 71109577 67311131
5356 67311131 62073319 57918221 53961666 50444195 47580718 44545468 41967517 40456821
5348D0456821k087682j644037q86862j199984n46465j241242j290833k23038j059616
5339C0277062j313671l82260j290257j131635p99189j423062j313819J00371p77517
5330B1946023q10488n2994J01093o96431j7362j614703k61057n86288q57373J00492
5320A7250912r610k79041o32601j048456o17174j4968l40810r82814K75259j60959
5310A3439738K0716q6358p57100n90248r7725K0983j48732K0128p319l2963j36922
5299A1644198k26699n17403k68773J16322R2690j133929l71160M99406j0332k4031
5289I800289n55047p19415K2332o87538N94152O87342J20579m35614m19722M21351
5279H828709m20366l5635L81561j1792m77929q02252M86949m73277o7844N03258
$$ plain form
5348 40456821 38369139 36725102 35838240 34638256 34091791 32850549 31559716 31336678 30277062
5339 30277062 28963391 28581131 27290874 26159239 25360050 23936988 22623169 22723540 21946023
5330 21946023 21135535 21082541 21183634 20487203 20469841 18855138 18594081 18007793 17150420 17250912
5320 17250912 17241302 16962261 16329660 15281204 14664030 14649062 14308252 13325438 13600697 13439738
5310 13439738 13460454 13374096 12616996 12026748 11929023 11950006 11801274 11821402 11814083 11781120 11644198
5299 11644198 11417499 10900096 10631323 10747645 10840335 9706406 9335246 9834652 9824320 9800289
5289 9800289 9245242 8525827 8548159 7860621 8454773 9142115 9262694 8827080 8407358 8828709
5279 8828709 8408343 8372708 8754269 8742477 8264548 7462296 7949245 7475968 7408124 7911382
5269G911382L25378j113809j81315J3708m82579J75641N99749k8141k56503j18027
5259F845484J1524J95225K86016l09200J17478L34615m85729Q1684M50931l67184
5249G160844r1382m33138k5156l46730J84334M00050L10997k5821K41443l04492
5239G070949k22166L38765K71037K80518k85030Q8271J78901j71208Q4331j41939
5229G492429O14089j99508K4567J83350J03095m15004p46160J122361k02587L28618
5219H305250n22624l18095R40306Q98619j90828l53466K42137p1634n2145M04329
5209I281849L9311N14428j49482p6156j06260l7952L93502L69273N48646k40094
5199A0537065m45770O64055N18945l72916m2107M6065l92994N41559R84420O5860
$$ plain form
5269 7911382 8236760 7122951 6941636 6955344 6472765 6648406 7248155 7220014 6963511 6845484
5259 6845484 6857008 7052233 7338249 7029049 7146527 7481142 6995413 7077097 7528028 7160844
5249 7160844 7069462 6636324 6611168 6264438 6448772 6848822 7159819 7133998 7375441 7070949
5239 7070949 6848783 7187548 7458585 7739103 7454073 7542344 7721245 7550037 7634368 7492429
5229 7492429 8106518 7907010 7931577 8114927 8218022 7803018 7056858 8179219 7976632 8305250
5219 8305250 7782626 7464531 8404837 9303456 9112628 8759162 9001299 8929665 8877520 9281849
5209 9281849 9321160 9835588 9686106 9609950 9503690 9465738 9859240 10228513 10777159 10537065
5199 10537065 10091295 10755350 11274295 10901379 10859272 10905337 10512343 11053902 12038322 12104182
5189A2104182K8139L09358M14990K57135m22914M46985K24435O24379K90102l58396
5179A3918395J224030J40207J46159Q4557R52296m9266n9995P01410O24714p4895
5169A7607612L36744J095827M8668M92564M28497L3353R62933N12334J093562
5160B2612094Q11766Q47245O19038J85586k76801K33924M47681K64128J46285
5151B5890946P19802K54073J38928L59028L63861P58795L49753r14245P01277
5142B8622218N59014l44015M31844j2032J138875J58265R20236L50621Q12069
5133C2637095m0763J126534Q44878J891107K290314K161248K197813N79869k131232
5124D1556863l511465k995525k476711k505172j757931j280448j268697p17569
$$ plain form
5189 12104182 12132321 12441679 12856669 13113804 12690890 13137875 13362310 13986689 14276791 13918395
5179 13918395 15142425 15282632 15428791 15513348 16465644 16416378 16356383 17057793 17682507 17607612
5169 17607612 17944356 19040183 19088851 19581415 20009912 20043265 21006198 21518532 22612094
5160 22612094 23423860 24271105 24890143 25075729 24798928 25032852 25480533 25744661 25890946
5151 25890946 26610748 26864821 27003749 27362777 27726638 28485433 28835186 27920941 28622218
5142 28622218 29181232 28837217 29269061 29257029 30395904 30554169 31474405 31825026 32637095
5133 32637095 32596332 33722866 34567744 36458851 38749165 40910413 43108226 43688095 41556863
5124 41556863 38045398 35049873 32573162 30067990 28310059 27029611 25760914 25043345
5116B5043345o71933k96306o43079L1175o20336J13814P5278n78037N67899N10552
5106B3532372j7873q37631L92073N55686K52888O81377m86783L39164Q71160K37185
5096B5519618R34053J143745M88477J175691J102004J528000J889128J029150
5088C4809866K239576L075248K792368L195775M199083K260587J171178j52019
5080E3591662j393712k142470q73986j231909n77680m888o22470o09524l85597
5071D5749426m89469R6747k58864K8033O99619J225333Q55906J370402R45026
5062E0222159J156840J094627l71925K43217n09612n14903j021896l28346j266858
5053D8703303k90209j310471j61545n15456n15256n58594Q0955R7984n73198l66568
$$ plain form
5116 25043345 24371412 24075106 23432027 23463202 22842866 22956680 23031958 22453921 23021820 23532372
5106 23532372 23514499 22676868 23068941 23624627 23877515 24558892 24072109 24411273 25282433 25519618
5096 25519618 26453671 27597416 28085893 29261584 30363588 31891588 33780716 34809866
5088 34809866 37049442 40124690 42917058 46112833 50311916 52572503 53743681 53591662
5080 53591662 52197950 50055480 49181494 47949585 47371905 47367017 46744547 46135023 45749426
5071 45749426 45259957 45356704 45097840 45125873 45825492 47050825 47906731 49277133 50222159
5062 50222159 51378999 52473626 52101701 52344918 51835306 51320403 50298507 49970161 48703303
5053 48703303 48413094 47102623 46941078 46425622 45910366 45351772 45432727 45530711 44957513 44590945
5043D4590945k86698K34926o47740N04762m53415P75848L86582M17924N10821
5034D6033955N92231L75129J7691n7266M40776Q52224J58211L84213M22231J517475
5024E0736870K90851Q31659J283646J017207J059077J038066J610474J178954
5016E9046804J799340J628561J311338K278295K040281K902925K429606K792281
5008G6229431L074940L785796L120943M110926N248502N052913O089160P288120
5000A14000731Q679673Q843114J0489079J2000851J3664297J5987329J8799053
4993B02464127K1657882K5304253K8511112L2161320L6346867L8233415L8736914
4986D23415890L4199513K3241552N346733j5883687l2619243m1519168m3993470
$$ plain form
5043 44590945 44304247 44539173 43891433 44396195 43942780 44718628 45105210 45523134 46033955
5034 46033955 46626186 47001315 47019006 46961740 47402516 48254740 48412951 48797164 49219395 50736870
5024 50736870 51027721 51859380 53143026 54160233 55219310 56257376 57867850 59046804
5016 59046804 60846144 62474705 63786043 66064338 68104619 71007544 73437150 76229431
5008 76229431 79304371 83090167 86211110 90322036 95570538 100623451 106712611 114000731
5000 114000731 122680404 131523518 142012597 154013448 167677745 183665074 202464127
4993 202464127 224122009 249426262 277937374 310098694 346445561 384678976 423415890
4986 423415890 457615403 480856955 486203688 470320001 437700758 396181590 352188120
4979C52188120m1553071l7880520l2706949k6878078k2041125j7636268j4481972
4972A59010137j3183735j1147180p788321p585820o851975n498579n066955m091664
4964I7795908m425400l917420l010201l322702l152724l129728l007379j962937
4956G1867417j695829l125444k349826j554702k360064j136455j208756k359498
4948E6076843r33768r78025j757005j559770j308726j283743j384239j217060
4940D5654507j178355m13036q26211j64225m59857n02224q93528K5031l11874
4931D0930228J39034l63020J10627l30475o88342o38825l66262k32298n97459
4922C7963208k23682n3963l19817m08905j08337n17854J02401M40889j65802n46309
$$ plain form
4979 352188120 310635049 272754529 240047580 213169502 191128377 173492109 159010137
4972 159010137 145826402 134679222 126890901 119305081 112453106 106954527 101887572 97795908
4964 97795908 93370508 89453088 86442887 83120185 79967461 76837733 73830354 71867417
4956 71867417 70171588 67046144 64696318 63141616 60781552 59645097 58436341 56076843
4948 56076843 55143075 54165050 52408045 50848275 49539549 48255806 46871567 45654507
4940 45654507 44476152 44063116 43236905 43072680 42612823 42110599 41217071 41242102 40930228
4931 40930228 41069262 40706242 40816869 40486394 39798052 39159227 38792965 38560667 37963208
4922 37963208 37739526 37685563 37365746 36956841 36848504 36330650 36433051 36873940 36708138 36161829
4912C6161829j48278r46145j193597k05099l49555n88021l3112j075006L60727
4903C1983743k20831J17578L92404Q3293Q33539O58170j13157O31972M41496N98594
4893C5406801O05264L42601L22337N01249J106074J090422J241305J345519J407944
4884D3369516N14673J337285J774128J647945R45739J866895L425040K484495
4876E7365716J845379K775709L727018L471489M616004N076898N910239O077310
4868I0865762P346883R541414J0099718J3127348J4279991J4524333J2542956
4861A72328405M521169m887684j2548841j2427907j0714315p330444m920341k491681
4853A21528361N592J762895K441708N132252N235685O660710Q370498R722623
$$ plain form
4912 36161829 36013551 35067406 33873809 33668710 33319155 32731134 32698022 31623016 31983743
4903 31983743 31762912 31880490 32272894 32356187 33189726 33847896 33734739 34366711 34808207 35406801
4893 35406801 36012065 36354666 36677003 37178252 38284326 39374748 40616053 41961572 43369516
4884 43369516 43884189 45221474 46995602 48643547 49589286 51456181 54881221 57365716
4876 57365716 59211095 61986804 65713822 69185311 73801315 78878213 84788452 90865762
4868 90865762 98212645 107754059 117853777 130981125 145261116 159785449 172328405
4861 172328405 176849574 171961890 159413049 146985142 136270827 128940383 124020042 121528361
4853 121528361 121533953 123296848 125738556 130870808 136106493 142767203 151137701 160860324
4845A60860324J2717213J4546913J4989528J6673294J8799645K3231393K9312054
4838B91130364L5979549M1711914M1693913K5655664n113439l5403966n0442298
4831C45211701m8767504m2695754l4976417k7024605k1860248j7951187j3084565
4824A38851421j1149013r291458q414852o911625n787319n706937m147368l904361
4816H3538488l197690j906295k146396j415690j549374k30215q06942n78052j285308
4807G0422526l224758l742360l627387k397010k926837k428285k270660k133508
4799D7671721j608097k567007j877941k408074k011082j994951j433621j134620
4791C2636328j609595j254063j157453q53636r95507o52324p85472k14753q02037
$$ plain form
4845 160860324 173577537 188124450 203113978 219787272 238586917 261818310 291130364
4838 291130364 327109913 368821827 410515740 436171404 431057965 395653999 345211701
4831 345211701 296444197 253748443 218772026 191747421 169887173 151935986 138851421
4824 138851421 127702408 118410950 109996098 103084473 97297154 91590217 87442849 83538488
4816 83538488 80340798 78434503 76288107 74872417 73323043 73092828 72285886 71707834 70422526
4807 70422526 67197768 63455408 59828021 57431011 54504174 52075889 49805229 47671721
4799 47671721 46063624 43496617 41618676 39210602 37199520 35204569 33770948 32636328
4791 32636328 31026733 29772670 28615217 27761581 26766074 26113750 25328278 25113525 24311488
4782B4311488r71254r17566p77716o21209l75029p99317m08690k07666m32515
4773A8800526l02486q93464n15306J39327L07740n05102q27611Q866O82837k12511
4763A6682816r91054r86705Q7640p01138o30556K07476k48433q61849l20159o80511
4753A1557527L19552r30117L89262k33145m78916J50931l74222k47222J94295
4744A0347945j13132n20573j38771J10508r10704n22044O4762l36396l39187N7669
4734G700077n90937J67046p4868k12061l96393j048646O68897L97333m2459o0519
4724F507470J8290j29989J02898m4736n15423J9887r6989j62333J37312l77701
4714E458686R2545m17799K26491L14N07391j62458j10291K6187l43553J86925
$$ plain form
4782 24311488 23340234 22422668 21644952 21023743 20648714 19849397 19440707 19233041 18800526
4773 18800526 18498040 17604576 17089270 17228597 17536337 17031235 16203624 16212490 16895327 16682816
4763 16682816 15691762 14705057 14792697 14091559 13461003 13668479 13420046 12558197 12238038 11557527
4753 11557527 11877079 10946962 11336224 11103079 10624163 10775094 10400872 10153650 10347945
4744 10347945 10234813 9714240 9575469 9685977 8775273 8253229 8317991 7981595 7642408 7700077
4734 7700077 7109140 7276186 7201318 6989257 6592864 5544218 6213115 6610448 6567989 6507470
4724 6507470 6525760 6395771 6498669 6453933 5938510 5958397 5861408 5699075 5836387 5458686
4714 5458686 5551231 5133432 5359923 5360237 5867628 5705170 5594879 5621066 5277513 5464438
4704E464438p062J57919M83449K47920J40307n12035K66890J95805p7288J29493
4694F489836p1434p11899K10579O10521O1350l22533L76835J18089p85358Q9853
4684F065839N1919M07333m22321k93827K87464k36693N4560K41098j71185k19053
4674E765134j67364P1590L32314L94780l42271L93446j09190P22277M32579M97466
4664G990761J66771j182663p1116m24279L94736M20952l21939l96545O02011Q07631
4654G986320J3618j37217K52995L3369O2731j0209O53367p3264N47945M01040
4644I730695k84747O51018Q50372Q62059J260573M67444K087074J653842R51096
4635A8229426J315513j277421j289395j339766p89582l73593n98374j033982M79080
$$ plain form
4704 5464438 5457376 5615295 6098744 6346664 6486971 5974936 6241826 6437631 6360343 6489836
4694 6489836 6418402 5706503 5917082 6527603 6588953 6266420 6643255 6761344 5975986 6065839
4684 6065839 6117758 6525091 6102770 5808943 6096407 5859714 5914274 6155372 5984187 5765134
4674 5765134 5597770 5669360 6001674 6396454 6054183 6447629 6338439 7060716 7493295 7990761
4664 7990761 8157532 6974869 6903753 6479474 6874210 7295162 6973223 6576678 7178689 7986320
4654 7986320 7999938 7862721 8115716 8149085 8211816 8201607 8854974 8781710 9329655 9730695
4644 9730695 9445948 10096966 10947338 11809397 13069970 13537414 15624488 17278330 18229426
4635 18229426 19544939 18267518 16978123 15638357 14848775 14475182 13876808 12842826 13321906
4626A3321906P17919L6129Q95703J121818J054165J246335J201414J424393J822211
4617B2841993J536824P09097r53366k084898j753245j970821q89882o52026q80658
4608A5903018n26327k74575o87476j34259L41131q24825J69508N35674j7805l97295
4598A4086769p12133k96371j221207q95957L01310q31702l39571o55794N77681
4589A0013025k31380l34550l69791l86261n49403j23278N59273j297N51974J44902
4579I273214l21081l64866k34180J88630l47110J75044n60226N62246l76712J19785
4569H114744J85351L62588j81194m01447J50555L69345l34392N24543N30422m84938
4559H835577O44938M53124o46691n18298P18084P98814L23260l79020p2144j66470
$$ plain form
4626 13321906 14039825 14075954 14971657 16093475 17147640 18393975 19595389 21019782 22841993
4617 22841993 24378817 25087914 24134548 22049650 20296405 18325584 17435702 16783676 15903018
4608 15903018 15376691 15102116 14414640 14280381 14621512 13796687 13966195 14501869 14484064 14086769
4598 14086769 13374636 13078265 11857058 10961101 11262411 10430709 10091138 9435344 10013025
4589 10013025 9781645 9447095 9077304 8691043 8141640 8018362 8577635 8576338 9128312 9273214
4579 9273214 8952133 8587267 8353087 8541717 8194607 8369651 7809425 8371671 7994959 8114744
4569 8114744 8300095 8662683 8481489 8080042 8230597 8599942 8265550 8790093 9320515 8835577
4559 8835577 9480515 9933639 9286948 8768650 9486734 10285548 10608808 10229788 10157644 9991174
4549I991174K84598P4725m9050P4068J16310K07140N26061j77745O83246j53845
4539A1576682N97058m54511J62966n69316P11043J38418n9977j5695J80701L37068
4529A2604437N07868J66551l75853O93675L9532Q47520L8381K79634J33635k14721
4519A4720659p2179J141732K98812o79987J88015J55827L43020n22909n92802
4510A4980188r9384j96240j002311m93130m61215N10076k26569K51142j88417
4501A3074140n63412q9850j32091K89720k97858m9629j93479j114395O33939l070
4491A1554015j87557k50395n83552P7411J33270m32072l91418L66987k12696J0941
4481A0084934l65850j91277o29467m49843K14506J78359J66573l64718r251j63109
$$ plain form
4549 9991174 10275772 10350497 10301447 10375515 10491825 10698965 11225026 11047281 11730527 11576682
4539 11576682 12173740 11719229 11882195 11312879 12023922 12162340 12102363 12086668 12267369 12604437
4529 12604437 13112305 13278856 12903003 13596678 13636210 14483730 14522111 14801745 14935380 14720659
4519 14720659 14648480 15790212 16089024 15409037 15597052 15752879 16095899 15572990 14980188
4510 14980188 14880804 14684564 13682253 13189123 12727908 13237984 13011415 13262557 13074140
4501 13074140 12510728 12420878 12288787 12578507 12280649 12231020 12037541 10923146 11557085 11554015
4491 11554015 11366458 11116063 10532511 10609922 10743192 10311120 9919702 10286689 10073993 10084934
4481 10084934 9719084 9527807 8898340 8448497 8663003 8841362 9007935 8643217 8633966 8470857
4471H470857l69297m7501m58230K07013r3528k11056M02771p55101L7112K95602
4461G478642O9700m31247J86824L7647l72640m49946p38232J37560j03519O60450
4451F475239J54696n95036L30521n69047L6180m77066j83452J5931n71068k65465
4441D351433l7863J71744M19837l37549L16437r4351j77972P76843j039480j02704
4431D246375N6269j22094m62057o5925p7047K71616n50119P20991r44183o5372
4421C008454j12917j86402O34175k47517r7586j62907l57571N71535N4220K73131
4411C376615n17171O15873l80809p62365M04712p0896J41859j06355p2023R2055
4401B721495l53008j05675K0983L35148l38633m33912L95234M20344j97502l14333
$$ plain form
4471 8470857 8101560 8054059 7595829 7802842 7709314 7498258 7901029 7145928 7183040 7478642
4461 7478642 7548342 7117095 7303919 7341566 6968926 6518980 5780748 5918308 5814789 6475239
4451 6475239 6629935 6034899 6365420 5796373 5832553 5355487 5172035 5187966 4616898 4351433
4441 4351433 4313570 4485314 4905151 4567602 4884039 4789688 4611716 5388559 4349079 4246375
4431 4246375 4302644 4180550 3718493 3652568 3575521 3847137 3297018 4018009 3073826 3008454
4421 3008454 2895537 2709135 3343310 3095793 2998207 2835300 2477729 3049264 3103484 3376615
4411 3376615 2859444 3475317 3094508 2332143 2736855 2665959 2807818 2701463 2629440 2721495
4401 2721495 2368487 2262812 2283795 2618943 2280310 1846398 2241632 2661976 2464474 2150141
4391B150141m93288N25798J07216m8363m64853M60872j38628Q6716J15149K90187
4381B590947l83723j023158N07589k87761j66290J160O48786J86835o62404m48204
4371I63777O15676q9049N14347o62892p4507L11894j6099j34683K20576l58729
4361A290311j9906K30810n3441j76190m6457J08832K08736K83985m70094l40625
4351A015961M3325o7938L9636j36906K29595J86542k74079k64969j44392L5170
4341F61945l44344j13676P15408J41166o1868J99297N87217q70468o0291m79735
4331C74651L42388Q24964n82650l95036l9117n5032J20862N74421l03112O3497
4321I25836n08301O76981P19287p35588j66545n2030M49904q67160O01756Q0119
$$ plain form
4391 2150141 1656853 2182651 2289867 2241504 1776651 2237523 2098895 2185611 2300760 2590947
4381 2590947 2207224 1184066 1691655 1403894 1237604 1238764 1887550 2074385 1411981 963777
4371 963777 1579453 1490404 2004751 1341859 1267352 1579246 1563147 1428464 1649040 1290311
4361 1290311 1270405 1501215 1447774 1271584 1225127 1333959 1542695 1826680 1356586 1015961
4351 1015961 1059286 991348 1030984 894078 1123673 1310215 1036136 771167 626775 661945
4341 661945 317601 203925 919333 1060499 998631 1197928 1785145 914677 854386 374651
4331 374651 717039 1542003 959353 564317 525200 470168 591030 1165451 862339 925836
4321 925836 417535 1094516 1813803 1078215 911670 859640 1309544 442384 1044140 1124259
4311A124259o50575O5867o24118J87440J075268J03523l07817k87616J77220N4428
4301I17879n77226R25475L44094p10769L1950R0294m00921K7630N8144J99609
4291I06159N9821j43567j08967m39105j4642P06266m48935K07305L19198l00159
4281G43374j40037q9974J27670J9266J301283l28592n62844j73299L26174l29444
4271H93577K59964k72148l63783J09799j69825N60996k26034k34519M8337n15612
4261I0752L63650J51476m60556k16375K1356L13296l66808Q08662j80l601l93843
4250C07829K38144O23501L0628n53483J48408J03533L05794n33235j84658j2916
4240D73545m99155L42181r3087M11052n31754k57814P23350k28810m23820R87522
$$ plain form
4311 1124259 473684 539551 -84567 102873 1178141 1281664 973847 686231 863451 917879
4301 917879 340653 1266128 1610222 899453 931403 1021697 620776 648406 706550 906159
4291 906159 965980 822413 713446 274341 259699 965965 517030 724335 1043533 743374
4281 743374 603337 513363 641033 660299 1961582 1632990 1070146 896847 1223021 893577
4271 893577 1153541 881393 517610 627409 457584 1018580 792546 558027 606364 90752
4261 90752 454402 605878 145322 -71053 -49697 263599 -103209 705453 705273 701672 307829
4250 307829 545973 1169474 1200102 646619 795027 898560 1204354 671119 486461 473545
4240 473545 -25610 316571 223484 634536 102782 -155032 568318 339508 -84312 903210
4230I03210j45106q26826K27116J40432L22922j28169N29038q5371r38475j7876
4220a9105O40504j95912o5472l09812P6006J52869K83548J21062n21624N5586
4210B17650M02445l45886J79059Q9078Q1639l19130l9402K33561K26016J69470
4200H94500k81091j44009j8701L05233p97304K6676J118347J1000K27602K62869
4190A605122k22139l27560p23315K97334m69848j55666K33395K20043o2263Q02257
4180A197360N7389P8447l30543J7059j74437o31591J5846O8604J41105K9680q3364
4169C85555O19226q3994m21086L65274N24723P0008o97680L75216J16270r0233
4159A163279k49681j026893J68528O15593l81466K2189J05204R5650k47603M31092
$$ plain form
4230 903210 758104 -68722 158394 298826 621748 493579 1022617 937246 -1229 -19105
4220 -19105 621399 425487 360015 50203 126209 279078 562626 683688 162064 217650
4210 217650 620095 274209 453268 542346 623985 304855 265453 499014 725030 894500
4200 894500 613409 469400 450699 755932 -41372 -14696 1103651 1114651 1342253 1605122
4190 1605122 1382983 1055423 332108 629442 159594 3928 237323 457366 395103 1197360
4180 1197360 1254749 1333196 1002653 1019712 845275 213684 229530 298134 439239 468919 385555
4169 385555 1004781 920787 499701 864975 1389698 1459706 762026 1137242 1253512 1163279
4159 1163279 913598 -113295 55233 670826 289360 311549 416753 512403 264800 695892
4149F95892l54080J85379J2934l47056L76753m71831k4113L09258o9750j34006
4139A79380N6382N50285l87703M18787m5377n4114N48572n28983r86429O74848
4129D25648l33787M26194k05976j65026k87461J88232L01041k48829l3430k29010
4119a62404J98297J71292k93690o0642N26874p78573P02294n64857K06797O95417
4109F40805M35746m47686k60456M01644k3108J4000l55829K02895O64451n69910
4099G02552j64305o02285L15798L00867l4519J2247n7767k77429j31307j03148
4089c9296p6602P39710J19368p3222m68240P6924L94681J33047P4655n44851J0556
4078C46730L00945J16341J31530k22681J93973k53181L43019N08745j61807m02392
$$ plain form
4149 695892 341812 527191 540125 193069 569822 97991 73878 383136 313386 179380
4139 179380 235762 786047 398344 817131 771754 717640 1266212 737229 -249200 425648
4129 425648 91861 518055 312079 147053 -140408 47824 348865 100036 66606 -162404
4119 -162404 35893 207185 -86505 -147147 379727 -398846 303448 -261409 -54612 640805
4109 640805 1076551 628865 368409 770053 746945 760945 405116 608011 1272462 702552
4099 702552 538247 -64038 251760 552627 518108 530355 472588 195159 63852 -39296
4089 -39296 -115898 623812 743180 669958 201718 278642 673323 806370 881025 336174 346730
4078 346730 647675 764016 895546 672865 866838 613657 956676 1465421 1303614 901222
4068I01222L64882J99125n54838j70266J7947N6304L06737J03853j76353l96137
4058F52476J04200K66371L02687m78378K78553n0169Q6580K23697r86127N69963
4048I69853M06308O2860k00687k21987k70005P2759K86746R50695n47276Q7516
4038A596782L9379k82789L43428K07280l03313J10047k7788l86880j02794N11715
4028A705067N45957K0480k60441l23667J80416M00869K71854l79774K63106L42106
4018B765973q49205O71998N66900k49797q7463o18690P84148M3696M48486K89194
4008C765240k93311j13667M32892J59478L33036p3538j12613R89608M76327p17323
3998D846129k43855R09038q22755R58498M75195l08128J86248J19026j60208M71482
$$ plain form
4068 901222 1266104 1465229 910391 740125 758072 814376 1121113 1224966 1048613 652476
4058 652476 756676 1023047 1325734 847356 1125909 1075740 1162320 1386017 399890 969853
4048 969853 1376161 1439021 1238334 1016347 746342 819101 1105847 2056542 1509266 1596782
4038 1596782 1636161 1353372 1696800 1904080 1600767 1710814 1683026 1296146 1193352 1705067
4028 1705067 2251024 2271504 2011063 1687396 1867812 2268681 2540535 2160761 2423867 2765973
4018 2765973 1916768 2588766 3155666 2905869 2818406 2199716 2983864 3027560 3476046 3765240
4008 3765240 3471929 3358262 3791154 3950632 4283668 4210130 4097517 5087125 5563452 4846129
3998 4846129 4602274 5511312 4688557 5647055 6122250 5814122 6000370 6119396 5959188 6430670
3988F430670O74813O78084R46506k26091O23344L54478J514172M04279K65945
3979A1666200O24222J123843J044811r6205k35935j182994j844494j234561o61714
3970I203173k37367j049793n00481L87610L9127L7518R9829L1807M2448N5402
3960H109273M0397J341730K54326K38444J420707J403340K335616J674677J494651
3951A8313161q07071k892463j950702j936574j817797m73158o85006n98353k66707
3942F885330q18936k1195k02266m23128n48038M82745J25735J53842O84710j40869
3932F177930N11558R80872J147720M80449K79303p38652p97753j032777r49874
3923F058776m38986j176238r63540m0157j49687l60082M9295j33013m41077o0781
$$ plain form
3988 6430670 7105483 7783567 8730073 8503982 9127326 9481804 10995976 11400255 11666200
3979 11666200 12290422 13414265 14459076 14362871 14126936 12943942 11099448 9864887 9203173
3970 9203173 8965806 7916013 7415532 7803142 7842269 7879787 7979616 8011423 8053871 8109273
3960 8109273 8149670 9491400 9745726 9984170 11404877 12808217 15143833 16818510 18313161
3951 18313161 17506090 14613627 12662925 10726351 8908554 8435396 7750390 7152037 6885330
3942 6885330 6066394 6045199 5842933 5419805 4871767 5354512 5480247 5634089 6318799 6177930
3932 6177930 6689488 7670360 8818080 9298529 9577832 8839180 8041427 7008650 6058776
3923 6058776 5619790 4443552 3480012 3439855 3290168 2930086 2979381 2846368 2405291 2344510
3913B344510K25409p66736k88783M7305o2659N09855o74104M158K06682l33847
3903A211790M00881M78183m42740q2514K38064m24715n48353M54619L2389p5567
3893A242037M92721J5845q1828J21243r66170j46129M59801K8021p76211p9248
3883C10082L93166M08871L1764k52768R9212o02066j87001J75065K7224L15784
3873G19333O0707o46095M07076m63492J89728J4445J8850M59207m98158r7953
3863A63648M3840L6324k45563R9017k05856p8574K21850p29J87847j78305M60565
3852E04064r43285M58163L16627M47435m24437Q912K15606j30326k97658J62275
3842C17376N4852J72219M80877m97396m31301k57783M63135J57819j94347k89964
$$ plain form
3913 2344510 2569919 1803183 1514400 1561705 1499046 2008901 1334797 1338955 1545637 1211790
3903 1211790 1612671 2090854 1648114 1565600 1803664 1378949 830596 1285215 1317604 1242037
3893 1242037 1734758 1750603 1668775 1790018 823848 677719 1137520 1165541 389330 310082
3883 310082 703248 1112119 1143883 891115 990327 388261 201260 376325 403549 719333
3873 719333 780040 133945 541021 77529 267257 281702 300552 759759 261601 163648
3863 163648 207488 243812 -1751 97266 -108590 -187164 34686 33957 221804 43499 504064
3852 504064 -439221 18942 335569 783004 358567 367479 583085 452759 155101 317376
3842 317376 372228 544447 1025324 527928 96627 -161156 301979 459798 265451 -24513
3832b4513k116j70258O9604r1432m85286N5666N91170J45455k77838k59134p8741
3821e27423P76799k22266J79791k01870J30685M73278j5625n96832l18977N0063
3811b72377J4767N0531J51047M26295k32383l86359Q80862J94453o60761K09047
3801C75122O1947m56365J94048J1058N9327m36956l32013K78851l27051K42064
3791c29968l81662P16126j05973k15373j69433O47968n83254K312P2598K21077
3781a25582M46511M1121j45060n1690j05294j19756J86659j92100L18835l67015
3771a13371M3531j69247L06859K66477J25261J69064J99141L41615n55368l24329
3761B89633k11701K14843L3136m17200K13608L5555k79547L5889N13820k28569
$$ plain form
3832 -24513 -26629 -196887 -127283 -218715 -704001 -648335 -57165 88290 -189548 -448682 -527423
3821 -527423 249376 27110 206901 5031 135716 608994 593369 -3463 -322440 -272377
3811 -272377 -257610 -207079 -56032 370263 137880 -248479 632383 826836 166075 375122
3801 375122 437069 -19296 174752 185810 245137 -191819 -523832 -244981 -572032 -329968
3791 -329968 -711630 4496 -101477 -316850 -486283 161685 -421569 -419257 -346659 -125582
3781 -125582 320929 362050 216990 165300 60006 -59750 126909 -65191 253644 -113371
3771 -113371 -69840 -239087 67772 334249 459510 628574 827715 1169330 613962 289633
3761 289633 77932 292775 325911 -91289 122319 157874 -121673 -85784 428036 199467
3751A99467k68234p1136P05584L17336L9031p9762k89321O51463O91816k65522
3741A630722m73724N77548m67423l03623J07705O7014j12308m83217Q35788J16506
3731A494988q40156Q3537M84250j34679o12834O02838M17337L13241q6491k0421
3721A701610o7905p40312j10663L5763M14499K75747k36649j29081q8214J38143
3711A192938p35988M46970M59621K84032O6188j5414K5914k84758j97168j46141
3701A096194L89196N14620O1822p52614k9569O20223n2312k78017n30914k31619
3691H07010L62087j13721k17947N60740m62538P1751M18155M5836p91667o70704
3681I002l51146J229394j68785q80282K00706P3726L1475M9448P2196N7342J39802
$$ plain form
3751 199467 -68767 -139903 565681 883017 922048 842286 552965 1204428 1896244 1630722
3741 1630722 1156998 1734546 1267123 963500 1071205 1138219 1025911 542694 1378482 1494988
3731 1494988 654832 738369 1222619 1087940 475106 1077944 1495281 1808522 1722031 1701610
3721 1701610 1633705 893393 782730 818493 1232992 1508739 1272090 1143009 1054795 1192938
3711 1192938 456950 903920 1363541 1647573 1713761 1698347 1724261 1439503 1242335 1096194
3701 1096194 1485390 2000010 2061832 1309218 1279649 1899872 1847560 1569543 1038629 807010
3691 807010 1169097 1055376 837429 1398169 935631 1007382 1425537 1471373 679706 9002
3681 9002 -342144 887250 718465 -161817 38889 112615 144090 193538 265734 323076 462878
3670D62878l54884M03449m64821l87035K48885n8403j33260K92414l18963P0070
3660b39670k65133M03226K4206P81747m20810o68181k60729Q5342L20105o00404
3650h40301L03907N31209J45937p9305J34016j71304L54218p83286M9845o5910
3640d20974K01149K04438q84822N9170M39186M11068l90688L1448n72372l03052
3630a225449O97941L06105k17811K74601N3353k92197K11380M19053p4849k05692
3620e3565j26066l4833L81888P7072p38990K23105m17907L76610M84330p35821
3610e64177N76565j61280n68948P4272J06194K97728m65665Q52907j29369k56245
3600b38018l98328N54954j77557k58624K14755M26016k08685j14812J19415j04934
$$ plain form
3670 462878 107994 511443 46622 -340413 -91528 -149931 -283191 9223 -309740 -239670
3660 -239670 -504803 -101577 -77371 704376 283566 -384615 -645344 -560002 -239897 -840301
3650 -840301 -536394 -5185 140752 61447 195463 24159 378377 -404909 -355064 -420974
3640 -420974 -219825 -15387 -900209 -841039 -401853 9215 -381473 -350025 -922397 -1225449
3630 -1225449 -527508 -221403 -439214 -164613 -111260 -403457 -192077 226976 152127 -53565
3620 -53565 -179631 -214464 167424 244496 -494494 -271389 -689296 -312686 171644 -564177
3610 -564177 12388 -148892 -717840 -643568 -537374 -239646 -705311 147596 18227 -238018
3600 -238018 -636346 -81392 -258949 -517573 -302818 123198 -85487 -200299 -80884 -185818
3590a85818L4226j56202M88082M0415M8438m16567n73516P55620l09494k83908
3580e58724M08658L68423l56871N0771j92606K87806l75754o72531R06298j37813
3570b72343m4410J56326l10862K0921K09567K48273j52868l70575L46376j35734
3560c05329r8373k2634L10856m5034m34424M097M67100l19528o0768M75256J26691
3549I7910K80557n428m18554P07078r76649O81499r19983L5470o55571K97404
3539h76267N18201J75971J08484q4051J86772q93207O7306q62876P05233P44109
3529b10325Q542o46453R8729O39795L2380K95587n62866L21046J12506J60697
3519B49638n04469j66922J97360L38575q27412j15891N901L79360l18435P02534
$$ plain form
3590 -185818 -151592 -307794 180288 220703 269141 -147426 -720942 34678 -274816 -558724
3580 -558724 -150066 218357 -138514 -87743 -280349 7457 -368297 -1040828 -134530 -272343
3570 -272343 -316753 -160427 -471289 -450368 -240801 7472 -145396 -515971 -169595 -305329
3560 -305329 -403702 -426336 -115480 -160514 -594938 -590841 -123741 -443269 -504037 -28781 97910
3549 97910 378467 373039 -45515 661563 -315086 366413 -553570 -518100 -1173671 -876267
3539 -876267 -358066 -182095 -73611 -157662 29110 -864097 -796791 -1659667 -954434 -210325
3529 -210325 -201783 -848236 -749507 -109712 -77332 218255 -344611 -23565 88941 249638
3519 249638 -254831 -421753 -224393 114182 -713230 -829121 -823220 -443860 -762295 -59761
3509e9761o75302j18959L86715J14123N52433m02617k6948R1428l63655P7320
3499d25223j04356k18492K64410k39465O1064N01321k08272K41433O82921l83479
3489A71862N831r46248Q14012j08335P4139j32425J21989m52089m11671L25142
3479e37793M16261q17772M2633m85028Q30878K77737j72865K63334L44289j97566
3469c5892l68022J55013P65123k6328p62666k44347M3176J28700j06458L8808
3459d12893m9675J58628M95924n02767l17875P32974l18344m31814P36032O3571
3449A53761K37951j10423k78556k20802n5748J86404j33790j48791O02303L13094
3439E45403o83821L37442j32175n01319n8219P23049j17836k69350J42182m87581
$$ plain form
3509 -59761 -735063 -854022 -467307 -353184 199249 -203368 -230316 -138888 -502543 -425223
3499 -425223 -529579 -748071 -483661 -723126 -662062 -160741 -369013 -127580 555341 171862
3489 171862 177693 -768555 45457 -62878 11261 -121164 825 -451264 -862935 -537793
3479 -537793 -121532 -939304 -896671 -1381699 -550821 -273084 -445949 -182615 161674 -35892
3469 -35892 -403914 -248901 516222 489894 -272772 -517119 -473943 -345243 -451701 -412893
3459 -412893 -462568 -303940 191984 -310783 -628658 104316 -214028 -645842 90190 153761
3449 153761 391712 281289 2733 -218069 -273817 -87413 -221203 -369994 232309 545403
3439 545403 -138418 199024 66849 -434470 -492689 230360 112524 -156826 -14644 -502225
3429e02225K34870k43042o3772M77251K15538J33997m7164K56079J96319n56576
3419A01275n85058L86522n62951J52768N31835J59589l19629L30152n88331j96513
3409e90341J9541K16542P2565n62861J01677J59791O12166L88207j98113l23183
3399a04009j11193L39237k27227j50103L9846l48299j19374N02017R9805P0761
3389h539o9061k82684O41781l77806J0438k0543J79873q83868k91203M96503K33836
3378c71273j66666K10939Q68395p57465L4277N03366l04269p04730L34687J39937
3368b12802k7462P31314p75213r09365L29217L31309K12312k62324O54144M1159
3358A12289j10097m464K10017J58126o87594j39484K55694j13102J14503k23965
$$ plain form
3429 -502225 -267355 -510397 -574169 -96918 118620 252617 205453 461532 657851 101275
3419 101275 -483783 -97261 -660212 -507444 24391 183980 -135649 194503 -393828 -590341
3409 -590341 -570800 -354258 -281693 -844554 -742877 -583086 29080 417287 219174 -104009
3399 -104009 -215202 124035 -103192 -253295 -213449 -561748 -681122 -179105 -79300 -8539
3389 -8539 -77600 -360284 281497 -96309 -85871 -106414 73459 -810409 -1101612 -605109 -371273
3378 -371273 -537939 -327000 541395 -216070 -181793 321573 17304 -687426 -352739 -212802
3368 -212802 -240264 491050 -284163 -1193528 -864311 -533002 -320690 -583014 71130 112289
3358 112289 2192 -2272 207745 365871 -321723 -461207 -205513 -318615 -204112 -428077
3348d28077j99060K68378K8825j40564M03099P3168K3920k0785m30762l246M06607
3337a8497L28655q7058K72299l14090m62313L64188K51385o16867Q9321K13640
3327B0663L83990n83585Q7474n7880J16977q90979J29156Q10046J15841Q29395
3317I61098k73209o57799k41994K85417m29131K49213L01439j5625l59199l65905
3307e45695j97005K00940L44920m20497M40074L60742n30260L19902M31755k26635
3297A78241o54621M87809J81129j35868L83884M40665q50809r4193O45246Q7911
3287F69394q49961L50459L25111k66265n65311l04730R90233k18335j33715k8606
3277c1726j34582K47644k68751M49172n08823K13705M27830K59981o4859p84276
$$ plain form
3348 -428077 -627137 -358759 -329934 -470498 -67399 5769 29689 8904 -421858 -425104 -18497
3337 -18497 310158 223100 495399 181309 -281004 83184 334569 -282298 -192977 20663
3327 20663 404653 -178932 -91458 -149338 -32361 -923340 -794184 15862 131703 961098
3317 961098 687889 30090 -211904 73513 -355618 -106405 195034 179409 -179790 -545695
3307 -545695 -742700 -541760 -196840 -617337 -177263 183479 -346781 -26879 404876 178241
3297 178241 -476380 11429 192558 56690 440574 881239 30430 -63763 581483 669394
3287 669394 -180567 169892 495003 228738 -336573 -641303 348930 130595 -3120 -31726
3277 -31726 -166308 81336 -187415 261757 -247066 -33361 394469 654450 589591 -194685
3267a94685J63544m71523J76997L80660l45048J78728M18555m78273K40917P7697
3257A47569k82027M47183N58533p99336O17051n86526J65627M51756l94814j83342
3247A41674j6994J43993q2649l2196j75482O8842O29522L81838o84722N2898l85854
3236D0870j23534j33656p9150K57583J27755M6752L04749J21909j09865j76807
3226B76606k26973N02085K36875n2829q6988K93226j91603r4942K2797k80807
3216C97447j78040R15622m2085J23951m69186j35940M89133M0412l94472O4281
3206H11123o10070J07871J24272N97024L39028J80342L2958k75928L95079p12417
3196I89282M54068M38516J30283o59905l56456N92245L07292J41494K17133J10194
$$ plain form
3267 -194685 -31141 -502664 -325667 54993 -290055 -111327 307228 -171045 69872 147569
3257 147569 -134458 312725 871258 71922 688973 102447 268074 719830 325016 141674
3247 141674 124680 268673 186024 153828 -21654 47188 676710 1058548 373826 426724 40870
3236 40870 -82664 -216320 -295470 -37887 89868 136620 441369 563278 453413 276606
3226 276606 49633 551718 788593 735764 648776 942002 750399 655457 678254 397447
3216 397447 219407 1135029 1092944 1216895 747709 611769 1100902 1141314 746842 811123
3206 811123 201053 308924 433196 1030220 1369248 1549590 1582548 1306620 1701699 989282
3196 989282 1443350 1881866 2012149 1352244 995788 1588033 1895325 2036819 2253952 2364146
3186B364146m53567j50348Q61098m57129N9049J9770N83719O05404k86824M2965
3176C188283N18836K67043K03021k138o74520M09736J23006p9784Q34522j01419
3166D686586R57454l41627j40242M30350j72495M81934J22846N34461O00510k1297
3156G138480M06626R7079O36185K20010P10823O86876N34178K10699J054812N34005
3146A2229773P40183J102599R99690J496075K017162J216398K083852J763095
3138B3648827K448550K923596K891244L526552L897852N597118O907241R432776
3130F1273756J2661630J5583764J5515182O341742j2782076j8248699j5531155
3123F4814144j2170663r161390p067996m977051l811000k472744k117386j629881
$$ plain form
3186 2364146 1910579 1760231 2621329 2164200 2223249 2243019 2826738 3432142 3145318 3188283
3176 3188283 3707119 3974162 4177183 4175045 3500525 3910261 4033267 3953483 4788005 4686586
3166 4686586 5644040 5302413 5162171 5592521 5420026 5901960 6024806 6559267 7159777 7138480
3156 7138480 7545106 7642185 8278370 8498380 9209203 9896079 10430257 10640956 11695768 12229773
3146 12229773 12969956 14072555 15072245 16568320 18585482 19801880 21885732 23648827
3138 23648827 26097377 29020973 31912217 35438769 39336621 44933739 51840980 61273756
3130 61273756 73935386 89519150 105034332 111376074 98593998 80345299 64814144
3123 64814144 52643481 43482091 36414095 31437044 27626044 25153300 23035914 21406033
3115B1406033j739847k161913q48756j448650j231489o10400n88720p19603n80806
3106A1475849r30551j044812l40862o87659q78697k50372K5023j37504m8631l6559
3096G145225o23417o72104p264J51642l79078R529j41460q09906J46730m98612
3086D321285l38002k71677J13999k73848l29928k42903K55750L969k43889K33932
3076C228688n26993k82636L13718m50538m58243l19604j60812L45745k63964P5600
3066A500961R3414k09627o85890o7323R70428J62140k80804R4478M5454L9831
3056A663062n47009L06767l82911P7689m02513J32080N82653o5568m3377J4001
3046A334874o72814j22088K25297q28056M15363K44402q1252K50812K53094l880
$$ plain form
3115 21406033 19666186 17504273 16655517 15206867 13975378 13364978 12776258 12056655 11475849
3106 11475849 10545298 9500486 9159624 8471965 7593268 7342896 7367919 7230415 7181784 7145225
3096 7145225 6521808 5849704 5842440 5994082 5615004 5624533 5483073 4673167 4819897 4321285
3086 4321285 3983283 3711606 3825605 3551757 3221829 2978926 3234676 3238645 2994756 3228688
3076 3228688 2701695 2419059 2732777 2282239 1823996 1504392 1343580 1689325 1425361 1500961
3066 1500961 1594375 1384748 698858 631535 1601963 1764103 1483299 1577777 1623231 1663062
3056 1663062 1116053 1422820 1039909 1117598 715085 847165 1429818 1364250 1320873 1334874
3046 1334874 662060 539972 765269 -62787 352576 596978 515726 766538 1019632 1015752
3036A015752L65881J09642n97692n33344P4952n83931j82573O89349k27479n93479
3026d62922L12068O69134j61185n73579J00207o4201P89367k733m58569m2878
3016A04709M91997j59533o51424m7795J05112k3347l12338J58003k87310K18061
3006d03865K16874Q10466m14871Q5761n64709K67699l20541p86143M87396L79463
2996b42470j29961M04752O12119j98601l83201p02764R1610J76645N1302k72798
2986e93367M60288M73731P6291l70116P8023N8786n16966k67794L93348k1532
2976b29308p8662q9258M04843k32966m27420R56043l83248n6249m899l3221N28213
2965C53868L84058j056682L06916J65675r06970J8455M78533j90066q6212P24441
$$ plain form
3036 1015752 1381633 1491275 893583 360239 435191 -148740 -331313 358036 130557 -462922
3026 -462922 -150854 518280 357095 -216484 -116277 -180478 608889 606156 147587 104709
3016 104709 596706 437173 -214251 -262046 -156934 -180281 -492619 -334616 -621926 -403865
3006 -403865 -186991 623475 208604 294365 -270344 -2645 -323186 -1109329 -621933 -242470
2996 -242470 -372431 32321 644440 445839 62638 -640126 -548516 -371871 -320569 -593367
2986 -593367 -133079 340652 416943 46827 124850 183636 -333330 -601124 -207776 -229308
2976 -229308 -307970 -397228 7615 -225351 -652771 303272 -79976 -136225 -141124 -174345 353868
2965 353868 737926 -318756 -11840 153835 -753135 -734680 -256147 -446213 -532425 192016
2955A92016m37946Q42580k40287q59111M10806P9393L41185k38898j49423M31609
2945C71924m31068K19672p8674k92504J06771J48093J25125j81812R0584L61580
2935D39691p15373r6503K06135n75749Q5451J09454M92634K24988p5522J90106
2925B85312j58744J03898m44689N25976l73493O45694J49295j088175Q488K13089
2915a33349l68464O51204J17693n04545K44552o8078J51159K49562l28656P3801
2905H4879k37011J20831J08284l96797N76414r96655K45021J048507l48481l85553
2895a80561k94300N53195J93295k11247N59271L1156l6168m99236N423j16578
2885D250r0404j06104p3076R9364k97579J81603p16425N45082M45663O99159j07831
$$ plain form
2955 192016 -245930 596650 356363 -502748 -91942 -12549 328636 89738 -59685 371924
2945 371924 -59144 160528 81854 -210650 -103879 44214 169339 -12473 78111 439691
2935 439691 -275682 -372185 -166050 -741799 -656348 -546894 -54260 170728 95206 285312
2925 285312 126568 230466 -214223 311753 -61740 583954 733249 -354926 -346438 -133349
2915 -133349 -501813 149391 267084 -237461 7091 -60987 90172 339734 11078 84879
2905 84879 -152132 -31301 76983 -319814 256600 -740055 -495034 553473 204992 -180561
2895 -180561 -474861 78334 271629 60382 619653 650809 614641 115405 120828 4250
2885 4250 -86154 -192258 -265334 -165970 -463549 -281946 -998371 -453289 -7626 691533 583702
2874E83702m05651o25570O579o110L55051j84733k3382R29007m02811K6000l39969
2863h7887R3406m32620J9352M06284m92571L00472k6364j83804L1646J22230M42251
2852A92395J3905n16935K38651n22282J22298L49587k26903N48889m73648N8964
2842b15079K36764R7917M78277p89408j1877J94756n57710J54053M69918K46341
2832C03952p55285l05746k8991N25018o5520N18622m04937n83492J8430M70248
2822c07701k30261k90841m2946O88145J64406j46339m63547l20241M31488L8550
2812d79287M58146m4732J76617j22752m21101J8195L73762L2845J66620j591p4664
2801H2058l9370n36032N44913J74994L13498n03551N71315n51018l55819L90639
$$ plain form
2874 583702 178051 -447519 -440940 -447050 -91999 -276732 -300114 628893 226082 252082 -87887
2863 -87887 5519 -427101 -407749 -1465 -494036 -193564 -219928 -403732 -372086 -249856 192395
2852 192395 206300 -310635 -71984 -594266 -471968 -122381 -349284 199605 -274043 -215079
2842 -215079 21685 119602 597879 -191529 -203406 -8650 -566360 -412307 57611 303952
2832 303952 -451333 -757079 -786070 -261052 -326572 192050 -212887 -796379 -777949 -307701
2822 -307701 -537962 -828803 -871749 -183604 -19198 -165537 -629084 -949325 -517837 -479287
2812 -479287 -21141 -65873 110744 -12008 -433109 -414914 -41152 -8307 158313 156722 82058
2801 82058 42688 -493344 51569 226563 540061 36510 607825 56807 -299012 91627
2791I1627m16730J69989J03247j3614J46372N2157k20405k19257N76642n87938
2781c17910k6666J35012L16879J75661j56377l48121R9223m21432M88427k70900
2771c26204M80686l52831j54827j52458j65564O42938k57288M01670m26405k08647
2761e18930r2555J051271p94322j23827j30765J09435n57602K31856M28733J19244
2751b77462L1266k78914N59545m1586J02510r1042n31681m96703O82378K69633
2741g2056n65729j83012J55015M64715J26254j48770k92155L78150k14851N03832
2731A51393o91591M04924L06768j54475n2712K46922K03408n43083K28091p62450
2721f62805j16294P87296J13115k56318k93695k47573j37270L24003O47869m5140
$$ plain form
2791 91627 -325103 -155114 -51867 -65481 80891 133048 -87357 -306614 270028 -317910
2781 -317910 -344576 -209564 107315 282976 126599 -221522 -122299 -543731 -55304 -326204
2771 -326204 154482 -198349 -353176 -505634 -671198 -28260 -285548 116122 -310283 -518930
2761 -518930 -611485 439786 -354536 -478363 -609128 -499693 -1057295 -825439 -396706 -277462
2751 -277462 -246196 -525110 34435 -7151 95359 4317 -527364 -1024067 -341689 -72056
2741 -72056 -637785 -820797 -665782 -201067 -74813 -223583 -515738 -137588 -352439 151393
2731 151393 -540198 -135274 171494 17019 -35693 211229 414637 -128446 99645 -662805
2721 -662805 -779099 8197 121312 -135006 -428701 -676274 -813544 -489541 158328 113188
2711A13188l53497R7936k49916J34609j39595O16378n5102j08509l31101P1429
2701b04180J71676M15622j97572m90803l39431K84570L02263j62856m55410N8887
2691f17234M6028m22984K59977P58037N3782J31418l43809k32005k23088l30793
2681i20671M00124m99844L07782M52333n95552j2852O84995p27046J03196Q21748
2671A4213k05963n4918j01666M38749K97112j52747m3155j4377k55594j25934
2661b04280N34518j70797n47532K88957J03148m13617J26466o26763O59508J34792
2651a15600m05636O55215M65828j39533m10780L07843p30936o21728K53213O20300
2641a21814M61846j18991k94577q40899J28453N34100M24973j7501m24386p54270
$$ plain form
2711 113188 -240309 -142373 -392289 -257680 -397275 219103 164001 55492 -275609 -204180
2701 -204180 -32504 383118 185546 -305257 -644688 -360118 -57855 -220711 -676121 -617234
2691 -617234 -571206 -994190 -734213 23824 77606 209024 -134785 -366790 -589878 -920671
2681 -920671 -520547 -1020391 -712609 -260276 -855828 -868680 -183685 -910731 -807535 14213
2671 14213 -191750 -246668 -348334 90415 387527 234780 191625 177248 -78346 -204280
2661 -204280 330238 159441 -388091 -99134 4014 -409603 -283137 -909900 -250392 -115600
2651 -115600 -521236 133979 599807 460274 49494 357337 -373599 -995327 -742114 -121814
2641 -121814 340032 221041 -73536 -914435 -785982 -251882 173091 155590 -268796 -1023066
2631a023066K43838j29014K92489J2237M54537K09405o26633K64028O03236p49984
2621d48927K81782k07307j64967L98656J49731j41202O5867K74117j54423M69877
2611E23204l32078k07805p31023O09632n30251K3927L09941k17013N03491M71721
2601D23746m16909K40644J25962j4210j20946l61314j20902K78604J01437R5301
2591B31413N76399n18715p09645k71027J35401j92507M83513q6728l83411n1055
2581g86362K22246J47680J4529K12949J24359l96807n36328P50714j02232J75997
2571a73255l35757K91874L96814k84685j23882P8892M0651l78501O09148j75526
2561e4227K58887j85089j11944r2170p273K69201R5056q30304j41362M24058r44
$$ plain form
2631 -1023066 -779228 -908242 -615753 -603516 -148979 60426 -566207 -302179 301057 -448927
2621 -448927 -167145 -374452 -539419 -140763 8968 -132234 -66367 207750 53327 523204
2611 523204 191126 -16679 -747702 -138070 -668321 -644394 -334453 -551466 -47975 423746
2601 423746 6837 247481 373443 359233 238287 -123027 -243929 34675 136112 231413
2591 231413 807812 289097 -420548 -691575 -556174 -748681 -265168 -351896 -735307 -786362
2581 -786362 -564116 -416436 -401907 -188958 -64599 -461406 -997734 -247020 -349252 -173255
2571 -173255 -509012 -217138 179676 -105009 -228891 -149999 -109348 -487849 121299 -54227
2561 -54227 204660 19571 -92373 -184543 -191816 77385 172441 -657863 -799225 -375167 -376111
2550c76111o5793j34837J61931M03542k7540L07537o30962J061843o31533O2051
2540A30128L70117J82695L84062n16042l11278k1424j39252k51508j26847K26124
2530g3225r3330N43630J04571j35384n34008m24464L74698K60438j64958J10429
2520c1603m5618J17346j19188k64831P84365n85914k35637M89573J81831j59272
2510A31052J79625K73307k64149j15279R0201m00289m31928k60084L53993K74820
2500a68731L29202n98287K6543L35408j51381m34784l2067k16796O63432M6139
2490b01322l02688M82268j49434k64073L7023O14165N73874m73264M85688j03179
2480F99058o36759m04240r2884M34671k27795L94460L14790R3415n19375P6492
$$ plain form
2550 -376111 -441904 -576741 -414810 -11268 -38808 268729 -362233 699610 68077 130128
2540 130128 500245 682940 1067002 550960 239682 218258 79006 -172502 -299349 -73225
2530 -73225 -166555 377075 481646 346262 -187746 -612210 -237512 22926 -142032 -31603
2520 -31603 -77221 40125 -79063 -343894 440471 -145443 -381080 108493 290324 131052
2510 131052 310677 583984 319835 204556 294757 -105532 -537460 -797544 -443551 -168731
2500 -168731 160471 -437816 -411273 -75865 -227246 -662030 -694097 -910893 -247461 -201322
2490 -201322 -504010 -21742 -171176 -435249 -398226 215939 789813 316549 802237 699058
2480 699058 62299 -341941 -434825 -154 -227949 166511 481301 574716 55341 131833
2470A31833L17106p92839N34112O638L7684l66335l59275j09115P49939p42411
2460e92663O87063j12388o01001L3512P46467r0238k65049P2399Q8372j72411
2450b05937l01326M0012M26227l0304n10903N87565K09975J1166o9807K13654
2440C70322p845k22639j83635l81979N2945l63972R41815o17670N9523M83132
2430A29997k00856J76678o11325P9435N87994K41014o92030M46902m18753J86124
2420g4820L4198j9582N83468K5762k24385K27798q04232J32954j73559K21702
2410g0696O07258o43115j45779N78058j39476m62302O0268M865M65203l45285
2400i1001K15109m15360n39631K49984M18603q4005j19762n8631k3701J25645
$$ plain form
2470 131833 448939 -343900 190212 196850 234534 -131801 -491076 -600191 149748 -592663
2460 -592663 94400 -17988 -618989 -585477 160990 70752 -194297 -121898 -33526 -205937
2450 -205937 -507263 -467251 -41024 -71328 -582231 5334 215309 226475 156668 370322
2440 370322 362477 139838 -43797 -425776 -372831 -736803 205012 -412658 -353135 129997
2430 129997 -70859 105819 -505506 -426071 161923 402937 -289093 157809 -260944 -74820
2420 -74820 -40622 -60204 523264 549026 324641 552439 -251793 -118839 -292398 -70696
2410 -70696 536562 -106553 -252332 325726 186250 -276052 -215784 -210919 254284 -91001
2400 -91001 124108 -291252 -830883 -580899 -162296 -246301 -366063 -424694 -448395 -322750
2390c22750J24207N2569M27663N76764r01662m89308l51422M13496J75590k87086
2380e81939N70113k76461l65604O93055L24719j81240Q6987m63489R2803M55681
2370C54625j84678O29510k25115o0822n26714j41704P85663M08585n03699M04726
2360I40377o84816o89631L77694K26277M196J71801q39214K02303k8276j40162
2350d59451J79509q6675J19721K34959R783J75989J33217m41224Q1736K71185
2340B18749j023125R8904N85667P2167m24846J55849Q210K73501L93729j21714
2330B37091p0182k99555L63777l69353M21204L0519k40350L50205o64274l67298
2320f08216N12132l01563k15649L93159J2006J95618P5712L16520J78729l71130
$$ plain form
2390 -322750 -198543 -145974 281689 858453 -43209 -532517 -883939 -470443 -294853 -581939
2380 -581939 -11826 -288287 -653891 39164 363883 182643 269630 -193859 -101056 354625
2370 354625 169947 799457 574342 513520 -13194 -154898 630765 1039350 535651 940377
2360 940377 255561 -434070 -56376 169901 174097 345898 -493316 -291013 -319289 -459451
2350 -459451 -279942 -366617 -246896 -11937 -2154 173835 307052 -134172 -52436 218749
2340 218749 -804376 -705472 -119805 -47638 -472484 -316635 -308425 -34924 358805 237091
2330 237091 166909 -132646 231131 -138222 282982 313501 73151 423356 -240918 -608216
2320 -608216 -96084 -397647 -613296 -220137 -208131 -12513 63199 379719 558448 187318
2310A87318k99669N05573m71579k88724K56677k35222K53414N60638m91454m28541
2300d51569L05579p6326k64613l51501N08558Q5769k869O94878M26586m67338
2290D07154n09928l58170K00559L91543j85816m98799J79646L1841J78167J87785
2280B3982m72759M58966M6676p54891L81698N06824P80197m93823L04643p06510
2270G5003l98776M22123N83110j80576m87897k72703K25698j90789o1466L37922
2260E1649m81144j79196J120322K11608o12404k27452j27208m49880M09193q8812
2250c73324J93611L74723q55169R56140m77296M00598l77682L25547j04210L31329
2240C94267n63805j077465O41542K51455N80635o4307J69526k87044l08691q82225
$$ plain form
2310 187318 -112351 393222 -78357 -367081 -110404 -345626 -92212 468426 -23028 -451569
2300 -451569 -145990 -222316 -486929 -838430 -329872 -244103 -246972 447906 874492 407154
2290 407154 -102774 -460944 -260385 131158 -54658 -553457 -373811 -341970 -163803 23982
2280 23982 -448777 10189 56865 -698026 -316328 190496 970693 476870 781513 75003
2270 75003 -323773 98350 681460 500884 12987 -259716 -34018 -224807 -286273 51649
2260 51649 -429495 -608691 511631 723239 110835 -116617 -243825 -693705 -284512 -373324
2250 -373324 -179713 195010 -660159 295981 -181315 219283 -158399 167148 62938 394267
2240 394267 -169538 -1247003 -605461 -354006 226629 162322 331848 44804 -263887 -1146112
2230a146112P55562O35070K05593l67688j18743M7558L06677o2428K45531p91537
2220b90517l46617Q26934J36041l04611n35721l1310M31762O3528J63127k78647
2210a66031k27113k01070K27387K1322P27943Q66418o27607j21496l62041K05924
2200C43636l55374m30829P03550L11284j39965j08022p22979J15083o0759M69071
2190A24696n51479J02287O37503m36413O92133m89665j28465l39226J40732L84775
2180A36878J08053N9163J32249M8400n28008R92253n0367n45629K5951l24177
2170E4766j40843M96255k74589J6126M7120l20063J35041l25727K0543M29131
2160A37760m16040O05805n3490K81146k57626j71415K19900l60330O3423J21037
$$ plain form
2230 -1146112 -390550 244520 450113 82425 -36318 11240 317917 255489 501020 -290517
2220 -290517 -637134 189800 325841 21230 -514491 -545801 -114039 -50511 112616 -166031
2210 -166031 -393144 -594214 -366827 -345505 382438 1248856 621249 499753 137712 343636
2200 343636 -11738 -442567 260983 572267 432302 324280 -398699 -283616 -344375 124696
2190 124696 -426783 -324496 313007 -123406 568727 79062 -49403 -388629 -247897 136878
2180 136878 244931 304094 436343 484743 -43265 948988 898621 352992 378943 54766
2170 54766 -86077 410178 135589 151715 198835 -121228 13813 -311914 -291371 137760
2160 137760 -278280 327525 274035 555181 297555 126140 346040 -14290 49133 170170
2150A70170k57635m688k1264j94430J70517m4232L55650m96057l66663J56612
2140e32020N78595L91988l61676k95582j68844k67562P99366j89648j1599L50831
2130B93849n00593O57576M8768j35664q4583l68554j89317O66055K41819k21368
2120D07988j19171J57367j99456l84344n03437l3920L7791L46208P20476k62484
2110A67018J54775p9908l27728J02357O1538k20162P3365R51020q66333n74552
2100e58610N50265M0105K1739k05964k31548P20228J90214n89663l00382Q2822
2090b80794M24975l579J95461l08536m51047O35609l29153K06775j23004O39303
$$ plain form
2150 170170 -87465 -92153 -113417 -307847 -137330 -181562 174088 -321969 -688632 -532020
2140 -532020 46575 438563 76887 -218695 -387539 -655101 144265 -45383 -56982 293849
2130 293849 -206744 450832 499600 363936 279353 -89201 -278518 387537 629356 407988
2120 407988 288817 446184 246728 -137616 -641053 -674973 -637182 -290974 429502 167018
2110 167018 321793 241885 -85843 16514 78052 -142110 -68745 882275 15942 -558610
2100 -558610 -8345 31760 53499 -152465 -384013 336215 526429 -63234 -363616 -280794
2090 -280794 144181 140602 336063 27527 -423520 212089 -117064 89711 -33293 606010
$$ [...]
##END NTUPLES=NMR SPECTRUM
##END=
