##TITLE=1H_EC-3316(II-2)X
 CDCl3
 8 sc, 
 25.11.2024
##JCAMPDX= 6.0         $$ Bruker NMR JCAMP-DX V2.0
##DATA TYPE= NMR SPECTRUM
##DATA CLASS= NTUPLES
##ORIGIN= UXNMR, Bruker Analytische Messtechnik GmbH
##OWNER= root
$$ XWIN-NMR		Version 3.5
$$ Mon Nov 25 14:23:09 2024 Russian Standard Time (UT+4h)  she@DPX200
##.OBSERVE FREQUENCY= 200.1315
##.OBSERVE NUCLEUS= ^1H
##.ACQUISITION MODE= SIMULTANEOUS
##.ACQUISITION SCHEME= undefined
##.AVERAGES= 8
##.DIGITISER RES= 18
##SPECTROMETER/DATA SYSTEM= spect
##.PULSE SEQUENCE= zg30
##.SOLVENT NAME= CDCl3
##.SHIFT REFERENCE= (INTERNAL, CDCl3, 0, 19.5136)
##AUDIT TRAIL= $$ (NUMBER, WHEN, WHO, WHERE, WHAT)
$$ ##TITLE= Audit trail, XWIN-NMR		Version 3.5
$$ ##JCAMPDX= 5.01
$$ ##ORIGIN= Bruker BioSpin GmbH
$$ ##OWNER= she
$$ F:/spectra/data/she/nmr/H-F/1/pdata/1/auditp.txt
$$ ##AUDIT TRAIL=  $$ (NUMBER, WHEN, WHO, WHERE, WHAT)
(   1,<2024-11-25 14:21:35.37 +0400>,<she>,<DPX200>,
      <created by zg, POWCHK disabled, PULCHK disabled
       configuration hash MD5:
       00 E9 B6 7A A2 85 ED C7 34 08 36 98 17 FE 4E 26
       data hash MD5: 16K
       51 45 28 8F B7 B6 57 74 33 0F 14 43 E4 7A 49 D7>)
(   2,<2024-11-25 14:21:38.60 +0400>,<she>,<DPX200>,
      <Start of raw data processing
       efp BC_mod = 2 LB = 0.24 FT_mod = 6 PKNL = 1 PHC0 = -26711.14 PHC1 = 21.78744 SI = 16K 
       data hash MD5: 16K
       85 5D 73 59 EC 8A 3C 02 AD 42 A8 3D 6C 57 B3 08>)
(   3,<2024-11-25 14:22:02.57 +0400>,<she>,<DPX200>,
      <pk PHC0 = 2.981959 PHC1 = -5.399999 
       data hash MD5: 16K
       85 FA 9E EC 14 39 80 30 FF 81 5F D4 8C 1D ED 8C>)
(   4,<2024-11-25 14:22:06.87 +0400>,<she>,<DPX200>,
      <abs ABSG = 5 
       data hash MD5: 16K
       19 35 A5 9F 6A 58 02 3F 81 BE 53 44 E5 8E 8B 6F>)
$$ ##END=
$$ 
$$ hash MD5
$$ F5 24 85 32 53 BB F6 0D BE AC A3 C5 91 93 37 E7
##$RELAX= 
##$RELAX= 
##$RELAX= 
##$RELAX= 
##$RELAX= 
##$RELAX= 
$$ Bruker specific parameters
$$ --------------------------
##$DU= <F:/spectra>
##$EXPNO= 1
##$NAME= <H-F>
##$PROCNO= 1
##$TYPE= <nmr>
##$USER= <she>
##$AMP= (0..31)
100 100 100 100 100 100 100 100 100 100 100 100 100 100 100 100 100 100 
100 100 100 100 100 100 100 100 100 100 100 100 100 100 
##$AQSEQ= 0
##$AQ_mod= 1
##$AUNM= <au_zg>
##$AUTOPOS= <>
##$BF1= 200.13
##$BF2= 200.13
##$BF3= 200.13
##$BF4= 200.13
##$BF5= 200.13
##$BF6= 200.13
##$BF7= 200.13
##$BF8= 200.13
##$BYTORDA= 1
##$CFDGTYP= 0
##$CFRGTYP= 5
##$CHEMSTR= <none>
##$CNST= (0..31)
1 1 145 1 1 1 1 1 1 1 1 1 1 1 1 1 1 1 1 1 1 1 1 1 1 1 1 1 1 1 1 1 
##$CPDPRG= <>
##$CPDPRG1= <>
##$CPDPRG2= <>
##$CPDPRG3= <>
##$CPDPRG4= <mlev>
##$CPDPRG5= <mlev>
##$CPDPRG6= <mlev>
##$CPDPRG7= <mlev>
##$CPDPRG8= <mlev>
##$CPDPRGB= <>
##$CPDPRGT= <>
##$D= (0..31)
0 1.2 0 0 0 0 0 0 0 0.06 0 0.03 0 0 0 0 0.0002 0 0 0 0 0 0 0 0 0 0 0 0 
0 0 0 
##$DATE= 1732530094
##$DBL= (0..7)
120 120 120 120 120 120 120 120 
##$DBP= (0..7)
150 150 150 150 150 150 150 150 
##$DBP07= 0
##$DBPNAM0= <>
##$DBPNAM1= <>
##$DBPNAM2= <>
##$DBPNAM3= <>
##$DBPNAM4= <>
$$ [...]
##$SUBNAM3= <"">
##$SUBNAM4= <"">
##$SUBNAM5= <"">
##$SUBNAM6= <"">
##$SUBNAM7= <"">
##$SUBNAM8= <"">
##$SUBNAM9= <"">
##$SW= 24.0689530833862
##$SWIBOX= (0..15)
0 0 2 0 0 0 0 0 0 0 0 0 0 0 0 0 
##$SW_h= 4816.95568400771
##$TD= 16384
##$TD0= 1
##$TE= 0
##$TE2= 300
##$TE3= 300
##$TEG= 300
##$TL= (0..7)
0 120 120 120 120 120 120 120 
##$TP= (0..7)
150 150 150 150 150 150 150 150 
##$TP07= 0
##$TPNAME0= <>
##$TPNAME1= <>
##$TPNAME2= <>
##$TPNAME3= <>
##$TPNAME4= <>
##$TPNAME5= <>
##$TPNAME6= <>
##$TPNAME7= <>
##$TPOAL= (0..7)
0.5 0.5 0.5 0.5 0.5 0.5 0.5 0.5 
##$TPOFFS= (0..7)
0 0 0 0 0 0 0 0 
##$TUNHIN= 0
##$TUNHOUT= 0
##$TUNXOUT= 0
##$USERA1= <user>
##$USERA2= <user>
##$USERA3= <user>
##$USERA4= <user>
##$USERA5= <user>
##$V9= 5
##$VALIST= <valist>
##$VCLIST= <CCCCCCCCCCCCCCC>
##$VD= 0
##$VDLIST= <DDDDDDDDDDDDDDD>
##$VPLIST= <PPPPPPPPPPPPPPP>
##$VTLIST= <TTTTTTTTTTTTTTT>
##$WBST= 1024
##$WBSW= 4
##$XGAIN= (0..3)
0 0 0 0 
##$XL= 0
##$YL= 0
##$YMAX_a= 820441
##$YMIN_a= -439163
##$ZGOPTNS= <>
##$ZL1= 120
##$ZL2= 120
##$ZL3= 120
##$ZL4= 120
##$ABSF1= 19.49153
##$ABSF2= -4.577602
##$ABSG= 5
##$ABSL= 3
##$ALPHA= 0
##$AQORDER= 0
##$ASSFAC= 0
##$ASSFACI= 0
##$ASSFACX= 0
##$ASSWID= 0
##$AUNMP= <proc_1d>
##$AZFE= 0.1
##$AZFW= 0.1
##$BCFW= 0
##$BC_mod= 2
##$BYTORDP= 0
##$COROFFS= 0
##$CY= -3
##$DATMOD= 1
##$DC= 0
##$DFILT= <>
##$DTYPP= 0
##$F1P= 0
##$F2P= 0
##$FCOR= 1
##$FTSIZE= 16384
##$FT_mod= 6
##$GAMMA= 0
##$GB= 0
##$INTBC= 1
##$INTSCL= 2.524811e-10
##$ISEN= 128
##$LB= 0.24
##$LEV0= 0
##$LPBIN= 0
##$MAXI= 10000
##$MC2= 0
##$MEAN= 0
##$ME_mod= 0
##$MI= 1.114404
##$NCOEF= 0
##$NC_proc= -5
##$NLEV= 6
##$NOISF1= 3.799351
##$NOISF2= 2.8
##$NSP= 0
##$NTH_PI= 0
##$NZP= 0
##$OFFSET= 19.51357
##$PC= 1
##$PHC0= -26708.16
##$PHC1= 16.38744
##$PH_mod= 1
##$PKNL= yes
##$PPARMOD= 0
##$PSCAL= 0
##$PSIGN= 0
##$REVERSE= no
##$SF= 200.130003227348
##$SI= 16384
##$SIGF1= 3
##$SIGF2= 2
##$SINO= 5.538805
##$SIOLD= 16384
##$SREGLST= <1H.CDCl3>
##$SSB= 0
##$STSI= 16384
##$STSR= 0
##$SW_p= 4816.95568400771
##$SYMM= 0
##$S_DEV= 0
##$TDeff= 16384
##$TDoff= 0
##$TI= <>
##$TILT= no
##$TM1= 0
##$TM2= 0
##$TOPLEV= 0
##$USERP1= <user>
##$USERP2= <user>
##$USERP3= <user>
##$USERP4= <user>
##$USERP5= <user>
##$WDW= 1
##$XDIM= 16384
##$YMAX_p= 392155836
##$YMIN_p= -192348
$$ End of Bruker specific parameters
$$ ---------------------------------
##NTUPLES= NMR SPECTRUM
##VAR_NAME=  FREQUENCY,     SPECTRUM/REAL,   SPECTRUM/IMAG
##SYMBOL=    X,             R,               I
##VAR_TYPE=  INDEPENDENT,   DEPENDENT,       DEPENDENT
##VAR_FORM=  AFFN,          ASDF,            ASDF
##VAR_DIM=   16384,         16384,           16384
##UNITS=     HZ,            ARBITRARY UNITS, ARBITRARY UNITS
##FACTOR=    0.29402158847633, 1,            1
##FIRST=     3905.25098428369, 0,            0
##LAST=      -911.704699724016, 0,           0
##MIN=       -911.704699724016, -192348,     0
##MAX=       3905.25098428369, 392155836,    0
$$ Real data points
##PAGE= N=1
##DATA TABLE= (X++(R..R)), XYDATA
$$ [...]
7669D343054j65008j02797j66411j29822j48224n1910r7948j28938j73200P482
$$ 4343054 4178046 4075249 3908838 3779016 3630792 3578882 3480934 3351996 3178796 3186278
7659C186278j10782j09769j04586k195o7833p8286m9510n6017p9624J0694l6269
$$ 3186278 3075496 2965727 2861141 2858946 2791113 2712827 2663317 2607300 2527676 2538370 2502101
7648B502101p8337n6738l5873J259l3323j22650L4203j0845n4308l0781j2172
$$ 2502101 2423764 2367026 2331153 2332412 2299089 2176439 2210642 2199797 2145489 2114708 2102536
7637B102536k5076M5171o9402l0307q9646N2808m2896L077m9120m7190j9186l3154
$$ 2102536 2077460 2122631 2053229 2022922 1933276 1986084 1943188 1946265 1897145 1849955 1830769 1797615
7625A797615p7337K3589j3135j0097p686o5475j2252n9466m673O3023n7666q3925
$$ 1797615 1720278 1743867 1730732 1720635 1712949 1647474 1635222 1575756 1571083 1634106 1576440 1492515
7613A492515O299r613L7482L7852p3223m2163M7959K711p630k3464O2205k4040
$$ 1492515 1498814 1489201 1526683 1564535 1491312 1449149 1497108 1499819 1492189 1468725 1530930 1506890
7601A506890O144j4565J5704m9565q3546m9485L4219N4971m5607r1903k7631o3473
$$ 1506890 1513034 1498469 1514173 1464608 1381062 1331577 1365796 1420767 1375160 1283257 1255626 1192153
7589A192153q22R315m6923m3932N1077p42l7984q3186L9414n603p2290L0801K6682
$$ 1192153 1191331 1200646 1153723 1109791 1160868 1160126 1122142 1038956 1078370 1072767 1000477 1031278 1057960
7576A057960j03959M8935L3457o462N910o734o7339p1078J3150N6480o6406n1684
$$ 1057960 954001 1002936 1036393 1029931 1035841 1029107 961768 890690 903840 960320 893914 842230
7564H42230J8249p3121P5247j7197m7931L2862q3035L6571p4173k9769n3573j4087
$$ 842230 860479 787358 862605 845408 797477 830339 747304 783875 709702 679933 626360 612273
7552F12273Q463k9009k6813L459K197L7671j4111n0415O6006m4137K8325j6356
$$ 612273 620736 591727 564914 568373 570570 608241 594130 543715 609721 565584 593909 577553
7540E77553q8709J1426Q213J111j1895J2050j4050N7971J9279l3051l1726q552
$$ 577553 488844 500270 508483 509594 497699 509749 495699 553670 572949 539898 508172 499620
7528D99620J0398J0035N4608r31L798l4385k4901p4103L2322J7693K2665Q333
$$ 499620 510018 520053 574661 573730 577528 543143 518242 444139 476461 494154 516819 525152
7516E25152M1699m4262L222O6134J8363n9363j0381J0825j4907q452p7127P423
$$ 525152 566851 522589 525811 591945 610308 550945 540564 551389 536482 528030 450903 458326
7504D58326J7341L6911P907K0495l5480j3760p621j0780M0474j8372K0300k141
$$ 458326 475667 512578 520485 540980 505500 491740 484119 473339 513813 495441 515741 513600
7492E13600J2949K0615J4482j9990K4196k6639j9580j3620q2198K3845Q3877O0524
$$ 513600 526549 547164 561646 541656 565852 539213 519633 506013 423815 447660 531537 592061
7480E92061k5224j22366j3365j9693K3821R18L6874K0471j4224j3355o800K8388
$$ 592061 566837 444471 431106 411413 435234 436152 473026 493497 479273 465918 459118 487506
7468D87506J884m7842O042J0608q577l5575P1496K5659p4520l0594J6340k2490
$$ 487506 489390 441548 447590 458198 449621 414046 485542 511201 436681 406087 422427 399937
7456C99937k0876N8493j0453L9112j16358k2036J8546m9859J6326j9793m3927
$$ 399937 379061 437554 427101 466213 349855 327819 346365 296506 312832 293039 249112
7445B49112K4935j1805Q936l0375O9281j8593q5354K4008m223K7062O6498n4403
$$ 249112 274047 262242 271178 240803 310084 291491 206137 230145 225922 252984 319482 265079
7433B65079j8522j588j7904j4815M576J2934n3113n2892Q9795j9608m5235K742
$$ 265079 246557 244969 227065 212250 216826 229760 176647 123755 213550 193942 148707 151449
7421A51449Q300j3864N7394j6520n8676k5402L595L5163l4644J4920n8688n816
$$ 151449 159749 145885 203279 186759 128083 102681 106276 141439 106795 121715 63027 57211
7409E7211K6615L5562m683M2058L9441j6548l3335m53o8864p8864J09259k5363
$$ 57211 83826 119388 114705 156763 196204 179656 146321 145868 77004 -1860 107399 82036
7397H2036M1476q63l4158l1582j4428L6964J2307m3777l6940Q7509k4057o2296
$$ 82036 123512 122649 88491 56909 42481 79445 91752 47975 11035 98544 74487 12191
7385A2191K338K0767K0057M7415o837k9639k8502M4101P268j0309l030L0654K1853
$$ 12191 14529 35296 55353 102768 95931 66292 37790 81891 89159 78850 75820 106474 128327
7372A28327j2088O521K3351m8451k2933J1878p2643l3398R5019L9260R0665q8444
$$ 128327 116239 122760 146111 97660 74727 86605 13962 -19436 75583 114843 205508 117064
7360A17064n0308J4921k6748m001J24550j6923n2469P581j9136k4760o399N1665
$$ 117064 66756 81677 54929 50928 175478 158555 106086 113667 94531 69771 63372 115037
7348A15037j6994q0087o398L5626j6502K6782j02933N9295L738M3703K8924k4717
$$ 115037 98043 17956 11558 47184 30682 57464 -45469 13826 17564 61267 90191 65474
7336F5474Q0291m7595o1948P9731K956n9904Q6799k3902q5682M8116Q569k8557
$$ 65474 145765 98170 36222 115953 118909 59005 145804 121902 36220 84336 92905 64348
7324F4348l0428K9497P6959q458K75n1587n6742L7233j2965K5192M1074m5076
$$ 64348 33920 63417 140376 131918 132193 80606 23864 61097 48132 73324 114398 69322
7312F9322L9090m4955K8107L983m4312P1488L6282p3319j1730J8959L4471m2312
$$ 69322 108412 63457 91564 95547 51235 122723 159005 85686 73956 92915 127386 85074
7300H5074q941L7483K3185J2034p180r921Q786j0812L2582m5500j981L2236j4033
$$ 85074 76133 113616 136801 148835 141655 131734 140520 129708 162290 116790 114809 147045 133012
7287A33012J7393R9569k4874k718q036O462L8254J8705l6420O6834R9156J4704
$$ 133012 150405 249974 225100 222382 214346 220808 259062 277767 241347 308181 407337 422041
7275D22041N4504o7517J3079R2719M5543l5027J20876Q6526P3704n2235K3544
$$ 422041 476545 409028 422107 514826 560369 525342 646218 732744 806448 754213 777757
7264G77757L1777P6304N5112R9181j32955M4687J25714j9791L0898Q0442K5847
$$ 777757 809534 885838 940950 1040131 907176 951863 1077577 1057786 1088684 1169126 1194973
7253A194973M1276J13141J05249O4454J48809J45237K62380K19983K08996J56342
$$ 1194973 1236249 1349390 1454639 1519093 1667902 1813139 2075519 2295502 2504498 2660840
7243B660840J94844K45174J44319J85952J26079J25445Q0859L7243q4930r2062
$$ 2660840 2855684 3100858 3245177 3431129 3557208 3682653 3763512 3800755 3715825 3623763
7233C623763j65735j89661k12289j83638l25851k15080j82418k41860j53112j10582
$$ 3623763 3458028 3268367 3056078 2872440 2546589 2331509 2149091 1907231 1754119 1643537
7223A643537j15034j41798k51331j49011o8193k2196J049p1578j9016j7526m1066
$$ 1643537 1528503 1386705 1135374 986363 918170 895974 897023 825445 806429 788903 747837
7212G47837l3532l6339l9418l8535l8081M5q9382O0133p9660j154o4007n4212
$$ 747837 714305 677966 638548 600013 561932 561977 472595 532728 453068 451914 387907 333695
7200C33695N7104L452r040n6818j19561n5507L2713K1846n863K4516l4561k1388
$$ 333695 390799 394251 385211 328393 208832 153325 186038 207884 202021 226537 191976 170588
7188A70588O5608o7000k5047L9461l0758J3675n1779k0074K5802N0357K6387k9162
$$ 170588 236196 169196 144149 183610 152852 166527 114748 94674 120476 170833 197220 168058
7176A68058k4058l3660O166j4897P0041j03741Q1626k5570n703k2065n1904o8913
$$ 168058 144000 110340 116506 101609 171650 67909 149535 123965 118262 96197 44293 -24620
7164b4620J6018J43244P679p8451K1517l3195M8518k6031j0861m585m7904n7204
$$ -24620 -8602 134642 142321 63870 85387 52192 100710 74679 63818 59233 11329 -45875
7152d5875L026R088J01650P0718o0713j2586q0117K6471l8682m6410Q2463M5075
$$ -45875 -42849 -33761 67889 138607 77894 65308 -14809 11662 -27020 -73430 9033 54108
7140E4108m3852l092o2630M2565m7978k68J3681P4520P7146m9781j8636K3363
$$ 54108 10256 7164 -55466 -12901 -60879 -61147 -47466 27054 104200 54419 35783 59146
7128E9146M2352l0282n4730R1072l0398o4725m3392j74K9312J9001L9040j25580
$$ 59146 101498 71216 16486 107558 77160 12435 -30957 -31131 -1819 17182 56222 -69358
7116f9358J7367N0676m1457N7187j817l9294m4468N7051L013R920O2250n8947
$$ -69358 -51991 -1315 -42772 14415 12598 -26696 -71164 -14113 -11100 -1180 61070 2123
7104B123L590l5316j03662K7689N7320P2556o0623P8124P9570j42356J1924M4291
$$ 2123 5713 -29603 -133265 -105576 -48256 24300 -36323 41801 121371 -20985 -9061 35230
7092C5230n8726M2353M4416k9493k0012k3836M347N6038j1270l6790J8946m6736
$$ 35230 -23496 18857 63273 33780 13768 -10068 -5721 50317 39047 2257 21203 -25533
7080b5533R3741n0903K268j7215j14312r322P8153j9792J0275N3982j4697L2899
$$ -25533 68208 17305 19573 2358 -111954 -121276 -43123 -62915 -52640 1342 -13355 19544
7068A9544J009k3230k8125J13529l1899j6384Q864m3546O9855j4905r9929j0821
$$ 19544 20553 -2677 -30802 82727 50828 34444 43308 -238 69617 54712 -45217 -56038
7056e6038J20811Q245k7059m3516O471m9797M9227L6833j6116p5465k425L3359
$$ -56038 64773 73018 45959 2443 8914 -40883 8344 45177 29061 -46404 -48829 -15470
7044a5470L2408j0604R333n1252P3163r1515q852P1469J4009p2829J9898J451
$$ -15470 16938 6334 15667 -35585 37578 -53937 -62789 8680 22689 -50140 -30242 -28791
7032b8791j6518J5291n357M0806m9194k382L3098L6429o2576r730J0159M347r465
$$ -28791 -45309 -30018 -35375 5431 -43763 -46145 -13047 23382 -39194 -48924 -38765 -34418 -43883
7019d3883k144l633M7789o7456L6915O6951n0153J988J4637j7559j1575o4623
$$ -43883 -46027 -49660 -1871 -69327 -32412 34539 -15614 -13626 1011 -16548 -28123 -92746
7007i2746J402P1077L7649m4635l0060m3559O2317J9545m9373K395J9541p4251
$$ -92746 -91344 -20267 17382 -27253 -57313 -100872 -38555 -19010 -68383 -65988 -46447 -120698
6995a20698K8952M6599K968m2820O718o9192P7122K8718j9957j1713n900K0410
$$ -120698 -91746 -45147 -42179 -84999 -78281 -147473 -70351 -41633 -61590 -73303 -79203 -58793
6983e8793J4897L804K7960m324J0736M0186j4463j09603n7559J15737J9855Q2459
$$ -58793 -43896 -40092 -12132 -16456 -5720 34466 20003 -89600 -147159 -31422 -11567 70892
6971G0892p3286L589L110j0826k2276k5355l9767N942O9374j4901N2953k5945
$$ 70892 -2394 1195 4305 -6521 -28797 -54152 -93919 -87977 -18603 -33504 19449 -6496
6959f496m3135n2708N8127M3608K7873r6333Q3980k5563k0491r805k918O8465
$$ -6496 -49631 -102339 -44212 -604 27269 -69064 14916 -10647 -31138 -40943 -43861 24604
6947B4604L5283k7330o0279L4823k0019p4340M2915K4573L5159j7594M7037L047
$$ 24604 59887 32557 -27722 7101 -12918 -87258 -44343 -19770 15389 -2205 44832 47879
6935D7879l4639M3528M1919p0184l2112k0629K1595P4660p6046k2903k4478O0258
$$ 47879 13240 56768 98687 28503 -3609 -24238 -2643 72017 -4029 -26932 -51410 8848
6923H848K6623O376k688J8776o4069N2267N1710r9062K1637N0140j1203r1350
$$ 8848 35471 41847 39159 57935 -6134 46133 97843 -1219 20418 70558 59355 -31995
6911c1995j4762N3617K1356m3754K3302j3196m1064J31118l7719q9196O4671j7447
$$ -31995 -46757 6860 28216 -15538 7764 -5432 -46496 84622 46903 -42293 22378 4931
6899D931m5232J9012L806k1613K8314R7171q9549j9608j9723M7248m6451N9210
$$ 4931 -40301 -21289 -17483 -39096 -10782 86389 -3160 -22768 -42491 4757 -41694 17516
6887A7516K9385m9228N7625J9456r1786l907o1089M8856N5965R845j6513q0651
$$ 17516 46901 -2327 55298 74754 -17032 -20939 -82028 -33172 22793 32638 16125 -64526
6875f4526J0617n311O6100n0814l3774j0876L3684P8552l4311j9832o303M6789
$$ -64526 -53909 -59220 6880 -43934 -77708 -88584 -54900 23652 -10659 -30491 -36794 9995
6863I995K4745K3059j04302M5806n7959J9896N6423M303N135N46K6626m1607n9946
$$ 9995 34740 57799 -46503 -697 -58656 -38760 17663 21966 27101 27647 54273 12666 -47280
6850d7280L541R8027n2070K632M671L692k284j1660l1670m5885K3599M5596l9861
$$ -47280 -43739 54288 2218 4850 9521 13213 10929 -731 -32401 -78286 -54687 -9091 -48952
6837d8952O4153M9681m7469k7724K0482J8757j1389M7521m8392J9183j2984o0409
$$ -48952 15201 64882 17413 -10311 10171 28928 17539 65060 16668 35851 22867 -37542
6825c7542k0555Q4160j0397l6699J5273p6567O8734N6394l7410l592j3810R6747
$$ -37542 -58097 26063 15666 -21033 -5760 -82327 -13593 42801 5391 1799 -12011 84736
6813H4736N343j896j03436k1457L0519p2426O8611j9811q730j75J0626P2933L931
$$ 84736 90079 88183 -15253 -36710 -6191 -78617 -10006 -29817 -38547 -38722 -28096 44837 48768
6800D8768k1644r200M784Q274p4655l706R5595L3580j2557p8119l8804J452J1707
$$ 48768 27124 17924 22708 30982 -43673 -47379 48216 81796 69239 -8880 -47684 -46232 -34525
6787c4525K7711j7129j7768j4348M5253k5807J02108o537L1873o1159o2364k8733
$$ -34525 -6814 -23943 -41711 -56059 -10806 -36613 65495 58958 90831 29672 -32692 -61425
6775f1425J09013J0584j69810J6313Q7161L0803L4580j35754o826L8154Q1521
$$ -61425 47588 58172 -111638 -95325 -8164 22639 57219 -78535 -85361 -47207 34314
6764C4314k5664K091L9676j54327M6131N5599K200l7692K3310K1927r391r8849
$$ 34314 8650 10741 50417 -103910 -57779 -2180 20 -37672 -14362 7565 -1826 -100675
6752a00675K2665m5018P2181k4306L0420j4887Q727P9197p10k0132p3852M1080
$$ -100675 -78010 -123028 -50847 -75153 -44733 -59620 -50893 28304 27594 7462 -66390 -25310
6740b5310l798K4169j9493L8570M758N8770o5937Q136R573o0667j0064m828o385
$$ -25310 -29108 -4939 -24432 14138 18896 77666 11729 19865 29438 -31229 -41293 -46121 -52506
6727e2506l936j6608M0603j4269l2914L2608l4618L7423n9634k6564J09286m8270
$$ -52506 -56442 -73050 -32447 -46716 -79630 -47022 -81640 -44217 -103851 -130415 -21129 -69399
6715f9399k3778R895O6249O2288m1919N1021j8018j6139o79r1254l9638R0549
$$ -69399 -93177 -83282 -17033 45255 3336 54357 36339 20200 19521 -71733 -111371 -20822
6703b0822J0028j7625J3553M1046J8929n3380J20918n7792j4402o4704j8176L0363
$$ -20822 -10794 -28419 -14866 26180 45109 -8271 112647 54855 40453 -24251 -42427 -12064
6691a2064m6191L696J0120L0236p3373J8210N8209L8516M6986J8852m6223r9059
$$ -12064 -58255 -54559 -44439 -14203 -87576 -69366 -11157 27359 74345 93197 46974 -52085
6679e2085M0640k2211R839n309J4129J0991K9020p2313K142R9333l6623O9448
$$ -52085 -11445 -33656 -23817 -29126 -14997 -4006 25014 -47299 -45157 54176 17553 87001
6667H7001n3974j3406K3233p0559p8934M6014Q758K8067L9499O772k0572J5747
$$ 87001 33027 19621 42854 -27705 -106639 -60625 -51867 -23800 15699 22471 1899 17646
6655A7646j1175L9222l3977J4895J5472n5598P5308p3748l4564P04O8697J3622
$$ 17646 6471 45693 11716 26611 42083 -13515 61793 -11955 -46519 -45815 22882 36504
6643C6504o2400L1568p8188K462K0957P3801r211j8578P7423K254o9812m6317
$$ 36504 -25896 5672 -72516 -70054 -49097 24704 15493 -3085 74338 76592 6780 -39537
6631c9537K662K7804n413L587q199K135l5062o4974J368O9277j6599O5457n915
$$ -39537 -36875 -9071 -14484 -10897 -19096 -16961 -52023 -116997 -115629 -46352 -62951 2506 -3409
6618c409j6243P4782j17227P1296L2723q0462K5283M9577q285j02699K8018N2878
$$ -3409 -19652 55130 -62097 9199 41922 -38540 -13257 36320 28035 -74664 -46646 6232
6606F232K1173L3311j8816o759k9084n9379K1318N225j2952N3356l708l9960L69
$$ 6232 27405 60716 41900 35141 6057 -53322 -32004 -26779 -39731 13625 9917 -30043 -29674
6593b9674m421J4374j6725j5697M5441K423k2081O0105k0105k0522Q194j4927
$$ -29674 -34095 -19721 -36446 -52143 -6702 -4279 -26360 33745 13640 -6882 1312 -13615
6581a3615K7430K8246l2198o3578M7362O1134p666k047j5413k354L1027L4853
$$ -13615 13815 42061 9863 -53715 -6353 54781 47115 45068 29655 27301 58328 93181
6569I3181l3956j8223j9127k159N0604k716m1599J8115k1311N1361P6013n8534
$$ 93181 59225 41002 21875 19716 70320 67604 26005 44120 22809 74170 150183 91649
6557I1649n8226l342q1231J74238l1749l6078L6749m0533K9772J2818O906q0557
$$ 91649 33423 30081 -51150 123088 91339 55261 92010 51477 81249 94067 100973 20416
6545B0416j7765R084m7001M1550L362l7498Q5016p955P314k4522K7401O677k5965
$$ 20416 2651 11735 -35266 6284 9646 -27852 57164 49209 56523 32001 59402 66079 40114
6532D0114K6257O575q9061M7805O5640J1121L2245m0650q1477M7887k02K3338
$$ 40114 66371 72946 -16115 31690 97330 108451 140696 100046 18569 66456 66254 89592
6520H9592j3208J6688K4412p9746l8688O4374j6870J488L4728j3613l4146J7819
$$ 89592 76384 93072 117484 37738 -950 63424 46554 48042 82770 69157 35011 52830
6508E2830k9872j357N7004k4742l4890L7827M0042K7292j3516n916q8185M1405
$$ 52830 22958 21601 78605 53863 18973 56800 96842 124134 110618 104702 16517 57922
6496E7922q659L6743K2079k9876j294O974J4992J2253l2836l6235P865J8392O1148
$$ 57922 49263 86006 108085 78209 76915 83889 98881 111134 78298 42063 49928 68320 129468
6483A29468l8024J3026j9568k2280J5504O6560n7877K1128k5659M858R2132l707
$$ 129468 91444 104470 84902 62622 78126 144686 86809 107937 82278 87136 179268 175561
6471A75561l2817l2735r062k4867J7820r102M1813L199o9088j0682N1444K4562
$$ 175561 142744 110009 100947 76080 93900 84798 126611 129810 60722 50040 101484 126046
6459A26046m5438k2448L4648N634n2260N8707l1985m0454P013O3424l0443O341
$$ 126046 80608 58160 92808 98442 46182 104889 72904 32450 39463 102887 72444 78785
6447G8785J37l3915K9860N8961R4800n7226r9729K8255r095J7032J3155r234O0837
$$ 78785 78922 45007 74867 133828 228628 171402 71673 99928 90833 107865 121020 111786 172623
6434A72623k5934k2559m3790j8859M9246R7N4666l7552K3703m9925o285j7614
$$ 172623 146689 124130 80340 61481 110727 110824 165490 127938 151641 101716 95431 77817
6422G7817L5759m7701R3314N5659k0887J6320o1025l6749M1548j9069K0646M2157
$$ 77817 113576 65875 159189 214848 193961 210281 149256 112507 154055 134986 155632 197789
6410A97789m7036K9724m1520L2040r2644J09271j4525k752P2667n0709p1650J5174
$$ 197789 150753 180477 138957 170997 78353 187624 173099 170347 243014 192305 120655 135829
6398A35829O9629J0938q9707L7652k842O7528K5790n3702J7525k61M6036r878
$$ 135829 205458 216396 126689 164341 161499 229027 254817 201115 218640 218379 264415 254537
6386B54537o7022L4468k8019M7791K3678K0291l2868j5806L4304M493p9143k5992
$$ 254537 187515 221983 193964 241755 265433 285724 252856 237050 271354 275847 196704 170712
6374A70712P1696l5334r9904J5982N6264N4846j14551K7023O3516K7804k8940
$$ 170712 242408 207074 107170 123152 179416 234262 119711 146734 210250 238054 209114
6363B09114L6748p438r9518K9594j7072m47N4660O165N6999p895l1953k97n806
$$ 209114 245862 238424 138906 168500 151428 150981 205641 211806 268805 260910 228957 228660 222854
6350B22854J21919q5526L4407m2887K8510j9642P181p1926Q4421K5429j0204K2235
$$ 222854 344773 259247 293654 250767 279277 259635 266816 194890 279311 304740 294536 316771
6338C16771j6626Q4913o0464j0716J3461O8825j7580k8507l8334K1703K1663N0698
$$ 316771 300145 385058 324594 313878 327339 396164 378584 350077 311743 333446 355109 405807
6326D05807Q7307p2789q6671K8971L2368n1982K5138L0646l8168l8123J07726
$$ 405807 493114 420325 333654 362625 394993 343011 368149 398795 360627 322504 430230
6315D30230l9942M5709J1853q0810P9569L9070n7835N1073j2592m4903M9048N8832
$$ 430230 390288 435997 447850 367040 446609 485679 427844 478917 466325 421422 470470 529302
6303E29302l2799m3590K0402K1446L9442q6440k1890R3603P3624J8052n071o8387
$$ 529302 496503 452913 473315 494761 534203 447763 425873 519476 593100 611152 606081 537694
6291E37694K6326K1326J8232m4601m4543L2175J5733L3185o9919l0783O010P7148
$$ 537694 564020 585346 603578 558977 514434 546609 562342 595527 525608 494825 500835 577983
6279E77983K8062n772m7590Q0319N3292m4745M4644l5831q1643L4333q3020R5668
$$ 577983 606045 600273 552683 633002 686294 641549 686193 650362 568719 603052 520032 615700
6267F15700k6513K3787k3046P670O3883l8449k5530J9143L5056p3482L6686P2172
$$ 615700 589187 612974 589928 597598 661481 623032 597502 616645 651701 578219 614905 687077
6255F87077o2690P653N5917l952k0279p380K084Q5453N5141k7276r9101M6912
$$ 687077 624387 632040 687957 684005 663726 656346 658430 743883 799024 771748 672647 719559
6243G19559O2503m4857K6211J479P6038q0470l8193o2951R5312J00794p8607K6056
$$ 719559 782062 737205 763416 764895 840933 760463 722270 659319 754631 855425 776818 802874
6231H02874L6296j4704L2701J1359l1900j8131O1588J7290l4858R5908K1443n8286
$$ 802874 839170 824466 857167 868526 836626 818495 880083 897373 862515 958423 979866 921580
6219I21580R806j9679M5272k2382J6149L9062R4187k6359m6777P0529K1928k0841
$$ 921580 931386 911707 956979 934597 950746 989808 1083995 1057636 1010859 1081388 1103316 1082475
6207A082475M9813n5968k5782J00528M3778l427O4069M2671J1196J9032J7412
$$ 1082475 1132288 1076320 1050538 1151066 1194844 1191417 1255486 1298157 1309353 1328385 1345797
6196A345797l606L0712L4105M811O2866J0236k8114J3546Q9087J2510M5665M3456
$$ 1345797 1342191 1372903 1407008 1411819 1474685 1484921 1456807 1470353 1559440 1571950 1617615 1661071
6184A661071M5808M0706p4473N1592N1191Q1512K0535j6276O4114M3261N0585
$$ 1661071 1706879 1747585 1673112 1724704 1775895 1857407 1877942 1861666 1925780 1969041 2019626
6173B019626O6179j9538Q3354M7166N9682Q2039Q1142Q8638J1437R6425N0769
$$ 2019626 2085805 2066267 2149621 2196787 2256469 2338508 2419650 2508288 2519725 2616150 2666919
6162B666919Q0409R3189j169J01541J08293J70194R5175P6903Q7027K06951J58032
$$ 2666919 2747328 2840517 2839348 2940889 3049182 3219376 3314551 3391454 3478481 3685432 3843464
6151C843464J43704J84114K13308J26922O4212J87509J92902J02708J12532Q382
$$ 3843464 3987168 4171282 4384590 4511512 4575724 4763233 4956135 5058843 5171375 5179757
6141E179757J32978J37847M1853J01439K26536J67524J21652J35097J87167K25856
$$ 5179757 5312735 5450582 5492435 5593874 5820410 5987934 6109586 6244683 6431850 6657706
6131F657706K76113L02948K94074L77001K81341J45132J56495K65418P3844N2556
$$ 6657706 6933819 7236767 7530841 7907842 8189183 8334315 8490810 8756228 8830072 8882628
6121H882628J61520O7672L3939J70312J83610J98853K31415K68021K37990K98346
$$ 8882628 9044148 9111820 9145759 9316071 9499681 9698534 9929949 10197970 10435960 10734306
6111A0734306K83294L57897M24429L38676K71969L43862L42266K60470K86352
$$ 10734306 11017600 11375497 11799926 12138602 12410571 12754433 13096699 13357169 13643521
6102A3643521L08783K08336J86625K79616J84540K95188L39042K10832K40010
$$ 13643521 13952304 14160640 14347265 14626881 14811421 15106609 15445651 15656483 15896493
6093A5896493K30726L30978L38334L51247L10754K29092L29717L96224L32583
$$ 15896493 16127219 16458197 16796531 17147778 17458532 17687624 18017341 18413565 18746148
6084A8746148M77921L94357N26852N26125N00215N49726O46260P31501P26008
$$ 18746148 19224069 19618426 20145278 20671403 21171618 21721344 22367604 23099105 23825113
6075B3825113P85308P12135Q85595Q98068Q27906Q95374R48836Q66636Q25392
$$ 23825113 24610421 25322556 26208151 27106219 27934125 28829499 29778335 30644971 31470363
6066C1470363P92015O99193O99975O99729P25732O46527O89304O74415P37369
$$ 31470363 32262378 32961571 33661546 34361275 35087007 35733534 36422838 37097253 37834622
6057C7834622O96044P92701P27706O63526O46003N83292L23676J90845N1998q1482
$$ 37834622 38530666 39323367 40051073 40714599 41360602 41943894 42267570 42458415 42510413 42428931
6047D2428931k80628m99961o11340o87497p90713p92846q43818r44591o67812
$$ 42428931 42148303 41648342 41037002 40349505 39558792 38765946 37922128 36977537 36309725
6038C6309725p91894q69077p58473p69568q65943r02544p71622r39282r35965
$$ 36309725 35517831 34648754 33890281 33120713 32254770 31352226 30580604 29641322 28705357
6029B8705357r66485j069486j008173j117912r60573r17956j024919r17896r70469
$$ 28705357 27738872 26669386 25661213 24543301 23582728 22664772 21639853 20721957 19751488
6020A9751488q61615p62076o30077o90458p18574o65169m64920n05707n75022
$$ 19751488 18889873 18127797 17497720 16807262 16088688 15423519 14958599 14452892 13877870
6011A3877870m85663m43489l82542l27400l13925m14305l52263k96482l18558
$$ 13877870 13392207 12948718 12566176 12238776 11924851 11510546 11158283 10861801 10543243
6002A0543243k50212l29981k26314j77315k69443k19195k28465k03945k58757
$$ 10543243 10293031 9963050 9736736 9559421 9289978 9070783 8842318 8638373 8379616
5993H379616k89133j80278j72737j79897k02169j75467j51344j66558j59896j37030
$$ 8379616 8090483 7910205 7737468 7557571 7355402 7179935 7028591 6862033 6702137 6565107
5983F565107j28237j65095j43972k16480j27627r4444j10282j71125j52234p1284
$$ 6565107 6436870 6271775 6127803 5911323 5783696 5689252 5578970 5407845 5255611 5184327
5973E184327o4541j61828p0566j99671j21744m4518j0382r2136k17894l9283m1452
$$ 5184327 5119786 4957958 4887392 4687721 4565977 4521459 4511077 4418941 4201047 4161764 4120312
5962D120312j37224o1740p7956l7517o6983j00920l1242n8133j04805m2187N223
$$ 4120312 3983088 3921348 3843392 3805875 3738892 3637972 3606730 3548597 3443792 3401605 3406828
5951C406828J0220j16363J125p1050Q712o7057q0821n3932o6239o2844N858L0953
$$ 3406828 3417048 3300685 3301810 3230760 3239472 3172415 3091594 3037662 2971423 2908579 2914437 2945390
5939B945390r1578n3526J6754l4376j20985M9832j497k904m9567n0443o098j01364
$$ 2945390 2853812 2800286 2817040 2782664 2661679 2711511 2710014 2707110 2657543 2607100 2601002 2499638
5927B499638J6437R480j1810l653J1329j7573l239j810j1596j3003p5402k3549
$$ 2499638 2516075 2525555 2513745 2510092 2521421 2503848 2500609 2498799 2487203 2474200 2398798 2375249
5915B375249k4585n2963j2177r4694L9763J14601r9496L9350l2507r0755O7713
$$ 2375249 2350664 2297701 2285524 2190830 2230593 2345194 2245698 2285048 2252541 2161786 2229499
5904B229499m9314N7897J2539j7932n0888j7765p7031R278p0444N8838K7558j282
$$ 2229499 2180185 2238082 2250621 2232689 2181801 2164036 2087005 2096283 2025839 2084677 2112235 2110953
5892B110953n2559P3899O294K3964l8765o1273N2480n5459M578L5303P587l6219
$$ 2110953 2058394 2132293 2138587 2162551 2123786 2062513 2114993 2059534 2064112 2099415 2107002 2070783
5880B070783O4247j11561J1189Q5677l9984n3678j6371l911M4152L270R4841o5722
$$ 2070783 2135030 2023469 2034658 2120335 2080351 2026673 2010302 2006391 2050543 2053813 2148654 2082932
5868B082932M3479K9978j8060j24808M0725P1457Q0562k7745n1150K4632J4394
$$ 2082932 2126411 2156389 2138329 2013521 2054246 2125703 2206265 2178520 2127370 2152002 2166396
5857B166396J6574m282L965Q5039l3747K0256J7925k841N2452K3218j7829k4552
$$ 2166396 2182970 2178688 2182653 2267692 2233945 2254201 2272126 2269285 2321737 2344955 2327126 2302574
5845B302574j3334l5034R7106o6917P3299P7360j26587O1994m937q8582J11398
$$ 2302574 2289240 2254206 2351312 2284395 2357694 2435054 2308467 2370461 2365524 2276942 2388340
5834B388340m5486N7249k7181j35245M2183J2643m788N7200n9498R1760M5862
$$ 2388340 2342854 2400103 2372922 2237677 2279860 2292503 2287715 2344915 2285417 2377177 2423039
5823B423039k930k5618l9744M7965l7064J11578p8738r503O5634r8315L898O9069
$$ 2423039 2420109 2394491 2354747 2402712 2365648 2477226 2398488 2388985 2454619 2356304 2360202 2429271
5811B429271l318Q886P8767j5142J2987K762L0398m3401p1669J8021j445L1396
$$ 2429271 2425953 2434839 2513606 2498464 2511451 2514213 2544611 2501210 2429541 2447562 2446117 2477513
5799B477513N1238q8553M8474J5275N1680Q9044j25178O5678L2996o0276m7549
$$ 2477513 2528751 2440198 2488672 2503947 2555627 2644671 2519493 2585171 2618167 2557891 2510342
5788B510342P7500J4084m320o8190P2010k0554N3215k6179N3061L9775P147k7044
$$ 2510342 2587842 2601926 2597606 2529416 2601426 2580872 2634087 2607908 2660969 2700744 2707891 2680847
5776B680847P8223j7004L9231J01874l1392j4671P2953l3817O0867Q1081J5800
$$ 2680847 2759070 2742066 2781297 2883171 2851779 2837108 2910061 2876244 2937111 3018192 3033992
5765C033992m5795N3087P5739Q0689K5887k1488J5632M7200J05242j5727N2759
$$ 3033992 2988197 3041284 3117023 3197712 3223599 3202111 3217743 3264943 3370185 3354458 3407217
5754C407217O2336L1211P1060L4084N9667R7731N784J18142J23973J5362P1079
$$ 3407217 3469553 3500764 3571824 3605908 3665575 3763306 3769090 3887232 4011205 4026567 4097646
5743D097646Q9418P7406R6267R4727J17704M7653J73464k226J25301J49927J28396
$$ 4097646 4187064 4264470 4360737 4455464 4573168 4620821 4794285 4792059 4917360 5067287 5195683
5732E195683J18446J73888J44715J91498J66826J88989K37621J44274J22236L17479
$$ 5195683 5314129 5488017 5632732 5824230 5991056 6180045 6417666 6561940 6684176 7001655
5722G001655J17306J40172K7985L7149J94636J22698J10648J70372J50785J01242
$$ 7001655 7118961 7259133 7287118 7324267 7518903 7641601 7752249 7922621 8073406 8174648
5712H174648K30641J82635K39258K46965L07837K76860L15887L33707L20657J81648
$$ 8174648 8405289 8587924 8827182 9074147 9381984 9658844 9974731 10308438 10629095 10810743
5702A0810743J41244J13430J05509R6885J49753J31660P3455J70920J83625K36986
$$ 10810743 10951987 11065417 11170926 11267811 11417564 11549224 11622679 11793599 11977224 12214210
5692A2214210K43995J50872K34262K44996K53292K36197K57950L66307L12037
$$ 12214210 12458205 12609077 12843339 13088335 13341627 13577824 13835774 14202081 14514118
5683A4514118L79042K52013K79857K89934L03782L05409K70411J98576L00991
$$ 14514118 14893160 15145173 15425030 15714964 16018746 16324155 16594566 16793142 17094133
5674A7094133L59523L72987L01319L70364L20926K90043L49869L64477L58172
$$ 17094133 17453656 17826643 18127962 18498326 18819252 19109295 19459164 19823641 20181813
5665B0181813L93113M11116L50991M26657M79325M64617N84560N14153L50541
$$ 20181813 20574926 20986042 21337033 21763690 22243015 22707632 23292192 23806345 24156886
5656B4156886N07680O26843O00003O45525P39357N58373O72992Q44735P46045
$$ 24156886 24664566 25291409 25891412 26536937 27276294 27834667 28507659 29352394 30098439
5647C0098439P16464Q59649R13312R59863R13126R47955R74623R05485R38889
$$ 30098439 30814903 31674552 32587864 33547727 34460853 35408808 36383431 37288916 38227805
5638C8227805R13652Q86067P25119Q47541P61041P40496P22673P75962Q23577
$$ 38227805 39141457 40027524 40752643 41600184 42361225 43101721 43824394 44600356 45423933
5629D5423933Q04868R11806R27702R66115J009384Q79819Q36132P70083O63069
$$ 45423933 46228801 47140607 48068309 49034424 50043808 50923627 51759759 52529842 53192911
5620E3192911N69012M05254J53565R2172o7779o7927j21924k21026k20963k09025
$$ 53192911 53761923 54167177 54320742 54412914 54345135 54277208 54155284 53934258 53713295 53504270
5610E3504270k11755j59191q3445j89552j08547k80477j69743k50950k72759k82696
$$ 53504270 53292515 53133324 53049879 52860327 52751780 52471303 52301560 52050610 51777851 51495155
5600E1495155m69163m44949n61198n76921n39263o45309p33587o55145p83589
$$ 51495155 51025992 50581043 50019845 49442924 48903661 48258352 47524765 46869620 46086031
5591D6086031q18287q42647o88278q24453p39725p49010p93424p83172q04444
$$ 46086031 45267744 44425097 43736819 42912366 42172641 41423631 40630207 39847035 39042591
5582C9042591p22147p49145p78243q70651p22598o44339q06987p02505o95484
$$ 39042591 38320444 37571299 36793056 35922405 35199807 34555468 33748481 33045976 32350492
5573C2350492p85948o36201p93958p49260o88104p10489o64000o32191o87581
$$ 32350492 31564544 30928343 30134385 29385125 28697021 27986532 27322532 26690341 26002760
5564B6002760o51913n46146n44816n25304n19224n73125l42741n07827l68481
$$ 26002760 25350847 24804701 24259885 23734581 23215357 22642232 22299491 21791664 21423183
5555B1423183m91158n58549l71994m48915m03022m07891l64927l93206l63176
$$ 21423183 20932025 20373476 20001482 19552567 19149545 18741654 18376727 17983521 17620345
5546A7620345l80696l02483k04125k21990k39667k75170k13948l11922l15812
$$ 17620345 17239649 16937166 16733041 16511051 16271384 15996214 15782266 15470344 15154532
5537A5154532l66549l19122l27733l75319m15535k37847j96826k18433k43197
$$ 15154532 14787983 14468861 14141128 13765809 13350274 13112427 12915601 12697168 12453971
5528A2453971k20529k35725q7837j78351j51605k28504r2238j86082j38039j46667
$$ 12453971 12233442 11997717 11909880 11731529 11579924 11351420 11259182 11073100 10935061 10788394
5518A0788394j33816j93142j16536n5577j78084r9397j12876n9316j59368j20288
$$ 10788394 10654578 10461436 10344900 10289323 10111239 10011842 9898966 9839650 9680282 9559994
5508I559994j819r4446r0198k1383k9026m6624j9128l9314j1616j72828P55J1043
$$ 9559994 9558175 9463729 9373531 9352148 9323122 9276498 9257370 9218056 9206440 9033612 9034367 9045410
5496I045410m8893O854R532J2500O5201J7384j5405P5133N8027O0032j8289k2421
$$ 9045410 8996517 9003371 9012903 9025403 9090604 9107988 9092583 9167716 9225743 9285775 9267486 9245065
5484I245065O7252J21547M1200J73448J44806Q1969J6213K12777K21500K06895
$$ 9245065 9312317 9433864 9475064 9648512 9793318 9875287 9891500 10104277 10325777 10532672
5474A0532672K24821K41818J30137K69509K30602K24451K40823J66288K64874
$$ 10532672 10757493 10999311 11129448 11398957 11629559 11854010 12094833 12261121 12525995
5465A2525995L64816L15999M37869N04266N99419P87590P98849R25305P87152
$$ 12525995 12890811 13206810 13644679 14148945 14748364 15535954 16334803 17260108 18047260
5456A8047260N35697K36070j66010m26105n61948q60161p68405o45064m92972
$$ 18047260 18582957 18819027 18653017 18226912 17664964 16804803 16036398 15391334 14898362
5447A4898362k97502j74710r8583r8782k8278j75775p4185r5976p1209r5041q0549
$$ 14898362 14600860 14426150 14327567 14228785 14200507 14024732 13950547 13854571 13783362 13688321 13607772
5436A3607772j11382l7833p4429m970p396R4935L1970J08276J51851J51746J84508
$$ 13607772 13496390 13458557 13384128 13379158 13371762 13466697 13498667 13606943 13758794 13910540 14095048
5425A4095048J82575J40098J89364J55404K5755R0723L5491J30988Q0415N705
$$ 14095048 14277623 14417721 14607085 14762489 14788244 14878967 14914458 15045446 15125861 15131566
5415A5131566J92232J01364J72948K33950J82562K30493K47509J24670J56890
$$ 15131566 15323798 15425162 15598110 15832060 16014622 16245115 16492624 16617294 16774184
5406A6774184R4540K51609J55601J92732L12882K58051K27145L56801M06013M64092
$$ 16774184 16868724 17120333 17275934 17468666 17781548 18039599 18266744 18623545 19029558 19493650
5396A9493650N25305M64750M68156N36655O31887O29072O92022O44749O80879
$$ 19493650 20018955 20483705 20951861 21488516 22120403 22749475 23441497 24086246 24767125
5387B4767125P13070P31451P02061P48397P42772P07791P35299P91132Q46093
$$ 24767125 25480195 26211646 26913707 27662104 28404876 29112667 29847966 30639098 31485191
5378C1485191P46238P57088Q13956Q15908P91227P44919Q35464Q17914Q00748
$$ 31485191 32231429 32988517 33802473 34618381 35409608 36154527 36989991 37807905 38608653
5369C8608653O92084P01247O89387P34515O02392N66684N43998M61838N33996
$$ 38608653 39300737 40001984 40691371 41425886 42028278 42594962 43138960 43600798 44134794
5360D4134794M96425M76377L36314M48956M24687M41371M73906K94120L33407
$$ 44134794 44631219 45107596 45443910 45892866 46317553 46758924 47232830 47526950 47860357
5351D7860357M00831K37191K31603K29299K59908K90514K09769K63718L35703
$$ 47860357 48261188 48498379 48729982 48959281 49219189 49509703 49719472 49983190 50318893
5342E0318893K76810K94065L21086M38796N36982M50561N24788N28653N59854
$$ 50318893 50595703 50889768 51210854 51649650 52186632 52637193 53161981 53690634 54250488
5333E4250488N81888O34717N93141O15890N88993N15018O35509M69254M49145
$$ 54250488 54832376 55467093 56060234 56676124 57265117 57780135 58415644 58884898 59334043
5324E9334043M12823K49847K18768M9683J67588L366j47216j93310k35455k66883
$$ 59334043 59746866 59996713 60215481 60265164 60432752 60436118 60288902 60095592 59860137 59593254
5314E9593254k84317l11943k74032k67619k32423k39298j52070k23132k42121
$$ 59593254 59308937 58996994 58722962 58455343 58222920 57983622 57831552 57608420 57366299
5305E7366299n4199k56647k23256j50735k42086k59813k76012l62362m19549m15743
$$ 57366299 57312100 57055453 56832197 56681462 56439376 56179563 55903551 55541189 55121640 54705897
5295E4705897m15236m43073n49651m79578n29307o36994o37344o92365o37649
$$ 54705897 54290661 53847588 53297937 52818359 52289052 51652058 51014714 50322349 49684700
5286D9684700o39066p13631p07523p44713o66033q43426q51028p26902q25139
$$ 49684700 49045634 48332003 47624480 46879767 46213734 45370308 44519280 43792378 42967239
5277D2967239q07676p95349q24538q24318r20134q02453q45683q36961r08815
$$ 42967239 42159563 41364214 40539676 39715358 38795224 37992771 37147088 36310127 35401312
5268C5401312p33760q54443p06330p71752p96010p40564p48058p18986o72661
$$ 35401312 34667552 33813109 33106779 32335027 31539017 30798453 30050395 29331409 28658748
5259B8658748p39980p06878p39140p14425o19433o99488n17977p04985o46176
$$ 28658748 27918768 27211890 26472750 25758325 25138892 24439404 23921427 23216442 22570266
5250B2570266o33300n29039n55443m68664m26925n63153m12999m14685l36478
$$ 22570266 21936966 21407927 20852484 20383820 19956895 19393742 18980743 18566058 18229580
5241A8229580l91947k98828k99304k80517k42880l11833k62046k69156l33138
$$ 18229580 17837633 17538805 17239501 16958984 16716104 16404271 16142225 15873069 15539931
5232A5539931k84645k03220k88403j92118k25233k72501k13086j34621j72321
$$ 15539931 15255286 15052066 14763663 14571545 14346312 14073811 13860725 13726104 13553783
5223A3553783k11184j01198j87101k43608j15919j98525j44110r6851l14744j32741
$$ 13553783 13342599 13241401 13054300 12810692 12694773 12496248 12352138 12255287 11940543 11807802
5213A1807802j13514j92859j21920j57478j85741q9887r0819q8158k1324j10682
$$ 11807802 11694288 11501429 11379509 11222031 11036290 10946403 10855584 10767426 10746102 10635420
5203A0635420M427j47321q6180k2654P996n2776n9755N2120q9737m7104M8868
$$ 10635420 10639847 10492526 10406346 10383692 10391688 10338912 10279157 10331277 10241540 10194436 10243304
5192A0243304J3512J1737K2701m7600M0761O6031j1972L1895j0492K5850O0425
$$ 10243304 10256816 10268553 10291254 10243654 10284415 10350446 10338474 10370369 10359877 10385727 10446152
5181A0446152L0315j6851N5193J42459K556Q4826J1489O0374M6945N8660J40327
$$ 10446152 10476467 10459616 10514809 10657268 10659824 10744650 10756139 10816513 10863458 10922118 11062445
5170A1062445J09936P8169L8096R3168Q6958J96122L7291J72873J18405P5018
$$ 11062445 11172381 11250550 11288646 11381814 11468772 11664894 11702185 11875058 11993463 12068481
5160A2068481Q3809O4802J57924J98516N9721L0508K22456J50939R2509R4264
$$ 12068481 12152290 12217092 12375016 12573532 12633253 12663761 12886217 13037156 13129665 13223929
5150A3223929J80425J55518J53760J50355K11109J73959J3936K27810J76540K47043
$$ 13223929 13404354 13559872 13713632 13863987 14075096 14249055 14262991 14490801 14667341 14914384
5140A4914384J99398J54839J96367K41846K16583K69062K89772L11049K80225
$$ 14914384 15113782 15268621 15464988 15706834 15923417 16192479 16482251 16793300 17073525
5131A7073525L07010M09285M73510M52319M00284N48602N58186N29412P97887
$$ 17073525 17380535 17789820 18263330 18715649 19115933 19664535 20222721 20752133 21550020
5122B1550020Q93922R74964Q95251R54654Q80626Q09106Q21819O69757L97330
$$ 21550020 22443942 23418906 24314157 25268811 26149437 26958543 27780362 28450119 28847449
5113B8847449K62086J12437m6738k91290l32049l60563l00517k37966k18282m7065
$$ 28847449 29109535 29221972 29175234 28883944 28551895 28191332 27890815 27652849 27434567 27387502
5103B7387502O1887J73077M07262N29640O63196Q75308J204415J508598K003760
$$ 27387502 27449389 27622466 28029728 28559368 29222564 30097872 31302287 32810885 34814645
5094C4814645K423893K705412K565243J912430Q53615l44187j516626k387437
$$ 34814645 37238538 39943950 42509193 44421623 45275238 44931051 43414425 41026988
5086D1026988k772386k684409k388403j762069j404550j057577p79385p83630
$$ 41026988 38254602 35570193 33181790 31419721 30015171 28957594 28178209 27394579
5078B7394579n61079n87779o35552o02389n87680n16858m46486m26397l78291
$$ 27394579 26833500 26245721 25610169 25007780 24420100 23903242 23456756 23030359 22652068
5069B2652068l33165k66940l31866k32299l33396j38923k13542k63222k03309
$$ 22652068 22318903 22051963 21720097 21487798 21154402 21015479 20801937 20538715 20335406
5060B0335406j44477j27378j27314j03063j47592j83417r7361j9033n2268n4585
$$ 20335406 20190929 20063551 19936237 19833174 19685582 19502165 19404804 19385771 19333503 19278918
5050A9278918j39797q7580R6385o0334n1374L9713P3730O6854J06116J25813J45548
$$ 19278918 19139121 19051541 19147926 19087592 19036218 19075931 19149661 19216515 19322631 19448444 19593992
5039A9593992J65337J03560K22427K43905J45222L32071M48950M17577M89941
$$ 19593992 19759329 19862889 20085316 20329221 20474443 20806514 21255464 21673041 22162982
5030B2162982O63920P22591P79464P75980Q66510O78291N10744K04197j4555m19671
$$ 22162982 22826902 23549493 24328957 25104937 25971447 26649738 27160482 27364679 27350124 26930453
5020B6930453n51009p50908q66668r14949q88331p73219o52076o70093o21127
$$ 26930453 26379444 25628536 24761868 23846919 22958588 22185369 21533293 20863200 20242073
5011B0242073l62069l68590k72366k60054k71740k18256j47158p264l3111R986
$$ 20242073 19880004 19511414 19239048 18978994 18707254 18488998 18341840 18334576 18301465 18311451
5001A8311451l2348m2185r2516R8714N5961Q6902J56502J49719J20653J63905
$$ 18311451 18279103 18236918 18144402 18243116 18299077 18385979 18542481 18692200 18812853 18976758
4991A8976758K85714K62080L31531L29519L76635K93569L28377M56005M87800
$$ 18976758 19262472 19524552 19856083 20185602 20562237 20855806 21184183 21640188 22127988
4982B2127988M76344N17316N68835N21182O28444O59200P21417P31500Q34149
$$ 22127988 22604332 23121648 23690483 24211665 24840109 25499309 26220726 26952226 27786375
4973B7786375P53778Q93756Q63335R12661J066701R24417J075938J053373J031493
$$ 27786375 28540153 29433909 30297244 31209905 32276606 33201023 34276961 35330334 36361827
4964C6361827J092674R68426J037475R74642Q53814Q26793Q35132P14006N64517
$$ 36361827 37454501 38422927 39460402 40435044 41288858 42115651 42950783 43664789 44229306
4955D4229306N65911M14308L37752J85912Q0227J15669J3308j60514l24694l21565
$$ 44229306 44795217 45209525 45547277 45733189 45813416 45929085 45942393 45781879 45457185 45135620
4945D5135620m36988n13656o28246o96018p72870q67502r04874j000993r54893
$$ 45135620 44698632 44184976 43556730 42860712 42087842 41220340 40315466 39314473 38359580
4936C8359580j008407j155321j037132q78319j070975j027238j053543j018700
$$ 38359580 37351173 36195852 35158720 34280401 33209426 32182188 31128645 30109945
4928C0109945q78098q73543q17276q36432q33875p20156o55780o76219p29417
$$ 30109945 29231847 28358304 27541028 26704596 25870721 25150565 24494785 23818566 23089149
4919B3089149n64042o19578n71928n26234m73710n14261m10667m80340m37291
$$ 23089149 22525107 21905529 21333601 20807367 20333657 19819396 19408729 18928389 18491098
4910A8491098m15339m23820l54270l40495k95671l26100l30812l15384k88718
$$ 18491098 18075759 17651939 17297669 16957174 16661503 16335403 16004591 15689207 15400489
4901A5400489k85292k16535k66048k76063k28788k33940j42042k24519j41291
$$ 15400489 15115197 14898662 14632614 14356551 14127763 13893823 13751781 13527262 13385971
4892A3385971j53567j31533j02857q7707O4940r7783n7617O1360R0205N3433Q185
$$ 13385971 13232404 13100871 12998014 12910307 12975247 12877464 12819847 12881207 12971412 13024845 13033030
4881A3033030m3101p9904n6534r4319o2103r3469p7953q1974p9026M3964P1888
$$ 13033030 12989929 12910025 12853491 12759172 12697069 12603600 12525647 12443673 12364647 12408611 12480499
4870A2480499m6852n516M1175J75467L4485L1728R0208R5151M6998P7168r878
$$ 12480499 12433647 12428131 12469306 12644773 12679258 12710986 12801194 12896345 12943343 13020511 13010633
4859A3010633R5501L9703m595j5650k9086r4271M8767l0257j5465L7070O3939
$$ 13010633 13106134 13145837 13141242 13125592 13096506 13002235 13051002 13020745 13005280 13042350 13106289
4848A3106289r644j6332k5224l9052q9774K1609m6309M556j27808j07140o6875
$$ 13106289 13096645 13080313 13055089 13016037 12926263 12947872 12901563 12906119 12778311 12671171 12604296
4837A2604296j38131j34346l2674j12157j19645j10079j11301l0890o3480q0470
$$ 12604296 12466165 12331819 12299145 12186988 12067343 11957264 11845963 11815073 11751593 11671123
4827A1671123j40389j23352m1968j38319P387r6248N096n5128o5477q5793o2007
$$ 11671123 11530734 11407382 11365414 11227095 11234482 11138234 11143330 11088202 11022725 10936932 10874925
4816A0874925O825k2823j5704l9039k1543r9601l9284q5382p7796K8214J0448
$$ 10874925 10881750 10858927 10843223 10804184 10782641 10683040 10643756 10558374 10480578 10508792 10519240
4805A0519240r995j9594K7183L9605Q0779m9960J06906K099M708J5741m6342L2670
$$ 10519240 10509245 10489651 10516834 10556439 10637218 10587258 10694164 10696263 10700971 10716712 10670370 10703040
4793A0703040n835O7282N1251k5608q0758M5383J0701P2505q430J36093J4542
$$ 10703040 10697205 10764487 10815738 10790130 10709372 10754755 10765456 10837961 10829531 10965624 10980166
4782A0980166M8123K0280o7604j79609k20360k66037l51333l64055l44259l62776
$$ 10980166 11028289 11048569 10980965 10801356 10580996 10314959 9963626 9599571 9255312 8892536
4772H892536k23806j34284k19554k59731p5242j67965j65711j29571j79034j35529
$$ 8892536 8668730 8534446 8314892 8055161 7979919 7811954 7646243 7516672 7337638 7202109
4762G202109n8529j61086m9266k11888p255n2291j00708l2682J6419m5792o580
$$ 7202109 7143580 6982494 6933228 6721340 6714085 6661794 6561086 6528404 6544823 6499031 6492451
4751F492451j35843j00505q2948n549n0436J2504J8098m5769j94290r5596k54359
$$ 6492451 6356608 6256103 6173155 6167606 6117170 6129674 6147772 6102003 5907713 5812117 5557758
4740E557758q2040j77064j34952o6594k1539j00206j19244k5257J6566m6040p0756
$$ 5557758 5475718 5298654 5163702 5097108 5075569 4975363 4856119 4830862 4847428 4801388 4730632
4729D730632j59529j8846l3053J6954r1608k1578o3429P9392O7101K7162k8153
$$ 4730632 4571103 4552257 4519204 4536158 4444550 4422972 4359543 4438935 4506036 4533198 4505045
4718D505045n7950n5743O4488j12429K9038l0283l1839m3116j2968r2200Q7929
$$ 4505045 4447095 4391352 4455840 4343411 4372449 4342166 4310327 4267211 4254243 4162043 4249972
4707D249972n2884n4693L5355R0447m3121J1757l6805j4642M1851o8239r7066
$$ 4249972 4197088 4142395 4177750 4268197 4225076 4236833 4200028 4185386 4227237 4158998 4061932
4696D061932J5607L3256J9397j26253K8238M2105J00285o0582j6270J09126n2918
$$ 4061932 4077539 4110795 4130192 4003939 4032177 4074282 4174567 4113985 4097715 4206841 4153923
4685D153923K3109P5114K3058j3439k8331l5474j1498L8666P5280L0634J53291
$$ 4153923 4177032 4252146 4275204 4261765 4233434 4197960 4186462 4225128 4300408 4331042 4484333
4674D484333M0186O3565J10123J05729J17581O3259L0848j8824p780J20806N2250
$$ 4484333 4524519 4588084 4698207 4803936 4921517 4984776 5015624 4996800 4989020 5109826 5162076
4663E162076N6933J11713J61101Q6127J57086J16159K50809J31146J99724N4887
$$ 5162076 5219009 5330722 5491823 5577950 5735036 5851195 6102004 6233150 6432874 6487761
4653F487761R2655K7949k8399l7546o1582j64053r786p1902L2253j0557J25161
$$ 6487761 6580416 6608365 6579966 6542420 6480838 6316785 6306999 6235097 6267350 6256793 6381954
4642F381954Q0300J87836K4643J83381R7680J13448J14945J86670Q1330J86396
$$ 6381954 6462254 6650090 6674733 6858114 6955794 7069242 7184187 7370857 7452187 7638583
4632G638583Q8490K45578J92831L36202J71622M16877L55317M57112M70789L84258
$$ 7638583 7727073 7972651 8165482 8501684 8673306 9090183 9445500 9902612 10373401 10757659
4622A0757659L81203O17212N09397O73071N19301O97724N65243O89480O27336
$$ 10757659 11138862 11756074 12265471 12938542 13457843 14155567 14720810 15410290 16037626
4613A6037626R13260Q86067J264662J319549J647006J570127J660743J530860
$$ 16037626 16950886 17836953 19101615 20421164 22068170 23638297 25299040 26829900
4605B6829900K194645K527277L227999L761322M992194N601837O090931M541348
$$ 26829900 29024545 31551822 34779821 38541143 43533337 49135174 55226105 59767453
4597E9767453K538041j52603k057059l333010l436028k983009j588153p58512
$$ 59767453 62305494 62152891 60095832 56762822 53326794 50343785 48755632 47997120
4589D7997120N52769Q39942J533131J256994J947176J872234K603112K476365
$$ 47997120 48549889 49389831 50922962 52179956 54127132 55999366 58602478 61078843
4581F1078843L425506L497879M558035M782022O403926O958491R047016J0571009
$$ 61078843 64504349 68002228 72560263 77342285 83746211 90704702 99751718 110322727
4573A10322727J3928228J5702069K0921209K6556561L6917490M6452750O0354984
$$ 110322727 124250955 139953024 160874233 187430794 224348284 270801034 331156018
4566C31156018M8632423J2367395r544638l3879340m3450110n9414643m6311331
$$ 331156018 379788441 392155836 382611198 348731858 305281748 245867105 199555774
4559A99555774l1777935k3499123j7214669j3023912j0630183r210228p816438
$$ 199555774 167777839 144278716 127064047 114040135 103409952 94199724 86383286
4552H6383286o109462m788409m135986l452719k780462k452056k196913k307293
$$ 86383286 80273824 75485415 71349429 67896710 65116248 62664192 60467279 58159986
4544E8159986k554279k817681l042163k940461k912347k719086k522201k162663
$$ 58159986 55605707 52788026 49745863 46805402 43893055 41173969 38651768 36489105
4536C6489105j923293j604398j487677j390809j352782j237598j224601r38868
$$ 36489105 34565812 32961414 31473737 30082928 28730146 27492548 26267947 25329079
4528B5329079j036041r30991q41334o61242p69254q34192q99842o52049p03697
$$ 25329079 24293038 23362047 22520713 21859471 21090217 20256025 19356183 18704134 18000437
4519A8000437n99070p22354n76095p15436n58440o13085n83800m84716k74484
$$ 18000437 17401367 16679013 16102918 15387482 14829042 14215957 13632157 13147441 12872957
4510A2872957n19148k63055l64502l24167l30564k78054m06498k11632k76856
$$ 12872957 12353809 12090754 11726252 11402085 11071521 10793467 10386969 10175337 9898481
4501I898481j77355k98923k26481k78840j78852l49312j55228k67334q5652k89581
$$ 9898481 9721126 9422203 9195722 8916882 8738030 8388718 8233490 7966156 7880504 7590923
4491G590923j44200k74884j62172j75104p3785k32483j24781j19147r2321j59273
$$ 7590923 7446723 7171839 7009667 6834563 6760778 6528295 6403514 6284367 6192046 6032773
4481F032773j36372j92091p5622j81213p4429k09334p6414j61997l1333j3278
$$ 6032773 5896401 5704310 5628688 5447475 5373046 5163712 5087298 4925301 4893968 4880690
4471D880690Q3900o9145O6916j07301n6063j34192J8388j11038j32129k09236
$$ 4880690 4964590 4895445 4962361 4855060 4798997 4664805 4683193 4572155 4440026 4230790
4461D230790k38j01011J8970l3556M8824k3080j5203J9303J6596n3042k4833j50072
$$ 4230790 4230552 4129541 4148511 4114955 4163779 4140699 4125496 4144799 4161395 4108353 4083520 3933448
4449C933448L9945j75937r8912o0490N9867j14513q4970r3073M4771o7572J3921
$$ 3933448 3973393 3797456 3698544 3638054 3697921 3583408 3498438 3405365 3450136 3382564 3396485
4438C396485O6036L258j18106l0788J4506J3487o1176J00637m1297o1258m0675
$$ 3396485 3462521 3465779 3347673 3316885 3331391 3344878 3283702 3384339 3343042 3281784 3241109
4427C241109J4654P412k6189r294K8440K1267O4169N8263j6612k0276M4733Q5611
$$ 3241109 3255763 3263175 3236986 3227692 3256132 3277399 3341568 3399831 3383219 3362943 3407676 3493287
4415C493287K9794l0403n2926J17075M3836J2833L4856J57588M0330J06793O4996
$$ 3493287 3523081 3492678 3439752 3556827 3600663 3613496 3648352 3805940 3846270 3953063 4018059
4404D018059J09244Q4408P9785P4466O9531J21279J03315J03516K22537K58232
$$ 4018059 4127303 4211711 4291496 4365962 4435493 4556772 4660087 4763603 4986140 5244372
4394E244372J86489L37879K40765K52549K05400L33723K50612Q4614K25808K50526
$$ 5244372 5430861 5768740 6009505 6262054 6467454 6801177 7051789 7136403 7362211 7612737
4384G612737K70367K87297M75536N53641Q35137R94908J253619J343470J496771
$$ 7612737 7883104 8170401 8645937 9199578 10034715 11029623 12283242 13626712 15123483
4375A5123483J202320P64152M62010L0595n21928p51347j284831j336105j494355
$$ 15123483 16325803 17089955 17551965 17582560 17060632 16309285 15024454 13688349 12193994
4366A2193994j447875j213372r16523p32845n52771m61213k70088k90193j92039
$$ 12193994 10746119 9532747 8616224 7883379 7330608 6869395 6599307 6309114 6117075
4357F117075j55580k03376j26953p7018j940J37747O9460O3768r447J2327p3024
$$ 6117075 5961495 5758119 5631166 5554148 5552208 5689955 5759415 5823183 5813736 5826063 5753039
4346E753039k27186l11519j95142l11137k12497j31995j21400j91916r5368q0376
$$ 5753039 5525853 5214334 5019192 4708055 4495558 4363563 4242163 4050247 3954879 3874503
4336C874503j64169j78884j10967l2570K7143n1032q1559o0754k1712J1532M7029
$$ 3874503 3710334 3531450 3420483 3387913 3415056 3364024 3282465 3221711 3199999 3211531 3258560
4325C258560l9814J2172n0445m1791p8965M7587j03580N437l7210M892K1971K302
$$ 3258560 3218746 3230918 3180473 3138682 3059717 3107304 3003724 3009161 2971951 2976843 2998814 3001116
4313C001116q97N4014J50972O5966q235Q4035m0305M9162R8036J00507N2754N2873
$$ 3001116 3000219 3054233 3205205 3271171 3262936 3346971 3306666 3355828 3453864 3554371 3607125 3659998
4301C659998M5849J43354J00319q861O2077J17466K11727J68782J65999J78321
$$ 3659998 3705847 3849201 3949520 3940659 4002736 4120202 4331929 4500711 4666710 4845031
4291D845031J35312J37179J48458K16535J84384K08391J71007K41340K76301K27224
$$ 4845031 4980343 5117522 5265980 5482515 5666899 5875290 6046297 6287637 6563938 6791162
4281F791162K44819K76703L91298L23534L83829M09643N08217N05654O64472O00019
$$ 6791162 7035981 7312684 7703982 8027516 8411345 8820988 9329205 9834859 10499331 11099350
4271A1099350N68057O62677P39390R19947R60886J161023J274513J556624J683255
$$ 11099350 11667407 12330084 13069474 13989421 14950307 16111330 17385843 18942467 20625722
4262B0625722J924728J927386K114168K471487K988888L582391M527346N631547
$$ 20625722 22550450 24477836 26592004 29063491 32052379 35634770 40162116 45793663
4254D5793663P242360R323889J0879591Q645800K608147k842751p211744j0041214
$$ 45793663 53036023 62359912 73239503 81885303 84493450 81650699 74438955 64397741
4246F4397741j1441070r309984o704519m956207l835663l126378k455616k306946
$$ 64397741 52956671 43646687 36942168 31985961 28150298 25023920 22568304 20261358
4238B0261358j816550j538218j337399j218846j104365q64625o40194n76169o39947
$$ 20261358 18444808 16906590 15569191 14350345 13245980 12381355 11741161 11164992 10525045
4229A0525045n32661l96268m46210k64578l53812l75175k63180k50481k49310
$$ 10525045 9992384 9596116 9149906 8885328 8531516 8156341 7893161 7642680 7393370
4220G393370k78417k19375k19731j61267k74413j56116k44544j51852j73873r9428
$$ 7393370 7114953 6895578 6675847 6514580 6240167 6084051 5839507 5687655 5513782 5414354
4210E414354j86659r3385j22201j83539j58821j27348j12088q7833k22088k13574
$$ 5414354 5227695 5134310 5012109 4828570 4669749 4542401 4430313 4342480 4120392 3906818
4200C906818o3455j69127r0664k8636j75520o0931j07610r8323q05L6771j38975
$$ 3906818 3843363 3674236 3583572 3554936 3379416 3318485 3210875 3112552 3111747 3148518 3009543
4189C009543p3880l5748r5778k7443k0599n2733q343j31451o0266j040p7363l2569
$$ 3009543 2935663 2899915 2804137 2776694 2756095 2703362 2695019 2563568 2503302 2502262 2424899 2392330
4177B392330J1500j05919J1481p4191r6121o5651k9849K0033M9424l4340R170
$$ 2392330 2403830 2297911 2309392 2235201 2139080 2073429 2043580 2063613 2113037 2078697 2087867
4166B087867j1453k4450j6957L6749l2725n3929J9953K5190j07573k2047j7541
$$ 2087867 2076414 2051964 2035007 2071756 2039031 1985102 2005055 2030245 1922672 1900625 1883084
4155A883084O0354o3834l8816n6565P3137J9970j01299M5872q1243j16231M5393
$$ 1883084 1943438 1879604 1840788 1784223 1857360 1877330 1776031 1821903 1740660 1624429 1669822
4144A669822M3477m0362O036J5841j2953l3946k9886K6567k197l5660K1079l7081
$$ 1669822 1713299 1672937 1678973 1694814 1681861 1647915 1618029 1644596 1642399 1606739 1627818 1590737
4132A590737l7595k6073Q2471j7487p8908j7995J37110N6345M9829k2554J32694
$$ 1590737 1553142 1527069 1609540 1592053 1513145 1495150 1632260 1688605 1738434 1715880 1848574
4121A848574p7397n2623r3509p842o2349j37338L4849p8633k7409J0217r697M1445
$$ 1848574 1771177 1718554 1625045 1617203 1554854 1417516 1452365 1373732 1346323 1356540 1346843 1388288
4109A388288k5655r0252m5910K7696p3596M2050K9445q9453L2373m4784m13P1975
$$ 1388288 1362633 1272381 1226471 1254167 1180571 1222621 1252066 1162613 1194986 1150202 1149789 1221764
4097A221764N203p305j4284m5573j4627n3761J6129P7826k0426L1990l4491M9273
$$ 1221764 1226967 1219662 1205378 1159805 1145178 1091417 1107546 1185372 1164946 1196936 1162445 1211718
4085A211718j9913l856o898l2620K2908J7687M2634N3166n7332P3507o998p1941
$$ 1211718 1191805 1187949 1181051 1148431 1171339 1189026 1231660 1284826 1227494 1301001 1294003 1222062
4073A222062L0512J2112m600M0205j9836M6974J3681k5863m066O8587k1173l3474
$$ 1222062 1252574 1264686 1260086 1300291 1280455 1327429 1341110 1315247 1311181 1379768 1358595 1325121
4061A325121R5631j092k1682L2794N171J0499P9106L1043N5461J27382l3534J17279
$$ 1325121 1420752 1419660 1397978 1430772 1435943 1446442 1525548 1556591 1612052 1739434 1705900 1823179
4049A823179J72335k4539Q0401Q6560J74574K6879m2017o1698q8740N4503k1148
$$ 1823179 1995514 1970975 2051376 2137936 2312510 2339389 2297372 2235674 2146934 2201437 2180289
4038B180289N5243O091J04553p392N3722Q7295J20485N3465Q0669j03993l8898
$$ 2180289 2235532 2241623 2346176 2338784 2392506 2479801 2600286 2653751 2734420 2630427 2591529
4027B591529j22147j18111o306p6139q6189r0326R13N2398p9499p7491p8280R4664
$$ 2591529 2469382 2351271 2344965 2268826 2182637 2092311 2093224 2145622 2066123 1988632 1910352 2005016
4015B005016J0663m4401k081N61M9826q5226P7984Q3145o979O3544O1650J01347
$$ 2005016 2015679 1971278 1969197 1969758 2019584 1934358 2012342 2095487 2088508 2152052 2213702 2315049
4003B315049R4262P7831J09226P9551J9081R1638P3777J78813J66447K01276K51722
$$ 2315049 2409311 2487142 2596368 2675919 2695000 2786638 2860415 3039228 3205675 3406951 3658673
3992C658673J31196R2710j01774k07568l01714k30331k02510m1988j02315m8658
$$ 3658673 3789869 3882579 3780805 3573237 3271523 3041192 2838682 2796694 2694379 2645721
3982B645721L165o117o9008K3990J9411j089L0063R595J10053N1455m7695J09745
$$ 2645721 2648886 2642769 2573761 2597751 2617162 2616073 2646136 2655731 2765784 2817239 2769544 2879289
3970B879289J01184R4416J31726K7956P6246K28331J17077R2397J60013J70712
$$ 2879289 2980473 3074889 3206615 3234571 3310817 3539148 3656225 3748622 3908635 4079347
3960D079347J34689J81680J27075J31475J40493R6529K3058J00917J07961J59277
$$ 4079347 4214036 4395716 4522791 4654266 4794759 4891288 4914346 5015263 5123224 5282501
3950E282501J65078L47814L34981K24063n640j96996l95277n22523n06897l15589
$$ 5282501 5447579 5795393 6130374 6354437 6348797 6151801 5756524 5234001 4727104 4411515
3940D411515m15514j81115k29458k22521j23095r8597j26863m9588n9665l6745
$$ 4411515 3996001 3814886 3585428 3362907 3239812 3141215 3014352 2964764 2905099 2868354
3930B868354m5418l6410M0208l5719K0508n6939p4067r2424q89p2006m5171M0825
$$ 2868354 2822936 2786526 2826734 2791015 2811523 2754584 2680517 2588093 2587204 2515198 2470027 2510852
3918B510852n6688K6413j3344J3617J18707Q4973N7896l5778q965j38086o1884
$$ 2510852 2454164 2480577 2467233 2480850 2599557 2684530 2742426 2706648 2697683 2559597 2497713
3907B497713q7321p0316j14012j42701p5061p270o208k893n9605m5406p0563J8313
$$ 2497713 2410392 2340076 2226064 2083363 2008302 2001032 1994824 1991931 1932326 1886920 1816357 1834670
3895A834670j8150m0534Q1002n1689q624K2243l7190q1760n4150l9794j04468
$$ 1834670 1816520 1775986 1856988 1805299 1796675 1818918 1781728 1699968 1645818 1606024 1501556
3884A501556J9777P7084j85989l7343m8787O530K1926P356o2312o7490K8229q7562
$$ 1501556 1521333 1598417 1412428 1375085 1326298 1332828 1354754 1362110 1299798 1232308 1260537 1172975
3872A172975N0605J256n7919N8734n7286K2184P051k1467J191l8512l3211N6253
$$ 1172975 1223580 1224836 1166917 1225651 1168365 1190549 1197600 1176133 1177324 1138812 1105601 1161854
3860A161854o649j6315m6198j3634M3908l8183N5418p544n612j14695M7546p018
$$ 1161854 1155205 1138890 1092692 1079058 1122966 1084783 1140201 1132657 1127045 1012350 1059896 1052878
3848A052878o3191j9745K1842N8473k5206n6509k8958J1556O7860o9854l8526
$$ 1052878 989687 969942 991784 1050257 1025051 968542 939584 951140 1019000 949146 910620
3837I10620P451J2141l59j9674M3101r875k101K8200M9750j2559J9844q1183l8049
$$ 910620 918071 930212 929853 910179 953280 943405 941304 969504 1019254 1006695 1026539 945356 907307
3824I07307l9748Q156J0832N3062l8363L9650M5973n7487q5552j4901M7471o0631
$$ 907307 867559 875715 886547 939609 901246 940896 986869 929382 843830 828929 876400 815769
3812H15769Q3922l4929j6129J6527R989l9645N872p4003J62299p2778j12994K7410
$$ 815769 899691 864762 848633 865160 875149 835504 841376 767373 929672 856894 743900 771310
3800G71310J11414l7381l0966L2015M5071N542J0243n943K7805J27847k6851p525
$$ 771310 882724 845343 814377 846392 891463 897005 907248 901305 929110 1056957 1030106 1022581
3788A022581k7294j21100M9033k3400j03456k4674j9821j6994m3743p5832O8891
$$ 1022581 995287 874187 923220 899820 796364 771690 751869 734875 691132 615300 684191
3777F84191J21256l3571k7607l9626m5401J101m5990k9276J07712l4014n898J8889
$$ 684191 805447 771876 744269 704643 659242 660343 614353 585077 692789 658775 652877 671766
3765F71766l8890P1330l3768K904L4030o4801n6628O7973j6889j6164J1581n8194
$$ 671766 632876 704206 670438 673342 707372 642571 585943 653916 637027 620863 632444 574250
3753E74250P1194k456j2151K1789L7860J7630K6206l5219P2329K7161M9600l7154
$$ 574250 645444 642988 630837 652626 690486 708116 734322 699103 771432 798593 848193 811039
3741H11039k0813p200j2067K4968L7026N2835r3246r371K6273L1596l5060L7938
$$ 811039 790226 783026 770959 795927 832953 885788 792542 783171 809444 841040 805980 843918
3729H43918l9868J7887k1388k2752N0540J8046L0246l7295K8272r5167P0828M0108
$$ 843918 804050 821937 800549 777797 828337 846383 876629 839334 867606 772439 843267 883375
3717H83375l4592l5514j9704L8520P0042M025N8767m2930k6887K8918O9086L6397
$$ 883375 848783 813269 793565 832085 902127 906152 964919 921989 895102 924020 993106 1029503
3705A029503l1891k7476N4081j0989o785j4405K4651m6522p3903K136q9548M0244
$$ 1029503 997612 970136 1024217 1013228 1006443 992038 1016689 970167 896264 898400 808852 849096
3693H49096L7292K8568l3996J1995k5866J5682m397k8435Q780O1745N744N615
$$ 849096 886388 914956 880960 892955 867089 882771 878374 849939 858719 920464 926208 931823
3681I31823R947O5230o1938r08m5119r223l3296j6004L1624k8230n9899k868p6339
$$ 931823 941770 1007000 945062 944154 899035 889812 856516 840512 872136 843906 784007 781139 704800
3668G04800O7235R8268l9244m5186j5601l0621o5222Q6374K4441K7703l7543j02166
$$ 704800 772035 870303 831059 785873 770272 739651 674429 760803 785244 812947 775404 673238
3656F73238j7560L9252l3050k4774K690M8903p4659o8481K4417j3936J5484k4844
$$ 673238 655678 694930 661880 637106 639796 688699 614040 545559 569976 556040 571524 546680
3644E46680j0976j7206k5739p8808o3741M3426K1409K294J0074m8659p6053L9853
$$ 546680 535704 518498 492759 413951 350210 393636 415045 417339 427413 378754 302701 342554
3632C42554K2001j1612m6912K1618j2246j7786L8014N6626j5553l767p6509k1818
$$ 342554 364555 352943 306031 327649 315403 297617 335631 392257 376704 372937 296428 274610
3620B74610P2128r855k3183P02n6595J257J9503O076k4166N8395l4472n260K3578
$$ 274610 346738 336883 313700 314402 257807 259064 278567 284643 260477 318872 284400 279140 302718
3607C02718l610j3745n4135L566O6696n1246l96n3755Q8804Q623o5169m7672N2885
$$ 302718 299108 285363 231228 234794 301490 250244 249848 196093 284897 293520 228351 180679 233564
3594B33564L4612o4761M4777K6608l2826j3395k8945L2118n2414N915q8452O6436
$$ 233564 268176 203415 248192 274800 241974 228579 199634 231752 179338 185253 96801 163237
3582A63237p218L8815j7121k4428j0371j02649P6801J8805m5117K0479R0593m1241
$$ 163237 156019 194834 177713 153285 142914 40265 117066 135871 90754 111233 201826 160585
3570A60585m3677j8715O5781K687o6818o2141K0768n3658M4524K2165L4193L7990
$$ 160585 116908 98193 163974 166661 99843 37702 58470 4812 49336 71501 105694 143684
3558A43684n2720l2463j0966N680L4273K5279M755n0763J03409p4039P4476j9158
$$ 143684 90964 58501 47535 53215 87488 112767 117522 66759 170168 96129 170605 151447
3546A51447J6533k341j7411m5845R130o22m27K3186m0520R214m6805Q293O9913
$$ 151447 167980 165639 148228 102383 111513 110891 110464 133650 93130 102344 55539 63832 133745
3533A33745O6451p4231m8167q12J7866n6829J21957n1111m726J3433J7130J0099
$$ 133745 200196 125965 77798 76986 94852 38023 159980 108869 104143 117576 134706 144805
3521A44805p735k5966k5337l222l5669Q5134m5555k7721l8473O5036K9308J4150
$$ 144805 137070 111104 85767 82545 46876 132010 86455 58734 20261 85297 114605 128755
3509A28755m7607L0774l4122j1828L1072K6650m4892R89L5922n2790l0466J0611
$$ 128755 81148 111922 77800 65972 97044 123694 78802 79791 115713 62923 32457 43068
3497D3068L3279m9803J9346L8371J889L6184o7589M9190L1022L904j985j1022
$$ 43068 76347 26544 45890 84261 86150 122334 54745 103935 134957 138861 136876 125854
3485A25854p1062K9427j9690j0418l983K8359N0922o1838J8811l4951k2416Q8852
$$ 125854 54792 84219 64529 54111 50128 78487 129409 67571 86382 51431 29015 117867
3473A17867j4311M6440r4767J0878J6687n8833j1837N5080R4599M5818j04408
$$ 117867 103556 149996 55229 66107 82794 23961 12124 67204 161803 207621 103213
3462A03213j3148K6761J443l75P131k3225j5020n4659j009q401M6681m3924J528
$$ 103213 90065 116826 118269 117894 125025 101800 86780 32121 31112 22711 69392 25468 26996
3449B6996N3592k5241P923o1095Q2768p2616K1415o263l0397P5491k8651O955
$$ 26996 80588 55347 63270 2175 84943 12327 33742 27479 -2918 72573 43922 50877
3437E0877O1860k0844k2703p5931N9354q800J5687k7566j1794L2123J3422J1469
$$ 50877 112737 91893 69190 -6741 52613 43813 59500 31934 20140 52263 65685 77154
3425G7154j3884p7896O3333K4234k7357M1517K7667m5768J4489L8670r2349j8128
$$ 77154 63270 -14626 48707 72941 45584 87101 114768 69000 83489 122159 29810 11682
3413A1682O9607n060n0074K5455L5269r697O9120j01313J6306Q1865n5640N7633
$$ 11682 81289 76229 26155 51610 86879 77182 146302 44989 61295 143160 87520 145153
3401A45153j8441j00126j3730M9841n169j9690O6646l5363L237l5327j5040q500
$$ 145153 126712 26586 12856 62697 57528 37838 104484 69121 72358 37031 21991 13491
3389A3491l2585R0059r9183N3025O5622k5470K6022j6296K4880q1560L3055q2633
$$ 13491 -19094 70965 -28218 24807 90429 64959 90981 74685 99565 18005 51060 -31573
3377c1573K1744K2546m8502j7969M943N0800O34p383K6128K6147M8921p905k7862
$$ -31573 -9829 12717 -35785 -53754 -48811 1989 2623 -4760 21368 47515 96436 88531 60669
3364F0669l6043m0834J0311N0000J9854r1526n59R9247n6159M3777j0306J00815
$$ 60669 24626 -16208 -5897 44103 63957 -27569 -28128 71119 14960 58737 48431 149246
3352A49246j780l9059j5351J3678l4323N1322k278k9957r6582J6309O1016K7888
$$ 149246 147466 108407 93056 106734 72411 123733 121455 91498 -5084 11225 72241 100129
3340A00129J2099p0767m6494M4380K0086l9741O775p219L5719M3729m5533J581
$$ 100129 112228 41461 -5033 39347 59433 19692 26467 19248 54967 98696 53163 54744
3328E4744r2112L1062J02910k0699k5292L8220P396n6950P4041j3196l2973n499
$$ 54744 -37368 -6306 96604 75905 50613 88833 96229 39279 113320 100124 67151 61652
3316F1652L289k6565k5046J8618M745l736J0816K6561j7085r1346J22273K0915
$$ 61652 64941 38376 13330 31948 36693 32957 43773 70334 53249 -38097 84176 105091
3304A05091L2951J8778m9403j11101Q4903N3637j12219Q2173J6821o4982O1719
$$ 105091 138042 156820 107417 -3684 81219 134856 22637 104810 121631 56649 118368
3293A18368j16268L427L9728j0608P7708L136r4944O015L5792M9658r7425J5600
$$ 118368 2100 5527 45255 34647 112355 115491 20547 26562 62354 112012 14587 30187
3281C0187L4407o178k6226K4713N200K358n024J1150j8579k1518J8438k2981j2870
$$ 30187 64594 58416 32190 56903 62103 64461 59437 70587 52008 30490 48928 25947 13077
3268A3077L1542J5725K9520j02846J1117M1372k0159K1407L5218q6759O6226n9978
$$ 13077 44619 60344 89864 -12982 -1865 39507 19348 40755 75973 -10786 55440 -4538
3256d538K1263M2403J11490l3373j18024L230m25K5968K2630o4891m1512J14307
$$ -4538 16725 59128 170618 137245 19221 22451 22026 47994 70624 5733 -35779 78528
3244G8528k2586J6111l1352j2281J1959J9334O224o3961K0246Q0799k3844K6063
$$ 78528 55942 72053 40701 28420 40379 59713 65937 1976 22222 103021 79177 105240
3232A05240l0028o2099l40n398n1076J7603Q4250q9137q0930N3923J25621k2194
$$ 105240 75212 13113 12773 7375 -43701 -26098 58152 -30985 -111915 -57992 67629 45435
3220D5435r5546M3837K2231j4693k358K7740m58L7007R977o6700m676M8134Q916
$$ 45435 -50111 -6274 15957 1264 -1094 26646 26188 63195 73172 6472 1796 49930 58846
3207E8846j6033n405M020K6956n8027k6886K7563N3274J4007p5042m3198R2461
$$ 58846 42813 37408 41428 68384 10357 -16529 11034 64308 78315 3273 -39925 52536
3195E2536k1432P419N8108k9768j1691k7254J1204N246K5815k8261l4612L0222
$$ 52536 31104 38523 96631 66863 55172 27918 39122 44368 70183 41922 7310 37532
3183C7532K6988j9805M6217j7770J3147J5253n08m5417J07933N8188l1635j05372
$$ 37532 64520 44715 90932 73162 86309 101562 101054 55637 163570 221758 190123 84751
3171H4751l6553M4584R0016J2068m1715k4236l0537n72P5063K0244n9384L1791
$$ 84751 48198 92782 182798 194866 153151 128915 98378 97806 172869 193113 133729 165520
3159A65520N4904N8084m4277J8288J2186j09319K2273Q15N3862j5147M7191K4234
$$ 165520 220424 278508 234231 252519 264705 155386 177659 178474 232336 217189 264380 288614
3147B88614j1055O3731L2308J2213O7268J527l5952K456R334J3769N2652M5305
$$ 288614 277559 341290 373598 385811 453079 454606 418654 421110 430444 444213 496865 542170
3135E42170j7817m9200O6528Q0724o376R0666L1592q6583j1506J76051P3329J19144
$$ 542170 524353 475153 541681 622405 616029 706695 738287 651704 640198 816249 889578 1008722
3123A008722J4264Q2083J15914P7929O2264J19322K25668O934K21874K31928J98764
$$ 1008722 1022986 1105069 1220983 1298912 1361176 1480498 1706166 1713100 1934974 2166902 2365666
3112B365666J68842J68816L04425M16217M17551O30188O97698J183223J292949
$$ 2365666 2534508 2703324 3007749 3423966 3841517 4471705 5169403 6352626 7645575
3103G645575J812123J245418J78902n96454j227501j635413j597154j022947p48119
$$ 7645575 9457698 10703116 10882018 10285564 9058063 7422650 5825496 4802549 4054430
3094D054430n14994m18719j88156l23626j80892k07858j92584j85666j35360j98963
$$ 4054430 3539436 3120717 2932561 2608935 2428043 2220185 2027601 1841935 1706575 1507612
3084A507612k7242j03551j49307r7920m3403Q9541j20878r7557o0863q2713l580
$$ 1507612 1480370 1376819 1227512 1129592 1086189 1175730 1054852 957295 896432 813719 810139
3073H10139k1879n594j24138m4995M6529O421k6635m5496J2245j0384j08894n0500
$$ 810139 788260 782666 658528 613533 660062 666483 639848 594352 606597 596213 487319 436819
3061D36819J46382p4163n5901L9071n5842J5106L7594Q568j04048O540j2740n2330
$$ 436819 583201 509038 453137 492208 436366 451472 489066 497634 393586 400126 387386 335056
3049C35056J3345k7828q4333j319R866p737J7858J6951J3341o4173m3148m3576
$$ 335056 348401 320573 236240 234921 244787 237050 254908 271859 285200 221027 177879 134303
3037A34303J0425J04900l4881p9310O828N8064N544k0225m5430M4789j7825J5947
$$ 134303 144728 249628 214747 135437 142265 200329 205873 185648 140218 185007 167182 183129
3025A83129p4156p3331L1742m4343R2768M1525O5178n6056l9508l8157L417L9108
$$ 183129 108973 35642 67384 23041 115809 157334 222512 166456 126948 88791 92208 131316
3013A31316n9013R394k1728N0656L664l0812o241m1848j5449P9154j9426r089
$$ 131316 72303 81697 59969 110625 114289 83477 77236 35388 19939 99093 79667 70578
3001G0578J1154J05386p9271j6719m1549m8572M5981O9061o7739Q178j8361l5334
$$ 70578 81732 187118 107847 91128 49579 1007 46988 116049 48310 56488 38127 2793
2989B793M0898N018j9595j480K7320M5923K129k172K8450r0869p6442Q2373O550
$$ 2793 43691 48709 29114 27634 54954 100877 103006 100834 129284 38415 -38027 44346 50896
2976E0896L2855j8708k2793j7777M6459M1992q1778L8225L4819j4262n1135J8897
$$ 50896 83751 65043 42250 24473 70932 112924 31146 69371 104190 89928 38793 57690
2964E7690r866k7702J0187N4527k8141J2172l1910j0818Q9211o3933n1794K8338
$$ 57690 47824 20122 30309 84836 56695 68867 36957 26139 115350 51417 -377 27961
2952B7961M8617J5367m9090k6990J7179R8345n6951l6405j4401N1788k8021n933
$$ 27961 76578 91945 42855 15865 33044 131389 74438 38033 23632 75420 47399 41466
2940D1466N0683q9669K3920R2411n912o9736K3647n6563L7729O0340n153m4297
$$ 41466 92149 2480 26400 118811 112899 43163 66810 10247 47976 108316 103163 58866
2928E8866L713m09n8055n357q3810M0131K225j3182l0933R9162j7679m7967M0920
$$ 58866 62579 62170 4115 -1242 -85052 -44921 -42696 -55878 -86811 12351 -5328 -53295 -12375
2915a2375K2315o7132O506O3851k4491n4191N9089M5251Q7556p9024N4841O918
$$ -12375 9940 -57192 -50686 13165 -11326 -65517 -6428 38823 126379 47355 102196 109114
2903A09114n6859O6855Q307n0195O1123l2332j14454R5534m0798l4409O8696N246
$$ 109114 52255 119110 127417 77222 138345 106013 -8441 87093 46295 11886 80582 85828
2891H5828m6214k2613k4578N9219l2875q209R1632j231j47142L835Q812M5445
$$ 85828 39614 17001 -7577 51642 18767 10558 102190 100959 -46183 -42348 -33536 11909
2879A1909L228M195J6422n2623r303O339j7175N8421j7915k6683N8227K0958p747
$$ 11909 15137 19332 35754 -16869 -26172 -19833 -37008 21413 3498 -23185 35042 56000 48253
2866D8253n4974R387M5874l3075J9878M1135o8202Q494m2960R62J733M109P125
$$ 48253 -6721 2666 48540 15465 35343 76478 8276 16770 -26190 -25228 -23495 -19386 -12261
2853a2261p8017M3076R5314j3614Q184j782j07822M2428O3922o5909J7730n001
$$ -12261 -90278 -47202 48112 34498 42682 40900 -66922 -24494 39428 -26481 -8751 -13752
2841a3752j2908N6638N6553q9796J4757K7038J561J099K9064l7233p510k0911
$$ -13752 -26660 29978 86531 -3265 11492 38530 40091 41190 70254 33021 25511 4600
2829D600M6006o4027p3804N8360O3295J1398k0607m066o451K0097r8525M1402
$$ 4600 50606 -13421 -87225 -28865 34430 45828 25221 21155 14704 34801 -63724 -22322
2817b2322L3946r476k5401K1048l6825j3765P8025k9009K6122k1217R351o1382
$$ -22322 11624 2148 -23253 -2205 -39030 -52795 25230 -3779 22343 1126 10477 -50905
2805e0905k784N3202K0252J030o201K4079K1103n1814k9294K3148n9931N4962
$$ -50905 -53689 -487 19765 20795 14594 38673 59776 7962 -21332 1816 -58115 -3153
2793c153K2911j6426l14m7596O7180J20065n0772n0969O80n9782J2565N8202q95
$$ -3153 19758 3332 3018 -44578 22602 142667 91895 40926 41606 -18176 -5611 52591 51696
2780E1696o9441p7186P6785O576o3645O2714L0899m5401O175k5269R7694n11n1766
$$ 51696 -17745 -94931 -18146 -11570 -75215 -12501 18398 -27003 -20828 -46097 51597 51086 -680
2767f80M8669o4358n414L8130N6652l7439n4703Q864O4363j0954n3437K7660L1352
$$ -680 47989 -16369 -21783 16347 72999 35560 -19143 -10279 54084 43130 -10307 17353 48705
2754D8705L7495r6837m3174N1353L5593o5085l1314k6596N9606P6342j8179l4148
$$ 48705 86200 -10637 -53811 -2458 33135 -31950 -63264 -89860 -30254 46088 27909 -6239
2742f239l0688j4222M0071r3389Q3124n2465K0690J5031j9380k6633K9407M6263
$$ -6239 -36927 -51149 -11078 -104467 -21343 -73808 -53118 -38087 -57467 -84100 -54693 -8430
2730h430N443O660k0752m3715Q3139o6168M3007M7563j6040K613J5605J7016k0270
$$ -8430 -2987 3673 -17079 -60794 22345 -43823 -816 46747 30707 33320 48925 65941 45671
2717D5671j1393q0076j480j9757N9569p7623j8016J72440m9545l2616l2520N0332
$$ 45671 34278 -45798 -47278 -67035 -7466 -85089 -103105 69335 19790 -12826 -45346 4986
2705D986k8619n1093M1915M624j0954l4090R3309q8544O8714m0963k6108L4876
$$ 4986 -23633 -74726 -32811 -28187 -39141 -73231 20078 -68466 248 -40715 -66823 -31947
2693c1947P810n6525q046Q8271M387J7758o2288L4364o218M2999j0467o9010L5803
$$ -31947 -24137 -80662 -88708 -437 3950 21708 -40580 -6216 -12434 30565 20098 -48912 -13109
2680a3109j1898P5803r1598j3273O9827K0443L2185r878l0977M2930q5182N9499
$$ -13109 -25007 50796 -40802 -54075 15752 36195 68380 58502 27525 70455 -14727 44772
2668D4772m1770K6041J8986l8736L7743K8295j2549m8163j5644j5879j286L4542
$$ 44772 3002 29043 48029 9293 47036 75331 62782 14619 -1025 -16904 -18190 16352
2656A6352o5735K1341k2632O5125j7903j15499J28150l5451m2758J6997P5342
$$ 16352 -49383 -28042 -50674 14451 -3452 -118951 9199 -26252 -69010 -52013 23329
2645B3329Q978o5442J4528k3782K8482N6258n4011k0231l7934o0049J00855q633
$$ 23329 32307 -33135 -18607 -42389 -13907 42351 -11660 -31891 -69825 -129874 -29019 -37652
2633c7652p4468L8268O0527L2057j7897j7857Q2353n9667K5488m2939K1003J551
$$ -37652 -112120 -73852 -13325 18732 835 -17022 65331 5664 31152 -11787 9216 10767
2621A0767j3577j2688L4348J9043q82q5635l9662L5086m0748K1868L3139O4202
$$ 10767 -2810 -15498 18850 37893 37011 -48624 -88286 -53200 -93948 -72080 -38941 25261
2609B5261p3790O1530k7123P375J8198m2351N1421O963Q584K5039n3882j90L535
$$ 25261 -48529 13001 -14122 -6747 11451 -30900 20521 27484 36068 61107 7225 7035 10570
2596A0570J4584j0466R793k2348K342m5027L4404l8469M6645k3474M2137m9401
$$ 10570 25154 14688 24481 2133 4475 -40552 -6148 -44617 2028 -21446 20691 -28710
2584b8710m9606N6431Q1983p0915O0386m0865L5747j6599k5321P8j847L1771j4938
$$ -28710 -78316 -21885 60098 -10817 49569 8704 44451 27852 2531 2609 762 32533 17595
2571A7595J4507m4201k4292l1544j9371M9941J11309p5182K0533O249J143n6068
$$ 17595 32102 -12099 -36391 -67935 -87306 -37365 73944 -1238 19295 25544 26687 -29381
2559b9381M7504m1628L7157n6894K2808j9571J6124J0959L118m9230Q5460L5593
$$ -29381 18123 -23505 13652 -43242 -20434 -40005 -23881 -12922 -9804 -59034 26426 62019
2547F2019K6810j10307O2565j9015p9576J28836J8899r9040o0157L3795K3130
$$ 62019 88829 -21478 41087 22072 -57504 71332 90231 -8809 -68966 -35171 -12041
2536a2041M3311M3098l39p4549l8126K1756L5804j5459M909o3010k4353K5079
$$ -12041 31270 74368 74029 -520 -38646 -16890 18914 3455 8364 -54646 -78999 -53920
2524e3920K8160n981M3105j1162M09L2001L9136k5172k9532m8941P8499o8776
$$ -53920 -25760 -31741 11364 202 611 32612 71748 46576 17044 -31897 46602 -22174
2512b2174L1658m5984K5321M727o567l775R553K0724m1024N8338J2871p0543P3170
$$ -22174 9484 -36500 -11179 -6452 -13019 -16794 -7241 13483 -27541 30797 43668 -26875 46295
2499D6295q307o8725j0564K1436M854K083J0392K8638q9019M0304M8333k3715
$$ 46295 37988 -30737 -41301 -19865 -15011 -12928 -2536 26102 -62917 -22613 25720 2005
2487B005M9941l0863K2402l8320l1342M50M6896k7113O7191n6665K592o5886M0975
$$ 2005 51946 21083 43485 5165 -26177 -25727 21169 -5944 61247 4582 7174 -58712 -17737
2474a7737p139M1685L2328M3013k9397p1485m6495j9130K1356J0576J1834j561
$$ -17737 -24876 16809 49137 92150 62753 -8732 -55227 -74357 -53001 -42425 -30591 -32152
2462c2152M0654j05819Q8897K9430L2897k8424J1569n863n7071j928l7853L336
$$ -32152 8502 -97317 -8420 21010 53907 25483 37052 31189 -25882 -27810 -65663 -62327
2450f2327J9670k5929M5847k4110J566L5855o854J844m3426P6222o4108j0141
$$ -62327 -42657 -68586 -22739 -46849 -45283 -9428 -16282 -14438 -57864 18358 -45750 -55891
2438e5891n9172J5060M9501p1093Q7166n2580Q1432O9660K2688k4629n5365N554
$$ -55891 -115063 -100003 -50502 -121595 -34429 -87009 -5577 64083 86771 62142 6777 12331
2426A2331n7045L3153J0475M0451k6728j7912L2889k7470L8707l999k8723n0739
$$ 12331 -44714 -11561 -1086 39365 12637 -5275 27614 144 38851 34852 6129 -44610
2414d4610Q328j9957O4848M4269k652M1568j01492P7575Q427p3050L1608q032
$$ -44610 -36282 -56239 8609 52878 50226 91794 -9698 67877 76304 3254 34862 26830
2402B6830q0075O9976l0504m7129R3459l8125J006M2770N8779p1663k3377N7815
$$ 26830 -53245 16731 -13773 -60902 32557 -5568 -4562 38208 96987 25324 1947 59762
2390E9762n4454M4340l424k2121P3843m0502o2098N0070j8969J3804L1406L0321
$$ 59762 5308 49648 46224 24103 97946 57444 -4654 45416 26447 40251 71657 101978
2378A01978o7634m8070j6231o6951M4567Q794L7090N3969M8781K400o9193O073
$$ 101978 34344 -13726 -29957 -96908 -52341 -43547 -6457 47512 96293 98693 29500 35573
2366C5573J5855o2045M981q17K1490n5781k1063O5387L5688r9148M1573P5016
$$ 35573 51428 -10617 -5636 -6453 15037 -40744 -61807 3580 39268 -59880 -18307 56709
2354E6709j06840L7299L4515p7619L9756n126p7396N938N5082R2163K712l6733
$$ 56709 -50131 -12832 21683 -55936 -16180 -21306 -98702 -92764 -37682 54481 57193 20460
2342B0460K8875m964J309r8447J7255J4787K0633L6910o1639M8556j6464M9908
$$ 20460 49335 44371 45680 -52767 -35512 -20725 -92 36818 -24821 23735 7271 57179
2330E7179m1659M9403l1960n6561j7979M2247L7594J9983j9869L933M7205m8545
$$ 57179 15520 64923 32963 -23598 -41577 670 38264 58247 38378 42311 89516 40971
2318D0971o7402k3094J4995j8781L39M5834O4005J6760q0743l9902M9809k2725
$$ 40971 -26431 -49525 -34530 -53311 -52972 -7138 56867 73627 -7116 -47018 2791 -19934
2306a9934l412k094j3235O9545K8321l946p4051P7898m7343k2130j188m0411q043
$$ -19934 -23346 -25440 -38675 30870 59191 55245 -18806 59092 11749 -10381 -11569 -51980 -60023
2293f0023P0177l5780n7353r543K2036Q8424m4804O8907q3671J5483P0782l8k8421
$$ -60023 10154 -25626 -82979 -92522 -70486 17938 -26866 42041 -41630 -26147 44635 44597 16176
2280A6176M5115j0021r3061M9604j4771L1664p8921l6938J35241m0983l3686k4017
$$ 16176 61291 51270 -41791 7813 -6958 24706 -54215 -91153 44088 3105 -30581 -54598
2268e4598J7628L1067P446j4144K4534J5640j7356j344r2598J9494J01352n5415
$$ -54598 -36970 -5903 1543 -12601 11933 27573 10217 8873 -83725 -64231 37121 -18294
2256a8294J9393L3115l0120o8710j1807L1612O8336k4977o3055P2222l1120p0953
$$ -18294 1099 34214 4094 -64616 -76423 -44811 23525 -1452 -64507 7715 -23405 -94358
2244i4358J9739L4686N5845r9218O2974N1524m8920m7418l70O7018k2122j6411
$$ -94358 -74619 -39933 15912 -83306 -20332 31192 -17728 -65146 -65516 1502 -20620 -37031
2232c7031k4000l2421P3423L6021o9155n2443O2079N2723k3310M8112k2666p313
$$ -37031 -61031 -93452 -20029 15992 -53163 -105606 -43527 9196 -14114 33998 11332 4019
2220D019M231n9115m207K7608l3870M0046J8025n36L1571o3235j621Q338r737
$$ 4019 8250 -50865 -55072 -27464 -61334 -21288 -3263 -3799 27772 -35463 -37084 -28746 -38483
2207c8483N6368n5402k5171L2437P4377j9998M137P1023j15032K5044J5930m2873
$$ -38483 17885 -37517 -62688 -30251 44126 24128 28265 99288 -15744 9300 25230 -17643
2195a7643P075M882M5069k1175Q628o0461k2897o798k2447P9059j4010l5871K7956
$$ -17643 -10568 -5686 39383 18208 26836 -33625 -56522 -63320 -85767 -6708 -20718 -56589 -28633
2182b8633N2029k930m4936k1991j5209Q5727L4841m5178K141J0750o2193L2044
$$ -28633 23396 20466 -24470 -46461 -61670 24057 58898 13720 15861 26611 -35582 -3538
2170c538L1928n6007n2596J9867J3477M4565j4763l8627M1314k0561O7000P7766
$$ -3538 28390 -27617 -80213 -60346 -46869 -2304 -17067 -55694 -14380 -34941 32059 109825
2158A09825K9269o6857o9638K1891j8568n0949L2764p765j8932q8840O8498Q9875
$$ 109825 139094 72237 2599 24490 5922 -45027 -12263 -20028 -38960 -127800 -59302 30573
2146C0573j8371j9590m4337J6843N7176l4546M004O7097l0254n778n3984L3893
$$ 30573 12202 -7388 -51725 -34882 22294 -12252 -8248 58849 28595 22817 -31167 2726
2134B726M9596K9555J2577n5125q7937P80L2913k5459L8895M8880j14217N8643
$$ 2726 52322 81877 94454 39329 -48608 -47828 -14915 -40374 -1479 47401 -66816 -8173
2122h173l5683p9299J22288p283l9328J27707q3241p1005M4469p086m1757Q254
$$ -8173 -43856 -123155 -867 -8150 -47478 80229 -3012 -74017 -29548 -36634 -78391 -70137
2110g0137K7890k8235O4702r001J5734l6908J1297L3718l4512K8118p517m3013
$$ -70137 -42247 -70482 -5780 -14781 953 -35955 -24658 9060 -25452 2666 -4851 -47864
2098d7864Q3334l9996n1856O0820k3380N0712K5135l0814p1299K8200M8987l5332
$$ -47864 35470 -4526 -56382 4438 -18942 31770 56905 26091 -45208 -17008 31979 -3353
2086c353k9638K8121j0050n9964K4044m833M5415J789N1547L3067n2680q7454
$$ -3353 -32991 -4870 -14920 -74884 -50840 -55673 -10258 -8469 43078 76145 23465 -63989
2074f3989J8681l5938R1169R0293n2332n6588q717m6139k6322K843O5330K1836
$$ -63989 -45308 -81246 9923 100216 47884 -8704 -17421 -63560 -89882 -87039 -21709 127
2062A27o9749K8022M8287K0000L5738m4478k1078k454n7600N5736M1762m5986
$$ 127 -69622 -41600 6687 26687 62425 17947 -3131 -5585 -63185 -7449 34313 -11673
2050a1673O0813L359m2762L0598p7353m094o138N3712K8691j813K2960o1060k8520
$$ -11673 49140 52499 9737 40335 -37018 -41112 -47250 6462 35153 33340 56300 -4760 -33280
2037c3280L2690N0222r3714M1311k5116l2030Q2410j3510m2546p267K9439K6754
$$ -33280 -590 49632 -44082 -2771 -27887 -59917 22493 8983 -33563 -40830 -11391 15363
2025A5363l8427n3164M9768J7733K8288K6954n9421n8061Q1988j2041k8911l5731
$$ 15363 -23064 -76228 -26460 -8727 19561 46515 -12906 -70967 11021 -1020 -29931 -65662
2013f5662J7452R5427K332l1725n7495p280N2440k1098k2933J18579Q469l8561
$$ -65662 -48210 47217 49549 17824 -39671 -46951 5489 -15609 -38542 80037 88506 49945
2001D9945l6788J1336l0367j9527M907o0703O3110J0593J7799l5353o3171K255
$$ 49945 13157 24493 -5874 -25401 -20494 -81197 -18087 -7494 10305 -25048 -88219 -85964
1989h5964L8438P6292m2076J1686K4927j6905M320p3632K8334J4624K1704o6043
$$ -85964 -47526 28766 -13310 -1624 23303 6398 10718 -62914 -34580 -19956 1748 -64295
1977f4295O1063o098k6705n5733L0547K4908J6100N8307M9464j17017o7831L0478
$$ -64295 -3232 -9330 -36035 -91768 -61221 -36313 -20213 38094 87558 -29459 -97290 -66812
1965f6812j677P2865L825o5074P4728l5552O5331n0063O0295r267n7765l1584
$$ -66812 -68489 4376 8201 -56873 17855 -17697 47634 -2429 57866 48599 -9166 -40750
1953d0750J355k6219J9381O3346J4033K3010r0992N0479k6283l9728L6887J0566
$$ -40750 -39395 -65614 -46233 17113 31146 54156 -36836 13643 -12640 -52368 -15481 -4915
1941d915R5339K065r8310k8979L8493K5446r3619J8483K3659N19p0895N6967l414
$$ -4915 90424 92489 -5821 -34800 3693 29139 -64480 -45997 -22338 -21819 -92714 -35747 -39161
1928c9161L5680N0254L442k913j7682q5650J2598J6438o0432m9855O0744R317
$$ -39161 -3481 46773 50215 47302 29620 -56030 -43432 -26994 -87426 -137281 -76537 -67220
1916f7220P1727p5440M702M7442N4758l5166j09023k6220P3401J2563j8335M1649
$$ -67220 4507 -70933 -66231 -18789 35969 803 -108220 -134440 -61039 -48476 -66811 -25162
1904b5162J2116K7876R581j3855m0074J7207K1578p2002J6300M6966r7232R952
$$ -25162 -13046 14830 24411 10556 -29518 -12311 9267 -62735 -46435 531 -96701 -86749
1892h6749L6654L9728k5705j830O661k5625K7775O8774p2732k0350M440M242J42955
$$ -86749 -50095 -10367 -36072 -37902 -31241 -56866 -29091 39683 -33049 -53399 -48959 -44717 98238
1879I8238k5553n7536n4937K4556N8821L4664j11346N8112n1461l5650J4706O5418
$$ 98238 72685 15149 -39788 -15232 43589 78253 -33093 25019 -26442 -62092 -47386 18032
1867A8032l1455J1795m165N6597j6690o034o6578K2413k547o4497Q7732J5632
$$ 18032 -13423 -1628 -5793 50804 34114 28080 -38498 -16085 -18632 -83129 4603 20235
1855B0235n50l0299j7010L7806j6286n2245j0333r697O1740P722J8015j1911K2247
$$ 20235 19685 -10614 -27624 10182 -6104 -58349 -68682 -78379 -16639 -8917 9098 -2813 19434
1842A9434n1951L9502k9071k2818k5032n0462P7040k6985P988N0214l1766L8711
$$ 19434 -32517 6985 -22086 -44904 -69936 -120398 -43358 -70343 -62355 -12141 -43907 -5196
1830e196R667J4500j51197M7271R8658j5448J3526L9836k7238k9056k0495K7934
$$ -5196 4471 18971 -132226 -84955 13703 -1745 11781 51617 24379 -4677 -25172 2762
1818B762j3548r662l9627j2246P6891n1633O5697n5371m3638P6246N2407l7889
$$ 2762 -10786 -20448 -60075 -72321 4570 -47063 18634 -36737 -80375 -4129 48278 10389
1806A0389r384K3723l9513M9120j4013M0432r4860j4605q69J0610p618l033M5099
$$ 10389 1005 24728 -14785 34335 20322 60754 -34106 -48711 -49580 -38970 -46588 -49621 -4522
1793d522R692L6713Q522M882K469j10766O0217P9721l1699o7802k2932Q139J7572
$$ -4522 5170 41883 50405 55287 57756 -53010 7207 86928 55229 -12573 -35505 -27366 -9794
1780i794j8026o9242P2561p599J1670j8674m5035Q2539M2573P22n547m2970n59
$$ -9794 -27820 -97062 -24501 -32100 -20430 -39104 -84139 -1600 40973 41695 36148 -6822 -7381
1767g381J8183q3944L3958J10420N6672l085o3731j1699n0041o2258L0727K7950
$$ -7381 10802 -73142 -39184 71236 127908 124823 61092 49393 -648 -62906 -32179 -4229
1755d229J3993m3852k820l5274J6638l4217L4678J981N8911q458J3320j1231l5205
$$ -4229 9764 -34088 -36908 -72182 -55544 -89761 -55083 -53102 5809 -2649 10671 -560 -35765
1742c5765J4218j3607J11029m5256r0737K7083N7142j0395l6809K1583L2169m3845
$$ -35765 -21547 -35154 75875 30619 -60118 -33035 24107 13712 -23097 -1514 30655 -13190
1730a3190j4019M1054R093J7502J4792l4168n6021q381N0065M9337J3021p7941
$$ -13190 -27209 13845 22938 40440 55232 21064 -34957 -43338 6727 56064 69085 -8856
1718h856o608L2155N0876n672l6178j0367K440J660L4283Q725p3985K6783K5097
$$ -8856 -15464 16691 67567 61895 25717 15350 17790 19450 53733 62458 -11527 15256 40353
1705D0353k5428j2151J7337q5716j0913Q5346j3910M0434j1263l7905Q442o5991
$$ 40353 14925 2774 20111 -65605 -76518 8828 -5082 35352 24089 -13816 -5374 -71365
1693g1365J125N0651l8239N6529q0488J0771M3448K5784M9088J4703L703L3697
$$ -71365 -70240 -19589 -57828 -1299 -81787 -71016 -27568 -1784 47304 62007 65710 99407
1681I9407o8484l2663l6564J9749o7681Q631O570N040J1402Q7435J501j26927
$$ 99407 30923 -1740 -38304 -18555 -86236 -77605 -71035 -65995 -54593 32842 34343 -92584
1669i2584M5207L1347m1244J3058J5284k642J9245n9267M6706j459Q5282j4408
$$ -92584 -47377 -16030 -57274 -44216 -28932 -31574 -12329 -71596 -24890 -26349 58933 44525
1657D4525o7452l3934k9104J0563N4484M3917r5804N8330K0346j0319m046L6821
$$ 44525 -22927 -56861 -85965 -75402 -20918 22999 -72805 -14475 5871 -4448 -8494 28327
1645B8327n2494r205m876l9151O9801j8572j3083J36197o6080q2934L3061M4835
$$ 28327 -24167 -33372 -38248 -77399 -7598 -26170 -39253 96944 30864 -52070 -19009 25826
1633B5826n0970p8653N0089k838j6171P1001q3329L4518L3749q4002M9945j9766
$$ 25826 -25144 -103797 -53708 -56546 -72717 -1716 -85045 -50527 -16778 -100780 -50835 -70601
1621g0601M5276o6440l1n568P383Q1656k6552M3440n4038K9430O0417m7626j1018
$$ -70601 -25325 -91765 -91796 -97364 -89981 -8325 -34877 8563 -45475 -16045 44372 -3254 -14272
1608a4272J5848k350j4724q995K8383K8948J1016J129k7873l4336M0188L9757
$$ -14272 1576 -774 -15498 -24493 3890 32838 43854 44983 17110 -17226 22962 62719
1596F2719L514j7666o2880M9948J6962o4130k3920J04821p9004j223O4920k3219
$$ 62719 66233 48567 -14313 35635 52597 -11533 -35453 69368 -9636 -10859 54061 30842
1584C0842J786K8552L2655j0097n7311j1838k5164M2117K9671J1884n7714j2842
$$ 30842 32628 61180 93835 83738 26427 14589 -10575 31542 61213 73097 15383 2541
1572B541M926m8311p744M7260N4590k7810m594j7788m5899k1250J07493n7394
$$ 2541 7467 -40844 -48588 -1328 53262 25452 20858 3070 -42829 -64079 43414 -13980
1560a3980M2723K3064K4237l704r2694k6509J3234O0305j15574L0476O3289O5152
$$ -13980 28743 51807 76044 72340 -20354 -46863 -33629 26676 -88898 -58422 4867 70019
1548G0019o8852J4193J9655n5902k8114J6938n1053J4658L5596L8411k3975K031
$$ 70019 1167 15360 35015 -20887 -49001 -32063 -83116 -68458 -32862 5549 -18426 -16395
1536a6395m2732K2165L241o0292P1163J0449L1808n9701J9635J6362k7894j5516
$$ -16395 -59127 -36962 -33721 -94013 -22850 -12401 19407 -40294 -20659 -4297 -32191 -47707
1524d7707J8596K4771N5833J5932q6919m9719L1212N3647k9163o365K7671K0007
$$ -47707 -29111 -4340 51493 67425 -19494 -69213 -38001 15646 -13517 -19882 7789 27796
1512B7796j8708j1491m9362n5288P2338K7925K3993q8703J0426M1175k3152O257
$$ 27796 9088 -2403 -51765 -107053 -34715 -6790 17203 -71500 -61074 -19899 -43051 -36794
1500c6794K889Q9742p2940N1790l1053k4426N0189o090M0658p4166k8284Q9153
$$ -36794 -33905 55837 -17103 34687 3634 -20792 29397 23307 63965 -10201 -38485 50668
1488E0668L368n4870j4248j3937N2345N0055j5625q1293Q423q3038O9937O9115
$$ 50668 54036 -834 -15082 -29019 23326 73381 57756 -23537 -15114 -98152 -28215 40900
1476D0900k0751n7010J0715j4325r165N5081n0437j1114Q19J0989q322n385J26515
$$ 40900 20149 -36861 -26146 -40471 -49636 5445 -44992 -56106 -55287 -44298 -52620 -58005 68510
1463F8510j9148q0052K4447q0753L698N3293K1936j8564p195K0677J5396m2948
$$ 68510 49362 -30690 -6243 -86996 -83298 -30005 -8069 -26633 -33828 -13151 2245 -40703
1451d0703P9542J9901n6320k5343m368j1107j1746L2211J6508J2704k94n3112
$$ -40703 38839 58740 2420 -22923 -27291 -38398 -50144 -17933 -1425 11279 10985 -42127
1439d2127J1598J538M7964l5150n2583J11019m8674n7742q432L2072M9779m3735
$$ -42127 -30529 -28991 18973 -16177 -68760 42259 -6415 -64157 -72589 -40517 9262 -34473
1427c4473M2315N3473m7377J3649n2663k9804n189K447j8882L8304O1543r5311
$$ -34473 7842 61315 13938 27587 -25076 -54880 -60069 -57622 -76504 -38200 23343 -71968
1415g1968M3929O2073l3878N879j4965L1188j2285p3324O5677O4334l9122n3645
$$ -71968 -28039 34034 156 6035 -8930 22258 9973 -63351 2326 66660 27538 -26107
1403b6107M6980R509o6460K681l6802M854j7215O5717K5355O2176k5555l9883
$$ -26107 20873 30382 -36078 -33397 -70199 -65345 -82560 -16843 8512 70688 45133 5250
1391E250L3150n0056M9041L2642j20460j4288K7463P9368j11263k2883R8511r5200
$$ 5250 38400 -11656 37385 70027 -50433 -64721 -37258 42110 -69153 -92036 6475 -88725
1379h8725O0223M6275M3993n544l0990m125l5270n568q3982N3281K962r827K3386
$$ -88725 -28502 17773 61766 56222 25232 21107 -14163 -19731 -103713 -50432 -47470 -57297 -33911
1366c3911K3467P475l6650N4074j5958p8516M0716L0502J4796k4456m7383l2669
$$ -33911 -10444 -2969 -39619 14455 -1503 -80019 -39303 -8801 5995 -18461 -65844 -98513
1354i8513K4131K619J3915P0783k1330j0828k866M5364k8112L819o923K1744q299
$$ -98513 -74382 -71763 -57848 12935 -8395 -19223 -22089 23275 -4837 -1018 -7941 13803 5504
1341E504o5538m904K8618N8239j19048J5189Q3197l3791j4885O0338J9187J524
$$ 5504 -60034 -64938 -36320 21919 -97129 -81940 1257 -32534 -47419 12919 32106 33630
1329C3630P871l6181Q3090q3423k0689j5756L6446L773n0078r745l6452K7734
$$ 33630 41501 5320 88410 4987 -15702 -31458 4988 8761 -41317 -51062 -87514 -59780
1317e9780K4402m1654Q0554j3164N9241n4781j02502R2253J21196q9380o7932
$$ -59780 -35378 -77032 3522 -9642 49599 -5182 -107684 -15431 105765 16385 -51547
1306e1547M2697j5026L0267K188M6040L0879k5567q1518P2218l3833o6544n579
$$ -51547 -8850 -23876 6391 8579 54619 85498 59931 -21587 50631 16798 -49746 -55325
1294e5325K8502p093l992L9175L2699o5539M6680O6760n4656o234j5242K8780
$$ -55325 -26823 -33916 -37908 1267 33966 -31573 15107 81867 27211 20977 5735 34515
1282C4515J7686l3648M6333L3098J7468m3621l9103M4845k2823m0342o2132O6922
$$ 34515 52201 18553 64886 97984 115452 71831 32728 77573 54750 14408 -47724 19198
1270A9198l3960J5814o652j7927j0375K5961L9896l3414P3005n7010k7257M2953
$$ 19198 -14762 1052 -5600 -23527 -33902 -7941 31955 -1459 71546 14536 -12721 30232
1258C0232o349j8745K306l5744L781M695L3694r371j6006k7419j5998R6894p201
$$ 30232 23883 5138 7444 -28300 -24519 -19824 13870 4499 -11507 -38926 -54924 41970 34769
1245C4769R768o388j01402N0259J16194J722j0086j34366M5408l0977k1636J9798
$$ 34769 44537 38149 -63253 -12994 103200 104922 94836 -39530 5878 -25099 -46735 -26937
1233b6937k7372M2376L3704J7984q989O856J0146k2824m5668l0852L1171P1387
$$ -26937 -54309 -11933 21771 39755 30766 37622 47768 24944 -20724 -51576 -20405 50982
1221E0982l8916n5583n8147L7017L4297J1944N2450O205l9233l346m370K2156
$$ 50982 12066 -43517 -101664 -64647 -30350 -18406 34044 40249 1016 -2330 -6700 15456
1209A5456M912k6545j4407J9150m3543K5565K5280k5871J1946J9548j4664J4558
$$ 15456 20368 -6177 -20584 -1434 -44977 -19412 5868 -20003 -8057 11491 -3173 11385
1197A1385n986j8727N2218j3194p7296J428O7921j7585P524k1811k3855P9371
$$ 11385 5399 -13328 38890 25696 -51600 -50172 17749 164 7688 -14123 -37978 41393
$$ [...]
##END NTUPLES=NMR SPECTRUM
##END=
