##TITLE=1H_EC-3316(2)
 CDCl3
 8sc, 
 16.2.2024
##JCAMPDX= 6.0         $$ Bruker NMR JCAMP-DX V2.0
##DATA TYPE= NMR SPECTRUM
##DATA CLASS= NTUPLES
##ORIGIN= UXNMR, Bruker Analytische Messtechnik GmbH
##OWNER= root
$$ XWIN-NMR		Version 3.5
$$ Fri Feb 16 14:41:52 2024 Russian Standard Time (UT+4h)  she@DPX200
##.OBSERVE FREQUENCY= 200.1313
##.OBSERVE NUCLEUS= ^1H
##.ACQUISITION MODE= SIMULTANEOUS
##.ACQUISITION SCHEME= undefined
##.AVERAGES= 8
##.DIGITISER RES= 18
##SPECTROMETER/DATA SYSTEM= spect
##.PULSE SEQUENCE= zg30
##.SOLVENT NAME= DMSO
##.SHIFT REFERENCE= (INTERNAL, DMSO, 0, 15.4494)
##AUDIT TRAIL= $$ (NUMBER, WHEN, WHO, WHERE, WHAT)
$$ ##TITLE= Audit trail, XWIN-NMR		Version 3.5
$$ ##JCAMPDX= 5.01
$$ ##ORIGIN= Bruker BioSpin GmbH
$$ ##OWNER= she
$$ F:/spectra/data/she/nmr/H-F/1/pdata/1/auditp.txt
$$ ##AUDIT TRAIL=  $$ (NUMBER, WHEN, WHO, WHERE, WHAT)
(   1,<2024-02-16 14:39:48.50 +0400>,<she>,<DPX200>,
      <created by zg, POWCHK disabled, PULCHK disabled
       configuration hash MD5:
       00 E9 B6 7A A2 85 ED C7 34 08 36 98 17 FE 4E 26
       data hash MD5: 16K
       C1 9E 6F 7C AC 5F 36 2E 90 3E 20 A9 9A A3 17 3F>)
(   2,<2024-02-16 14:40:03.00 +0400>,<she>,<DPX200>,
      <Start of raw data processing
       efp BC_mod = 2 LB = 0.24 FT_mod = 6 PKNL = 1 PHC0 = -24958.19 PHC1 = 7.85264 SI = 16K 
       data hash MD5: 16K
       C9 0B 3A 59 C3 45 CA 5D D2 33 9E 12 51 48 1A 3F>)
(   3,<2024-02-16 14:40:23.45 +0400>,<she>,<DPX200>,
      <pk PHC0 = -2.396244 PHC1 = 6.4 
       data hash MD5: 16K
       9E A7 ED 44 4A 61 EC 5C 38 36 1E 47 E6 64 13 35>)
(   4,<2024-02-16 14:40:26.73 +0400>,<she>,<DPX200>,
      <abs ABSG = 5 
       data hash MD5: 16K
       A8 A4 FC FF 00 55 61 E1 66 DB 58 DC F3 40 F5 62>)
$$ ##END=
$$ 
$$ hash MD5
$$ EB 93 59 73 AE CF DE 7A D9 90 BE BE CF BE 70 7C
##$RELAX= 
##$RELAX= 
##$RELAX= 
##$RELAX= 
##$RELAX= 
##$RELAX= 
$$ Bruker specific parameters
$$ --------------------------
##$DU= <F:/spectra>
##$EXPNO= 1
##$NAME= <H-F>
##$PROCNO= 1
##$TYPE= <nmr>
##$USER= <she>
##$AMP= (0..31)
100 100 100 100 100 100 100 100 100 100 100 100 100 100 100 100 100 100 
100 100 100 100 100 100 100 100 100 100 100 100 100 100 
##$AQSEQ= 0
##$AQ_mod= 1
##$AUNM= <au_zg>
##$AUTOPOS= <>
##$BF1= 200.13
##$BF2= 200.13
##$BF3= 200.13
##$BF4= 200.13
##$BF5= 200.13
##$BF6= 200.13
##$BF7= 200.13
##$BF8= 200.13
##$BYTORDA= 1
##$CFDGTYP= 0
##$CFRGTYP= 5
##$CHEMSTR= <none>
##$CNST= (0..31)
1 1 145 1 1 1 1 1 1 1 1 1 1 1 1 1 1 1 1 1 1 1 1 1 1 1 1 1 1 1 1 1 
##$CPDPRG= <>
##$CPDPRG1= <>
##$CPDPRG2= <>
##$CPDPRG3= <>
##$CPDPRG4= <mlev>
##$CPDPRG5= <mlev>
##$CPDPRG6= <mlev>
##$CPDPRG7= <mlev>
##$CPDPRG8= <mlev>
##$CPDPRGB= <>
##$CPDPRGT= <>
##$D= (0..31)
0 1.2 0 0 0 0 0 0 0 0.06 0 0.03 0 0 0 0 0.0002 0 0 0 0 0 0 0 0 0 0 0 0 
0 0 0 
##$DATE= 1708079987
##$DBL= (0..7)
120 120 120 120 120 120 120 120 
##$DBP= (0..7)
150 150 150 150 150 150 150 150 
##$DBP07= 0
##$DBPNAM0= <>
##$DBPNAM1= <>
##$DBPNAM2= <>
##$DBPNAM3= <>
##$DBPNAM4= <>
##$DBPNAM5= <>
$$ [...]
##$SUBNAM3= <"">
##$SUBNAM4= <"">
##$SUBNAM5= <"">
##$SUBNAM6= <"">
##$SUBNAM7= <"">
##$SUBNAM8= <"">
##$SUBNAM9= <"">
##$SW= 18.0517328524113
##$SWIBOX= (0..15)
0 0 2 0 0 0 0 0 0 0 0 0 0 0 0 0 
##$SW_h= 3612.71676300578
##$TD= 16384
##$TD0= 1
##$TE= 0
##$TE2= 300
##$TE3= 300
##$TEG= 300
##$TL= (0..7)
0 120 120 120 120 120 120 120 
##$TP= (0..7)
150 150 150 150 150 150 150 150 
##$TP07= 0
##$TPNAME0= <>
##$TPNAME1= <>
##$TPNAME2= <>
##$TPNAME3= <>
##$TPNAME4= <>
##$TPNAME5= <>
##$TPNAME6= <>
##$TPNAME7= <>
##$TPOAL= (0..7)
0.5 0.5 0.5 0.5 0.5 0.5 0.5 0.5 
##$TPOFFS= (0..7)
0 0 0 0 0 0 0 0 
##$TUNHIN= 0
##$TUNHOUT= 0
##$TUNXOUT= 0
##$USERA1= <user>
##$USERA2= <user>
##$USERA3= <user>
##$USERA4= <user>
##$USERA5= <user>
##$V9= 5
##$VALIST= <valist>
##$VCLIST= <CCCCCCCCCCCCCCC>
##$VD= 0
##$VDLIST= <DDDDDDDDDDDDDDD>
##$VPLIST= <PPPPPPPPPPPPPPP>
##$VTLIST= <TTTTTTTTTTTTTTT>
##$WBST= 1024
##$WBSW= 4
##$XGAIN= (0..3)
0 0 0 0 
##$XL= 0
##$YL= 0
##$YMAX_a= 604847
##$YMIN_a= -788220
##$ZGOPTNS= <>
##$ZL1= 120
##$ZL2= 120
##$ZL3= 120
##$ZL4= 120
##$ABSF1= 15.58162
##$ABSF2= -2.470231
##$ABSG= 5
##$ABSL= 3
##$ALPHA= 0
##$AQORDER= 0
##$ASSFAC= 0
##$ASSFACI= 0
##$ASSFACX= 0
##$ASSWID= 0
##$AUNMP= <proc_1d>
##$AZFE= 0.1
##$AZFW= 0.1
##$BCFW= 0
##$BC_mod= 2
##$BYTORDP= 0
##$COROFFS= 0
##$CY= -3
##$DATMOD= 1
##$DC= 0
##$DFILT= <>
##$DTYPP= 0
##$F1P= 0
##$F2P= 0
##$FCOR= 1
##$FTSIZE= 16384
##$FT_mod= 6
##$GAMMA= 0
##$GB= 0
##$INTBC= 1
##$INTSCL= 3.70164e-10
##$ISEN= 128
##$LB= 0.24
##$LEV0= 0
##$LPBIN= 0
##$MAXI= 10000
##$MC2= 0
##$MEAN= 0
##$ME_mod= 0
##$MI= 1.114404
##$NCOEF= 0
##$NC_proc= -6
##$NLEV= 6
##$NOISF1= 3.799351
##$NOISF2= 2.8
##$NSP= 0
##$NTH_PI= 0
##$NZP= 0
##$OFFSET= 15.4494
##$PC= 1
##$PHC0= -24960.59
##$PHC1= 14.25264
##$PH_mod= 1
##$PKNL= yes
##$PPARMOD= 0
##$PSCAL= 0
##$PSIGN= 0
##$REVERSE= no
##$SF= 200.130014469475
##$SI= 16384
##$SIGF1= 3
##$SIGF2= 2
##$SINO= 5.538805
##$SIOLD= 16384
##$SREGLST= <1H.CDCl3>
##$SSB= 0
##$STSI= 16384
##$STSR= 0
##$SW_p= 3612.71676300578
##$SYMM= 0
##$S_DEV= 0
##$TDeff= 16384
##$TDoff= 0
##$TI= <>
##$TILT= no
##$TM1= 0
##$TM2= 0
##$TOPLEV= 0
##$USERP1= <user>
##$USERP2= <user>
##$USERP3= <user>
##$USERP4= <user>
##$USERP5= <user>
##$WDW= 1
##$XDIM= 16384
##$YMAX_p= 487041109
##$YMIN_p= -274439
$$ End of Bruker specific parameters
$$ ---------------------------------
##NTUPLES= NMR SPECTRUM
##VAR_NAME=  FREQUENCY,     SPECTRUM/REAL,   SPECTRUM/IMAG
##SYMBOL=    X,             R,               I
##VAR_TYPE=  INDEPENDENT,   DEPENDENT,       DEPENDENT
##VAR_FORM=  AFFN,          ASDF,            ASDF
##VAR_DIM=   16384,         16384,           16384
##UNITS=     HZ,            ARBITRARY UNITS, ARBITRARY UNITS
##FACTOR=    0.220516191357247, 1,           1
##FIRST=     3091.88863516199, 0,            0
##LAST=      -520.828127843795, 0,           0
##MIN=       -520.828127843795, -274439,     0
##MAX=       3091.88863516199, 487041109,    0
$$ Real data points
##PAGE= N=1
##DATA TABLE= (X++(R..R)), XYDATA
$$ [...]
8379E431694N669o5309n941K1078j1786J3157L9588k42576j10419M4282r3884
$$ 5431694 5437363 5372054 5366113 5387191 5375405 5388562 5428150 5185574 5075155 5119437 5025553
8368E025553O681l5466o0927j43166l5787m410m1819L2192k7087k6039j22823
$$ 5025553 5032234 4996768 4935841 4792675 4756888 4752478 4710659 4742851 4715764 4689725 4566902
8357D566902L9856Q4021o9076r5755o9321J4167J5257L3499j19163o8571j00374
$$ 4566902 4606758 4690779 4621703 4525948 4456627 4470794 4486051 4519550 4400387 4331816 4231442
8346D231442P575K5019K2336J6888M1810n023j04591l0092m7592m1746R2724J2873
$$ 4231442 4239017 4264036 4286372 4303260 4345070 4340047 4235456 4205364 4157772 4116026 4208750 4221623
8334D221623k0233q7054k4359q313Q8047k8421m2460M422l550J5579J08827j4709
$$ 4221623 4201390 4114336 4089977 4081664 4169711 4141290 4098830 4103252 4099702 4115281 4224108 4209399
8322D209399n1375J4227P4461M546p7577l9041k154j21555n6220K2355L5926Q830
$$ 4209399 4158024 4172251 4246712 4251258 4173681 4134640 4132486 4010931 3954711 3977066 4012992 4021822
8310D021822j5057n6417N9795L2275K9964N285K3637J14360n2396K6793j3607
$$ 4021822 4006765 3950348 4010143 4042418 4072382 4077667 4101304 4215664 4163268 4190061 4176454
8299D176454O7701j49124j2826q0065J1707q1203j04801j7558P8607J8291q8295
$$ 4176454 4244155 4095031 4082205 4002140 4013847 3932644 3827843 3810285 3888892 3907183 3818888
8288C818888J8002m4091K2301j19950j09658M0485P9162J41295j045r088O571
$$ 3818888 3836890 3792799 3815100 3695150 3585492 3625977 3705139 3846434 3845389 3836301 3842872
8277C842872K2081P1999p4351j13539q569m2558m5733J8064q9350Q4658Q112J2354
$$ 3842872 3864953 3936952 3862601 3749062 3740493 3697935 3652202 3670266 3580916 3665574 3673686 3686040
8265C686040R498L2414k7021k0194m5095m7437K2201o4999j35359k5784q1487
$$ 3686040 3695538 3727952 3700931 3680737 3635642 3588205 3610406 3545407 3410048 3384264 3302777
8254C302777k7215K5041l1946n9775q9871n4642J1110J4014n1069m9549n2467
$$ 3302777 3275562 3300603 3268657 3208882 3119011 3064369 3075479 3089493 3038424 2988875 2936408
8243B936408K4470j45824J4576R1682J6846l1027J16132J05671p9390j01740J72146
$$ 2936408 2960878 2815054 2829630 2921312 2938158 2907131 3023263 3128934 3049544 2947804 3119950
8232C119950j30566j10576l5349l0979r7531k2688j2856n3172l6876p6495J5053
$$ 3119950 2989384 2878808 2843459 2812480 2714949 2692261 2679405 2626233 2589357 2512862 2527915
8221B527915l4513K221q621K5112r6254r6243p783j7874R4439p7282N95j16591
$$ 2527915 2493402 2495623 2487002 2512114 2415860 2319617 2311834 2293960 2388399 2311117 2311712 2195121
8209B195121n8577J33453L4666o0740J15664k1564k32063l2152Q579J01135j14069
$$ 2195121 2136544 2269997 2304663 2243923 2359587 2338023 2105960 2073808 2082387 2183522 2069453
8198B069453q5697j10388J26050O1140j34398k00929P02251L03622m26367m5452
$$ 2069453 1983756 1873368 1999418 2060558 1926160 1725231 2427482 2731104 2304737 2259285
8188B259285l8295j425q1509l1423n2959m9439P16K12403o7263k03538Q6422J7165
$$ 2259285 2220990 2219565 2138056 2106633 2053674 2004235 2004951 2217354 2150091 1946553 2032975 2050140
8176B050140N606J39606q4916q8689O8798L2148k5228r3191L755O230l0090K831
$$ 2050140 2055746 2195352 2110436 2021747 2090545 2122693 2097465 2004274 2008029 2014259 1984169 1987000
8164A987000n1947M4259k9124j32115P8756Q4206m6211Q482m2486j10643l2987
$$ 1987000 1935053 1979312 1950188 1818073 1896829 1981035 1934824 1943306 1900820 1790177 1757190
8153A757190J05171j5246j02544K0561P0180l9432j8505L226j30794N1454J50982
$$ 1757190 1862361 1847115 1744571 1765132 1835312 1795880 1777375 1780601 1649807 1701261 1852243
8142A852243j9971o48j22338j01991L9262J03808N9406o1700L8212r5979k8821
$$ 1852243 1832272 1831624 1709286 1607295 1646557 1750365 1809771 1748071 1786283 1690304 1661483
8131A661483k0853j8464O7545L8885m6935O2982j4490O8777J7845j44622j4303
$$ 1661483 1640630 1622166 1689711 1728596 1681661 1744643 1730153 1798930 1816775 1672153 1657850
8120A657850j4086p2376j4158J83226n8783M2894k8177r1277J1666m3234J40593
$$ 1657850 1643764 1571388 1557230 1740456 1681673 1724567 1696390 1605113 1616779 1573545 1714138
8109A714138O6642k9046j24719J01168p4957M5963J32402p6297j33007r3230N0334
$$ 1714138 1780780 1751734 1627015 1728183 1653226 1699189 1831591 1755294 1622287 1529057 1579391
8098A579391M5244n5076J04823l5421j45786K3692J08135l7750M3708n99l4104
$$ 1579391 1624635 1569559 1674382 1638961 1493175 1516867 1625002 1587252 1630960 1630361 1596257
8087A596257n0197P0745J20261j68919n6783K8774M4885q6462m2843N7687J02254
$$ 1596257 1546060 1616805 1737066 1568147 1511364 1540138 1585023 1498561 1455718 1513405 1615659
8076A615659m5188o2181l9692J43957m85m6582L5014j9711N4247k283r894r9936
$$ 1615659 1570471 1508290 1468598 1612555 1612070 1565488 1600502 1580791 1635038 1632755 1622861 1522925
8064A522925M9506O5698k9784M5356J6882j3579j7034J38018n5837L7097n4633
$$ 1522925 1572431 1638129 1608345 1653701 1670583 1657004 1639970 1777988 1722151 1759248 1704615
8053A704615R8340J44122p5221O0333j30139q2245O1628J07028M4912K4163J06493
$$ 1704615 1802955 1947077 1871856 1932189 1802050 1719805 1781433 1888461 1933373 1957536 2064029
8042B064029n1066N7677K2153O0181N3020Q8154K02297J30347P6921J13896J95334
$$ 2064029 2012963 2070640 2092793 2152974 2205994 2294148 2496445 2626792 2703713 2817609 3012943
8031C012943K59179K41367L69870M88950M75393M61286L64971O2235k48832n82719
$$ 3012943 3272122 3513489 3883359 4372309 4847702 5308988 5673959 5736194 5487362 4904643
8021D904643o84380o41177m56173m76285k82645j44924j31359j42088j17191O9247
$$ 4904643 4220263 3579086 3122913 2646628 2363983 2219059 2087700 1945612 1828421 1897668
8011A897668j9364k04242n0954Q2072q6905p6690N3994J19j07975R3058q5956
$$ 1897668 1878304 1674062 1623108 1705180 1618275 1541585 1595579 1595698 1487723 1580781 1494825
8000A494825j0278n473O3614J3069j50306p3496R6942L1075o5693n4250j5804
$$ 1494825 1484547 1479074 1542688 1555757 1405451 1331955 1428897 1459972 1394279 1340029 1324225
7989A324225J7165o5239K8243M6346O6525O0149r3921r3283j5446M682r0742K5196
$$ 1324225 1341390 1276151 1304394 1350740 1417265 1477414 1383493 1290210 1274764 1279446 1188704 1213900
7977A213900p0016k7220P5785O1562p7529P4468R255N7341l3130M442O0535k0542
$$ 1213900 1143884 1116664 1192449 1254011 1176482 1250950 1260205 1317546 1284416 1288858 1349393 1328851
7965A328851n3061k4346j0544m3245j3460P06J03738n5992n5869N2776p4042L7686
$$ 1328851 1275790 1251444 1240900 1197655 1184195 1184901 1288639 1232647 1176778 1229554 1155512 1193198
7953A193198J92197l382q0031j10325M6564P6380l8549K9632J5450n7550l556
$$ 1193198 1385395 1382013 1301982 1191657 1238221 1314601 1276052 1305684 1321134 1263584 1260028
7942A260028r317J00007o752n6137M9551M388M1557J2111j39847p0312M9278j8819
$$ 1260028 1250711 1350718 1343966 1287829 1337380 1341768 1383325 1395436 1255589 1185277 1234555 1215736
7930A215736P8354O5379r9744J26296r976j7951J12259j17235m0610O0687j3012
$$ 1215736 1294090 1359469 1259725 1386021 1376045 1358094 1470353 1353118 1312508 1373195 1360183
7919A360183L9721N029O706j8657j343O3969j9035j02160l2693P7856J4548n744
$$ 1360183 1399904 1404933 1411639 1392982 1391639 1455608 1436573 1334413 1301720 1379576 1394124 1388380
7907A388380P9832n8568J05126M8724l209p6001j6843N634K9270L2197J9884k7963
$$ 1388380 1468212 1409644 1514770 1563494 1560285 1484284 1467441 1473075 1502345 1534542 1554426 1526463
7895A526463j27780o1034J05413n4670j08745K9421N3678J4085N1153n1310J08155
$$ 1526463 1398683 1337649 1443062 1388392 1279647 1309068 1362746 1376831 1427984 1376674 1484829
7884A484829J3246o5995j9254N0454q940j5685K5719K4191l7377j10631M9533
$$ 1484829 1498075 1432080 1412826 1463280 1454340 1438655 1464374 1488565 1451188 1340557 1390090
7873A390090L8706P719O58o3716k9209m9885L6814R1358n9023J3172p257J84690
$$ 1390090 1428796 1436515 1437173 1373457 1344248 1294363 1331177 1422535 1363512 1376684 1369427 1554117
7861A554117K2282j18440l5721L3909N0111J42275j17272K3207k677m4664o0930
$$ 1554117 1576399 1457959 1422238 1456147 1506258 1648533 1531261 1554468 1551791 1507127 1446197
7850A446197j7418J6369N4637j49046N3645M5259l3714N4938J57856o0035r549
$$ 1446197 1428779 1445148 1499785 1350739 1404384 1449643 1415929 1470867 1628723 1568688 1559139
7839A559139L7058m5086K874J28509N0470L940j4q279Q802j0995R608j05168K6455
$$ 1559139 1596197 1551111 1553985 1682494 1732964 1736904 1736890 1728611 1737413 1726418 1736026 1630858 1657313
7826A657313M003m4087O5446M3219l3897N627O5778P3359K2146k8572l6486j6893
$$ 1657313 1661316 1617229 1682675 1725894 1691997 1697624 1763402 1836761 1858907 1830335 1793849 1776956
7814A776956Q9968m0859Q435l9288j08876o957m0762K20683p532L4540j3788K7114
$$ 1776956 1866924 1826065 1834500 1795212 1686336 1679379 1638617 1859300 1851768 1886308 1872520 1899634
7802A899634L5978M598J6719L8173J0953L5703k0713N3901J57066J5200o414r6214
$$ 1899634 1935612 1940210 1956929 1995102 2006055 2041758 2021045 2074946 2232012 2247212 2240798 2144584
7790B144584j87608k0850J380J7260J29436R3994j8438j23799m837m46r282J70841
$$ 2144584 1956976 1936126 1937506 1954766 2084202 2178196 2159758 2035959 2031122 2030676 2021394 2192235
7778B192235j5848j17329q9777Q7900J19358R9045O3684m5932j26387J0734J7722
$$ 2192235 2176387 2059058 1969281 2057181 2176539 2275584 2339268 2293336 2166949 2177683 2195405
7767B195405O4457M9701j26822L8703J41104j4727j9787P1213j35583j29229j429
$$ 2195405 2259862 2309563 2182741 2221444 2362548 2347821 2328034 2399247 2263664 2134435 2133006
7756B133006J05245L9814Q8468J1576j83391k29J5342J06440p9288J50279q9018
$$ 2133006 2238251 2278065 2366533 2378109 2194718 2194489 2209831 2316271 2236983 2387262 2298244
7745B298244q4020n2736J908J96118J83622k1158k00354P0155M9330J46751Q2863
$$ 2298244 2214224 2161488 2163396 2359514 2543136 2521978 2321624 2391779 2441109 2587860 2670723
7734B670723m1256n9705O8496L6892L1385l2226J7098J9376K5138l2244J8316
$$ 2670723 2629467 2569762 2638258 2675150 2706535 2674309 2691407 2710783 2735921 2703677 2721993
7723B721993l8002J9081Q489q9120k5624J8463M7911k6745K135N3267P227n40
$$ 2721993 2683991 2703072 2711561 2622441 2596817 2615280 2663191 2636446 2638581 2691848 2699075 2698535
7711B698535l6682P3716n3272Q0045N9338Q692N6436J256J1775P2131q0551Q146
$$ 2698535 2661853 2735569 2682297 2762342 2821680 2830372 2886808 2888064 2899839 2971970 2891419 2899565
7699B899565j7505J4644J48229J10521p2898p8502P5090P5140M4890R620M3769
$$ 2899565 2882060 2896704 3044933 3155454 3082556 3004054 3079144 3154284 3199174 3208794 3252563
7688C252563K5152J5950P4847L7678o1968K1087P6248J19317m746m2480j1375
$$ 3252563 3277715 3293665 3368512 3406190 3344222 3365309 3441557 3560874 3556128 3513648 3502273
7677C502273N0051J6037J20688n844j1656M4626Q1172N6991l1150N0916O5755
$$ 3502273 3552324 3568361 3689049 3683205 3671549 3716175 3797347 3854338 3823188 3874104 3939859
7666C939859N6532Q8433P6830k8927j4723J3571J13254J08766K136J26103M6469
$$ 3939859 3996391 4084824 4161654 4132727 4118004 4131575 4244829 4353595 4355731 4481834 4528303
7655D528303M5838N3110R7094j0380K64101R8961N8737Q7326M25J35822J40572
$$ 4528303 4574141 4627251 4724345 4713965 4978066 5077027 5135764 5223090 5223515 5359337 5499909
7644E499909K8067N4309P0075J87874J26274K00483O9098J15603J95349N151K40123
$$ 5499909 5527976 5582285 5652360 5840234 5966508 6166991 6236089 6351692 6547041 6552192 6792315
7633F792315J05284K59532J39500J83557J33250J44795K30699J82542L48494J91039
$$ 6792315 6897599 7157131 7296631 7480188 7613438 7758233 7988932 8171474 8519968 8711007
7623H711007K89412J75195K02082K40838J99431M18881L04773L85386L51517M69640
$$ 8711007 9000419 9175614 9377696 9618534 9817965 10236846 10541619 10927005 11278522 11748162
7613A1748162L62674M43698N40053K67793N60785P78659N32484O15966O38283
$$ 11748162 12110836 12554534 13094587 13362380 13923165 14701824 15234308 15850274 16488557
7604A6488557O51719P34185Q02565P78017Q08181O83749P83274O78327P39069
$$ 16488557 17140276 17874461 18677026 19455043 20263224 20946973 21730247 22408574 23147643
7595B3147643O79162N97047M71826L79008J78753L1779l9135j85846k99827m48226
$$ 23147643 23826805 24423852 24895678 25274686 25453439 25485218 25446083 25260237 24960410 24512184
7585B4512184n22468p73756q84959o85048p67494q81217q82192q84642q33951
$$ 24512184 23989716 23215960 22331001 21645953 20878459 19997242 19115050 18230408 17396457
7576A7396457p52394p58008o70560n94498p80177m70686o01877n81435n04239
$$ 17396457 16644063 15886055 15215495 14620997 13840820 13370134 12768257 12186822 11682583
7567A1682583n48603m82412m10742l07278l46233l55023k56781k53630l62835
$$ 11682583 11133980 10651568 10240826 9933548 9587315 9232292 8975511 8721881 8359046
7558H359046j86703j94209k23044j26692r4767k67204k34970j35031j42487k18585
$$ 8359046 8172343 7978134 7755090 7628398 7533631 7266427 7031457 6896426 6753939 6535354
7548F535354j30345m8502k62989p8762r2312n4092j16404k29329j97848J8269
$$ 6535354 6405009 6356507 6093518 6014756 5922444 5868352 5751948 5522619 5324771 5343040
7538E343040l6861j34058N534N3960j13867k46296j75336k0929l6491j0453l2833
$$ 5343040 5306179 5172121 5177655 5231615 5117748 4871452 4696116 4675187 4638696 4628243 4595410
7527D595410m0976n8309j15922N2584r8587l0374o9332r9072N3294M9562j2993
$$ 4595410 4554434 4496125 4380203 4432787 4334200 4303826 4234494 4135422 4188716 4238278 4225285
7516D225285j6755J2017r6986O6620L8322r6827r5016q2354m5187n5325J2983
$$ 4225285 4208530 4220547 4123561 4190181 4228503 4131676 4036660 3954306 3909119 3853794 3866777
7505C866777N7245M8433j23927j04008o511q3304P5736j48059m7995r0432n2461
$$ 3866777 3924022 3972455 3848528 3744520 3738009 3654705 3730441 3582382 3534387 3443955 3391494
7494C391494L9996M2960N250q0831j0631j3846r2748R648K7798R1177p4981r4525
$$ 3391494 3431490 3474450 3479700 3398869 3388238 3374392 3281644 3291292 3319090 3410267 3335286 3240761
7482C240761m8380O3394M416o24R4800n8224k6657k3539L5793p8683M2346m7427
$$ 3240761 3192381 3255775 3260191 3259567 3354367 3296143 3269486 3245947 3281740 3203057 3245403 3197976
7470C197976j9479l584n276J21362M6232l8626n799j603N7865J25415Q5057j6054
$$ 3197976 3178497 3174913 3169637 3290999 3337231 3298605 3292806 3291203 3349068 3474483 3559540 3543486
7458C543486q7472l4694r7569J7358o2800n5986J30577p8703n2221Q9527O3137
$$ 3543486 3456014 3421320 3323751 3341109 3278309 3222323 3352900 3274197 3221976 3311503 3374640
7447C374640J8560r355k1243J148m7847J789J20008r9938L2440l6265r6851J59577
$$ 3374640 3393200 3383845 3362602 3363750 3315903 3317692 3437700 3337762 3370202 3333937 3237086 3396663
7435C396663N5880j06406j03233J02183K1616r926k5252Q865m7865J8940j39395
$$ 3396663 3452543 3346137 3242904 3345087 3366703 3356777 3331525 3340390 3292525 3311465 3172070
7424C172070j3077R2760o2380j41395o8883K2384q3375L4462j7199o7950k228
$$ 3172070 3158993 3251753 3189373 3047978 2979095 3001479 2918104 2952566 2935367 2867417 2865189
7413B865189L2824J25867P2621j8553l9346n7940Q0378j8113p8744J8296J00028
$$ 2865189 2898013 3023880 3096501 3077948 3038602 2980662 3061040 3042927 2964183 2982479 3082507
7402C082507L8609j39303p8160p349R1563j9417l1769J18710P6333j97117N9378
$$ 3082507 3121116 2981813 2903653 2896304 2987867 2968450 2936681 3055391 3131724 2934607 2993985
7391B993985J33792l7857j37701q8887M8932J14655p9718l2108P8252k8955j3386
$$ 2993985 3127777 3089920 2952219 2863332 2912264 3026919 2947201 2915093 2993345 2964390 2951004
7380B951004J2040l3768k6759r4637O8725l5676q9221l3005Q0606P679P5833M6149
$$ 2951004 2963044 2929276 2902517 2807880 2876605 2840929 2751708 2718703 2799309 2806988 2882821 2928970
7368B928970p7798J24295P9540l3289r1667L508j38980N4242R0932J0243l2684
$$ 2928970 2851172 2975467 3055007 3021718 2930051 2933559 2794579 2848821 2939753 2949996 2917312
7357B917312j71084L8957J32834M6585n288j0092j98020r084k8970k6247K6641
$$ 2917312 2746228 2785185 2918019 2964604 2959316 2949224 2751204 2742120 2713150 2686903 2713544
7346B713544m042N4717r5282j688R116N8595q5371K0070J5491k3410n669k856
$$ 2713544 2709502 2764219 2668937 2667249 2676365 2734960 2649589 2669659 2685150 2661740 2656071 2653215
7334B653215M3650q5965R7866R8018q7471N5811L3994M7187L3168r473n6929J20457
$$ 2653215 2696865 2610900 2708766 2806784 2719313 2775124 2809118 2856305 2889473 2880000 2823071 2943528
7322B943528K1850N3818J0278q1072k03414n1699k2798o5997n4264o5874M5278
$$ 2943528 2965378 3019196 3029474 2948402 2744988 2693289 2670491 2604494 2550230 2484356 2529634
7311B529634n429k8746N0224K7254O9714J5507j50998r2820M5985J14539k8909
$$ 2529634 2524205 2495459 2545683 2572937 2642651 2658158 2507160 2414340 2460325 2574864 2545955
7300B545955n8970p6120o3207p9506M6482P9297n3257o3695r0396J22321L4673
$$ 2545955 2486985 2410865 2347658 2268152 2314634 2393931 2340674 2276979 2186583 2308904 2343577
7289B343577J55190k2206m7529n6590K5058n6828j11014J70114m5001j22540j3583
$$ 2343577 2498767 2476561 2429032 2372442 2397500 2340672 2229658 2399772 2354771 2232231 2218648
7278B218648R4380k5878J3744J57126k4296m3798P7665r1878p8466N405N0496
$$ 2218648 2313028 2287150 2300894 2458020 2433724 2389926 2467591 2375713 2297247 2302652 2353148
7267B353148M6019J3111m1604p3374J20843j9775k4701r39P8765j02412J01673
$$ 2353148 2399167 2412278 2370674 2297300 2418143 2398368 2373667 2372728 2451493 2349081 2450754
7256B450754J0784j08991k2735O6855j1810j8441R9505J7029M1667j08599n6710
$$ 2450754 2461538 2352547 2329812 2396667 2384857 2366416 2465921 2482950 2524617 2416018 2359308
7245B359308O7050R2033l147q7333n8419O1180l1459J39536M4924p491j17611
$$ 2359308 2426358 2518391 2515244 2427911 2369492 2430672 2399213 2538749 2583673 2576182 2458571
7234B458571j17648K739J13793N8040J4446Q050N564j23004J12239J5983j8312
$$ 2458571 2340923 2343662 2457455 2515495 2529941 2537991 2543555 2420551 2532790 2548773 2530461
7223B530461N1772m3604k7862L9188J60184J58814R1247L3770j68962j09706K00238
$$ 2530461 2582233 2538629 2510767 2549955 2710139 2868953 2960200 2993970 2825008 2715302 2915540
7212B915540P5550q0994r3652j36710k5601J0141M1290j29532Q6231k7708l3481
$$ 2915540 2991090 2910096 2816444 2679734 2654133 2664274 2705564 2576032 2662263 2634555 2601074
7201B601074m7535L8378P8296J15193Q0079k0563L3808O8450r422j23375p8186
$$ 2601074 2553539 2591917 2670213 2785406 2865485 2844922 2878730 2947180 2937758 2814383 2736197
7190B736197j16147j09618j253n6885m8492M9112k3980n1321j10652n0361N0986
$$ 2736197 2620050 2510432 2509179 2452294 2403802 2452914 2428934 2377613 2266961 2216600 2267586
7179B267586Q2731r824m2247O1951L9249r7010m736l8380L3509J4013J88227J9589
$$ 2267586 2350317 2340493 2298246 2360197 2399446 2302436 2297700 2259320 2292829 2306842 2495069 2514658
7167B514658M5789K5022p3650Q1877p2813l6351m0777O6321o767k7193n4611j6272
$$ 2514658 2560447 2585469 2511819 2593696 2520883 2484532 2443755 2510076 2503309 2476116 2421505 2405233
7155B405233K3467p7531j2616J39707o9638j6725J6464P2684R4267j3334l6442
$$ 2405233 2428700 2351169 2338553 2478260 2408622 2391897 2408361 2481045 2575312 2561978 2525536
7144B525536O1774J20324J3792n969k08169q8452O1554N5220K3786M1535j09979
$$ 2525536 2587310 2707634 2721426 2715457 2507288 2418836 2480390 2535610 2559396 2600931 2490952
7133B490952p5010K472k2248j16946j1996J47285q9996j65814j513k8019L6279
$$ 2490952 2415942 2418414 2396166 2279220 2267224 2414509 2324513 2158699 2157186 2129167 2165446
7122B165446j27482Q9239j4541K7197k6854n0938J11529L3215j22695L1721M6036
$$ 2165446 2037964 2127203 2112662 2139859 2113005 2062067 2173596 2206811 2084116 2115837 2161873
7111B161873N1540L5379k7686j43537j2574o9078k1043l4459j3195P7714M7375
$$ 2161873 2213413 2248792 2221106 2077569 2064995 1995917 1974874 1940415 1927220 2004934 2052309
7100B052309R747l7322K2042j4125J27620O0722m0232p8204o2262J63873P2280
$$ 2052309 2062056 2024734 2046776 2032651 2160271 2220993 2180761 2102557 2040295 2204168 2276448
7089B276448k1753n6798j22197J36465o9358J2195K9058k5993j32216Q815n7558
$$ 2276448 2254695 2197897 2075700 2212165 2142807 2155002 2184060 2158067 2025851 2034666 1977108
7078A977108O5991p230L2954j016j91010J4225p0232j8176L5867l998K0689n2561
$$ 1977108 2043099 2035869 2068823 2067807 1876797 1891022 1820790 1802614 1838481 1834483 1855172 1802611
7066A802611m9423p206Q9273J13926j24928l8113N2980o6570J18056O5378j75574
$$ 1802611 1753188 1745982 1835255 1949181 1824253 1786140 1839120 1772550 1890606 1955984 1780410
7055A780410o9114N1757l4313j09809P8676L779k5742n60m1510q3467J67898K8450
$$ 1780410 1711296 1763053 1728740 1618931 1697607 1701386 1675644 1675084 1633574 1550107 1718005 1746455
7043A746455k1946l6689r4205n4644M8354J63733P7872j36087j19786L2077J38684
$$ 1746455 1724509 1687820 1593615 1538971 1587325 1751058 1828930 1692843 1573057 1605134 1743818
7032A743818R615n6977J7070m1314r8058r1032J85011n855K4971L4152j70501
$$ 1743818 1753433 1696456 1713526 1672212 1574154 1483122 1668133 1662278 1687249 1721401 1550900
7021A550900n3961J24686l7621p9935J865M6485P285P0663J9563l7993J8986M0766
$$ 1550900 1496939 1621625 1584004 1504069 1505934 1552419 1559704 1630367 1649930 1611937 1630923 1671689
7009A671689k0181j48874J10560J69799m6331k4945r1373N7519n6040L8177q1773
$$ 1671689 1651508 1502634 1613194 1782993 1736662 1711717 1620344 1677863 1621823 1660000 1578227
6998A578227q0327k2139N4863K0743J23209m2018N0192P8857K6470L6547p7610
$$ 1578227 1497900 1475761 1530624 1551367 1674576 1632558 1682750 1761607 1788077 1824624 1747014
6987A747014q871j52565N3643l8584m1997J9253k2464k0557N3752p9072m7999
$$ 1747014 1738143 1585578 1639221 1600637 1558640 1577893 1555429 1534872 1588624 1509552 1461553
6976A461553k897P5456r2441J22216j5184j75749M7026P2045R0250m5682K842
$$ 1461553 1458656 1534112 1441671 1563887 1548703 1372954 1419980 1492025 1582275 1536593 1539435
6965A539435j10656l3571L8079M1609N932J1478l2202j21907J3762J9429K0087
$$ 1539435 1428779 1395208 1433287 1474896 1480828 1492306 1460104 1338197 1351959 1371388 1391475
6954A391475J66466j15375N325J52143J8560L2713o4258j26387j23775o014O38
$$ 1391475 1557941 1442566 1447891 1600034 1618594 1651307 1587049 1460662 1336887 1330873 1331511
6943A331511K00511J36919m3467p8777l203O0738J03275q8583r069l0968m1369
$$ 1331511 1532022 1668941 1625474 1546697 1543494 1604232 1707507 1618924 1609855 1578887 1537518
6932A537518M6084j44711J2869J12157k2992k3041M0736M7529p251k2377n9072
$$ 1537518 1583602 1438891 1451760 1563917 1540925 1517884 1558620 1606149 1598898 1576521 1517449
6921A517449n3977J32988J3345j21076R6394J1384j14438K9642p2012L8424k5316
$$ 1517449 1463472 1596460 1609805 1488729 1585123 1596507 1482069 1511711 1439699 1478123 1452807
6910A452807Q959Q0591q4571L3516J27802n2280O6533L3196q7441r1520l1145
$$ 1452807 1461766 1542357 1457786 1491302 1619104 1566824 1633357 1666553 1579112 1487592 1456447
6899A456447j8318N4839k7144k4063P6254k0551R776j9074P2061N864j6807P5794
$$ 1456447 1438129 1492968 1465824 1441761 1518015 1497464 1507240 1488166 1560227 1566091 1549284 1625078
6887A625078N0742N2727k426k7883p1604r7186j1454r510K7576l6578j9765j07420
$$ 1625078 1675820 1728547 1726121 1698238 1626634 1529448 1517994 1508484 1536060 1499482 1479717 1372297
6875A372297L9873N8347L1361L2703j9283j67916n9235M0718N2701J33162O7352
$$ 1372297 1412170 1470517 1501878 1534581 1515298 1347382 1288147 1328865 1381566 1514728 1582080
6864A582080o6380n4487l2845k8997m4495J67437m4712j06966O0509p787R8356
$$ 1582080 1515700 1461213 1428368 1399371 1354876 1522313 1477601 1370635 1431144 1423357 1521713
6853A521713K0386l8622k3719k5956l4176J4990k315o7595J58739q001o3260O0940
$$ 1521713 1542099 1503477 1479758 1453802 1419626 1434616 1432301 1364706 1523445 1515444 1452184 1513124
6841A513124j25834n1333j0886O2426J76539o9373N8517J8481N3489k6552r9142
$$ 1513124 1387290 1335957 1325071 1387497 1564036 1494663 1553180 1571661 1625150 1598598 1499456
6830A499456P9623l837q143r7316O9928j79497m8703K5561O1311Q5856r3252p1883
$$ 1499456 1579079 1575242 1567099 1469783 1539711 1360214 1311511 1337072 1398383 1484239 1390987 1319104
6818A319104J06536J1690j23681P8027M7905L1836k0855j07995Q0418k1581k03
$$ 1319104 1425640 1437330 1313649 1391676 1439581 1471417 1450562 1342567 1422985 1401404 1401201
6807A401201M5841j76944K5172O7076p6138K4195J16783Q1872j4087M1743j161
$$ 1401201 1447042 1270098 1295270 1362346 1286208 1310403 1427186 1509058 1494971 1536714 1535553
6796A535553l0049j9425J6825n2503q1711M8604O3695O8505o5821J4133K8463
$$ 1535553 1505504 1486079 1502904 1450401 1368690 1417294 1480989 1549494 1483673 1497806 1526269
6785A526269P081O9942j90103j8988L9907J08040J27164j02987q2198J9336J8247
$$ 1526269 1533350 1603292 1413189 1394201 1434108 1542148 1669312 1566325 1484127 1503463 1521710
6774A521710N6954l1586k1102L3181J53868R468l7555P9986l9244q9984m4732
$$ 1521710 1578664 1547078 1525976 1559157 1713025 1722493 1684938 1764924 1725680 1635696 1590964
6763A590964R1271k3833q4673J6451k8067J37666M8932j12971j14575N1379Q2677
$$ 1590964 1682235 1658402 1573729 1590180 1562113 1699779 1748711 1635740 1521165 1572544 1655221
6752A655221m8318R5802m9361N772M4288N8657l8376j7547j17807l4665J43343
$$ 1655221 1606903 1702705 1653344 1659116 1703404 1762061 1723685 1706138 1588331 1553666 1697009
6741A697009K9542O3175j3735M2710o4454m542Q4589k3855P2209M192j00025O8327
$$ 1697009 1726551 1789726 1775991 1818701 1754247 1749705 1834294 1810439 1882648 1886840 1786815 1855142
6729A855142O0021J0946j4120R4337N953J34L0200m0709P3252P8065O2292o4525
$$ 1855142 1915163 1926109 1911989 2006326 2012279 2012413 2042613 2001904 2075156 2153221 2215513 2150988
6717B150988L9075Q532r9166n205O1653J5587O9781P9262m9515n7547l4081N1032
$$ 2150988 2190063 2198595 2099429 2094224 2155877 2171464 2241245 2320507 2270992 2213445 2179364 2230396
6705B230396J27663j3085O7413Q3500J96991K6856j08360K6710M1222J6206m2804
$$ 2230396 2358059 2344974 2412387 2495887 2692878 2719734 2611374 2638084 2679306 2695512 2652708
6694B652708O991M1205j6229n19o6772p558J4456l1599l436k7756j27577L1463
$$ 2652708 2659699 2700904 2684675 2684156 2617384 2609826 2624282 2592683 2589247 2561491 2433914 2465377
6682B465377J15352O030K5340j00412q9724m243J24731J11262J74073J38975j20757
$$ 2465377 2580729 2586759 2612099 2511687 2421963 2417720 2542451 2653713 2827786 2966761 2846004
6671B846004p4609j08580o3647r394K1961J16827n2354M6497q9154m3776P7125
$$ 2846004 2771395 2662815 2599168 2589774 2611735 2728562 2676208 2722705 2633551 2589775 2666900
6660B666900L6948P7936p7852m9711J65130o9786N2297L0236l0923J39251J4364
$$ 2666900 2703848 2781784 2703932 2654221 2819351 2749565 2801862 2832098 2801175 2940426 2954790
6649B954790K4495J18432j53394l0028J2421j72614J30981O3750O791q4210O8649
$$ 2954790 2979285 3097717 2944323 2914295 2926716 2754102 2885083 2948833 2955624 2871414 2940063
6638B940063L258N2626J30736p2221K3505M4910j02765Q6425J62528l6038l9268
$$ 2940063 2943321 2995947 3126683 3054462 3077967 3122877 3020112 3106537 3269065 3233027 3193759
6627C193759K7015J2830J34797L1118o568J7167l9346l0223l2887K5436P2135
$$ 3193759 3220774 3233604 3368401 3399519 3392951 3410118 3370772 3340549 3307662 3333098 3405233
6616C405233j4095Q0158J31963m2172j2938J71184o7689q2519j6454m1208Q4526
$$ 3405233 3391138 3471296 3603259 3561087 3548149 3719333 3651644 3569125 3552671 3511463 3595989
6605C595989Q9501R8002l7280m4047k2842P096Q5827J42795j25565l9606O80o9342
$$ 3595989 3685490 3783492 3746212 3702165 3679323 3686419 3772246 3915041 3789476 3749870 3750550 3681208
6593C681208m9697Q0097J28148p0625K016l4877Q0582L9426O7587m6494Q6914
$$ 3681208 3631511 3711608 3839756 3769131 3771147 3736270 3816852 3856278 3923865 3877371 3964285
6582C964285K24884N0342P4963O2681N1557L3000K18490J66996L13575J49154
$$ 3964285 4189169 4239511 4314474 4377155 4428712 4461712 4680202 4847198 5160773 5309927
6572E309927K69683L63591M02242K07233k994K1727j98460k28469m40459l73555
$$ 5309927 5579610 5943201 6345443 6552676 6549682 6571409 6372949 6144480 5704021 5330466
6562E330466j66041j20680j28697k54412q5753J7707k8560n6167R848J765K7531
$$ 5330466 5164425 5043745 4915048 4660636 4574883 4592590 4564030 4507863 4517711 4519476 4547007
6551D547007M7816n7653K2413Q5718L5185J42693K2390r3608l1948r060M3325
$$ 4547007 4594823 4537170 4559583 4645301 4680486 4823179 4845569 4751961 4720013 4710953 4754278
6540D754278J047R5738m0884l7598q808P3953K3067N2590L1573J79885K4322k0402
$$ 4754278 4755325 4851063 4810179 4772581 4763773 4837726 4860793 4913383 4944956 5124841 5149163 5128761
6528E128761K2052m6200P8460M7373m6824J6066m2034o95J33506n290M1342K2443
$$ 5128761 5150813 5104613 5183073 5230446 5183622 5199688 5157654 5156959 5290465 5285175 5326517 5348960
6516E348960j1159J68136R6028R330p8873Q0081R9466n2252J26364R9139L6455
$$ 5348960 5337801 5505937 5601965 5611295 5532422 5612503 5711969 5659717 5786081 5885220 5921675
6505E921675R2400J3249r6028K8232L2080J00232P0480J42550J75041J63090N2285
$$ 5921675 6014075 6027324 5931296 5959528 5991608 6091840 6162320 6304870 6479911 6643001 6695286
6494F695286J66140J3172J69828J41140P5618J92240R7214j2887N2266K5664L1103
$$ 6695286 6861426 6874598 7044426 7185566 7261184 7453424 7550638 7537751 7590017 7615681 7646784
6483G646784J82250K38866N7917L9848N7128J47341J38527M1040K10031R1665
$$ 7646784 7829034 8067900 8125817 8165665 8222793 8370134 8508661 8549701 8759732 8851397
6473H851397J38964J90296K58118K60577J78186J14411J10458J55317J63967K59826
$$ 8851397 8990361 9180657 9438775 9699352 9877538 9991949 10102407 10257724 10421691 10681517
6463A0681517J70805J95694J51009K32152J76319Q1623K97160L36657L36306K99448
$$ 10681517 10852322 11048016 11199025 11431177 11607496 11689119 11986279 12322936 12659242 12958690
6453A2958690L35311K60653M29954K71400L09650L75647L09981L21257M25274
$$ 12958690 13294001 13554654 13984608 14256008 14565658 14941305 15251286 15572543 15997817
6444A5997817L67523L86408N98512N08143L99752O08823P00031N67883N81363
$$ 15997817 16365340 16751748 17350260 17858403 18258155 18866978 19567009 20134892 20716255
6435B0716255Q40794Q21111R26263J013667J076065J401648J318665J326543J421898
$$ 20716255 21557049 22378160 23304423 24318090 25394155 26795803 28114468 29441011 30862909
6426C0862909J680037K040541K138481K402485K627650K941532L567407L952654
$$ 30862909 32542946 34583487 36721968 39124453 41752103 44693635 48261042 52213696
6418E2213696M323501M479783M179681L594973K440162O49663j022765k160094
$$ 52213696 56537197 61016980 65196661 68791634 71231796 71881459 70858694 68698600
6410F8698600k689424k556995k031268j730629j447010o81261k82410K53721P95830
$$ 68698600 66009176 63452181 61420913 59690284 58243274 57562013 57279603 57533324 58329154
6401E8329154J309089J884392K381734L233938L780460M543837N572759O452537
$$ 58329154 59638243 61522635 63904369 67138307 70918767 75462604 81035363 87487900
6393H7487900P512064Q196360Q572682Q288231O846381L939230n94665n345450
$$ 87487900 94999964 103196324 111769006 120057237 126903618 130842848 130248183 124902733
6385A24902733q452177r062330p987714o352617n013222m498058m489371m401728
$$ 124902733 116450556 107388226 99400512 93047895 88034673 83536615 79047244 74645516
6377G4645516l880688l044330k280627j386752o74353P2417P01180J317807K010316
$$ 74645516 70764828 67720498 65439871 64053119 63378766 63451183 64152363 65470170 67480486
6368F7480486K499805K936840L415960L540656L209443K413987P31508j572015
$$ 67480486 69980291 72917131 76333091 79873747 83083190 85497177 86228685 84656670
6360H4656670l808544n077683n295339m627976l838510l147517k810222k581028
$$ 84656670 80848126 75770443 70475104 65847128 62008618 58861101 56050879 53469851
6352E3469851k801690k912847k907496k643416k341300k051540j743248j456908
$$ 53469851 50668161 47755314 44847818 42204402 39863102 37811562 36068314 34611406
6344C4611406j302554j109297r08759p60918q67379q67590q44359q00364p07018
$$ 34611406 33308852 32199555 31290796 30529878 29662499 28794909 27950550 27150186 26443168
6335B6443168p03513m49386n30822m99392m41589n02384m66982n01971o08178
$$ 26443168 25739655 25290269 24759447 24260055 23818466 23316082 22849100 22347129 21738951
6326B1738951n15029o11743n50441n09137n93091m82045l90864m75415m79350
$$ 21738951 21223922 20612179 20061738 19552601 18959510 18477465 18086601 17611186 17131836
6317A7131836l12377l33022m98669l09028l89452k41173k93615j87324k72400
$$ 17131836 16819459 16486437 15987768 15678740 15289288 15048115 14754500 14567176 14294776
6308A4294776j91623j55402l44361l60849k02380k65212q8544k49120k10594j56331
$$ 14294776 14103153 13947751 13603390 13242541 13040161 12774949 12686405 12437285 12226691 12070360
6298A2070360j66038n8438o2281j15417j32413j03046m9694k30685j71570N103
$$ 12070360 11904322 11845884 11783603 11668186 11535773 11432727 11383033 11152348 10980778 10985881
6288A0985881k71458j36321j37580j46669j86594k93174j75455n3694n6411r2423
$$ 10985881 10714423 10578102 10440522 10293853 10107259 9814085 9638630 9584936 9528525 9436102
6278I436102j25621j74154j73553j3391k08498j08144O728o6876q1539n7707L2617
$$ 9436102 9310481 9136327 8962774 8949383 8740885 8632741 8639469 8572593 8491054 8433347 8465964
6267H465964M6944j06305k11582k39116k07616k34170j11539j02776p6921m8172
$$ 8465964 8512908 8406603 8195021 7955905 7748289 7514119 7402580 7299804 7222883 7174711
6257G174711k4885j87248k65677M6432J31779o8248O216q6072N2426p1048n4457
$$ 7174711 7149826 6962578 6696901 6743333 6875112 6806864 6813080 6727008 6779434 6708386 6653929
6246F653929l8983k33866j89469j96164O4547j8929k181q7247j11689m8795k5334
$$ 6653929 6614946 6381080 6191611 5995447 6059994 6041065 6038884 5951637 5839948 5791153 5765819
6235E765819j5097p206n150m7847o1307q4258P4706k762j8897m3595J1761O8375
$$ 5765819 5750722 5743516 5738366 5690519 5629212 5544954 5619660 5616898 5598001 5554406 5566167 5634542
6223E634542j04041M1889J77253j864l3331j03463l0682o1113n3091L999j21315
$$ 5634542 5530501 5572390 5749643 5747779 5714448 5610985 5580303 5519190 5466099 5470098 5348783
6212E348783r3065k7233N2379m0703M9981Q4111L3505q4427j39932J28052j8510
$$ 5348783 5255718 5228485 5280864 5240161 5290142 5374253 5407758 5323331 5183399 5311451 5292941
6201E292941m2674J69682K3954q5006L0120q9442O1371M9661L6199J04549j11572
$$ 5292941 5250267 5419949 5443903 5358897 5389017 5299575 5360946 5410607 5446806 5551355 5439783
6190E439783n6547M8365R7028q1118j42774P8203J4459p1868L416O0211j4075
$$ 5439783 5383236 5431601 5528629 5447511 5304737 5382940 5397399 5325531 5328947 5389158 5375083
6179E375083r1866L5260j6472J23830P1174p7358q4592K0964J20187R0882R2733
$$ 5375083 5283217 5318477 5302005 5425835 5497009 5419651 5335059 5356023 5476210 5567092 5659825
6168E659825l4111j9680k9087J32814K5601k3676L3312k9726N8899o5125K4563
$$ 5659825 5625714 5606034 5576947 5709761 5735362 5711686 5744998 5715272 5774171 5709046 5733609
6157E733609N8135o8755J03621j0785L5110k8860R6077o0065P2248J78632R0674
$$ 5733609 5791744 5722989 5826610 5815825 5850935 5822075 5918152 5858087 5930335 6108967 6199641
6146F199641P3639J2711l1486J40779J00101o6375N8189M2350J75159N2609M7014
$$ 6199641 6273280 6285991 6254505 6395284 6495385 6429010 6487199 6529549 6704708 6757317 6804331
6135F804331k944J58538p681J9703O8491J42397k6448Q0619J59120N0368M1471
$$ 6804331 6801387 6959925 6952244 6971947 7040438 7182835 7156387 7237006 7396126 7446494 7487965
6124G487965J42946J60383k0949P5676K23747K38071J79155K4726p739M083L7009
$$ 7487965 7630911 7791294 7770345 7846021 8069768 8307839 8486994 8511720 8503981 8508064 8545073
6113H545073k3294J18786J05238n9999N9737K89874J28307O676Q6771J54057J28172
$$ 8545073 8521779 8640565 8745803 8685804 8745541 9035415 9163722 9170398 9257169 9411226 9539398
6102I539398J88533J37969J38689J50792L39149R9568K0542K49543J68346K33488
$$ 9539398 9727931 9865900 10004589 10155381 10494530 10594098 10614640 10864183 11032529 11266017
6092A1266017K66521K17522K10190J96491J51089L51582L10984K18596L26258
$$ 11266017 11532538 11750060 11960250 12156741 12307830 12659412 12970396 13188992 13515250
6083A3515250K32300K54558M48065M61781N38797N22820L76777L62365N66605
$$ 13515250 13747550 14002108 14450173 14911954 15450751 15973571 16350348 16712713 17279318
6074A7279318M43190N82906O79760Q06034Q49652Q40839R72968J166345J325798
$$ 17279318 17722508 18305414 18985174 19791208 20640860 21481699 22454667 23621012 24946810
6065B4946810J499561J770372K210994K637600L048315L752009M657451N435475
$$ 24946810 26446371 28216743 30427737 33065337 36113652 39865661 44523112 49958587
6057D9958587N673144N265928L268568o95064l892861m928697m078289k584103
$$ 49958587 55631731 60897659 64166227 63471163 59578302 54649605 50571316 47987213
6049D7987213j137965J06568J215115K560642L355616L657304L313648J489211
$$ 47987213 46849248 46955816 48170931 50731573 54087189 57744493 61058141 62547352
6041F2547352j49298k76896R21020K503438L367906L107440J014072j939427m210787
$$ 62547352 62398054 62121158 63042178 65545616 68913522 72020962 73035034 71095607 66884820
6032F6884820m726276l713016j919601j86318R40391J332707R8104j854246l099643
$$ 66884820 62158544 58445528 56525927 56339609 57280000 58612707 58710811 56856565 53756922
6023E3756922k766702j371139P8431J171814K226823L373550L909933L671056
$$ 53756922 50990220 49619081 49697512 50869326 53096149 56469699 60379632 64050688
6015F4050688K184951j909740o189176p961073p489328o175418m549787l471705
$$ 64050688 66235639 64325899 58136723 50175650 42686322 36510904 31961117 28489412
6007B8489412k698067k129498j750824j271729j127108j000489p20227n74416
$$ 28489412 25791345 23661847 21911023 20639294 19512186 18511697 17791470 17217054
5999A7217054m76188m28577m38429n00682m70225l47561l95065l30625l96907
$$ 17217054 16740866 16312289 15873860 15373178 14902953 14555392 14160327 13829702 13432795
5990A3432795k46349k34273k95978l55996r9199j61312p4836j92028j32659j16719
$$ 13432795 13186446 12952173 12656195 12300199 12201000 12039688 11964852 11772824 11640165 11523446
5980A1523446K4260J06078L2821j27564j527N2520j77543j81742j68565j91232
$$ 11523446 11547706 11653784 11686605 11559041 11557514 11610034 11432491 11250749 11082184 10890952
5970A0890952j44904k57855j15184p4142k32294o7537j05774j02614q1535k6812
$$ 10890952 10746048 10488193 10373009 10298867 10066573 9999036 9893262 9790648 9709113 9682301
5960I682301O550j49486N3833O681n7096L1382N3910R8553N7103l8991q8927M9178
$$ 9682301 9688851 9539365 9593198 9599879 9542783 9574165 9628075 9726628 9783731 9744740 9655813 9704991
5948I704991J4492n4185p5775j146j30213j3241n9384k5959p1153K7892q035N5494
$$ 9704991 9719483 9665298 9589523 9588377 9458164 9444923 9385539 9359580 9288427 9316319 9308284 9363778
5936I363778q772j18875J74009O2031Q3490J68748j1997M6599J07262M3604n2784
$$ 9363778 9355006 9236131 9410140 9472171 9555661 9724409 9712412 9759011 9866273 9909877 9857093
5925I857093L2212O5034l116K02742j5348N0722J59547K1327P0591j5961J25109
$$ 9857093 9889305 9954339 9951223 10153965 10138617 10189339 10348886 10370213 10440804 10424843 10549952
5914A0549952O612N2132J41270R6374O6945L5157J43980K33996j37J52642R6559
$$ 10549952 10556564 10608696 10749966 10846340 10913285 10948442 11092422 11326418 11326281 11478923 11575482
5903A1575482K80393J72182J87993K03225J60598K20290K19276K57721J78454
$$ 11575482 11855875 12028057 12216050 12419275 12579873 12800163 13019439 13277160 13455614
5894A3455614K01012K92986J96005P8457L02586L64716J30134J38817L05516M27920
$$ 13455614 13656626 13949612 14145617 14224074 14526660 14891376 15021510 15160327 15465843 15893763
5884A5893763N09026K12333K57493K58094N76990L31960L25786L30585M47599
$$ 15893763 16402789 16615122 16872615 17130709 17707699 18039659 18365445 18696030 19143629
5875A9143629N13019M38475M91406M53398O34840O47945O53782O35425P48804
$$ 19143629 19656648 20095123 20586529 21039927 21674767 22322712 22976494 23611919 24360723
5866B4360723Q00111Q41410R39391J053103J148017J153252J376571J473115J689090
$$ 24360723 25160834 26002244 26941635 27994738 29142755 30296007 31672578 33145693 34834783
5857C4834783J773017J953689K165605K362854K673266K846713L154676L383853
$$ 34834783 36607800 38561489 40727094 43089948 45763214 48609927 51764603 55148456
5849E5148456M015087M685391N066438N074893M047652K320500m45530k704408
$$ 55148456 59163543 63848934 68915372 73990265 78037917 80358417 79912887 77208479
5841G7208479m144482m199754l482859k721211j512397p27531Q7077R21420J507531
$$ 77208479 73063997 68864243 65381384 62660173 61147776 60420245 60507322 61428742 62936273
5832F2936273J963677K540040L116967L679704L991968M014989L772255L814921
$$ 62936273 64899950 67439990 70556957 74236661 78228629 82243618 86015873 89830794
5824H9830794M405309N601204O888489P907870P960685O018683J687466m093244
$$ 89830794 94236103 99837307 106725796 114633666 122594351 128613034 130300500 126207256
5816A26207256q718293j0521490j0089045q712839p013235n372937l864744k665568
$$ 126207256 117488963 106967473 96878428 88165589 81152354 75779417 71914673 69249105
5808F9249105j708785q84713q3804O18691J317335J910650K343651K730405K267236
$$ 69249105 67540320 66655607 66571803 67190494 68507829 70418479 72762130 75492535 77759771
5799G7759771J154507L04367j5821J21549O65930P95447L27588q82656k863974
$$ 77759771 78914278 79218645 79202824 79324373 79990303 80785750 81113338 80230682 77366708
5790G7366708m351038n080837n173818m620090l787141k989077k457933j904901
$$ 77366708 73015670 67934833 62761015 58140925 54353784 51364707 48906774 47001873
5782D7001873j296300j030377q75130p18515q01762n02237k70715j54762q3136
$$ 47001873 45705573 44675196 43800066 43081551 42279789 41777552 41506837 41352075 41268939
5773D1268939k66353l10700o09247j073555j076900r97237q59016o72220o23625
$$ 41268939 41002586 40691886 40082639 39009084 37932184 36934947 36075931 35403711 34780086
5764C4780086q29803j193418j296042j130956q65656n40476m01063l13817k29295
$$ 34780086 33950283 32756865 31460823 30329867 29464211 28923735 28522672 28208855 27979560
5755B7979560q2498j79934k10862j71548k71589k58810m42932o40670o01235o32460
$$ 27979560 27897062 27717128 27506266 27334718 27063129 26804319 26361387 25720717 25119482 24487022
5745B4487022n56176m87633m82541k92825l33789j93311j51480n4770J14923J2638
$$ 24487022 23930846 23443213 22960672 22667847 22334058 22140747 21989267 21934497 22049420 22062058
5735B2062058j20748r4981j84838j03531j05188j17569j19622j80903k02628k19973
$$ 22062058 21941310 21846329 21661491 21557960 21452772 21335203 21215581 21034678 20832050 20612077
5725B0612077j29987k51942j15502j65327j42116j27785R1771K5295j36853n1268
$$ 20612077 20482090 20230148 20114646 19949319 19807203 19679418 19771189 19796484 19659631 19608363
5715A9608363l2641o6711m4339k2326J8034l1910j4213P309p344J13057q58N0667
$$ 19608363 19575722 19509011 19464672 19442346 19460380 19428470 19414257 19421566 19414222 19527279 19526421 19577088
5703A9577088R4290P3557k29023k70129k03502j50069o4482o888J4741O85K8527
$$ 19577088 19671378 19744935 19515912 19245783 19042281 18892212 18827730 18820842 18835583 18836268 18864795
5692A8864795q692k2843j24167r0895r1484q1839k64125j73741R0708j8756r6041
$$ 18864795 18856103 18833260 18709093 18618198 18526714 18444875 18180750 18007009 18097717 18078961 17982920
5681A7982920J52826R0603R3483J74679R0324J72058M6748K38101L51703K75800
$$ 17982920 18135746 18226349 18319832 18494511 18584835 18756893 18803641 19041742 19393445 19669245
5671A9669245K29545J85369p6475n1853j17627k20441o4826J1407n7268l8681
$$ 19669245 19898790 20084159 20007684 19955831 19838204 19617763 19552937 19564344 19507076 19468395
5661A9468395J09347J67200O0420J84518K37418L26932M28396M39263N17885M58388
$$ 19468395 19577742 19744942 19805362 19989880 20227298 20554230 20982626 21421889 21939774 22398162
5651B2398162P21753Q48476P78569Q02719O78285J86664m15099l15794l2913J78493
$$ 22398162 23119915 23968391 24746960 25549679 26227964 26414628 25999529 25683735 25650822 25829315
5641B5829315L15318K68102L6832q5364j72719l20426m01809l48290m8005n016
$$ 25829315 26144633 26412735 26449567 26364203 26191484 25871058 25469249 25120959 25072954 25067938
5631B5067938q9201M8529J14114K37827J80183K65165N18431M22992P31994Q42762
$$ 25067938 24978737 25027266 25141380 25379207 25559390 25824555 26342986 26765978 27497972 28340734
5621B8340734N97674L11129K3519k00446k97994k59120k13028p1053j61221j71395
$$ 28340734 28938408 29249537 29273056 29072610 28774616 28515496 28302468 28231415 28070194 27898799
5611B7898799j02455l0140j7813o0428M7562K79297K99595K34570L44681L95398
$$ 27898799 27796344 27766204 27748391 27687963 27735525 28014822 28314417 28548987 28893668 29289066
5601B9289066M04985N61993M99780N07049K21325j79304l64760o24899l86376
$$ 29289066 29694051 30256044 30755824 31262873 31484198 31304894 30940134 30315235 29928859
5592B9928859k85785j8857J22619J63973P8167J93743Q8472J16390K20062J30073
$$ 29928859 29643074 29624217 29746836 29910809 29988976 30182719 30271191 30387581 30607643 30737716
5582C0737716J53763K61935L72554K91241K01030J82057K60517L34687M08763
$$ 30737716 30891479 31153414 31525968 31817209 32018239 32200296 32460813 32795500 33204263
5573C3204263M63589M95578M05041M40994K48770K06263K99650J56458K88449
$$ 33204263 33667852 34163430 34568471 35009465 35258235 35464498 35764148 35920606 36209055
5564C6209055K52973N2261J09982J63279J40740J45134L00258L88771M82301P00252
$$ 36209055 36462028 36514289 36624271 36787550 36928290 37073424 37373682 37762453 38244754 38945006
5554C8945006Q28261P65013P92363P90173N63130L73708M92180L09162J44921
$$ 38945006 39773267 40538280 41330643 42120816 42683946 43057654 43549834 43858996 44003917
5545D4003917K08618K59148M96482O74296O65903Q26170Q18030Q01543R84441
$$ 44003917 44212535 44471683 44968165 45642461 46308364 47134534 47952564 48754107 49738548
5536D9738548Q31646Q30641R61074J349594J480283J361943J457777J582893J461613
$$ 49738548 50570194 51400835 52361909 53711503 55191786 56553729 58011506 59594399 61056012
5527F1056012J500930J315045R96708J094481J166315J198637J578984J823968
$$ 61056012 62556942 63871987 64868695 65963176 67129491 68328128 69907112 71731080
5519G1731080J874232K020850K240087K445143K609735K677453K647240K543522
$$ 71731080 73605312 75626162 77866249 80311392 82921127 85598580 88245820 90789342
5511I0789342K656022L120552L302652L405423L501107L531466L674759M076598
$$ 90789342 93445364 96565916 99868568 103273991 106775098 110306564 113981323 118057921
5503A18057921M477475M437496M111384L329773K513926J749719K053487K967167
$$ 118057921 122535396 126972892 131084276 134414049 136927975 138677694 140731181 143698348
5495A43698348L921791N109621O822347Q926305J1230449J2957696J2888604J0071760
$$ 143698348 147620139 152729760 159552107 168478412 179708861 192666557 205555161 215626921
5487B15626921M385822q49066k098161K74989M348582R092720J3523277J8493428
$$ 215626921 220012743 219163677 217065516 217340505 221689087 230781807 244305084 262798512
5479B62798512K3571806K9324708L4907636L9201126L9957527L4335221K2944573
$$ 262798512 286370318 315695026 350602662 389803788 429761315 464096536 487041109
5472D87041109o53145l4097440n5831513n9101983n0955008l9260524k9475167
$$ 487041109 486387964 452290524 396459011 337357028 286402020 247141496 217666329
5465B17666329k1929963j6023330j1658054q756050o501250m724068l262517j720341
$$ 217666329 195736366 179713036 168054982 159298932 152797682 148073614 144811097 143090756
5457A43090756J12746J640135L047513L971397M270917L828699J231081l526071
$$ 143090756 143203502 144843637 147891150 151862547 156133464 159962163 161193244 157667173
5449A57667173p082829q051994p591837o037255m509196k977606j307751J5294
$$ 157667173 150584344 142532350 134940513 128903258 124394062 121416456 120108705 120123999
5441A20123999Q51754Q84937n93308k308522k790585j699629K54066J999784L063840
$$ 120123999 120975753 121860690 121267382 118958860 116168275 114468646 114722712 116722496 119786336
5432A19786336L111839J656829j227050m305914n552802n048654l497840k080158
$$ 119786336 122898175 124555004 123327954 119022040 113469238 108420584 104922744 102842586
5424A02842586j079825j319319k922790m223774m268956l233630j966806o46845
$$ 102842586 101762761 100443442 97520652 93296878 89027922 85794292 83827486 83180641
5416H3180641M43706J607521K480256K993906K665742J091314k497786n998595
$$ 83180641 83624347 85231868 87712124 90706030 93371772 94463086 91965300 85966705
5408H5966705p189665o573674n527082m338748l299756k502688k095076j599049
$$ 85966705 78777040 72203366 66676284 62337536 59037780 56535092 54440016 52840967
5400E2840967j310500j165413q38848o09213l45077j56837O4474j13586p31468
$$ 52840967 51530467 50365054 49526206 48916993 48571916 48415079 48479553 48365967 47634499
5391D7634499j317947j441916j293008j140386q89895o91791n92046m92907l88518
$$ 47634499 46316552 44874636 43581628 42441242 41551347 40859556 40267510 39774603 39386085
5382C9386085l28179l58332k81245l02194m63387m18281n85466o47061n97403
$$ 39386085 39057906 38699574 38418329 38116135 37652748 37234467 36649001 36001940 35404537
5373C5404537p31627p01140n04218m65821l82004k44833l43315l13313k48809
$$ 35404537 34672910 33971770 33467552 33001731 32619727 32374894 32031579 31718266 31469457
5364C1469457l40183k33318k95902l61282n27239m34069m11340m75642l76664
$$ 31469457 31129274 30895956 30600054 30238772 29711533 29277464 28866124 28390482 28013818
5355B8013818m09443l93380l75033k46334m66485n07047l11233j70489k18643
$$ 28013818 27604375 27210995 26835962 26589628 26123143 25616096 25304863 25134374 24915731
5346B4915731l36845m42849l97014l17973r2232j49296j89899r5937r3983j13609
$$ 24915731 24578886 24136037 23739023 23421050 23328818 23179522 22989623 22893686 22799703 22686094
5336B2686094j80192j07406p5025j64492j17704j73645j36488j38919j92427k62592
$$ 22686094 22505902 22398496 22323471 22158979 22041275 21867630 21731142 21592223 21399796 21137204
5326B1137204k58593k28922j52034j02023o9733k1231j99718k09807j44284q5328
$$ 21137204 20878611 20649689 20497655 20395632 20325899 20304668 20104950 19895143 19750859 19665531
5316A9665531O2781j60130j70449K6668L6983L5622p5251J89129Q8237J19841
$$ 19665531 19728312 19568182 19397733 19424401 19461384 19497006 19421755 19610884 19699121 19818962
5306A9818962J88814J60965N2552R1776j69237j77190j96925j42767j81198j68838
$$ 19818962 20007776 20168741 20221293 20313069 20143832 19966642 19769717 19626950 19445752 19276914
5296A9276914j06260j15975j21697j13927K6690O82o4846r10j4184o075P264o8061
$$ 19276914 19170654 19054679 18932982 18819055 18845745 18846427 18781581 18780671 18766487 18760412 18767676 18699615
5284A8699615J46626q8078N328J01447K09101Q2604J27403J12466P3809Q2606
$$ 18699615 18846241 18758163 18763491 18864938 19074039 19156643 19284046 19396512 19470321 19552927
5274A9552927J85502R1036O1373J13802j12124j26719O8983Q6544J66793K44710
$$ 19552927 19738429 19829465 19890838 20004640 19892516 19765797 19834780 19921324 20088117 20332827
5264B0332827J47608J92119K72007L43442L41444K86380M06605M31668M10551
$$ 20332827 20480435 20672554 20944561 21288003 21629447 21915827 22322432 22754100 23164651
5255B3164651L98005K75543K86636J37448l1544k84098j77458j87852k70253k7170
$$ 23164651 23562656 23838199 24124835 24262283 24230739 23946641 23769183 23581331 23311078 23283908
5245B3283908q4584L3506K82180K19567L88105M74356M69563M16505L42532K40251
$$ 23283908 23199324 23232830 23515010 23734577 24122682 24597038 25066601 25483106 25825638 26065889
5235B6065889J96288O1289k37662m35183n24300m33081l23200k94493k75616k06592
$$ 26065889 26262177 26323466 26085804 25650621 25126321 24693240 24370040 24075547 23799931 23593339
5225B3593339R012L30112K97608K41963L90896M53658P04806P52996Q30244P46696
$$ 23593339 23602351 23932463 24230071 24472034 24862930 25316588 26021394 26774390 27604634 28351330
5215B8351330Q21352P10878M58828L84070O3352j62536k96991l87795l99671m74229
$$ 28351330 29172682 29883560 30342388 30726458 30789810 30627274 30330283 29942488 29542817 29068588
5205B9068588m73586k34618j18636R0053M7274J27760j9799k7926j36960k03266
$$ 29068588 28595002 28360384 28241748 28331801 28379075 28506835 28487036 28459110 28322150 28118884
5195B8118884l87062n38270p23151p47751p37990o51604n69859o80966m44579
$$ 28118884 27731822 27193552 26470401 25722650 24984660 24333056 23763197 23082231 22637652
5186B2637652k38938j88025k26226L6731J82085Q3759J86009L55908L46065L23860
$$ 22637652 22398714 22210689 21984463 22021194 22203279 22287038 22473047 22828955 23175020 23498880
5176B3498880L01607J76260K15169p7925j64324j38197k72021k64230L3090n0609
$$ 23498880 23800487 23976747 24191916 24113991 23949667 23811470 23539449 23275219 23308309 23257700
5166B3257700j43059J03829Q4326k1304O1155K5954j17376j56260l39313k63381
$$ 23257700 23114641 23218470 23302796 23281492 23342647 23368601 23251225 23094965 22755652 22492271
5156B2492271l26621l55658m63887l70434m26494l54679l39743k05274m11461
$$ 22492271 22165650 21809992 21346105 20975671 20549177 20194498 19854755 19649481 19238020
5147A9238020k52792j96639l21260k57113k13080j12849j84248p5569L7725p0767
$$ 19238020 18985228 18788589 18467329 18210216 17997136 17884287 17700039 17624470 17662195 17591428
5137A7591428N8604j7847K7479J38881J60334K43319J29387J45525Q5927M4656
$$ 17591428 17650032 17632185 17659664 17798545 17958879 18202198 18331585 18477110 18563037 18607693
5127A8607693j0259l7316j68494j97501j90684k57217k90753j80880j21453P5077
$$ 18607693 18597434 18560118 18391624 18194123 18003439 17746222 17455469 17274589 17153136 17228213
5117A7228213O6087r8882l4964M3514J06353J86468P2117K47715M34583L03300
$$ 17228213 17294300 17195418 17160454 17203968 17310321 17496789 17568906 17816621 18251204 18554504
5107A8554504L62588N87482N79187L38038K5047l37064n66853m15241j67384j73562
$$ 18554504 18917092 19504574 20083761 20421799 20446846 20109782 19542929 19127688 18960304 18786742
5097A8786742n6608l0261p9385k12781j78431l41268m19473j58663j69598n4225
$$ 18786742 18730134 18699873 18620488 18407707 18229276 17888008 17468535 17309872 17140274 17086049
5087A7086049k9042j9286o0284O2049J44957n3579j21702n6164j68952o6723J08860
$$ 17086049 17057007 17037721 16977437 17039486 17184443 17130864 17009162 16952998 16784046 16717323 16826183
5076A6826183j6795M8458Q9949Q0157K1436M1811P3580O0862O30Q6055M3353J57516
$$ 16826183 16809388 16857846 16947795 17027952 17049388 17091199 17164779 17225641 17226271 17312326 17355679 17513195
5064A7513195J85680J17516j11028j76947j60640k57670j51944j65809j40803
$$ 17513195 17698875 17816391 17705363 17528416 17367776 17110106 16958162 16792353 16651550
5055A6651550q4875k16604o9991O7070j23970r027N956j02195O5495J4171N9452
$$ 16651550 16566675 16350071 16280080 16347150 16223180 16214153 16220109 16117914 16183409 16197580 16257032
5044A6257032J24445k1274k1639Q4111Q9751m7547l903P4924o9093j8037J38884
$$ 16257032 16381477 16360203 16338564 16422675 16512426 16464879 16460976 16535900 16466807 16448770 16587654
5033A6587654Q0374j7209K0034J63267J38322Q9093O4258J43143K08968K30701
$$ 16587654 16668028 16650819 16670853 16834120 16972442 17061535 17125793 17268936 17477904 17708605
5023A7708605K75100K34410J49981K03383K49259K06067K06812K16283J12539
$$ 17708605 17983705 18218115 18368096 18571479 18820738 19026805 19233617 19449900 19562439
5014A9562439J85783K18432L47965J93833J10140J26035J27833J40793K14871
$$ 19562439 19748222 19966654 20314619 20508452 20618592 20744627 20872460 21013253 21228124
5005B1228124J56207J64675K72668M72506L67818L89881K22939L55954K99128
$$ 21228124 21384331 21549006 21821674 22294180 22661998 23051879 23274818 23630772 23929900
4996B3929900M15743L59615J26572K13965J91237L36585M53067P41211P28703
$$ 23929900 24345643 24705258 24831830 25045795 25237032 25573617 26026684 26767895 27496598
4987B7496598P60686P69595N57125L71012J61666O796o2845q962N9269K60105
$$ 27496598 28257284 29026879 29584004 29955016 30116682 30123478 30060633 30051671 30110940 30371045
4977C0371045K77127O57811N27071O36828O73470R05888J175230J311778J404378
$$ 30371045 30648172 31305983 31833054 32469882 33143352 34049240 35224470 36536248 37940626
4968C7940626J627031J729523J782158J866596J685823J565037J188639J094662
$$ 37940626 39567657 41297180 43079338 44945934 46631757 48196794 49385433 50480095
4960E0480095O91838M28753K50703q8684k32828l86155o21092o26739o74997m17539
$$ 50480095 51171933 51600686 51851389 51762705 51529877 51143722 50522630 49895891 49220894 48803355
4950D8803355l17183k84543K7546K28807M87797P26612P51021J122446J217950
$$ 48803355 48486172 48201629 48229175 48457982 48945779 49672391 50423412 51545858 52763808
4941E2763808J389616J734412K270496K734671L084519L468147L802511M293824
$$ 52763808 54153424 55887836 58158332 60893003 63977522 67445669 71248180 75542004
4933G5542004M939620N832784P345178Q890107J0635639J2794152J5931456J9843247
$$ 75542004 80481624 86314408 93659586 102549693 113185332 125979484 141910940 161754187
4925A61754187K5302030L2982333L7958367L7238611L0454584o146470m0818839
$$ 161754187 187056217 220038550 257996917 295235528 325690112 319543642 278724803
4918B78724803m6827273m0417017k8793620k0519935j4931832j1524740q572526
$$ 278724803 231897530 191480513 162686893 142166958 127235126 115710386 107137860
4911A07137860p078631o284122n834561n416206n127247m148929l338163k732999
$$ 107137860 100059229 93775107 87940546 82524340 77397093 73248164 69910001 67177002
4903F7177002k427837j960417k200691k485361k734290k764292k702129k442844
$$ 67177002 64749165 62788748 60588057 58102696 55368406 52604114 49901985 47459141
4895D7459141k118286j765551j676663j445950j263039j053977j135722q81951
$$ 47459141 45340855 43575304 41898641 40452691 39189652 38135675 36999953 36118002
4887C6118002o52484n60968n43508l94277l48089n88925l47792l19430l34966
$$ 36118002 35465518 34904550 34361042 33966765 33618676 33029751 32681959 32362529 32027563
4878C2027563Q025j42571n7705J29651j2377J8002r815k8529j90155j39781n0089
$$ 32027563 32035588 31893017 31835312 31964963 31952586 31970588 31960773 31932244 31742089 31602308 31552219
4867C1552219j22969r4556J67623J94075J11012j8407j94439p05307j202932j064232
$$ 31552219 31429250 31334694 31502317 31696392 31807404 31788997 31594558 30889251 29686319 28622087
4857B8622087j106969q20651o26816m25603j45396k75636j74176k17780k70834
$$ 28622087 27515118 26694467 26067651 25642048 25496652 25221016 25046840 24829060 24558226
4848B4558226l53357k12022n8193j76530l00820j20752n8302k23428r5518l02689
$$ 24558226 24204869 23992847 23934654 23758124 23457304 23336552 23278250 23054822 22959304 22656615
4838B2656615k65220m547j86840j91512k3085j38598J05707J41668L14882J47200
$$ 22656615 22391395 22386848 22200008 22008496 21985411 21846813 21952520 22094188 22409070 22556270
4828B2556270L57802L76110M56749M43605O03617M57208N07456P92896R19334
$$ 22556270 22914072 23290182 23746931 24190536 24794153 25251361 25758817 26551713 27471047
4819B7471047J003740R13061M17306J11986l10379j086352j469765j343279j233970
$$ 27471047 28474787 29387848 29805154 29917140 29606761 28520409 27050644 25707365 24473395
4810B4473395r22555o90291o80926l92723m87315k28732j62307j13714j0818J77199
$$ 24473395 23550840 22860549 22179623 21786900 21299585 21070853 20908546 20794832 20784014 20961213
4800B0961213o4850p917K3419M5970R5251J71874J83059K93076K78499L95468
$$ 20961213 20896363 20888446 20911865 20957835 21053086 21224960 21408019 21701095 21979594 22375062
4790B2375062K17843J99877N0745j13779k6643O3827j67169m16420n39399n73488
$$ 22375062 22592905 22792782 22843527 22729748 22703105 22766932 22599763 22183343 21643944 21070456
4780B1070456m66802n68222n04526l47574l31584j62497j70826k27685j39864
$$ 21070456 20603654 20035432 19530906 19183332 18851748 18689251 18518425 18290740 18150876
4771A8150876J6947j28998O3911O7073j44867J37754J68507P0697R1461P5547
$$ 18150876 18167823 18038825 18102736 18169809 18024942 18162696 18331203 18401900 18493361 18568908
4761A8568908J10563q6090Q260q4095K9381R6121R7788J5104O0931J35710Q740
$$ 18568908 18679471 18593381 18601641 18517546 18546927 18643048 18740836 18755940 18816871 18952581 18961321
4750A8961321K05004J50653J14772J51252m85J42118J55919J55010J76355J98882
$$ 18961321 19166325 19316978 19431750 19583002 19582517 19724635 19880554 20035564 20211919 20410801
4740B0410801J11010M0813J33950J83828K2935J81389K95764K5402l788P219K22922
$$ 20410801 20521811 20562624 20696574 20880402 20903337 21084726 21380490 21405892 21402104 21409323 21632245
4729B1632245K66659L02645K66178M68158L64322O30409M48802M29193M83380
$$ 21632245 21898904 22201549 22467727 22935885 23300207 23930616 24379418 24808611 25291991
4720B5291991N10219P19406P07907Q61410R45502J090419J361068J617482J710980
$$ 25291991 25802210 26521616 27229523 28090933 29036435 30126854 31487922 33105404 34816384
4711C4816384J912473K294001K655642K939055K940910K506911J653131M40578
$$ 34816384 36728857 39022858 41678500 44617555 47558465 50065376 51718507 52159085
4703E2159085q14555j981385k715777l038756k848715k558009k164614j629351
$$ 52159085 51344530 49363145 46647368 43608612 40759897 38201888 36037274 34407923
4695C4407923j449195j259401r75450q18255p71615n48239m64772k37601r5191
$$ 34407923 32958728 31699327 30723877 29905622 29134007 28585768 28120996 27883395 27788204
4686B7788204j32014r1396Q8166K7689J11379J79300K17627K56696K93155M02586
$$ 27788204 27656190 27564794 27652960 27680649 27792028 27971328 28188955 28445651 28738806 29141392
4676B9141392M02569M52260N85464O65682Q09389Q53532R61834J198407J332019
$$ 29141392 29543961 29996221 30581685 31247367 32056756 32910288 33872122 35070529 36402548
4667C6402548J571345J756342K187987K377336K528213K364116J475824J94720
$$ 36402548 37973893 39730235 41918222 44295558 46823771 49187887 50663711 50858431
4659E0858431r75094j627584j991327k099069j963945j755834j607601j466268
$$ 50858431 49883337 48255753 46264426 44165357 42201412 40445578 38837977 37371709
4651C7371709j185021r61301p91255p32310n76597k90430l13548j77446k33727
$$ 37371709 36186688 35225387 34434132 33701822 33125225 32834795 32521247 32343801 32110074
4642C2110074j67012k42418q1519O4553P8946L00881K17686K30537L84283L87164
$$ 32110074 31943062 31700644 31619125 31683678 31762624 32063505 32281191 32511728 32896011 33283175
4632C3283175K97544L08923L71967M19608N88948N86384O71783P18767Q49256
$$ 33283175 33580719 33889642 34261609 34681217 35270165 35856549 36528332 37247099 38096355
4623C8096355Q50477Q70718R21428O83389N89451N32134M73348L16234N9525j41488
$$ 38096355 38946832 39817550 40738978 41422367 42011818 42543952 43017300 43333534 43393059 43251571
4613D3251571m73331q21142j044295j317724j117147j070121r36175p23584o69679
$$ 43251571 42778240 41957098 40912803 39595079 38477932 37407811 36471636 35748052 35078373
4604C5078373o09891n82222o66407m86212k55906j84018j69514r8775M8437J15874
$$ 35078373 34468482 33886260 33219853 32733641 32477735 32293717 32124203 32025428 32073865 32189739
4594C2189739K10745L84763L37965M74249N12905L36978N17034O32301O58587
$$ 32189739 32400484 32785247 33123212 33597461 34110366 34447344 34964378 35596679 36255266
4585C6255266R20710R72240J003217J299094J344626J353390J284010Q95127N32807
$$ 36255266 37175976 38148216 39151433 40450527 41795153 43148543 44432553 45327680 45860487
4576D5860487K07099L5960l68694m98429p97366q36290r45889q63848p47704n92152
$$ 45860487 46067586 46103546 45734852 45236423 44439057 43602767 42656878 41793030 41045326 40453174
4566D0453174n15354k04370r4850O9295K31532M26786O41984N66533M79944L67934
$$ 40453174 39937820 39733450 39638600 39707895 39939427 40366213 41008197 41574730 42054674 42422608
4556D2422608K55012M9666L0390K0444J07156J55398M60782M98103P18767Q55513
$$ 42422608 42677620 42727286 42757676 42778120 42885276 43040674 43501456 43999559 44718326 45573839
4546D5573839Q20741Q69360J149539J272257J384879J467736J480458J377559
$$ 45573839 46394580 47263940 48413479 49685736 51070615 52538351 54018809 55396368
4538E5396368J415772J134568R56182R18724R59823J035732J589568J936182K500595
$$ 55396368 56812140 57946708 58902890 59821614 60781437 61817169 63406737 65342919 67843514
4529F7843514K860733L104759L422531L925957M406755N242072O446470P692139
$$ 67843514 70704247 73809006 77231537 81157494 85564249 90806321 97252791 104944930
4521A04944930R084382J0830224J2581882J4264627J5505772J5218003J2603370
$$ 104944930 114029312 124859536 137441418 151706045 167211817 182429820 195033190
4514A95033190P001986j527758j0433100j6565339j8644318j7429637j5089434
$$ 195033190 202035176 200507418 190074318 173508979 154864661 137435024 122345590
4507A22345590j2308471j0053126q415535p064501o045721n359021m623533m307675
$$ 122345590 110037119 99983993 91568458 84503957 78458236 73099215 68475682 64168007
4499F4168007l802032l371557k874971k514280k248225j862115j807714j501492
$$ 64168007 60365975 56994418 54119447 51605167 49356942 47494827 45687113 44185621
4491D4185621j262233j383180j229916j145251q19113p78991q11513n62937m28354
$$ 44185621 42923388 41540208 40310292 39165041 38345928 37566937 36755424 36192487 35764133
4482C5764133k19554k07531j95705n5713m8410L2868q7563k07943k98877l53451
$$ 35764133 35544579 35337048 35141343 35085630 35037220 35070088 34982525 34774582 34475705 34122254
4472C4122254j03429j26419o3198M3778J14676K24116L80596O41843O15454N60513
$$ 34122254 34018825 33892406 33829208 33872986 33987662 34211778 34592374 35234217 35849671 36410184
4462C6410184O47812N76120L08166R5863m19433q98888j056673r65963r56924
$$ 36410184 37057996 37634116 37942282 38038145 37618712 36719824 35663151 34697188 33740264
4453C3740264q14336m32246k36399j86841J4012L78822Q00917O96314P23398O12336
$$ 33740264 32925928 32493682 32257283 32070442 32084454 32463276 33264193 33960507 34683905 35296241
4443C5296241K69636J8972n54959q88363j074445j414052j340794j214040j128541
$$ 35296241 35565877 35584849 35029890 34141527 33067082 31653030 30312236 29098196 27969655
4434B7969655q86667n55419m68711l44546n4173j26258P8436J64250J89017K97086
$$ 27969655 27082988 26527569 26058858 25714312 25660139 25533881 25612317 25776567 25965584 26262670
4424B6262670R6275M91020N31613M77833N09672K82989K46520j88889n31594o58023
$$ 26262670 26358945 26849965 27381578 27859411 28369083 28652072 28898592 28709703 28178109 27520086
4414B7520086n49951m94578m90719m11392l11383j01970J9137J7095l6857q5530
$$ 27520086 26970135 26475557 25984838 25573446 25262063 25160093 25179230 25196325 25159468 25073938
4404B5073938q5062j49862k76203n32192p38893p84746q48328q56106n20499n20042
$$ 25073938 24988876 24839014 24562811 24030619 23291726 22506980 21658652 20802546 20282047 19762005
4394A9762005l97575l11216l14334l71719l81538k79514k45250k87260j70297
$$ 19762005 19364430 19053214 18738880 18367161 17985623 17706109 17460859 17173599 17003302
4385A7003302j85886J2305o5337k49930K287r213K1449o2741m4629J02747m7300
$$ 17003302 16817416 16829721 16764384 16514454 16516741 16507528 16528977 16466236 16421607 16524354 16477054
4374A6477054L6950p5889j04716j40527j08593j0442j11k11863l4852N6636J3532
$$ 16477054 16514004 16438115 16333399 16192872 16084279 16073837 16073726 15861863 15827011 15883647 15897179
4363A5897179K9907m1758K7094K6106N2287J10609O4727k3275j39578n9445q1406
$$ 15897179 15927086 15885328 15912422 15938528 15990815 16101424 16166151 16142876 16003298 15943853 15862447
4352A5862447j57138n5808j12260l7911j91257j2187j095n4834Q180q629l6628
$$ 15862447 15705309 15649501 15537241 15499330 15308073 15295886 15294791 15239957 15248137 15239508 15202880
4341A5202880j23511j03370N5453J51338L0287O7961J15286R2962Q4788j1317
$$ 15202880 15079369 14975999 15031452 15182790 15213077 15281038 15396324 15489286 15574074 15562757
4331A5562757P5642j05373k73749k44380k33543k09915q7912r9543r5233j06517
$$ 15562757 15638399 15533026 15259277 15014897 14781354 14571439 14483527 14383984 14288751 14182234
4321A4182234n9260j11481j81608O0828K1659j08007n7397p6248m7796O5599K06648
$$ 14182234 14122974 14011493 13829885 13890713 13912372 13804365 13746968 13670720 13622924 13688523 13895171
4310A3895171q2116j80984o6032P00J83891N2423k3904L5570l6629J4951Q0353
$$ 13895171 13813055 13632071 13566039 13566739 13750630 13803053 13779149 13814719 13778090 13793041 13873394
4299A3873394J78054J23112J07309J54865Q7239J08230J47014k39012l15730k32123
$$ 13873394 14051448 14174560 14281869 14436734 14523973 14632203 14779217 14540205 14224475 13992352
4289A3992352k50877j90415n2516R051j06181n3432m848p1004m8607R981k24392
$$ 13992352 13741475 13551060 13498544 13507595 13401414 13347982 13343134 13272130 13223523 13233504 13009112
4278A3009112q5175j42252p5377P0877k6561j26551l7369l5644r0943Q4892M4608
$$ 13009112 12923937 12781685 12706308 12777185 12750624 12624073 12586704 12551060 12460117 12545009 12589617
4267A2589617R6754Q889j9088J23920K01983l4201L6587K45905J92853O2434J71224
$$ 12589617 12686371 12695260 12676172 12800092 13002075 12967874 13004461 13250366 13443219 13505653 13676877
4256A3676877K38320K09576K76306O5251k88591k83794j24627j84132j41557j18782
$$ 13676877 13915197 14124773 14401079 14466330 14177739 13893945 13769318 13585186 13443629 13324847
4246A3324847o5270p3114O292M1835R7478Q0913N8844J99854J34565K24177K06904
$$ 13324847 13259577 13186463 13192755 13234590 13332068 13412981 13471825 13671679 13806244 14030421 14237325
4235A4237325K53114K24710L09406L89935M21158L51057M64760N70082M48823
$$ 14237325 14490439 14715149 15024555 15414490 15835648 16186705 16651465 17221547 17670370
4226A7670370N77773O44817O90539N88589L23614L12852K68736M2565j57791j64323
$$ 17670370 18248143 18892960 19583499 20172088 20495702 20808554 21077290 21119855 20962064 20797741
4216B0797741m27658n53734n08874n18802l89216l80557l84379j80082j7236j49933
$$ 20797741 20370083 19816349 19307475 18788673 18399457 18018900 17634521 17454439 17437203 17287270
4206A7287270l5105j8048J0165P7542J03250P6160L21574L09018M72126L29903
$$ 17287270 17252165 17234117 17244282 17321824 17425074 17501234 17822808 18131826 18603952 18933855
4196A8933855M76880O61920P26308Q46310Q67434R99849R40918R50334Q49384
$$ 18933855 19410735 20072655 20798963 21645273 22512707 23512556 24453474 25403808 26253192
4187B6253192M71221R9005l0789l79263o66451r05249j117704j103039j054774
$$ 26253192 26724413 26823418 26792629 26413366 25746915 24841666 23723962 22620923 21566149
4178B1566149r06965o56981n34880m72549k79034j34421l0679l0018J77809K16982
$$ 21566149 20659184 20002203 19467323 18994774 18715740 18581319 18550640 18520622 18698431 18915413
4168A8915413J34658K58755M73037L63473J99880M2740j0677l347o8767k34851
$$ 18915413 19050071 19308826 19781863 20145336 20345216 20387956 20377279 20373932 20305165 20070314
4158B0070314k06303j59289n7298J5525j5887J58281J66685J7808L4398j72094
$$ 20070314 19864011 19704722 19647424 19662949 19647062 19805343 19972028 19989836 20024234 19852140
4148A9852140j86617k84707l39635l96099n34625m36995l89884j42205j53546
$$ 19852140 19665523 19380816 19041181 18645082 18110457 17673462 17283578 17141373 16987827
4139A6987827j29403n4996J81055J75957K43879N16724M25928M55322M71314O19211
$$ 16987827 16858424 16803428 16984483 17160440 17404319 17921043 18346971 18802293 19273607 19892818
4129A9892818M37430K14213P0826k57344n25438p30474p02282p34133p33385p34201
$$ 19892818 20330248 20544461 20615287 20357943 19832505 19102031 18399749 17665616 16932231 16198030
4119A6198030p66400o74487o06734n07460k86746l04356j69683k06431j58609
$$ 16198030 15431630 14757143 14150409 13642949 13356203 13051847 12882164 12675733 12517124
4110A2517124k08939j86140j09754m2476j25633J33383l8499J03256M811q6784
$$ 12517124 12308185 12122045 12012291 11969815 11844182 11977565 11939066 12042322 12047133 11960349
4100A1960349k2673M6334J66661J95547L01425K58044J35883K23499J83146M6484
$$ 11960349 11937676 11984010 12150671 12346218 12647643 12905687 13041570 13265069 13448215 13494699
4090A3494699P140K5692j65800k31048k91837l61247l24448n37208k60728l17931
$$ 13494699 13501839 13527531 13361731 13130683 12838846 12477599 12153151 11615943 11355215 11037284
4080A1037284l65319j65180k42572k18108j88170j30465n0158j35368k1065m5959
$$ 11037284 10671965 10506785 10264213 10046105 9857935 9727470 9677312 9541944 9520879 9474920
4070I474920q494k6543q6926j99490q035n0175j4213n9400j870k0538k0672j00661
$$ 9474920 9466426 9439883 9352957 9153467 9145432 9095257 9081044 9021644 9019774 8999236 8978564 8877903
4058H877903j06587P888J0579n5657k31508r395k6962J613j9226p1940l606j19846
$$ 8877903 8771316 8779204 8789783 8734126 8502618 8493223 8466261 8467874 8448648 8376708 8373102 8253256
4046H253256q8208p3154n4300O0014n0325j58855q5754m4893l8300K388m121n0227
$$ 8253256 8165048 8091894 8037594 8097608 8047283 7888428 7802674 7757781 7719481 7721869 7717748 7667521
4034G667521K508P512k1787J34792k4171j8388m727N0463m7842R5903M9683p1993
$$ 7667521 7670029 7677541 7655754 7790546 7766375 7747987 7743260 7793723 7745881 7841784 7891467 7819474
4022G819474p7986m7381K3685q973q1860m6371O2249p2371J49275L9657O9185
$$ 7819474 7741488 7694107 7717792 7708819 7626959 7580588 7642837 7570466 7719741 7759398 7828583
4011G828583j59179j95479q1355o0153N4993L2555L543p4849m0929q9315p6144
$$ 7828583 7669404 7473925 7392570 7332417 7387410 7419965 7423508 7348659 7307730 7218415 7142271
4000G142271P2925m9516q859N1061k7420r7563N5110P3610K9291p9965j30154
$$ 7142271 7215196 7165680 7156821 7207882 7180462 7082899 7138009 7211619 7240910 7160945 7030791
3989G030791r1887J4874N9219K8544o8408j5806n9982j13984R9511Q0218M205
$$ 7030791 6938904 6953778 7012997 7041541 6973133 6957327 6897345 6783361 6882872 6963090 6967295
3978F967295p1006j65645J5148P8515p0543P6647j9997j62817m9099K1900J74146
$$ 6967295 6896289 6730644 6745792 6824307 6753764 6830411 6810414 6647597 6598498 6620398 6794544
3967F794544J64680j11886j33571j7644K0409N8695m4420K7051j6301p1320J3322
$$ 6794544 6959224 6847338 6713767 6696123 6716532 6775227 6730807 6757858 6741557 6670237 6683559
3956F683559L2686K4207N2619K1882j64877O3433J03052J4232l305L1597m9970
$$ 6683559 6716245 6740452 6793071 6814953 6650076 6713509 6816561 6830793 6827488 6859085 6809115
3945F809115j0160J01804P3988j397j35481O7990j3837P827L3710l8324Q6488
$$ 6809115 6798955 6900759 6974747 6973350 6837869 6905859 6892022 6899849 6933559 6895235 6981723
3934F981723J23577n2651l2769J20291M9496L1558n2331O3995q6942N292J7342
$$ 6981723 7105300 7052649 7019880 7140171 7189667 7221225 7168894 7232889 7145947 7151239 7168581
3923G168581P6810J6742n3218P2217J76088m8901m2890J12051N3828l5809P836
$$ 7168581 7245391 7262133 7208915 7281132 7457220 7408319 7365429 7477480 7531308 7495499 7503335
3912G503335L3079O6742L4211J47354Q3832j24835l3160m83O6814O3978J858l342
$$ 7503335 7536414 7603156 7637367 7784721 7868553 7743718 7710558 7710075 7776889 7840867 7842725 7839383
3900G839383K4456K6057r107l4925l218O6511K5566o606O4251J36100M7815j11710
$$ 7839383 7863839 7889896 7880789 7845864 7842646 7909157 7934723 7928117 7992368 8128468 8176283 8064573
3888H064573J23131n8871j7114j5556O7205K0287O018L1300j4728o0447N3127
$$ 8064573 8187704 8128833 8111719 8096163 8163368 8183655 8189673 8220973 8206245 8145798 8198925
3877H198925J43014O8134M407p516j82285m3525K44194p4538j22786L9831O3714
$$ 8198925 8341939 8410073 8414480 8406964 8224679 8181154 8425348 8350810 8228024 8267855 8331569
3866H331569M321N5573N5291k8780q0722K3138R0446P8077r8495L3227O1691j40050
$$ 8331569 8335890 8391463 8446754 8417974 8337252 8360390 8450836 8528913 8430418 8463645 8525336 8385286
3854H385286m3855p4134J2200j6197j35840N9042j18972J0434R83L2692J1576
$$ 8385286 8341431 8267297 8279497 8263300 8127460 8186502 8067530 8077964 8078947 8111639 8123215
3843H123215m2479j12058p7422j2893j59519O904k09897k39440p814O911q8985
$$ 8123215 8080736 7968678 7891256 7878363 7718844 7725748 7515851 7276411 7268597 7275508 7186523
3832G186523p3537l4421m2392Q2493J08692r6713l9260R2772N822k11651k8286
$$ 7186523 7112986 7078565 7036173 7118666 7227358 7130645 7091385 7184157 7189979 6978328 6950042
3821F950042p2432L6765p9884j27436L7478l8864n1449J7622N7576l4872j39806
$$ 6950042 6877610 6914375 6834491 6707055 6744533 6705669 6654220 6671842 6729418 6694546 6554740
3810F554740n517R7294j75466l8610J599K3832Q8402J6814M6136l0545o3858r8415
$$ 6554740 6549223 6646517 6471051 6432441 6434040 6457872 6546274 6563088 6609224 6578679 6514821 6416406
3798F416406o0849L5145m7969Q6630K9187J0219k959R2153J27663K15n3707p2739
$$ 6416406 6355557 6390702 6342733 6429363 6458550 6468769 6465810 6557963 6685626 6685841 6632134 6559395
3786F559395K8474J5066k4251m7971j1665J4989j11946m6217K2447m1120M5000
$$ 6559395 6587869 6602935 6578684 6530713 6519048 6534037 6422091 6375874 6398321 6357201 6402201
3775F402201J0737n0097K8618n2077K2143m2793m3907j9037o9297q580j14150
$$ 6402201 6412938 6362841 6391459 6339382 6361525 6318732 6274825 6255788 6186491 6177911 6063761
3764F063761p3413K8730P9625o7668p2841n9569m0149M2874M8436l3311Q6553
$$ 6063761 5990348 6019078 6098703 6031035 5958194 5898625 5858476 5901350 5949786 5916475 6003028
3753F003028o3044p2745k4104L4943J88232K15883K6406p5550l6809o1093J0767
$$ 6003028 5939984 5867239 5843135 5878078 6066310 6282193 6308599 6233049 6196240 6135147 6145914
3742F145914q5976k4453j4583j18794P6768J00235p9490P8951M4121K2943q5668
$$ 6145914 6059938 6035485 6020902 5902108 5978876 6079111 5999621 6078572 6122693 6145636 6059968
3731F059968n7127N7037q1444p255K5830n1494J37857K9402o4233l2160l9609
$$ 6059968 6002841 6059878 5978434 5971179 5997009 5945515 6083372 6112774 6048541 6016381 5976772
3720E976772k6248N5176L5256m1993J04881k0437l6671P813Q1379r877O9957l7785
$$ 5976772 5950524 6005700 6040956 5998963 6103844 6083407 6046736 6054549 6135928 6126051 6196008 6158223
3708F158223j38444j41259k7890l0040j17522K14278P5343j3371l4491K242k1647
$$ 6158223 6019779 5878520 5850630 5820590 5703068 5917346 5992689 5979318 5944827 5947069 5925422
3697E925422L9327J13136K858m4998j99247N1558Q5108L8034k02637p3084J20044
$$ 5925422 5964749 6077885 6080743 6035745 5836498 5888056 5973164 6011198 5808561 5735477 5855521
3686E855521J3720l0268j4453J82843l3143J18869N3217P0610M6003m3367l557
$$ 5855521 5869241 5838973 5824520 6007363 5974220 6093089 6146306 6216916 6262919 6219552 6215995
3675F215995l1150j14440l7270k7251N8493N682O819m6222j1056n329k3991J02310
$$ 6215995 6184845 6070405 6033135 6005884 6064377 6070059 6076878 6030656 6019600 6014271 5990280 6092590
3663F092590N9218L7644J1024P7170O4695N339j64401n6750M6413O8448J46728
$$ 6092590 6151808 6189452 6200476 6277646 6342341 6347680 6183279 6126529 6172942 6241390 6388118
3652F388118J58231k1454N4640N6962J78102L5666K6688J04347j36094j7100J17408
$$ 6388118 6546349 6524895 6579535 6636497 6814599 6850265 6876953 6981300 6845206 6828106 6945514
3641F945514o9651J1110l0350L5501L5073m7479R9311K795j2714L589m8166J69567
$$ 6945514 6875863 6886973 6856623 6892124 6927197 6879718 6979029 6981824 6969110 6972699 6924533 7094100
3629G094100J03638j18982J26706J39585J5544R5549J87899J27548J65609l0139
$$ 7094100 7197738 7078756 7205462 7345047 7360591 7456140 7644039 7771587 7937196 7907057
3619G907057J02067N4665P241N6421N2791M4761M9392M0728L5103O2360P4418
$$ 7907057 8009124 8063789 8071030 8127451 8180242 8225003 8274395 8315123 8350226 8412586 8487004
3608H487004N4757J39156R0814k9306J58292J5156J60437J98550Q7643M6736Q3706
$$ 8487004 8541761 8680917 8771731 8742425 8900717 8915873 9076310 9274860 9362503 9409239 9492945
3597I492945K52689K03441Q624J99743R8469J2539J83352O6614J17259J87603
$$ 9492945 9745634 9949075 9957699 10157442 10255911 10268450 10451802 10518416 10635675 10823278
3587A0823278K10680J02424J29882R6744J02579K32892K30292J21305J96295J13121
$$ 10823278 11033958 11136382 11266264 11363008 11465587 11698479 11928771 12050076 12246371 12359492
3577A2359492K65103J50555J85184K72314J27283J52422K25255L16345L09604
$$ 12359492 12624595 12775150 12960334 13232648 13359931 13512353 13737608 14053953 14363557
3568A4363557K88690P0030K07211K74536K26284J47491K38461K17403K50794K94397
$$ 14363557 14652247 14722277 14929488 15204024 15430308 15577799 15816260 16033663 16284457 16578854
3558A6578854K47968J37690J90792L50492K94056L43797K96352K41420K40449
$$ 16578854 16826822 16964512 17155304 17505796 17799852 18143649 18440001 18681421 18921870
3549A8921870L54074L43433K65464M21131K83636K63380M16174L68066J61041
$$ 18921870 19275944 19619377 19884841 20305972 20589608 20852988 21269162 21637228 21798269
3540B1798269L64669M02920L46778L32172L23474M20380M07498N57614M75740
$$ 21798269 22162938 22565858 22912636 23244808 23568282 23988662 24396160 24953774 25429514
3531B5429514N18476N71806M31495N22099N58927N32697N29826N25267N39897
$$ 25429514 25947990 26519796 26951291 27473390 28032317 28565014 29094840 29620107 30160004
3522C0160004O64092P78051Q87861R94498J126035J266002J277249J414876J665887
$$ 30160004 30824096 31602147 32490008 33484506 34610541 35876543 37153792 38568668 40234555
3513D0234555J731240J940793K103433K140609K358603K608548K735800K812300
$$ 40234555 41965795 43906588 46010021 48150630 50509233 53117781 55853581 58665881
3505E8665881K789860K691306K686791K327503J809178J349747P07985n9840p96115
$$ 58665881 61455741 64147047 66833838 69161341 70970519 72320266 73028251 72968411 72172296
3496G2172296j451998k278820l051894l547403l948598l906769l634748l210334
$$ 72172296 70720298 68441478 65389584 61842181 57893583 53986814 50352066 47141732
3488D7141732k650374k294726j914821j687722j392266j368051j470767j369832
$$ 47141732 44491358 42196632 40281811 38594089 37201823 35833772 34363005 32993173
3480C2993173j170191j094834q66104p71250r11917p81042o49164n10862q01935
$$ 32993173 31822982 30728148 29862044 29090794 28178877 27397835 26748671 26237809 25435874
3471B5435874o20276o00768n23123n57474m94659n18465n13217n25376l99430
$$ 25435874 24815598 24214830 23691707 23134233 22639574 22121109 21607892 21082516 20683086
3462B0683086m14748l04978k76208j89835j83438j42777J75365J22164K05444
$$ 20683086 20268338 19963360 19687152 19497317 19313879 19171102 19346467 19468631 19674075
3453A9674075L07631n0430p71913q72853p86914p68541p18895m55908l44594l32875
$$ 19674075 19981706 19931276 19159363 18286510 17499596 16731055 16012160 15556252 15211658 14878783
3443A4878783l59109k97199k95601o7446l11911l50497j90451k11439j8097j15254
$$ 14878783 14519674 14222475 13926874 13859428 13547517 13197020 13006569 12795130 12777033 12661779
3433A2661779j99136k41798j37952j54049L5642J18936k2239r057N8917L39611
$$ 12661779 12462643 12220845 12082893 11928844 11964486 12083422 12061183 12052126 12111043 12450654
3423A2450654L05178K92995J8199j88675m27348m80732m80047l82318j74783m00549
$$ 12450654 12755832 13048827 13067026 12878351 12451003 11970271 11490224 11107906 10933123 10532574
3413A0532574k68437j73593k19204J5505k7119j29631k01046j03065M8109j40057
$$ 10532574 10264137 10090544 9871340 9886845 9859726 9730095 9529049 9425984 9474093 9334036
3403I334036P290k24835j62548k9104j2035J60288K8216L0330N2202o5136o5514
$$ 9334036 9341326 9116491 8953943 8924839 8912804 9073092 9101308 9131638 9183840 9118704 9053190
3392I053190J71073J00837j05323j77160j74796m0205k00142j22474j14186j81449
$$ 9053190 9224263 9325100 9219777 9042617 8867821 8827616 8627474 8505000 8390814 8209365
3382H209365k00891j84131l1701j48753k9022N2167j16162l3981j7481O6455P1975
$$ 8209365 8008474 7824343 7792642 7643889 7614867 7667034 7550872 7516891 7499410 7565865 7637840
3371G637840Q292q581q3660j06559j40854O6639N4939j10610j99285P859j29498
$$ 7637840 7646132 7637551 7553891 7447332 7306478 7373117 7428056 7317446 7118161 7126020 6996522
3360F996522r5168n3912j92192p7631j39472q7857p7508L904J34032P867j05095
$$ 6996522 6901354 6847442 6655250 6577619 6438147 6350290 6272782 6276686 6410718 6418585 6313490
3349F313490r7190J02712k5257K1691n3479j00552j11686k4726j81785L6156K9977
$$ 6313490 6216300 6319012 6293755 6315446 6261967 6161415 6049729 6025003 5843218 5879374 5909351
3338E909351j41537j037k9537J2958j82443N1993J11312j20132o8920l8683p7620
$$ 5909351 5767814 5766777 5737240 5750198 5567755 5619748 5731060 5610928 5542008 5503325 5425705
3327E425705q2888j19380p2705L127J4474p0404n4628j30594J24534n7678j55791
$$ 5425705 5342817 5223437 5150732 5153859 5168333 5097929 5043301 4912707 5037241 4979563 4823772
3316D823772k5170j19374j67568J20892P6334j503n6440J7903q5457j02008K8281
$$ 4823772 4798602 4679228 4511660 4632552 4708886 4707383 4650943 4668846 4583389 4481381 4509662
3305D509662o196p631l6368j08790j1797O7979o0302o9997r4438M1876J6571N5865
$$ 4509662 4503466 4495835 4459467 4350677 4338880 4406859 4346557 4276560 4182122 4223998 4240569 4296434
3293D296434r9148q4127j74147r9941J74366L9786o0413k4435P8009p0339n0105
$$ 4296434 4197286 4113159 3939012 3839071 4013437 4053223 3992810 3968375 4046384 3976045 3925940
3282C925940K9378q0058k4232J9152P2681K9404M3896P2156K0474o0350o7867
$$ 3925940 3955318 3875260 3851028 3870180 3942861 3972265 4016161 4088317 4108791 4048441 3980574
3271C980574j32813l9928Q4456k4784R0265N731q6955M6077L5499R608l010o277
$$ 3980574 3847761 3807833 3892289 3867505 3957770 3963501 3876546 3922623 3958122 3967730 3964720 3958443
3259C958443N0754l2912o756R9214M8850j7607k8847J5898J52201p5094p9003
$$ 3958443 4009197 3976285 3969529 4068743 4117593 4099986 4071139 4087037 4239238 4164144 4085141
3248D085141Q3215k1617R0510R3767J902L1388p932J4043O4380N4981n0693J39828
$$ 4085141 4168356 4146739 4237249 4331016 4332918 4364306 4356374 4370417 4434797 4489778 4439085 4578913
3236D578913L937P2915J19574p4978J54563q668m0208J01796M4166k5288M5952
$$ 4578913 4582850 4655765 4775339 4700361 4854924 4846256 4806048 4907844 4952010 4926722 4972674
3225D972674J37773P4649n1523J31773N9905L8070J9174N5881J99480J30512m292
$$ 4972674 5110447 5185096 5133573 5265346 5325251 5363321 5382495 5438376 5637856 5768368 5764076
3214E764076j4200K5320J72014J68181J56991P8357M9948J78010J99855J30151
$$ 5764076 5749876 5775196 5947210 6115391 6272382 6350739 6400687 6578697 6778552 6908703
3204F908703J37759J17388J32844J25909K07669K66053J85040L06527K69524K26364
$$ 6908703 7046462 7163850 7296694 7422603 7630272 7896325 8081365 8387892 8657416 8883780
3194H883780K48080N28118M29530L38971K81336K82084L1838l54J66838K2806
$$ 8883780 9131860 9659978 10089508 10428479 10709815 10991899 11023737 11023383 11190221 11213027
3184A1213027J1358m0929Q6396Q3389J98967J56759P88K16686J92355J32059J86193
$$ 11213027 11224385 11183456 11269852 11353241 11552208 11708967 11709755 11926441 12118796 12250855 12437048
3173A2437048L15250M24941K99512L16566K95459L40696M19816O35146O39901
$$ 12437048 12752298 13177239 13476751 13793317 14088776 14429472 14849288 15484434 16124335
3164A6124335L97239M99458O69252O40627N26085L17862J73892l1896l95381n55576
$$ 16124335 16521574 17021032 17690284 18330911 18856996 19174858 19348750 19316854 18921473 18365897
3154A8365897p26671p22813m96312m10245l30967l36294j61407L5833P7170J44791
$$ 18365897 17639226 16916413 16420101 16009856 15678889 15342595 15181188 15217021 15294191 15438982
3144A5438982J72304J91940J04393P4671K22234K59449K08119J87276J42653Q4061
$$ 15438982 15611286 15803226 15907619 15982290 16204524 16463973 16672092 16859368 17002021 17086082
3134A7086082J9588n6060k15243k56578l39030k24417k51084l19927m75259m93235
$$ 17086082 17105670 17049610 16834367 16577789 16238759 16014342 15763258 15443331 14968072 14474837
3124A4474837m68892m65102l00992k89470k93156j65311p2654j61341q8323r8768
$$ 14474837 14005945 13540843 13239851 12950381 12657225 12491914 12419260 12257919 12169596 12070828
3114A2070828l0772r0455l24097j86167j66372k03027j98634l15351k08344m33385
$$ 12070828 12040056 11949601 11625504 11439337 11272965 11069938 10871304 10555953 10347609 9914224
3104I914224o45417m58822k49518m72231k46700k76385l13296l99105k12049k12221
$$ 9914224 9268807 8809985 8560467 8088236 7841536 7565151 7251855 6852750 6640701 6428480
3094F428480r5418j69884j89819n8501k30890j08392j79319r3743j91963q1406
$$ 6428480 6333062 6163178 5973359 5914858 5683968 5575576 5396257 5302514 5110551 5029145
3084E029145j09234p2384j02233r0095p2198r7007j32527p9697j18413j82468
$$ 5029145 4919911 4847527 4745294 4655199 4583001 4485994 4353467 4273770 4155357 3972889
3074C972889k08777o6766M5542J13j37491j20295J5389J1995K5475j35241j97356
$$ 3972889 3764112 3697346 3742888 3743001 3605510 3485215 3500604 3512599 3538074 3402833 3205477
3063C205477p3773J7277k9807j24905l6390m6930p2386n1993p5839n9693O581
$$ 3205477 3131704 3148981 3119174 2994269 2957879 2910949 2838563 2786570 2710731 2651038 2657619
3052B657619K539n5438J0919r47m8058N043m8408m7085j21462K6960l808j36729
$$ 2657619 2660158 2604720 2615639 2614692 2566634 2571677 2523269 2476184 2354722 2381682 2377874 2241145
3040B241145j13714q7316m5867J86565k2545j75999n574l1793q7886o289m2547
$$ 2241145 2127431 2040115 1994248 2180813 2158268 1982269 1976695 1944902 1857016 1850727 1808180
3029A808180q7120P8349q710L0475j58382k8043J08752K5851q162r4585j53308
$$ 1808180 1721060 1799409 1790699 1821174 1662792 1634749 1743501 1769352 1761190 1666605 1513297
3018A513297L5474K6581n6797k3195p0582M6167o6757O5228j20778P665Q013J289
$$ 1513297 1548771 1575352 1518555 1495360 1424778 1470945 1404188 1469416 1348638 1356303 1364316 1365605
3006A365605J5476j53277J3281J19446q1934J02286p039j12881L1938J2800o0968
$$ 1365605 1381081 1227804 1241085 1360531 1278597 1380883 1373844 1260963 1292901 1305701 1244733
2995A244733j10606M6048j1828Q7010O592p9067j56758K280N5976N6353j23399
$$ 1244733 1134127 1180175 1168347 1255357 1261949 1182882 1026124 1028404 1084380 1140733 1017334
2984A017334k3965j3063p8277m2710P6983O5589J8129J16409l6632r6966o7092
$$ 1017334 993369 980306 902029 859319 936302 1001891 1020020 1136429 1099797 1002831 935739
2973I35739J58348q5410j09043j20530J6928J15399o1400r910K1355R0175p7054
$$ 935739 1094087 1008677 899634 779104 796032 911431 850031 840121 861476 951651 874597
2962H74597o4787j38031O7800J11095M6745j23628k5540k8025J19001j9637l7261
$$ 874597 809810 671779 739579 850674 897419 773791 748251 720226 839227 819590 782329
2951G82329P6648j10784K2977q8122k6370K7465m5505R2467K1800n1004q1558
$$ 782329 858977 748193 771170 683048 656678 684143 638638 731105 752905 701901 620343
2940F20343L4222J36621L9759j18558j3917M2282M7198r3950j23903l8446J6943
$$ 620343 654565 791186 830945 712387 698470 740752 787950 694000 570097 531651 548594
2929E48594R3186K5736M4437n5732k0884l9941k585J7431p817P7070n0940k6438
$$ 548594 641780 667516 711953 656221 635337 595396 592811 610242 602425 679495 628555 602117
2917F02117o0243j11120O0901N2655Q1561L7381j35913J0986K0957J6896R0099
$$ 602117 541874 430754 491655 544310 625871 663252 527339 538325 559282 576178 666277
2906F66277M1347K0374r3821m1361j8449n8175n2677R7854q8552Q010P5945M0637
$$ 666277 707624 727998 634177 592816 574367 516192 463515 561369 472817 480827 556772 597409
2894E97409k7349j67889n3079J49862R3278Q9516L741r5631q4857l0586N4285
$$ 597409 570060 402171 349092 498954 592232 681748 685489 589858 505001 474415 528700
2883E28700l3871L5311J05472M1283j45032q132O7430R3088m0719q3645k759l5475
$$ 528700 494829 530140 635612 676895 531863 523731 591161 684249 643530 559885 557126 521651
2871E21651j3256n9965M0273r908j1272O0063k9483n0955Q3036L687K5820j09874
$$ 521651 508395 448430 488703 478795 467523 527586 498103 447148 530184 533871 559691 449817
2859D49817L6353L4007N9025M6296n1469m0089j27220K8420J94201r4686L1887
$$ 449817 486170 520177 579202 625498 574029 533940 406720 435140 629341 534655 566542
2848E66542Q6413j23849J7316q3934j1813N5808J9908m8821O6146l0051m6326
$$ 566542 652955 529106 546422 462488 450675 506483 526391 477570 543716 513665 467339
2837D67339P1208j04961K377P3575o3069n7985l0535J8138O2249j9043j6992j7575
$$ 467339 538547 433586 435963 509538 446469 388484 357949 376087 438336 419293 402301 384726
2825C84726J39434p7689l0083N3446K8081o7750P370r568r6700J9666K2230l3683
$$ 384726 524160 446471 416388 469834 497915 430165 437535 427967 331267 350933 373163 339480
2813C39480J9657P9031J258P4641n510k4891r0013J6959P5768k6675o516m5670
$$ 339480 359137 438168 439426 514067 508557 483666 393653 410612 486380 459705 453189 407519
2801D07519j23193q00j6709M9852j597J20182q1671o9586p1132j29219J40898
$$ 407519 284326 283526 266817 316669 315072 435254 353583 283997 212865 83646 224544
2790B24544J3660q6658O2346Q5203L059K8166o0799n3078Q6818l3441j01185J04600
$$ 224544 238204 151546 213892 299095 302154 330320 269521 216443 303261 269820 168635 273235
2778B73235M7637m3715m021L1598P2616k6551l2882m2861J0971n7914p7289O8248
$$ 273235 320872 277157 273136 304734 377350 350799 317917 275056 286027 228113 150824 219072
2766B19072J22484K9560j7142q6979m4170L02m8524n6942K4862O92J13489M047
$$ 219072 341556 371116 353974 266995 222825 223127 174603 117661 142523 143215 256704 260751
2754B60751p3067J3990K7452j1240k7526k8019j1366R251O613O7514O4578J8467
$$ 260751 187684 201674 229126 217886 190360 162341 150975 160226 166839 234353 298931 317398
2742C17398k2847j07042J35616L0717k34375J4566L1409J3262O4721O8793J0961
$$ 317398 294551 187509 323125 353842 119467 134033 165442 178704 243425 312218 323179
2731C23179j04146N4100q5837J8728n7743r3312M7970J23397N0320m3561P5644
$$ 323179 219033 273133 187296 206024 148281 54969 102939 226336 276656 233095 308739
2720C08739p9822O4003p4121j9559l2531K5915O7077R6807j808j58542r6294K9510
$$ 308739 228917 292920 218799 199240 166709 192624 259701 356508 354700 196158 99864 129374
2708A29374M350J23748l7546k3440k8322O4469n6647l4296R3609j9730j53073
$$ 129374 133724 257472 219926 196486 168164 232633 175986 141690 235299 215569 62496
2697F2496L8271J31224n9639L6797j4274j44918K3569R0271J2358K8362K06K1851
$$ 62496 100767 231991 172352 209149 194875 49957 73526 163797 176155 204517 204723 226574
2685B26574l8680J31210m7562k6302l5921m790L3452p6440o0292J53171L9670
$$ 226574 187894 319104 271542 245240 209319 204529 237981 161541 101249 254420 294090
2674B94090r7711K6866N5062J827n9538q5261r453O7543O4477n6718l8348R769
$$ 294090 196379 223245 278307 280134 220596 135335 125882 193425 257902 201184 162836 172605
2662A72605n1143n0215r4606n2077J64202R3924m3703P4950n7851n1092O9644
$$ 172605 121462 71247 -23359 -75436 88766 182690 138987 213937 156086 104994 174638
$$ [...]
##END NTUPLES=NMR SPECTRUM
##END=
