##TITLE=1H_EC-3315(2)
 CDCl3
 8 sc, 
 14.2.2024
##JCAMPDX= 6.0         $$ Bruker NMR JCAMP-DX V2.0
##DATA TYPE= NMR SPECTRUM
##DATA CLASS= NTUPLES
##ORIGIN= UXNMR, Bruker Analytische Messtechnik GmbH
##OWNER= root
$$ XWIN-NMR		Version 3.5
$$ Wed Feb 14 13:41:22 2024 Russian Standard Time (UT+4h)  she@DPX200
##.OBSERVE FREQUENCY= 200.1313
##.OBSERVE NUCLEUS= ^1H
##.ACQUISITION MODE= SIMULTANEOUS
##.ACQUISITION SCHEME= undefined
##.AVERAGES= 8
##.DIGITISER RES= 18
##SPECTROMETER/DATA SYSTEM= spect
##.PULSE SEQUENCE= zg30
##.SOLVENT NAME= CDCl3
##.SHIFT REFERENCE= (INTERNAL, CDCl3, 0, 15.4582)
##AUDIT TRAIL= $$ (NUMBER, WHEN, WHO, WHERE, WHAT)
$$ ##TITLE= Audit trail, XWIN-NMR		Version 3.5
$$ ##JCAMPDX= 5.01
$$ ##ORIGIN= Bruker BioSpin GmbH
$$ ##OWNER= she
$$ F:/spectra/data/she/nmr/H-F/1/pdata/1/auditp.txt
$$ ##AUDIT TRAIL=  $$ (NUMBER, WHEN, WHO, WHERE, WHAT)
(   1,<2024-02-14 13:38:58.51 +0400>,<she>,<DPX200>,
      <created by zg, POWCHK disabled, PULCHK disabled
       configuration hash MD5:
       00 E9 B6 7A A2 85 ED C7 34 08 36 98 17 FE 4E 26
       data hash MD5: 16K
       09 E9 B4 FA 81 F0 84 10 98 1A 3B DF 8B F8 EF E5>)
(   2,<2024-02-14 13:39:00.64 +0400>,<she>,<DPX200>,
      <Start of raw data processing
       efp BC_mod = 2 LB = 0.24 FT_mod = 6 PKNL = 1 PHC0 = -24947.4 PHC1 = 9.85264 SI = 16K 
       data hash MD5: 16K
       7C FD DC 93 C4 44 FC 67 1D 15 8E B5 38 9A 44 3C>)
(   3,<2024-02-14 13:39:25.87 +0400>,<she>,<DPX200>,
      <pk PHC0 = -5.581548 PHC1 = 9.999999 
       data hash MD5: 16K
       70 A9 BC BF 73 00 6B C0 4E 13 38 D4 95 F7 16 A4>)
(   4,<2024-02-14 13:39:29.00 +0400>,<she>,<DPX200>,
      <abs ABSG = 5 
       data hash MD5: 16K
       4B 24 4D 96 B6 E4 94 26 FB E8 8A 15 F1 72 7E 57>)
(   5,<2024-02-14 13:40:46.56 +0400>,<she>,<DPX200>,
      <abs ABSG = 5 
       data hash MD5: 16K
       C1 8C E9 D4 27 A8 5B 02 F4 16 DC 70 55 3F 11 26>)
$$ ##END=
$$ 
$$ hash MD5
$$ 03 77 99 9A D6 85 F2 E3 CC 3F 2E 04 C5 01 50 45
##$RELAX= 
##$RELAX= 
##$RELAX= 
##$RELAX= 
##$RELAX= 
##$RELAX= 
$$ Bruker specific parameters
$$ --------------------------
##$DU= <F:/spectra>
##$EXPNO= 1
##$NAME= <H-F>
##$PROCNO= 1
##$TYPE= <nmr>
##$USER= <she>
##$AMP= (0..31)
100 100 100 100 100 100 100 100 100 100 100 100 100 100 100 100 100 100 
100 100 100 100 100 100 100 100 100 100 100 100 100 100 
##$AQSEQ= 0
##$AQ_mod= 1
##$AUNM= <au_zg>
##$AUTOPOS= <>
##$BF1= 200.13
##$BF2= 200.13
##$BF3= 200.13
##$BF4= 200.13
##$BF5= 200.13
##$BF6= 200.13
##$BF7= 200.13
##$BF8= 200.13
##$BYTORDA= 1
##$CFDGTYP= 0
##$CFRGTYP= 5
##$CHEMSTR= <none>
##$CNST= (0..31)
1 1 145 1 1 1 1 1 1 1 1 1 1 1 1 1 1 1 1 1 1 1 1 1 1 1 1 1 1 1 1 1 
##$CPDPRG= <>
##$CPDPRG1= <>
##$CPDPRG2= <>
##$CPDPRG3= <>
##$CPDPRG4= <mlev>
##$CPDPRG5= <mlev>
##$CPDPRG6= <mlev>
##$CPDPRG7= <mlev>
##$CPDPRG8= <mlev>
##$CPDPRGB= <>
##$CPDPRGT= <>
##$D= (0..31)
0 1.2 0 0 0 0 0 0 0 0.06 0 0.03 0 0 0 0 0.0002 0 0 0 0 0 0 0 0 0 0 0 0 
0 0 0 
##$DATE= 1707903537
##$DBL= (0..7)
$$ [...]
##$SUBNAM3= <"">
##$SUBNAM4= <"">
##$SUBNAM5= <"">
##$SUBNAM6= <"">
##$SUBNAM7= <"">
##$SUBNAM8= <"">
##$SUBNAM9= <"">
##$SW= 18.0517328524113
##$SWIBOX= (0..15)
0 0 2 0 0 0 0 0 0 0 0 0 0 0 0 0 
##$SW_h= 3612.71676300578
##$TD= 16384
##$TD0= 1
##$TE= 0
##$TE2= 300
##$TE3= 300
##$TEG= 300
##$TL= (0..7)
0 120 120 120 120 120 120 120 
##$TP= (0..7)
150 150 150 150 150 150 150 150 
##$TP07= 0
##$TPNAME0= <>
##$TPNAME1= <>
##$TPNAME2= <>
##$TPNAME3= <>
##$TPNAME4= <>
##$TPNAME5= <>
##$TPNAME6= <>
##$TPNAME7= <>
##$TPOAL= (0..7)
0.5 0.5 0.5 0.5 0.5 0.5 0.5 0.5 
##$TPOFFS= (0..7)
0 0 0 0 0 0 0 0 
##$TUNHIN= 0
##$TUNHOUT= 0
##$TUNXOUT= 0
##$USERA1= <user>
##$USERA2= <user>
##$USERA3= <user>
##$USERA4= <user>
##$USERA5= <user>
##$V9= 5
##$VALIST= <valist>
##$VCLIST= <CCCCCCCCCCCCCCC>
##$VD= 0
##$VDLIST= <DDDDDDDDDDDDDDD>
##$VPLIST= <PPPPPPPPPPPPPPP>
##$VTLIST= <TTTTTTTTTTTTTTT>
##$WBST= 1024
##$WBSW= 4
##$XGAIN= (0..3)
0 0 0 0 
##$XL= 0
##$YL= 0
##$YMAX_a= 280870
##$YMIN_a= -486412
##$ZGOPTNS= <>
##$ZL1= 120
##$ZL2= 120
##$ZL3= 120
##$ZL4= 120
##$ABSF1= 15.43178
##$ABSF2= -2.62007
##$ABSG= 5
##$ABSL= 3
##$ALPHA= 0
##$AQORDER= 0
##$ASSFAC= 0
##$ASSFACI= 0
##$ASSFACX= 0
##$ASSWID= 0
##$AUNMP= <proc_1d>
##$AZFE= 0.1
##$AZFW= 0.1
##$BCFW= 0
##$BC_mod= 2
##$BYTORDP= 0
##$COROFFS= 0
##$CY= -3
##$DATMOD= 1
##$DC= 0
##$DFILT= <>
##$DTYPP= 0
##$F1P= 0
##$F2P= 0
##$FCOR= 1
##$FTSIZE= 16384
##$FT_mod= 6
##$GAMMA= 0
##$GB= 0
##$INTBC= 1
##$INTSCL= 3.70164e-10
##$ISEN= 128
##$LB= 0.24
##$LEV0= 0
##$LPBIN= 0
##$MAXI= 10000
##$MC2= 0
##$MEAN= 0
##$ME_mod= 0
##$MI= 1.114404
##$NCOEF= 0
##$NC_proc= -8
##$NLEV= 6
##$NOISF1= 3.799351
##$NOISF2= 2.8
##$NSP= 0
##$NTH_PI= 0
##$NZP= 0
##$OFFSET= 15.45822
##$PC= 1
##$PHC0= -24952.98
##$PHC1= 19.85264
##$PH_mod= 1
##$PKNL= yes
##$PPARMOD= 0
##$PSCAL= 0
##$PSIGN= 0
##$REVERSE= no
##$SF= 200.130012705953
##$SI= 16384
##$SIGF1= 3
##$SIGF2= 2
##$SINO= 5.538805
##$SIOLD= 16384
##$SREGLST= <1H.CDCl3>
##$SSB= 0
##$STSI= 16384
##$STSR= 0
##$SW_p= 3612.71676300578
##$SYMM= 0
##$S_DEV= 0
##$TDeff= 16384
##$TDoff= 0
##$TI= <>
##$TILT= no
##$TM1= 0
##$TM2= 0
##$TOPLEV= 0
##$USERP1= <user>
##$USERP2= <user>
##$USERP3= <user>
##$USERP4= <user>
##$USERP5= <user>
##$WDW= 1
##$XDIM= 16384
##$YMAX_p= 416753840
##$YMIN_p= -1541649
$$ End of Bruker specific parameters
$$ ---------------------------------
##NTUPLES= NMR SPECTRUM
##VAR_NAME=  FREQUENCY,     SPECTRUM/REAL,   SPECTRUM/IMAG
##SYMBOL=    X,             R,               I
##VAR_TYPE=  INDEPENDENT,   DEPENDENT,       DEPENDENT
##VAR_FORM=  AFFN,          ASDF,            ASDF
##VAR_DIM=   16384,         16384,           16384
##UNITS=     HZ,            ARBITRARY UNITS, ARBITRARY UNITS
##FACTOR=    0.220516191357247, 1,           1
##FIRST=     3093.65367058972, 0,            0
##LAST=      -519.063092416055, 0,           0
##MIN=       -519.063092416055, -1541649,    0
##MAX=       3093.65367058972, 416753840,    0
$$ Real data points
##PAGE= N=1
##DATA TABLE= (X++(R..R)), XYDATA
$$ [...]
8280A8971853q1790q5474k06755K92578j48424Q9867M03413R88m03772j5933M26825
$$ 18971853 18890063 18804589 18597834 18890412 18741988 18831855 19235268 19236256 18832484 18816551 19243376
8269A9243376l80577k73379k77154J83471p1425R8781M1727j83547M77529P8800
$$ 19243376 18862799 18589420 18312266 18495737 18424312 18523093 18564820 18381273 18858802 18937602
8259A8937602j24709L1273J01554j05258K51548o94m36441n89142J2339K32406
$$ 18937602 18812893 18844166 18945720 18840462 19092010 19091316 18654875 18065733 18078072 18310478
8249A8310478J59829k81531J96507P2017k22911K35041J13651k64588L67974n00853
$$ 18310478 18470307 18188776 18385283 18457300 18234389 18469430 18583081 18318493 18686467 18185614
8239A8185614m33244O9886r9116M6901m9183n98405R9078L40819k48577L93838
$$ 18185614 17752370 17822256 17723140 17770041 17720858 17122453 17221531 17562350 17313773 17707611
8229A7707611k23056K56284o65350j08601j9466n1174k12288j64879O03026q9279
$$ 17707611 17484555 17740839 17075489 16966888 16947422 16896248 16683960 16519081 17122107 17032828
8219A7032828j46881m69065l75063m0108r3427L33026J61663k01346P0951l64191
$$ 17032828 16885947 16416882 16041819 16001711 15908284 16241310 16402973 16201627 16272578 15908387
8209A5908387M1337k67859j93745k91850j90402M15116K35551k95758M7734k79286
$$ 15908387 15949724 15681865 15488120 15196270 15005868 15420984 15656535 15360777 15408511 15129225
8199A5129225p22846N02442O65996L53185k36734p87040O98148J003248j871424
$$ 15129225 14406379 14908821 15574817 15928002 15691268 14904228 15602376 16605624 14734200
8190A4734200j03310j23781l94734k03963L1426M7206L57565l5483j10185k20561
$$ 14734200 14630890 14507109 14112375 13908412 13939838 13987044 14344609 14309126 14198941 13978380
8180A3978380j6723R47259m49507m95436j92864M3916J63061m22737n0687L34427
$$ 13978380 13961657 14908916 14459409 13963973 13771109 13815025 13978086 13555349 13504662 13839089
8170A3839089L62979N68201j94080m82850k27019l50639k88557L36353m07472
$$ 13839089 14202068 14770269 14576189 14093339 13866320 13515681 13227124 13563477 13156005
8161A3156005j21931l39630P9007N3836J90339K60929k56235m4213k74096K00815
$$ 13156005 13034074 12694444 12773451 12827287 13017626 13278555 13022320 12978107 12704011 12904826
8151A2904826j76379j50264J69947j97423k16378k91424K43614M3709j1986K6996
$$ 12904826 12728447 12578183 12748130 12550707 12334329 12042905 12286519 12330228 12318242 12345238
8141A2345238p4311p0738L13836K553J45335l15145j09996K18569K4222m91854
$$ 12345238 12270927 12200189 12514025 12516578 12661913 12346768 12236772 12455341 12479563 11987709
8131A1987709j87408L2318K3070L28508m60124j99356J16014j1048j17004j30463
$$ 11987709 11800301 11832619 11855689 12184197 11724073 11524717 11640731 11629683 11512679 11382216
8121A1382216J01866L30792r5412l34072k14402l3860k8443J84497k87513J8323
$$ 11382216 11484082 11814874 11719462 11385390 11170988 11137128 11108685 11293182 11005669 11023992
8111A1023992l61004P08294n43383L914N5490p64415K09146N04929n27505k09197
$$ 11023992 10662988 11371282 10827899 10831813 10887303 10122888 10332034 10836963 10309458 10100261
8101A0100261K01030j62805k43039N196P14818J07551J72727p3479k44958J23946
$$ 10100261 10301291 10138486 9895447 9900643 10615461 10723012 10895739 10822260 10577302 10701248
8091A0701248p41704l40928K32671J80166M14447j51996P9853q8631l48409n15257
$$ 10701248 9959544 9618616 9851287 10031453 10445900 10293904 10373757 10285126 9936717 9421460
8081I421460K73827k9284o35609j05066M61458m0853J76899l47352m8184L68153
$$ 9421460 9695287 9666003 9030394 8925328 9386786 9345933 9522832 9175480 9127296 9495449
8071I495449L17147o2323m8401l15969J2769J43094m79550k71896J63923j8747
$$ 9495449 9812596 9750273 9701872 9385903 9398672 9541766 9062216 8790320 8954243 8935496
8061H935496Q0861L21156J7536r2586Q0264k56410l59387Q1195k4374M61449j76905
$$ 8935496 9016357 9337513 9355049 9262463 9342727 9086317 8726930 8808125 8783751 9245200 9068295
8050I068295n73525L18638k44679K04548l68038l47375K33786M18463J15402m06785
$$ 9068295 8494770 8813408 8568729 8773277 8405239 8057864 8291650 8710113 8825515 8418730
8040H418730J75568Q4425k14495l13634O3042j01733K32568M19188n9083J5780
$$ 8418730 8594298 8678723 8464228 8150594 8213636 8111903 8344471 8763659 8704576 8720356
8030H720356l36609p9246l34792n002L87360q7633Q3940l33875J04282j50469
$$ 8720356 8383747 8304501 7969709 7964707 8352067 8264434 8348374 8014499 8118781 7968312
8020G968312K55726j479k81064K30921n988j24991l6788r9648l3743M7541K11059
$$ 7968312 8224038 8222559 7941495 8172416 8166428 8041437 8004649 7905001 7871258 7918799 8129858
8009H129858j4288m10507j71613J7757q3647j14472n9827r4723J22066Q9751q1445
$$ 8129858 8115570 7705063 7533450 7551207 7467560 7353088 7293261 7198538 7320604 7410355 7328910
7998G328910K03552K0980r2937N71745n71627k38960m7019j34476L21499l32525
$$ 7328910 7532462 7553442 7460505 8032250 7460623 7221663 7174644 7040168 7361667 7029142
7988G029142K2235P0577k75547Q0535M6294O1835o546m39837K47834k6094L06779
$$ 7029142 7051377 7121954 6846407 6926942 6973236 7035071 7028525 6588688 6836522 6810428 7117207
7977G117207J31660l89838l19264K76313r1793k96636L7114L80603L57106j9474
$$ 7117207 7248867 6859029 6539765 6816078 6724285 6427649 6464763 6845366 7202472 7182998
7967G182998l81593M816K1264k09759l0424M63924K40678l19281k37678j22770
$$ 7182998 6801405 6806221 6827485 6617726 6587302 7051226 7291904 6972623 6734945 6612175
7957F612175j32213J00658l8972L67058k31128R1459K01810l35565M32233j33145
$$ 6612175 6479962 6580620 6541648 6908706 6677578 6769037 6970847 6635282 7067515 6934370
7947F934370l98698p8600J02131L9908k2374L79242j49189J21838l4947k46001
$$ 6934370 6535672 6457072 6559203 6599111 6576737 6955979 6806790 6928628 6893681 6647680
7937F647680j73478L67922k41526n59338P04084K29324n29889k01448K89465M61069
$$ 6647680 6474202 6842124 6600598 6041260 6745344 6974668 6444779 6243331 6532796 6993865
7927F993865J28953l78705j7314l57544R3760R1402j45558J02588L50405p6081
$$ 6993865 7122818 6744113 6726799 6369255 6463015 6554417 6408859 6511447 6861852 6785771
7917F785771j86333k96303J61916l35143K15280K82500N983J00015m62361M5203
$$ 6785771 6599438 6303135 6465051 6129908 6345188 6627688 6633671 6733686 6271325 6316528
7907F316528N25176j90942J55375j36654J25203p0112k02356K74207k23172k58956
$$ 6316528 6841704 6650762 6806137 6669483 6794686 6724574 6522218 6796425 6573253 6314297
7897F314297N14710k60987O9368L46898k86379k26571K53944K01179j2719j32250
$$ 6314297 6829007 6568020 6637388 6984286 6697907 6471336 6725280 6926459 6913740 6781490
7887F781490m06000j2253K70088O7577m17373J15259J58334Q0607j87080L94983
$$ 6781490 6375490 6363237 6633325 6700902 6283529 6398788 6557122 6637729 6450649 6845632
7877F845632k5324k0611R5149M3784M38834m48038q7858Q138j17164J01738Q9570
$$ 6845632 6820308 6799697 6894846 6938630 7377464 6929426 6841568 6849706 6732542 6834280 6923850
7866F923850l32359j70588K99839L63254l71153j39080M955k25777O562N5069
$$ 6923850 6591491 6420903 6720742 7083996 6712843 6573763 6578718 6352941 6359503 6414572
7856F414572Q3154j44958M04753L7158M7674m05371O17284k27804j1636N3550
$$ 6414572 6497726 6352768 6757521 6794679 6842353 6436982 7054266 6826462 6814826 6868376
7846F868376l00914K22749l95607q7857L12687J81652k29128N7266O1458N5045
$$ 6868376 6567462 6790211 6394604 6306747 6619434 6801086 6571958 6629224 6690682 6745727
7836F745727k67937N0500k64450j49492j59915J41188J13193J57685K07075l35323
$$ 6745727 6477790 6528290 6263840 6114348 5954433 6095621 6208814 6366499 6573574 6238251
7826F238251j53611L45638K34565m37610J69028J07715n59171Q5889J71409k27870
$$ 6238251 6084640 6430278 6664843 6227233 6396261 6503976 5944805 6030694 6202103 5974233
7816E974233M8103K06492j89490k38197N85595L00593K42778l50436j72279J69911
$$ 5974233 6022336 6228828 6039338 5801141 6386736 6687329 6930107 6579671 6407392 6577303
7806F577303J10317j807346P29638J297244K77039n16148l50747M65505k60261
$$ 6577303 6687620 4880274 5609912 6907156 7184195 6668047 6317300 6782805 6522544
7797F522544N048J79946o2227l06652L73548P822J65419m31126K03171l83059
$$ 6522544 6527592 6707538 6645311 6338659 6712207 6720029 6885448 6454322 6657493 6274434
7787F274434r1229o7651k83343N70878M95593J5033j31962J02333k37295l4092
$$ 6274434 6183205 6115554 5832211 6403089 6898682 6913715 6781753 6884086 6646791 6612699
7777F612699K38693o9080j28515J10787m2725K68154l5214k29705N1804K4382
$$ 6612699 6851392 6782312 6653797 6764584 6721859 6990013 6954799 6725094 6776898 6801280
7767F801280K70972M7155m8755l00395J10336K91533j76608j6035J99687K32289
$$ 6801280 7072252 7119407 7070652 6770257 6880593 7172126 6995518 6979483 7179170 7411459
7757G411459N7713l85460l17002R1460R854m0374J45822R1279J37212J34907M06046
$$ 7411459 7469172 7083712 6766710 6858170 6868024 6827650 6973472 7064751 7201963 7336870 7742916
7746G742916k90914K55467k52633j62852L63648p8808k08296k53572K26506m2843
$$ 7742916 7452002 7707469 7454836 7291984 7655632 7576824 7368528 7114956 7341462 7298619
7736G298619R1664l0313J55018J86493k00352N15726L88295j11529N8736L06823
$$ 7298619 7390283 7359970 7514988 7701481 7501129 8016855 8405150 8293621 8352357 8659180
7726H659180K26783J11085K0311K24779j57614j57067k49116K04377K42368L69838
$$ 8659180 8885963 8997048 9017359 9242138 9084524 8927457 8678341 8882718 9125086 9494924
7716I494924K78371k4761J87128J31265J13424j13885k30331L29284M56668J39166
$$ 9494924 9773295 9748534 9935662 10066927 10180351 10066466 9836135 10165419 10622087 10761253
7706A0761253J06313J56622P0308L88862N4244o2872L09337M83179l31802j51056
$$ 10761253 10867566 11024188 11094496 11483358 11537602 11474730 11784067 12267246 11935444 11784388
7696A1784388O9395n4558O72701n67006j99674k55739j33442j50625q8516n3572
$$ 11784388 11853783 11799225 12471926 11904920 11705246 11449507 11316065 11165440 11076924 11023352
7686A1023352k77003q951J24134M7734n17704k80342k35510l50190J02901m0883
$$ 11023352 10746349 10737398 10861532 10909266 10391562 10111220 9875710 9525520 9628421 9587538
7676I587538R5088k93703k51932k13825N4213n8952M09044m32712l19977j10651
$$ 9587538 9682626 9388923 9136991 8923166 8977379 8918427 9327471 8894759 8574782 8464131
7666H464131J43367L44239k86746k99064m12921J51548n2534m11668o7077k94900
$$ 8464131 8607498 8951737 8664991 8365927 7953006 8104554 8052020 7640352 7573275 7278375
7656G278375j91590m40001M0886K66956K8543j38256K26554j74376n29303M05659
$$ 7278375 7086785 6646784 6687670 6954626 6983169 6844913 7071467 6897091 6367788 6773447
7646F773447q7537m14214j23946M47976R75q6200j19565m23622l51054L87657
$$ 6773447 6685910 6271696 6147750 6595726 6596701 6510501 6390936 5967314 5616260 6003917
7636F003917K8626l12502m794l44039l4983j16590k6748j15497N56647O72097
$$ 6003917 6032543 5720041 5715247 5371208 5336225 5219635 5192887 5077390 5634037 6306134
7626F306134l45815k64835k50122j34896j37660M00307j65066k24528J14712j57005
$$ 6306134 5960319 5695484 5445362 5310466 5172806 5573113 5408047 5183519 5298231 5141226
7616E141226k84583k33582K62509O19373j63734r8716N2165j68606N6629l05173
$$ 5141226 4856643 4623061 4885570 5504943 5341209 5242493 5294658 5126052 5182681 4877508
7606D877508k06507k87249K01494L93799j92143K0810j25823j05229j63911m1149
$$ 4877508 4671001 4383752 4585246 4979045 4786902 4807712 4681889 4576660 4412749 4371600
7596D371600O44735j13466k92288n0454J06881M8347j51679j06536j90877L0744
$$ 4371600 5016335 4902869 4610581 4560127 4667008 4715355 4563676 4457140 4266263 4297007
7586D297007O29257J37043l90347L4068n41652j12208M50328M0870l65018J74663
$$ 4297007 4926264 5063307 4672960 4707028 4165376 4053168 4503496 4544366 4179348 4354011
7576D354011K73494m684l41333J53553k08759K14600J05322l57499l14277L52910
$$ 4354011 4627505 4622821 4281488 4435041 4226282 4440882 4546204 4188705 3874428 4227338
7566D227338J07697j73711m19798L45505M10733l77087K48849L9329l3586k3700
$$ 4227338 4335035 4161324 3741526 4087031 4497764 4120677 4369526 4408855 4375269 4351569
7556D351569J29311m15961k54207P6297J44204p0490J83k17209j36907N59751
$$ 4351569 4480880 4064919 3810712 3887009 4031213 3960723 3960906 3743697 3606790 4166541
7546D166541j15073o26386R3648O07916j10280P8998J78451k88077p7899K70698
$$ 4166541 4051468 3425082 3518730 4126646 4016366 4095364 4273815 3985738 3907839 4178537
7536D178537J0361K21329j64386j9081l30410m99293M42884J33070R3918J06023
$$ 4178537 4188898 4410227 4245841 4226760 3896350 3397057 3839941 3973011 4066929 4172952
7526D172952o3235k06207K59206j61170o1353m82776L03002K42302P867J28876
$$ 4172952 4109717 3903510 4162716 4001546 3940193 3457417 3760419 4002721 4010588 4139464
7516D139464L03241J9507J01879o21184r6128N14975j72376J29421J35464J49422
$$ 4139464 4442705 4462212 4564091 3942907 3846779 4361754 4189378 4318799 4454263 4603685
7506D603685j70711m82539j15993L47165k43778l68065K52168K34534M9850l89407
$$ 4603685 4432974 3950435 3834442 4181607 3937829 3569764 3821932 4056466 4106316 3716909
7496C716909J19258j84219K49025l26295J26644N17602j48185J52869n45101k7394
$$ 3716909 3836167 3651948 3900973 3574678 3701322 4218924 4070739 4223608 3678507 3651113
7486C651113k0810M86613j2887j73265r8271J6908J53297L39172k1270n49686
$$ 3651113 3630303 4116916 4104029 3930764 3832493 3849401 4002698 4341870 4320600 3770914
7476C770914M49833K18809J14045j6961m7822J67324k71179q8116O4465J94616
$$ 3770914 4220747 4439556 4553601 4536640 4488818 4656142 4384963 4296847 4361312 4555928
7466D555928P4002k41019J68030l51931l48856O8119o2634M82801N15552k95131
$$ 4555928 4629930 4388911 4556941 4205010 3856154 3924273 3861639 4344440 4859992 4564861
7456D564861k2072P7713k20525k66487R20K95701k846L07418Q4083L62467p74431
$$ 4564861 4542789 4620502 4399977 4133490 4134410 4430111 4427265 4734683 4818766 5181233 4406802
7445D406802P5917j40892r2608K0906p03763M37032N15425l75204j28744L31515
$$ 4406802 4482719 4341827 4249219 4270125 3566362 4003394 4518819 4143615 4014871 4346386
7435D346386O3289J74239J83123n92235j78790J15380j55716L31301O80160l93589
$$ 4346386 4409675 4583914 4767037 4174802 3996012 4111392 3955676 4286977 4967137 4573548
7425D573548o68802l54895J53803K84609K75101Q2784k93029K08296Q7498m7104
$$ 4573548 3904746 3549851 3703654 3988263 4263364 4346148 4053119 4261415 4348913 4301809
7415D301809k55024j25143r4308k1783K78429o4925l27628K75790m24931K09933
$$ 4301809 4046785 3921642 3827334 3805551 4083980 4019055 3691427 3967217 3542286 3752219
7405C752219k03040J66147L60534L7600j25427J84113k10998j044J95887k36246
$$ 3752219 3549179 3715326 4075860 4113460 3988033 4172146 3961148 3960104 4155991 3919745
7395C919745m98572M00050p0687j39204J99910l21328J39406q6084J58944k09959
$$ 3919745 3421173 3821223 3750536 3611332 3811242 3489914 3629320 3543236 3702180 3492221
7385C492221L02695K34012m7072m50933m65717L7511J79784K8414L4846k11648
$$ 3492221 3794916 4028928 3981856 3530923 3065206 3102717 3282501 3310915 3345761 3134113
7375C134113k1572j47807J39866m6690K76171K25612N310L2167k30303j78073
$$ 3134113 3112541 2964734 3104600 3057910 3334081 3559693 3565003 3597170 3366867 3188794
7365C188794J13474M1195k89424K29059K530K03135j66116l57541J76063k72690
$$ 3188794 3302268 3343463 3054039 3283098 3285628 3488763 3322647 2965106 3141169 2868479
7355B868479K46781J06891K6023K54508l52752K4056L40075j22462J00646j04488
$$ 2868479 3115260 3222151 3248174 3502682 3149930 3173986 3514061 3391599 3492245 3387757
7345C387757L3262K41704k53520k13218n19012M18373Q4094M1649K77823m94352
$$ 3387757 3421019 3662723 3409203 3195985 2676973 3095346 3179440 3221089 3498912 3004560
7335C004560k69136q5998L94478m9440M68008L51470n12646j11323j41896k9136
$$ 3004560 2735424 2649426 3043904 2994464 3462472 3813942 3301296 3189973 3048077 3018941
7325C018941Q457p596N09248M6468m06359J74597N2315O9650l71532k01800L10327
$$ 3018941 3027398 3019802 3529050 3575518 3169159 3343756 3396071 3465721 3094189 2892389 3202716
7314C202716M40833k22712j22099J17840j30266J2323j92124p549k30972O7668
$$ 3202716 3643549 3420837 3298738 3416578 3286312 3298635 3106511 3098962 2867990 2935658
7304B935658K68437L38178K29579L6587r3213k02602l08797j27800l21819L55538
$$ 2935658 3204095 3542273 3771852 3808439 3715226 3512624 3203827 3076027 2754208 3109746
7294C109746K75823k75169r3802M35464N98934j17935j85505P1894l46621k31233
$$ 3109746 3385569 3110400 3016598 3452062 4050996 3933061 3747556 3819450 3472829 3241596
7284C241596J92198L00080m1123l9985m35518N82879j74411J644N426P8777N024
$$ 3241596 3433794 3733874 3692751 3652766 3217248 3800127 3625716 3627360 3632786 3711563 3716587
7273C716587n15756K25274L05786M06905m98387r005j66255r5758m61573M98558
$$ 3716587 3200831 3426105 3731891 4138796 3640409 3631404 3465149 3369391 2907818 3406376
7263C406376N4670Q7232L26309k58947m45439j5168K35281R1351n7310K57382
$$ 3406376 3461046 3548278 3874587 3615640 3170201 3155033 3390314 3481665 3424355 3681737
7253C681737L57836j01522N1121j95681Q841N47598n10281q8854K79776k96852
$$ 3681737 4039573 3938051 3989172 3793491 3802332 4349930 3839649 3750795 4030571 3733719
7243C733719l20874L68322k42240P1451k30891J77785J88928n4891J53791K37926
$$ 3733719 3412845 3781167 3538927 3610378 3379487 3557272 3746200 3691309 3845100 4083026
7233D083026l19713R9239N40673Q386k99597k21407l55582k2883K46371l02322
$$ 4083026 3763313 3862552 4403225 4411611 4112014 3890607 3535025 3512142 3758513 3456191
7223C456191M1551J30507l0322J19090K93949j54178K69656K7010J00292p4876
$$ 3456191 3497742 3628249 3597927 3717017 4010966 3856788 4126444 4153454 4253746 4178870
7213D178870J4567J36947k54689k12915K48520k57061l15650k538L90687J10642
$$ 4178870 4193437 4330384 4075695 3862780 4111300 3854239 3538589 3536051 3926738 4037380
7203D037380k22041J2413K77901l85800m33084L58728M97532J01579j25919m59525
$$ 4037380 3815339 3827752 4105653 3719853 3286769 3645497 4143029 4244608 4118689 3659164
7193C659164j02538L62945k25163l60600J15805L94737j06623J18275l27k35573
$$ 3659164 3556626 3919571 3694408 3333808 3449613 3844350 3737727 3856002 3855675 3620102
7183C620102m8370j30766m1597l1035J51267M7301J2614l25764Q1297P9130K06913
$$ 3620102 3571732 3440966 3399369 3368334 3519601 3566902 3579516 3253752 3335049 3414179 3621092
7172C621092j6097J03530m78511j54475N5004L33943K93402j20682o67421L72758
$$ 3621092 3604995 3708525 3230014 3075539 3130543 3464486 3757888 3637206 2969785 3342543
7162C342543K33800K58693j98141l9190l30111n9407K04409L98312j24044l32877
$$ 3342543 3576343 3835036 3636895 3597705 3267594 3208187 3412596 3810908 3686864 3353987
7152C353987M47322k01125k4576K79833M22765p7319k76372K18507J63126p5555
$$ 3353987 3801309 3600184 3575608 3855441 4278206 4200887 3924515 4143022 4306148 4230593
7142D230593j743r0486k01501J08331K88621l4724N4890n11578k94191k9428K63540
$$ 4230593 4228850 4138364 3936863 4045194 4333815 4299091 4353981 3842403 3548212 3518784 3782324
7131C782324K47125M2343j29972j40503J67960n3624l15992m2024l53137K21631
$$ 3782324 4029449 4071792 3941820 3801317 3969277 3915653 3599661 3557637 3204500 3426131
7121C426131n3867J6639k72297J73354m28589K81545J35207l49568J83804J50118
$$ 3426131 3372264 3388903 3116606 3289960 2861371 3142916 3278123 2928555 3112359 3262477
7111C262477k21096l93573r1024K60534M69989n10430p3128L69683O6433Q7211
$$ 3262477 3041381 2647808 2556784 2817318 3287307 2776877 2703749 3073432 3139865 3227076
7101C227076K51136j51186m85105K49513k15900N29652m30662j53976K35133k60597
$$ 3227076 3478212 3327026 2841921 3091434 2875534 3405186 2974524 2820548 3055681 2795084
7091B795084L66894j20483J01393J96017l50262l41694n3476P65966k37392j68155
$$ 2795084 3161978 3041495 3142888 3338905 2988643 2646949 2593473 3359439 3122047 2953892
7081B953892K95500J03059k27198L11033j26444l59887L76351m70402J41893K89605
$$ 2953892 3249392 3352451 3125253 3436286 3309842 2949955 3326306 2855904 2997797 3287402
7071C287402r0056j83718J75510l65954l868L48623k79450J40750r308L98964
$$ 3287402 3197346 3013628 3189138 2823184 2819316 3167939 2888489 3029239 3019931 3418895
7061C418895k63917j11472K04615k63863l91542K04875N62904J20478K25074k65159
$$ 3418895 3154978 3043506 3248121 2984258 2592716 2797591 3360495 3480973 3706047 3440888
7051C440888j71225K6499K60314k84058K26612M25119k63183m24026J26417j23590
$$ 3440888 3269663 3296162 3556476 3272418 3499030 3924149 3660966 3236940 3363357 3239767
7041C239767l8122l17158J48707L43330q601k88360K23030J90635J25689j94444
$$ 3239767 3201645 2884487 3033194 3376524 3367923 3079563 3302593 3493228 3618917 3424473
7031C424473n5384p8755j8859k64326K9202l58056K4385M98400R455j86752J73168
$$ 3424473 3369089 3290334 3271475 3007149 3036351 2678295 2702680 3201080 3210535 3023783 3196951
7020C196951K9216k30112L5533J12761P68435j25499j61994J46104R2411k37057
$$ 3196951 3226167 2996055 3031588 3144349 3912784 3787285 3625291 3771395 3863806 3626749
7010C626749l88613K3640l74718K84044O6328j41926K14611J5953j02391k99564
$$ 3626749 3238136 3261776 2887058 3171102 3237430 3095504 3310115 3326068 3223677 2924113
7000B924113J22621r1002K30278L53975K9350j24760j9563k13680q5821L57479
$$ 2924113 3046734 2955732 3186010 3539985 3569335 3444575 3425012 3211332 3125511 3482990
6990C482990J27216k17815n9230j39328n6744J20441M29316o7330j55188L48095
$$ 3482990 3610206 3392391 3333161 3193833 3137089 3257530 3686846 3619516 3464328 3812423
6980C812423l39125j68356j08078j31242L29183r3194J49680l39817L35546m86184
$$ 3812423 3473298 3304942 3196864 3065622 3394805 3301611 3451291 3111474 3447020 2960836
6970B960836r81J03995k00818K70429m3640K05910j61170J52658J68481K12529
$$ 2960836 2959855 3063850 2863032 3133461 3089821 3295731 3134561 3287219 3455700 3668229
6960C668229k44238q91410K02568j47896L05116P28682m18110k1942k33716L52244
$$ 3668229 3423991 2532581 2735149 2587253 2892369 3621051 3202941 3180999 2947283 3299527
6950C299527K04039k24595J79736J9431m01260J37268J31935o498q1180K69015
$$ 3299527 3503566 3278971 3458707 3478138 3076878 3214146 3346081 3339583 3258403 3527418
6940C527418N4476m35179o4258K48234M3721o1099k23898L18173k23927j35640
$$ 3527418 3581894 3146715 3082457 3330691 3374412 3313313 3089415 3407588 3183661 3048021
6930C048021L68175Q9259j26045m2394K64482n18198O25223J93020n45963l86852
$$ 3048021 3416196 3505455 3379410 3337016 3601498 3083300 3708523 3901543 3355580 2968728
6920B968728L66430K24377N90j22l44800j00608j58790M02022l2767m9436m2496
$$ 2968728 3335158 3559535 3560125 3560003 3215203 3114595 2955805 3357827 3325060 3275624 3233128
6909C233128K00113J59959p2276o3416K58768M01803L46723m72241n26378J67811
$$ 3233128 3433241 3593200 3520924 3457508 3716276 4118079 4464802 3992561 3466183 3633994
6899C633994L40890k8561L00139j62386l37218J66387J08642k38082M8359k23807
$$ 3633994 3974884 3946323 4246462 4084076 3746858 3913245 4021887 3783805 3832164 3608357
6889C608357r1656L64353p9437j91905j14007J34387m7501k1639j8973j15210
$$ 3608357 3516701 3881054 3801617 3609712 3495705 3630092 3582591 3560952 3541979 3426769
6879C426769J9805N6344M50581O6109J89833k30836l10916Q6584J33321K64838
$$ 3426769 3446574 3502918 3953499 4019608 4209441 3978605 3667689 3754273 3887594 4152432
6869D152432L51177o3366n40789O44414l06659m41705M7643l1909n10172M40198
$$ 4152432 4503609 4440243 3899454 4543868 4237209 3795504 3843147 3811238 3301066 3741264
6859C741264J47632J68047j26766R8617q3147j09565Q2212n3540J47727M65316
$$ 3741264 3888896 4056943 3930177 4028794 3945647 3836082 3918294 3864754 4012481 4477797
6849D477797m84732j93324M5947K38816K01334l37576J63832l49548k18693M72484
$$ 4477797 3993065 3799741 3845688 4084504 4285838 3948262 4112094 3762546 3543853 4016337
6839D016337L68761l66219j29155l3499k13690K45171j57762O9951N3383N12965
$$ 4016337 4385098 4018879 3889724 3856225 3642535 3887706 3729944 3799895 3853278 4366243
6829D366243k70647l68055M58795j7243J27880K78827j69196r2763M81360m70070
$$ 4366243 4095596 3727541 4186336 4169093 4296973 4575800 4406604 4313841 4795201 4325131
6819D325131J2291M6085k28493O2690K90579j0817j05489l04908j2507O77968
$$ 4325131 4337422 4383507 4155014 4217704 4508283 4497466 4391977 4087069 4074562 4752530
6809D752530K33321k13221m46582m03234L95431j45328J21309j47736n2423L13617
$$ 4752530 4985851 4772630 4326048 3922814 4318245 4172917 4294226 4146490 4094067 4407684
6799D407684J40161K8728N5304k79550j53441R8650k80951L35876N63748J43443
$$ 4407684 4547845 4576573 4631877 4352327 4198886 4297536 4016585 4352461 4916209 5059652
6789E059652j85660j56352J67811k70631J00579K56191o48275k68934L19725L4705
$$ 5059652 4873992 4717640 4885451 4614820 4715399 4971590 4323315 4054381 4374106 4408811
6779D408811K40450J44805K11005p5458m1419L71595l64706l90900j1086j09297
$$ 4408811 4649261 4794066 5005071 4929613 4888194 5259789 4895083 4504183 4493097 4383800
6769D383800J26096J60175p6312K15080M12916l02932j96230k21259l8727L48251
$$ 4383800 4509896 4670071 4593759 4808839 5221755 4918823 4722593 4501334 4462607 4810858
6759D810858J02540M7062K60013p7731J51138j18503j48741p040r6816J08123
$$ 4810858 4913398 4960460 5220473 5142742 5293880 5175377 5026636 5019596 4922780 5030903
6749E030903l32840K07816p0417R9266J44967K4883o7265k34296M12502J80696
$$ 5030903 4698063 4905879 4835462 4934728 5079695 5104578 5037313 4803017 5215519 5396215
6739E396215l4659J58988L26154m19650j8118k57003L15505l70874K32944L28167
$$ 5396215 5361556 5520544 5846698 5427048 5408930 5151927 5467432 5096558 5329502 5657669
6729E657669j25011K45380k43861q9161k00615Q8797j9910L08658J34349M59457
$$ 5657669 5532658 5778038 5534177 5445016 5244401 5333198 5313288 5621946 5756295 6215752
6719F215752n33195L19014K84714j31790l1396r2209k59591M13537M52879m11051
$$ 6215752 5682557 6001571 6286285 6154495 6123099 6030890 5771299 6184836 6637715 6226664
6709F226664j81340M20013J17886j48778q9684K63996r003J45522m36320j5617
$$ 6226664 6045324 6465337 6583223 6434445 6344761 6608757 6599754 6745276 6308956 6293339
6699F293339K56378L19383L10900k40027j872k86656P2398K50812O7730p5403
$$ 6293339 6549717 6869100 7180000 6939973 6938101 6651445 6723843 6974655 7042385 6966982
6689F966982J93455M2666j21247O1025L40415p3040o63204J3280K68025L4483
$$ 6966982 7160437 7203103 7081856 7142881 7483296 7410256 6747052 6760332 7028357 7062840
6679G062840k0702N1110M81342R2738l48565q8730J85696o7999L06721K11104
$$ 7062840 7042138 7093248 7574590 7667328 7318763 7230033 7415729 7347730 7654451 7865555
6669G865555P0156j73451m7498N9551r492j93859K05461L29975J9666k90268k79688
$$ 7865555 7935711 7762260 7714762 7774313 7764821 7570962 7776423 8106398 8126064 7835796 7556108
6658G556108M32719K96113M2760L57357L75110K40488j59798j3780L39141m0642
$$ 7556108 7988827 8284940 8327700 8685057 9060167 9300655 9140857 9127077 9466218 9425576
6648I425576m8686N16388m5701j10895K20211j90392j50836J8725M98769p6007
$$ 9425576 9376890 9893278 9847577 9736682 9956893 9766501 9615665 9634390 10133159 10057152
6638A0057152L44329Q4113P5019k6086K87331L81069K84442J68699Q4537m9270
$$ 10057152 10401481 10485594 10560613 10534527 10821858 11202927 11487369 11656068 11740605 11691335
6628A1691335O1987M29923j40653L10140K70053R4758L4942K16227k39009J73963
$$ 11691335 11753322 12183245 12042592 12352732 12622785 12717543 12752485 12968712 12729703 12903666
6618A2903666K67287N40226l43134p311O53492k56556N37344j8529q223O21282
$$ 12903666 13170953 13711179 13368045 13360734 14014226 13757670 14295014 14276485 14268262 14889544
6608A4889544m71031j15495K82172J24925J73549P60K46537o287k39540N3024
$$ 14889544 14418513 14303018 14585190 14710115 14883664 14884424 15130961 15124674 14885134 14938158
6598A4938158Q6979O5882j39231L31941q4088N9005m56163j81360O34864j52648
$$ 14938158 15025137 15091019 14951788 15283729 15199641 15258646 14802483 14621123 15255987 15103339
6588A5103339j55151l0742k97851j91006M82884O5919l16717j8975J81421k37084
$$ 15103339 14948188 14917446 14619595 14428589 14911473 14977392 14660675 14641700 14823121 14586037
6578A4586037k02960k22725j56798K25987K9252l27087Q7658J95371K4200m4629
$$ 14586037 14383077 14160352 14003554 14229541 14258793 13931706 14019364 14214735 14238935 14194306
6568A4194306l73270m8084N1488m83341M31091j75813j66274j30366l88181j48262
$$ 14194306 13821036 13772952 13824440 13341099 13772190 13596377 13430103 13299737 12911556 12763294
6558A2763294N02880k92980o7972K04885j51074n76800K32422L00197L60869l27086
$$ 12763294 13266174 12973194 12905222 13110107 12959033 12382233 12614655 12914852 13275721 12948635
6548A2948635j59930L73328n72452L02518K18210k90852m0944l5847k1901N3188
$$ 12948635 12788705 13162033 12589581 12892099 13110309 12819457 12778513 12742666 12720765 12773953
6538A2773953l19106J88031R114K33893m13149m24300K53636N68762n12304l61334
$$ 12773953 12454847 12642878 12651992 12885885 12472736 12048436 12302072 12870834 12358530 11997196
6528A1997196K6305M35665J19783K87666K21442k64350J2935Q9752r9145j13782
$$ 11997196 12023501 12459166 12578949 12866615 13088057 12823707 12836642 12926394 12827249 12713467
6518A2713467K07564K84241k01387K21412m3996P6038J07211q3739K86578Q9159
$$ 12713467 12921031 13205272 13003885 13225297 13181301 13257339 13364550 13280811 13567389 13656548
6508A3656548n5652Q8225j14878k67538l15103k61150L65835M46574O4022J4933
$$ 13656548 13600896 13689121 13574243 13306705 12991602 12730452 13096287 13542861 13606883 13621816
6498A3621816l39121j68564R0197J81997o3607J62035m1782K18136L64333k72286
$$ 13621816 13282695 13114131 13204328 13386325 13322718 13484753 13442971 13661107 14025440 13753154
6488A3753154j08393M16942m54202n6752R1120k5566J78211J82969j9701j81733
$$ 13753154 13644761 14061703 13607501 13550749 13641869 13616303 13794514 13977483 13957782 13776049
6478A3776049O8843j30394K13240j08861J19816k73503j35027M67130p0248j79845
$$ 13776049 13844892 13714498 13927738 13818877 13938693 13665190 13530163 13997293 13927045 13747200
6468A3747200K81388Q1958K07761M5660J54297m75103J64366k14485J08601l03066
$$ 13747200 14028588 14110546 14318307 14363967 14518264 14043161 14207527 13993042 14101643 13798577
6458A3798577q6762M87714K38068K86500O12873o18805M4141J67466l20066m15645
$$ 13798577 13711815 14199529 14437597 14724097 15336970 14718165 14762306 14929772 14609706 14194061
6448A4194061L95149N36155k44286k7670K05502M61190j4345J12057J82090L12416
$$ 14194061 14589210 15125365 14881079 14853409 15058911 15520101 15505756 15617813 15799903 16112319
6438A6112319L133j33024o64L46770k89672L15860N47782L6908L95780l7759m28407
$$ 16112319 16115452 15982428 15981764 16328534 16038862 16354722 16902504 16939412 17335192 17297433 16869026
6427A6869026j32338K56167K03682k35802J87522P33556R9956j38513N3665J26468
$$ 16869026 16736688 16992855 17196537 16960735 17148257 17881813 17981769 17843256 17896921 18023389
6417A8023389M57860O5692j95455k93590K95992j9113J27193J22909P1781N53850
$$ 18023389 18481249 18546941 18351486 18057896 18353888 18334775 18461968 18584877 18656658 19210508
6407A9210508K01376m7628K71663O4334j08195L74969k32304j01008J88683j98402
$$ 19210508 19411884 19364256 19635919 19700253 19592058 19967027 19734723 19633715 19822398 19623996
6397A9623996L23661N16106m324k48701K64144M03081J67199l54189K95118Q6223
$$ 19623996 19947657 20463763 20459439 20210738 20474882 20877963 21045162 20690973 20986091 21072314
6387B1072314K07487j3683n9260M3975k83804N03696J32148L00749K40602M4838
$$ 21072314 21279801 21266118 21206858 21250833 20967029 21470725 21602873 21903622 22144224 22189062
6377B2189062k24886j53236j1871J45460J24741M6375L28873k57822l49351J13240
$$ 22189062 21964176 21810940 21799069 21944529 22069270 22115645 22444518 22186696 21837345 21950585
6367B1950585K097N47094J3343k0526J83539j58009N56941l8931k52628J58586
$$ 21950585 21952682 22499776 22513119 22492593 22676132 22518123 23075064 23036133 22783505 22942091
6357B2942091p1310J63445M53201k49575P4742M3057n7151m74141j35154O75879
$$ 22942091 22870781 23034226 23487427 23237852 23312594 23355651 23298500 22824359 22689205 23365084
6347B3365084M3786m6032j06924J14107l60903j01941L51463L14186P79364l41726
$$ 23365084 23408870 23362838 23255914 23370021 23009118 22907177 23258640 23572826 24352190 24010464
6337B4010464m46437l1781J0574l34345J24593Q58397N64711l13294p25937M26625
$$ 24010464 23564027 23532246 23542820 23208475 23333068 24191465 24756176 24442882 23716945 24143570
6327B4143570L09440K85733K31821k33851m16260L17560R59921K55738j19379
$$ 24143570 24453010 24738743 24970564 24736713 24320453 24638013 25597934 25853672 25734293
6318B5734293j94451K02463K9852n6480j41209K64824J45744k96272M59563M53336
$$ 25734293 25539842 25742305 25772157 25715677 25574468 25839292 25985036 25688764 26148327 26601663
6308B6601663K7475k74017M39826M40326K03197m10835n4422L67809O6308l9212
$$ 26601663 26629138 26355121 26794947 27235273 27438470 27027635 26973213 27341022 27407330 27368118
6298B7368118L77619J13590M40907J96348L32549L67673N4787L20379j0403L15116
$$ 27368118 27745737 27859327 28300234 28496582 28829131 29196804 29251591 29571970 29561567 29876683
6288B9876683m1539l4500q0042M40679M96242m37850M78739M02835J7225K79635
$$ 29876683 29835144 29800644 29720602 30161281 30657523 30219673 30698412 31101247 31118472 31398107
6278C1398107m9005J15730L27946J58459J67721N3621J45264M30629k0126L85239
$$ 31398107 31349102 31464832 31792778 31951237 32118958 32172579 32317843 32748472 32728346 33113585
6268C3113585L86286j68576J35776J23573J89292O09302K43730L79715K9324M15549
$$ 33113585 33499871 33331295 33467071 33590644 33779936 34389238 34632968 35012683 35042007 35457556
6258C5457556J6423m14819K90341N10992M38414L52581K1452L84539O82294K90031
$$ 35457556 35473979 35059160 35349501 35860493 36298907 36651488 36672940 37057479 37739773 38029804
6248C8029804j40822J85858O03796Q29266K76661J38157J10255O93398M40831
$$ 38029804 37888982 38074840 38678636 39507902 39784563 39922720 40032975 40726373 41167204
6239D1167204L81332P37765O28675J65694M60173N72585r3980O76935J122627
$$ 41167204 41548536 42286301 42914976 43080670 43540843 44113428 44019448 44696383 45819010
6230D5819010N69895n8126P49432M23897Q57494P71145P32961M13577K89209J147306
$$ 45819010 46388905 46330779 47080211 47504108 48361602 49132747 49865708 50279285 50568494 51715800
6220E1715800R10322M37564O80034R26799P53188M46907O86063J010088N75710
$$ 51715800 52626122 53063686 53743720 54670519 55423707 55870614 56556677 57566765 58142475
6211E8142475P24386O04014P44592O80029R39720J110086R88024K26813N22951
$$ 58142475 58866861 59470875 60215467 60895496 61835216 62945302 63933326 64160139 64683090
6202F4683090Q29087O15268Q11860O00833R07394O13954N86648N02080O68977
$$ 64683090 65512177 66127445 66939305 67540138 68447532 69061486 69648134 70150214 70819191
6193G0819191J200226Q28180P70607N56323N95043L74790M28088Q31441O59400
$$ 70819191 72019417 72847597 73618204 74174527 74769570 75144360 75572448 76403889 77063289
6184G7063289M25234O10742J082377N56139N55558Q23781J176286N52176N44053
$$ 77063289 77488523 78099265 79181642 79737781 80293339 81117120 82293406 82845582 83389635
6175H3389635N05373P49215P48171J182278R90083N93985Q83654J74046O17877
$$ 83389635 83895008 84644223 85392394 86574672 87564755 88158740 89042394 89216440 89834317
6166H9834317J356034J079891P54643Q36498J186060J227176J045120R97542J180920
$$ 89834317 91190351 92270242 93024885 93861383 95047443 96274619 97319739 98317281 99498201
6157I9498201P91940J284075J035104J288053J426558P40632J254538J384210
$$ 99498201 100290141 101574216 102609320 103897373 105323931 106064563 107319101 108703311
6149A08703311R28240P30221Q15141J501504J091115J140767Q93019J230620O16078
$$ 108703311 109631551 110361772 111176913 112678417 113769532 114910299 115803318 117033938 117650016
6140A17650016O04550J086388J394428J379039R63007J310902N03509J097365
$$ 117650016 118254566 119340954 120735382 122114421 123077428 124388330 124891839 125989204
6132A25989204P01693L11051Q50846O28307M85797P32469M64501K92535r5839
$$ 125989204 126690897 127001948 127852794 128481101 128966898 129699367 130163868 130456403 130360564
6123A30360564J26037k60141n9365N7215j12072m96093p83938l67216n96259n83140
$$ 130360564 130486601 130226460 130167095 130224310 130112238 129616145 128832207 128464991 127868732 127285592
6113A27285592q61847j049636n21931j114487r79418n75525r10864q23140o71743
$$ 127285592 126423745 125374109 124852178 123737691 122758273 122182748 121271884 120448744 119777001
6104A19777001p96555j535776j367192r98063j269490j105746j519477j425025
$$ 119777001 118980446 117444670 116077478 115079415 113809925 112704179 111184702 109759677
6096A09759677j863299j114802j319238j513018j555553j950837j280412j454058
$$ 109759677 107896378 106781576 105462338 103949320 102393767 100442930 99162518 97708460
6088I7708460j458407j682604j893905j575939q01183j715413j450000j782837
$$ 97708460 96250053 94567449 92673544 91097605 90296422 88581009 87131009 85348172
6080H5348172j534897j386853j623335j076961k011939j494793j303042j189931
$$ 85348172 83813275 82426422 80803087 79726126 77714187 76219394 74916352 73726421
6072G3726421j172662j178217j147569j195952j107464o27739r74900j257450
$$ 73726421 72553759 71375542 70227973 69032021 67924557 67296818 66321918 65064468
6064F5064468l99236j208374j543629q14515n40343o01937j069398p75134r77528
$$ 65064468 64665232 63456858 61913229 61098714 60558371 59956434 58887036 58111902 57134374
6055E7134374o14356n26182m69649n47203n90974k27039n58022p66440p9034m07737
$$ 57134374 56520018 55993836 55524187 54976984 54386010 54158971 53600949 52834509 52755475 52347738
6045E2347738m81353k61192k88254r97269l58706l98715l17386k19352o54654
$$ 52347738 51866385 51605193 51316939 50319670 49960964 49562249 49244863 49025511 48370857
6036D8370857o96766l31830l87054n47324p03911k04311p37005j040928p54975
$$ 48370857 47674091 47342261 46955207 46407883 45703972 45499661 44762656 43721728 42966753
6027D2966753l04295J90815k06559L3833o21673m38788j60188n18619j002486
$$ 42966753 42662458 42853273 42646714 42680547 42058874 41620086 41459898 40941279 39938793
6018C9938793l63996k26554O6413j99152n30705k30286k29649m58446m60315m97726
$$ 39938793 39574797 39348243 39414656 39215504 38684799 38454513 38224864 37766418 37306103 36808377
6008C6808377J05510l1114J34160l35872n15785k86218K78287j95737m28594L92838
$$ 36808377 36913887 36882773 37016933 36681061 36165276 35879058 36157345 35961608 35533014 35925852
5998C5925852j55729m95565l18943l97924m0661J39195k12650j62754p0546L78909
$$ 35925852 35770123 35274558 34955615 34557691 34517030 34656225 34443575 34280821 34210275 34589184
5988C4589184K0086m40281o5890m53496P4698k75118N5064l13972J12900J86934
$$ 34589184 34609270 34168989 34103099 33649603 33724301 33449183 33504247 33190275 33303175 33490109
5978C3490109L37221j06681m39607l45875J1838J31254q4964J5361k93848K56159
$$ 33490109 33827330 33720649 33281042 32935167 32947005 33078259 32993295 33008656 32714808 32970967
5968C2970967R5183J67763j43165n53521J51290k26866J87469Q0762k2035J94503
$$ 32970967 33066150 33233913 33090748 32537227 32688517 32461651 32649120 32729882 32707847 32902350
5958C2902350l08732J56768j21719j83896J8768J14612m498l2556k68138M1561
$$ 32902350 32593618 32750386 32628667 32444771 32463539 32578151 32573653 32541097 32272959 32314520
5948C2314520L60662Q4407k10763L39666J24763n84187K63185J40683l58762K27298
$$ 32314520 32675182 32759589 32548826 32888492 33013255 32429068 32692253 32832936 32474174 32701472
5938C2701472j26170K58248P19694j23157J14522m20540q9520O8048O2866M82265
$$ 32701472 32575302 32833550 33553244 33430087 33544609 33124069 33034549 33102597 33165463 33647728
5928C3647728M03745K10591n57379J82807j16572k2183M36176K91692m65704J47559
$$ 33647728 34051473 34262064 33704685 33887492 33770920 33748737 34184913 34476605 34010901 34158460
5918C4158460Q79194n03770l27294L95942L19588L18246K16508K58414J51663
$$ 34158460 35037654 34533884 34206590 34602532 34922120 35240366 35456874 35715288 35866951
5909C5866951J92869q10342L2667O82169J25789J82338M73738R1967l94288M83756
$$ 35866951 36059820 35249478 35282145 35964314 36090103 36272441 36746179 36838146 36443858 36927614
5899C6927614k7230J04046R74532L24142l3233j20768K01398K52150N4422J84275
$$ 36927614 36900384 37004430 37978962 38303104 38269871 38149103 38350501 38602651 38657073 38841348
5889C8841348K55291J19720J3538L27574M10564L70831M84932j02086J65988M69904
$$ 38841348 39096639 39216359 39229897 39557471 39968035 40338866 40823798 40721712 40887700 41357604
5879D1357604L21244k21474M92851L40398R7119M6498L53972K61436L04150j56447
$$ 41357604 41678848 41457374 41950225 42290623 42387742 42434240 42788212 43049648 43353798 43197351
5869D3197351M90555N67288P5716N82186J76567j19385J2139L15870K40634R7960
$$ 43197351 43687906 44255194 44330910 44913096 45089663 44970278 44982417 45298287 45538921 45636881
5859D5636881N65548N433L57984M49702Q25984j82512k51224P27047J46581J00526
$$ 45636881 46202429 46207862 46565846 47015548 47841532 47659020 47407796 48134843 48281424 48381950
5849D8381950L23474R07983M35698l26257J84908O05739P28793M54261N12901
$$ 48381950 48705424 49613407 50049105 49722848 49907756 50513495 51242288 51696549 52209450
5840E2209450J94474k34222O30746L79998K26041J80595N57902K57610J82600
$$ 52209450 52403924 52169702 52800448 53180446 53406487 53587082 54144984 54402594 54585194
5831E4585194L91379L68009O47564L00960p1538P15208J88083P18693L08754K48269
$$ 54585194 54976573 55344582 55992146 56293106 56221568 56936776 57124859 57843552 58152306 58400575
5821E8400575K57842N44969J90247Q63840L16943K24395K54253J063932P50353
$$ 58400575 58658417 59203386 59393633 60257473 60574416 60798811 61053064 62116996 62867349
5812F2867349K16134L87269N49030O65940O81685Q19419N24320O89603M95377
$$ 62867349 63083483 63470752 64019782 64685722 65367407 66186826 66711146 67400749 67896126
5803F7896126L05733Q89815R80367O81301O11662O12333J196703P84696N75091
$$ 67896126 68201859 69091674 70072041 70753342 71365004 71977337 73174040 73958736 74533827
5794G4533827Q45149P82395N70664Q07540P69011L23413K17920N35218L47631
$$ 74533827 75378976 76161371 76732035 77539575 78308586 78631999 78849919 79385137 79732768
5785G9732768J59526N03445N00465N58366R99763J54427M58320P19297N15615
$$ 79732768 79892294 80395739 80896204 81454570 82454333 82608760 83067080 83786377 84301992
5776H4301992K29809Q38904J006965M04536N86848J040143P60035Q87744J206429
$$ 84301992 84531801 85370705 86377670 86782206 87369054 88409197 89169232 90056976 91263405
5767I1263405Q20353R30466P72158R59968O37292J037959J377691R05877Q71638
$$ 91263405 92083758 93014224 93786382 94746350 95383642 96421601 97799292 98705169 99576807
5758I9576807J297650R13590R89476J428021R10641J392933J031138R86589J421891
$$ 99576807 100874457 101788047 102777523 104205544 105116185 106509118 107540256 108526845 109948736
5749A09948736J733022J202024J042887J036543J447134J713935R25657J649652
$$ 109948736 111681758 112883782 113926669 114963212 116410346 118124281 119049938 120699590
5741A20699590J489468J523868J333407J389210J851434J605345J678710J546662
$$ 120699590 122189058 123712926 125046333 126435543 128286977 129892322 131571032 133117694
5733A33117694J380171J809729J566904J748056J762529J361274J756706J979037
$$ 133117694 134497865 136307594 137874498 139622554 141385083 142746357 144503063 146482100
5725A46482100K325459J463513J542491J809585J856347K158342J814643J652472
$$ 146482100 148807559 150271072 151813563 153623148 155479495 157637837 159452480 161104952
5717A61104952J533563J814993J559524J826699J634139J467839K181055J751854
$$ 161104952 162638515 164453508 166013032 167839731 169473870 170941709 173122764 174874618
5709A74874618J245269J849216J544217J584306J584258J308508J478819J122027
$$ 174874618 176119887 177969103 179513320 181097626 182681884 183990392 185469211 186591238
5701A86591238J516724J056035J363964R53507J198555J333192J371790J151084
$$ 186591238 188107962 189163997 190527961 191481468 192680023 194013215 195385005 196536089
5693A96536089R68259R00262K39622J098071J009880O36820Q26649N14006M82026
$$ 196536089 197504348 198404610 198644232 199742303 200752183 201389003 202215652 202729658 203211684
5684B03211684J11834R35633O52342J25849j06892N41864L61298n8218j64398
$$ 203211684 203323518 204259151 204911493 205037342 204930450 205472314 205833612 205775394 205610996
5675B05610996K06172L64076q0005j07338o8088J05410N8925N8586J72705K08959
$$ 205610996 205817168 206181244 206101239 205993901 205925813 206031223 206090148 206148734 206321439 206530398
5665B06530398o93671o5991L04955j67929J44808n5183R9783j57540K71208M15822
$$ 206530398 205836727 205770736 206075691 205907762 206052570 205997387 206097170 205939630 206210838 206626660
5655B06626660K77329M12399P39818L49427L3263N1678O51146J011019O08809
$$ 206626660 206903989 207316388 208056206 208405633 208438896 208490574 209141720 210152739 210761548
5646B10761548P37671L31557J249108Q09449M59190R38588J497137J433833J769116
$$ 210761548 211499219 211830776 213079884 213889333 214348523 215287111 216784248 218218081 219987197
5637B19987197J141819Q29060J672854J774178J714992J822135J692577K019383
$$ 219987197 221129016 221958076 223630930 225405108 227120100 228942235 230634812 232654195
5629B32654195J305263J965126K195812K161765K128166K059346K633096K365163
$$ 232654195 233959458 235924584 238120396 240282161 242410327 244469673 247102769 249467932
5621B49467932K327615K641229K333595K033705J931742K621603K448963K973004
$$ 249467932 251795547 254436776 256770371 258804076 260735818 263357421 265806384 268779388
5613B68779388K298154K175206K412215K333787K723017K434128K869928K244484
$$ 268779388 271077542 273252748 275664963 277998750 280721767 283155895 286025823 288270307
5605B88270307K336835K286552K789309K922283K659411K639785K487212L045378
$$ 288270307 290607142 292893694 295683003 298605286 301264697 303904482 306391694 309437072
5597C09437072K575705K648183K942833K547160L138625L544217K711677K824136
$$ 309437072 312012777 314660960 317603793 320150953 323289578 326833795 329545472 332369608
5589C32369608L265420L006864L112030K851162L202225L404140L675459L339521
$$ 332369608 335635028 338641892 341753922 344605084 347807309 351211449 354886908 358226429
5581C58226429L712393L385477L490233L367085L626758L036740L601021M012535
$$ 358226429 361938822 365324299 368814532 372181617 375808375 378845115 382446136 386458671
5573C86458671L279922L118134L295471L416173K880900K631173K317602K273061
$$ 386458671 389738593 392856727 396152198 399568371 402449271 405080444 407398046 409671107
5565D09671107J899329K110520N95207J117456O67416M40146K52659k72133o22491
$$ 409671107 411570436 413680956 414276163 415393619 416061035 416501181 416753840 416481707 415859216
5556D15859216j163689j144897r97862j015774j589224j397669j971174j887777
$$ 415859216 414695527 413550630 412552768 411536994 409947770 408550101 406578927 404691150
5548D04691150j803984k336706k032900k067984k564518k098100k444070k064813
$$ 404691150 402887166 400550460 398517560 396449576 393885058 391786958 389342888 387278075
5540C87278075k147471k313663k459348k766711k121455k564642k294431k348333
$$ 387278075 385130604 382816941 380357593 377590882 375469427 372904785 370610354 368262021
5532C68262021k666160k513468k243623k923387k801310k644611l411122k860692
$$ 368262021 365595861 363082393 360838770 357915383 355114073 352469462 349058340 346197648
5524C46197648k933259k989617l363919l310979l058754l446023l630912l037888
$$ 346197648 343264389 340274772 336910853 333599874 330541120 327095097 323464185 320426297
5516C20426297l724769l910498l673456l839747m041098l464769l579394m477411
$$ 320426297 316701528 312791030 309117574 305277827 301236729 297771960 294192566 289715155
5508B89715155l860530l877210l886400l827975l886667l545623l818213l629704
$$ 289715155 285854625 281977415 278091015 274263040 270376373 266830750 263012537 259382833
5500B59382833l885217m283923l587307l829584m019041l842796l430065l043852
$$ 259382833 255497616 251213693 247626386 243796802 239777761 235934965 232504900 229461048
5492B29461048l011335l510399l680062l073787l492410l618214k880339k961831
$$ 229461048 226449713 222939314 219259252 216185465 212693055 209074841 206194502 203232671
5484B03232671l293996k919532k634867k750147l030224k992683k157806k847343
$$ 203232671 199938675 197019143 194384276 191634129 188603905 185611222 183453416 180606073
5476A80606073k645200k255006k381409k561723k598007k136357k452611j817321
$$ 180606073 177960873 175705867 173324458 170762735 168164728 166028371 163575760 161758439
5468A61758439k507107k277860k339739j952219j999364k025686j573326j948701
$$ 161758439 159251332 156973472 154633733 152681514 150682150 148656464 147083138 145134437
5460A45134437k169648k167119j284287k028521j908392j383775j329091j820805
$$ 145134437 142964789 140797670 139513383 137484862 135576470 134192695 132863604 131042799
5452A31042799j862408j687153j676166r71914j391969j007908r65704j295768
$$ 131042799 129180391 127493238 125817072 124845158 123453189 122445281 121479577 120183809
5444A20183809j344787j591146j309916j954002j262542j079684j069069j069513
$$ 120183809 118839022 117247876 115937960 113983958 112721416 111641732 110572663 109503150
5436A09503150r76707r75499j816052n55363o24053r18242r45115j349378p26321
$$ 109503150 108526443 107550944 105734892 105179529 104555476 103637234 102692119 101342741 100616420
5427A00616420j041619r79598j167946p81562r30407r23772q17184j116252n53482
$$ 100616420 99574801 98595203 97427257 96645695 95715288 94791516 93974332 92858080 92304598
5418I2304598m41447n53676q23458p00518j064590p52209K1238k62060r93591
$$ 92304598 91863151 91309475 90486017 89785499 88720909 87968700 87989938 87727878 86734287
5409H6734287r04719o78195p84997O218o61164q20629n11441L5907k91773j347316
$$ 86734287 85829568 85151373 84366376 84372594 83711430 82890801 82379360 82415267 82123494 80776178
5399H0776178k56483l26918j84254n30232o58527q31435l17123j64312o03389
$$ 80776178 80519695 80192777 80008523 79478291 78819764 77988329 77671206 77506894 76903505
5390G6903505j02759l61890m97239l3668J4514o19299k91513l81104k13878p08845
$$ 76903505 76800746 76438856 75941617 75907949 75922463 75303164 75011651 74630547 74416669 73707824
5380G3707824L958k933l50422k16361J39589n7621q3944j94582k70144N93018
$$ 73707824 73711782 73708849 73358427 73142066 73281655 73224034 73140090 72945508 72675364 73268382
5370G3268382K88140j55950k97325J45255r03129j95597L14448o0223k11325k12236
$$ 73268382 73556522 73400572 73103247 73248502 72345373 72149776 72464224 72404001 72192676 71980440
5360G1980440K44833l61223k23291l16905J00390M2064O3424m63265o88303J69456
$$ 71980440 72225273 71864050 71640759 71323854 71424244 71466308 71529732 71066467 70378164 70547620
5350G0547620J97753l9587l9496O1830L30178L40646j27404J12738R0520N67792
$$ 70547620 70745373 70705786 70666290 70728120 71058298 71398944 71271540 71384278 71474798 72042590
5340G2042590K09514k09436R984P40934O040j54934K9875L58494q323K31016M6607
$$ 72042590 72252104 72042668 72052652 72793586 72799626 72644692 72674567 73033061 73024738 73255754 73302361
5329G3302361o22044M9816n61027m03304l81988l10981O0139q56191l65916n11433
$$ 73302361 72680317 72730133 72169106 71765802 71383814 71072833 71132972 70276781 69910865 69399432
5319F9399432n86945m42287j78976k85951k1828l41315k53011J73490o65346j05168
$$ 69399432 68812487 68370200 68191224 67905273 67883445 67542130 67289119 67462609 66797263 66692095
5309F6692095j69137N54188j66929p7289L46590L91222J34476J4782p17235l20125
$$ 66692095 66522958 67077146 66910217 66832928 67179518 67570740 67705216 67719998 67002763 66682638
5299F6682638K5790k46485J43088n18344l40129p10597r99252l95187m97959o37208
$$ 66682638 66708428 66461943 66605031 66086687 65746558 65035961 64036709 63641522 63143563 62506355
5289F2506355l10644r69091o59903k34780m76470l23206p53802n72349m37595
$$ 62506355 62195711 61226620 60566717 60331937 59855467 59532261 58778459 58206110 57768515
5280E7768515n22446l44250o29633l0181p4967m51989m6347j48254n39069l69377
$$ 57768515 57246069 56901819 56272186 56242005 56167038 55715049 55668702 55520448 54981379 54612002
5270E4612002k75162m66969j90780J91117m83235o94341J43523J31212j81536
$$ 54612002 54336840 53869871 53679091 53870208 53386973 52692632 52836155 52967367 52785831
5261E2785831o78861r11354O0651J96607p25927o31569n97660k72445l50522l90726
$$ 52785831 52106970 51195616 51256267 51452874 50726947 50095378 49497718 49225273 48874751 48484025
5251D8484025j09575n50434l60984j69286K2810r8934l10475k91254k41050K39925
$$ 48484025 48374450 47824016 47463032 47293746 47316556 47217622 46907147 46615893 46374843 46614768
5241D6614768q9097m66240k71007l59512l88051K60811k53072P4296k98682j84547
$$ 46614768 46525671 46059431 45788424 45428912 45040861 45301672 45048600 45122896 44824214 44639667
5231D4639667k03601l67129p5569L8740K38686n17738m72702l5509k20484J18611
$$ 44639667 44436066 44068937 43993368 44032108 44270794 43753056 43280354 43244845 43024361 43142972
5221D3142972k73023m06721l29087j51408q6470j10512j48827j49063j46773j7457
$$ 43142972 42869949 42463228 42134141 41982733 41896263 41785751 41636924 41487861 41341088 41323631
5211D1323631n5365R3757R4260r2818k90895l07268O0219j17749o6063m93965
$$ 41323631 41268266 41362023 41456283 41363465 41072570 40765302 40825521 40707772 40641709 40147744
5201D0147744O4548j6478k05898K1044Q4053N551k03269j98736j07191o75825
$$ 40147744 40212292 40195814 39989916 40010960 40095013 40100564 39897295 39698559 39591368 38915543
5191C8915543K08602q8513J8984m460m4254P1162l60406l6909j36825K52832k58045
$$ 38915543 39124145 39035632 39054616 39050156 39005902 39077064 38716658 38679749 38542924 38795756 38537711
5180C8537711n16322J59730N0753Q9430k78099j85583Q772N0295m50899J31536
$$ 38537711 38021389 38181119 38231872 38321302 38043203 37857620 37866392 37916687 37465788 37597324
5170C7597324P0667L5275J10080j21193k2631j74470L81341m23448O6491O8932
$$ 37597324 37667991 37703266 37813346 37692153 37669522 37495052 37876393 37452945 37519436 37588368
5160C7588368m11460K79974j52563J9622J09741M2685k23408l22863M62924J77887
$$ 37588368 37176908 37456882 37304319 37323941 37433682 37476367 37252959 36930096 37393020 37570907
5150C7570907l2040J3171k24957O41513K66742r1983j02102k05522P0345M09893
$$ 37570907 37538867 37552038 37327081 37968594 38235336 38143353 38041251 37835729 37906074 38315967
5140C8315967K45517l46829K96589K60385k09112l47503N23929M50621M53420
$$ 38315967 38561484 38214655 38511244 38771629 38562517 38215014 38738943 39189564 39642984
5131C9642984M25366q71908K27084Q9703j66428J17290M40215N84882k0095K67892
$$ 39642984 40068350 39196442 39423526 39513229 39346801 39464091 39904306 40489188 40469093 40736985
5121D0736985P0823k01717K77412R5300J94574N74557L11711J31989o8165O08126
$$ 40736985 40807808 40606091 40883503 40978803 41173377 41747934 42059645 42191634 42123469 42731595
5111D2731595J36637j44943O76626M50657N1603J95125J82974J3432M47642L9435
$$ 42731595 42868232 42723289 43399915 43850572 43902175 44097300 44280274 44293706 44741348 44780783
5101D4780783Q9015N59805j91005j66939J43553L18758J24175K70560K4414K8869
$$ 44780783 44869798 45429603 45238598 45071659 45215212 45533970 45658145 45928705 45953119 45981988
5091D5981988j29143M04958N43491K15041m50830m2266J03512J97584M5869K93927
$$ 45981988 45852845 46257803 46801294 47016335 46565505 46523239 46626751 46824335 46870204 47164131
5081D7164131J45199J0173J56422K80827O6573N35337N0953p5890M51674K280
$$ 47164131 47309330 47319503 47475925 47756752 47823325 48358662 48409615 48333725 48785399 48787679
5071D8787679J33950M51046N21039M45966L26665k13668N94404K14185Q34064
$$ 48787679 48921629 49372675 49893714 50339680 50666345 50452677 51047081 51261266 52095330
5062E2095330N04974K343L10420O83847K26634O17896O84472O45057O69605M36603
$$ 52095330 52600304 52602647 52913067 53596914 53823548 54441444 55125916 55770973 56440578 56877181
5052E6877181R03937L09851N74124N96755O71352R83066J557042O10942J074623
$$ 56877181 57781118 58090969 58665093 59261848 59933200 60916266 62473308 63084250 64158873
5043F4158873J145064M18555Q69680J191986J572256Q73548O77744J402075J021703
$$ 64158873 65303937 65722492 66592172 67784158 69356414 70229962 70907706 72309781 73331484
5034G3331484M28959R31391P53172M48414P49169Q28737M04126j56956O4697K36269
$$ 73331484 73760443 74691834 75445006 75893420 76642589 77471326 77875452 77718496 77783193 78019462
5024G8019462K19725n5145q98405o38976m09867q63628k61368r04848j010157
$$ 78019462 78239187 78184042 77285637 76646661 76236794 75373166 75111798 74206950 73196793
5015G3196793r18332J15568q92545j468375j111297p05503l37160r40166q10144
$$ 73196793 72278461 72394029 71501484 70033109 68921812 68216309 67879149 66938983 66128839
5006F6128839j369752j179153l65696n04450r12325k28030q68740p41681l16282
$$ 66128839 64759087 63579934 63214238 62709788 61797463 61569433 60700693 59959012 59642730
4997E9642730p98011q24804l49588m47306n17942J6847q08390j387301O936j23723
$$ 59642730 58844719 58019915 57670327 57223021 56705079 56721926 55913536 54526235 54533171 54409448
4987E4409448m22254m22011j86867k19431m55968k44265j29155m08181k24786
$$ 54409448 53987194 53565183 53378316 53158885 52702917 52458652 52329497 51921316 51696530
4978E1696530k58797J86500n92209J36613k30238n29969j56425N31121k4331m08471
$$ 51696530 51437733 51624233 51032024 51168637 50938399 50408430 50252005 50783126 50758795 50350324
4968E0350324K8788j57072r8778N67685N1357o42328K34044m19018o6048N55376
$$ 50350324 50379112 50222040 50123262 50690947 50742304 50099976 50334020 49915002 49848954 50404330
4958E0404330j8822J49124l50361L42113K10721l93117N35540K90462l3796J40235
$$ 50404330 50385508 50534632 50184271 50526384 50737105 50343988 50879528 51169990 51136194 51276429
4948E1276429M76618M58364J41761M67239K15558O07607J3923P8535M29978J66830
$$ 51276429 51753047 52211411 52353172 52820411 53035969 53643576 53657499 53736034 54166012 54332842
4938E4332842L37240K66904N73764O11207P77017O01891K35596O04771P73446
$$ 54332842 54670082 54936986 55510750 56121957 56898974 57500865 57736461 58341232 59114678
4929E9114678M27925P73719L50009Q68523O85474P26296O39849O70492Q16573
$$ 59114678 59542603 60316322 60666331 61534854 62220328 62946624 63586473 64256965 65073538
4920F5073538P24166J172566N79070Q80472R64295J093589O29189J096794J584474
$$ 65073538 65797704 66970270 67549340 68429812 69394107 70487696 71116885 72213679 73798153
4911G3798153Q11988Q09265N48393J201552N87463L41042M39350Q22312M04168
$$ 73798153 74610141 75419406 75967799 77169351 77756814 78097856 78537206 79359518 79763686
4902G9763686m4020M6923M91445L78082k50436n48680k5978m46698l34873k45539
$$ 79763686 79719666 79766589 80258034 80636116 80385680 79837000 79811022 79364324 79029451 78783912
4892G8783912n6396m0753j19045M3170j78773r0471M7926n95346K07690Q18610
$$ 78783912 78727516 78686763 78567718 78610888 78432115 78341644 78389570 77794224 78001914 78820524
4882G8820524J60650n94194L06310J24739K05324J95760O21296O32970L96002
$$ 78820524 78981174 78386980 78693290 78818029 79023353 79219113 79840409 80473379 80869381
4873H0869381J55672Q36250Q54282N18293J141050N45151P68535M63842N29675
$$ 80869381 81025053 81861303 82715585 83233878 84374928 84920079 85688614 86152456 86682131
4864H6682131J323868J398529J044857R68725J139286Q72376J367801J337778
$$ 86682131 88005999 89404528 90449385 91418110 92557396 93429772 94797573 96135351
4856I6135351J200422J392848J054650J137907J493109J440365J210933J952551
$$ 96135351 97335773 98728621 99783271 100921178 102414287 103854652 105065585 107018136
4848A07018136K010353J854226J961815J742906J484478J612258J617449K342286
$$ 107018136 109028489 110882715 112844530 114587436 116071914 117684172 119301621 121643907
4840A21643907K050041J824057J825956K442381K155071J603990J826351J853935
$$ 121643907 123693948 125518005 127343961 129786342 131941413 133545403 135371754 137225689
4832A37225689J864051J783991K341269J585415K314417K389796J804814J625321
$$ 137225689 139089740 140873731 143215000 144800415 147114832 149504628 151309442 152934763
4824A52934763J814350K559911J794167J787346K134516K181673J754027J701387
$$ 152934763 154749113 157309024 159103191 160890537 163025053 165206726 166960753 168662140
4816A68662140J432780J938774J783543J694105K050369J756612R95469J279627
$$ 168662140 170094920 172033694 173817237 175511342 177561711 179318323 180313792 181593419
4808A81593419J562253J755913J514359J470550Q28955Q69717O36160P36788J066612
$$ 181593419 183155672 184911585 186425944 187896494 188725449 189595166 190231326 190968114 192034726
4799A92034726J270904J069804R66683P19559N92936R06655O77192M13024R49228
$$ 192034726 193305630 194375434 195342117 196061676 196654612 197561267 198238459 198651483 199600711
4790A99600711O08115M39772J017120O79156N03027R61188K17255O31225O80628
$$ 199600711 200208826 200648598 201665718 202344874 202847901 203809089 204026344 204657569 205338197
4781B05338197L05972L43213L22483M12141N03993k18004J4919k10385J71810
$$ 205338197 205644169 205987382 206309865 206722006 207225999 207007995 207022914 206812529 206984339
4772B06984339j98060J92476O10861j18051o73927k17235N5268l37147K4893K43725
$$ 206984339 206786279 206978755 207589616 207471565 206797638 206580403 206635671 206298524 206323417 206567142
4762B06567142l75958o84895L38236n03908m49184n27658n81063o27559j41575
$$ 206567142 206191184 205506289 205844525 205340617 204891433 204363775 203782712 203155153 203013578
4753B03013578p76798p56089r24914o85780q19936r78167q02812j631535j689767
$$ 203013578 202236780 201480691 200555777 199869997 199050061 198071894 197269082 195637547 193947780
4744A93947780j172451j074586j531040j838114j682637j570183j569132j645220
$$ 193947780 192775329 191700743 190169703 188331589 186648952 185078769 183509637 181864417
4736A81864417j387216j934210j612554k215261k163341j935284k083163j594368
$$ 181864417 180477201 178542991 176930437 174715176 172551835 170616551 168533388 166939020
4728A66939020j738502k399092j910548j877331k101433k086738k247913j934076
$$ 166939020 165200518 162801426 160890878 159013547 156912114 154825376 152577463 150643387
4720A50643387k302399k271421k661044k367668j826990k562618k415130j425834
$$ 150643387 148340988 146069567 143408523 141040855 139213865 136651247 134236117 132810283
4712A32810283k244056k624316j846357j687091j820863k024290k202043j865764
$$ 132810283 130566227 127941911 126095554 124408463 122587600 120563310 118361267 116495503
4704A16495503j595392k120351j639706j750483j741086k033337j532966j940164
$$ 116495503 114900111 112779760 111140054 109389571 107648485 105615148 104082182 102142018
4696A02142018j903545j100329o92257j361936j727146j715539j327065q31718
$$ 102142018 100238473 99138144 98445887 97083951 95356805 93641266 92314201 91482483
4688I1482483q64964j904393j598099o54376j308159j468068q35723q34822n32497
$$ 91482483 90617519 88713126 87115027 86460651 85152492 83684424 82848701 82013879 81481382
4679H1481382j325682j005217r70615j350717n23478r12829o93013p26187r49550
$$ 81481382 80155700 79150483 78179868 76829151 76305673 75392844 74699831 73973644 73024094
4670G3024094q45449q80527r63411k4219n94958o90049r41711q57334r55028q59867
$$ 73024094 72178645 71298118 70334707 70310488 69715530 69025481 68083770 67226436 66271408 65411541
4660F5411541o82581q20413m39263m84583p42716m74588o61174p00586l21762
$$ 65411541 64728960 63908547 63469284 62984701 62241985 61767397 61106223 60405637 60083875
4651F0083875n16881q61013o59330n70749m12840l83167p23163q83490m14803
$$ 60083875 59566994 58705981 58046651 57475902 57063062 56679895 55956732 55073242 54658439
4642E4658439k74817n40414k12031l41319m72596p50563m64482p77597l13478
$$ 54658439 54383622 53843208 53631177 53289858 52817262 52066699 51602217 50824620 50511142
4633E0511142j16323p94056o93036k85123L86837n64184j090025r4083J19460
$$ 50511142 50394819 49600763 48907727 48622604 49009441 48445257 47355232 47261149 47380609
4624D7380609n63513M7368m35443M705n17575o75028k10798k58665r55524k93856
$$ 47380609 46817096 46864464 46429021 46433726 45916151 45241123 45030325 44771660 43816136 43522280
4614D3522280K7065j87548m85631m62242j70117l136l53496l6767k31435J8966
$$ 43522280 43549345 43361797 42876166 42413924 42243807 42240671 41887175 41850408 41618973 41637939
4604D1637939k41478m31099j42535n26335L0980n33104l00793j82614K75660J13215
$$ 41637939 41396461 40965362 40822827 40296492 40327472 39794368 39493575 39310961 39586621 39699836
4594C9699836m12366k54025N9892J5004l21560o19779k30627J03667r4867k33904
$$ 39699836 39287470 39033445 39093337 39108341 38786781 38167002 37936375 38040042 37945175 37711271
4584C7711271l5368k08537N1781k96256m84824L79235n6118p24003k18502L21682
$$ 37711271 37675903 37467366 37519147 37222891 36738067 37117302 37061184 36337181 36118679 36440361
4574C6440361N4462k8635Q7072l28883Q0226K7090l58247m82971J66521l3187
$$ 36440361 36494823 36466188 36553260 36224377 36304603 36331693 35973446 35490475 35656996 35623809
4564C5623809J75404k20024K6630L80469l0983n69734l06659P8019K263k42885
$$ 35623809 35799213 35579189 35605819 35986288 35955305 35385571 35078912 35156931 35159194 34916309
4554C4916309l55394K61672L74297j41876j98791j3346K57024J00896p9350L5585
$$ 34916309 34560915 34822587 35196884 35055008 34856217 34842871 35099895 35200791 35121441 35157026
4544C5157026J79871J6636j59894N14700j60429m6996j69222j25208N23183m187
$$ 35157026 35336897 35353533 35193639 35708339 35547910 35500914 35331692 35206484 35729667 35725480
4534C5725480j9896K03926J09102J09214l3214K79881n31011J51525J47312J6625
$$ 35725480 35705584 35909510 36018612 36127826 36094612 36374493 35843482 35995007 36142319 36158944
4524C6158944J26220j36933J31180P32174L75466r2861Q7087k4051K41446P5838
$$ 36158944 36285164 36148231 36279411 37011585 37387051 37294190 37381277 37357226 37598672 37674510
4514C7674510n04372L33165k70463K31042R55681K61119k22401l23777J99757
$$ 37674510 37170138 37503303 37232840 37463882 38419563 38680682 38458281 38134504 38334261
4505C8334261J75668N61490l42544J31876K76964K37980K41771j68417K61232
$$ 38334261 38509929 39071419 38728875 38860751 39137715 39375695 39617466 39449049 39710281
4496C9710281K08417Q3499O2128k16909L65984j35469J83483M9151q4481K52781
$$ 39710281 39918698 40002197 40064325 39847416 40213400 40077931 40261414 40310565 40226084 40478865
4486D0478865K70418m15350K53904L79178j31362k70613M48554K8018n27406M63851
$$ 40478865 40749283 40333933 40587837 40967015 40835653 40565040 41013594 41041612 40514206 40978057
4476D0978057K75903k54309j3853K64001j28171R5656o26773K3655N11329R1046
$$ 40978057 41253960 40999651 40985798 41249799 41121628 41217284 40590511 40614166 41125495 41216541
4466D1216541q7727m14531J20312N726k92694l27415k46655j3949j90687L87855
$$ 41216541 41128814 40714283 40834595 40840321 40547627 40220212 39973557 39959608 39768921 40156776
4456D0156776K4181k49597N354l7160k91074p4072l4269k71445q007j90771r1924
$$ 40156776 40180957 39931360 39936714 39899554 39608480 39534408 39500139 39228694 39220687 39029916 38937992
4445C8937992k74504R0899m23852j37235m8181j14043L02322k67663k12977K61474
$$ 38937992 38663488 38754387 38330535 38193300 38145119 38031076 38333398 38065735 37852758 38114232
4435C8114232k14898m76086J28887k17859l75016l54070K98349L01209m95850
$$ 38114232 37899334 37423248 37552135 37334276 36959260 36605190 36903539 37204748 36708898
4426C6708898m34228O7850j81679K698L68129n05228J38318P7708m32079m3588
$$ 36708898 36274670 36342520 36160841 36163539 36531668 36026440 36164758 36242466 35810387 35766799
4416C5766799L81802J8522n16592P635j95420O8167Q9549r4772j0371l05270Q5507
$$ 35766799 36148601 36167123 35650531 35658166 35462746 35530913 35620462 35525690 35515319 35210049 35295556
4405C5295556K13046j61114L70366o8417p54703k03719m8619L47778L09230n62328
$$ 35295556 35508602 35347488 35717854 35649437 34894734 34691015 34642396 34990174 35299404 34737076
4395C4737076K03379K14450j66139l79603J86303M58920m1949o27337J67354l14443
$$ 34737076 34940455 35154905 34988766 34609163 34795466 35254386 35212437 34585100 34752454 34438011
4385C4438011n3592J76797M66471q5378j34193J43429m51168k21899L59615L35540
$$ 34438011 34384419 34561216 35027687 34942309 34808116 34951545 34500377 34278478 34638093 34973633
4375C4973633m93371j90267j02327K21503m51131M8824Q19542j20182k10878p3176
$$ 34973633 34480262 34289995 34187668 34409171 33958040 34006864 34826406 34706224 34495346 34422170
4365C4422170Q0068J10632l86570J66788M22351K0823k17542j02344L8861m05371
$$ 34422170 34502238 34612870 34226300 34393088 34815439 34836262 34618720 34516376 34555237 34149866
4355C4149866Q2713k891m6994n2800l34240L96752J00104j95462n5914M17200
$$ 34149866 34232579 34229688 34182694 34129894 33795654 34192406 34292510 34097048 34041134 34458334
4345C4458334m8568m2816J44981K03634k73184K65210J39067m27341j047M16919
$$ 34458334 34409766 34366950 34511931 34715565 34442381 34707591 34846658 34419317 34418270 34835189
4335C4835189o24393k66820J81829M54014K81275k20765o1435q7500R2100o9799
$$ 34835189 34210796 33943976 34125805 34579819 34861094 34640329 34578894 34491394 34583494 34513695
4325C4513695j44461n42188M34449J97640K09931J19022J18703J17933m27326
$$ 34513695 34369234 33827046 34261495 34459135 34669066 34788088 34906791 35024724 34597398
4316C4597398K91021P9895l3918N29481r4630K50268m26150k52457M85081M08337
$$ 34597398 34888419 34968314 34934396 35463877 35369247 35619515 35193365 34940908 35425989 35834326
4306C5834326l58077l46459j39963L0659O03171j0024O4878k5814K35619R432
$$ 35834326 35476249 35129790 34989827 35020486 35623657 35613633 35678511 35652697 35888316 35897748
4296C5897748m45122k40574j18402M95707n9223M2075j1402k63743L64222L76079
$$ 35897748 35452626 35212052 35093650 35589357 35530134 35572209 35560807 35297064 35661286 36037365
4286C6037365j72003J49593J24634j50121P70116l68266J22262N374m5593J07929
$$ 36037365 35865362 36014955 36139589 35989468 36759584 36391318 36513580 36518954 36473361 36581290
4276C6581290K77684l67193l21185K59911N18003K68984l251j8580M04762J72321
$$ 36581290 36858974 36491781 36170596 36430507 36948510 37217494 37214243 37195663 37600425 37772746
4266C7772746o01415Q0786L11000l44861M3992L64207K66534L44626N7663k72899
$$ 37772746 37171331 37252117 37563117 37218256 37262248 37626455 37892989 38237615 38295278 38022379
4256C8022379k54546K74192J77495K37602L9694O9900L18467M82800J11221j7598
$$ 38022379 37767833 38042025 38219520 38457122 38496816 38566716 38885183 39367983 39479204 39461606
4246C9461606J71220L54052j6114R1051K39067J62635K34568k40067L82842L40288
$$ 39461606 39632826 39986878 39970764 40061815 40300882 40463517 40698085 40458018 40840860 41181148
4236D1181148M83232N6658j77610L64388l88988K83578Q67491L03970J69942l46114
$$ 41181148 41664380 41721038 41543428 41907816 41518828 41802406 42669897 42973867 43143809 42797695
4226D2797695J20544Q84772K10629k27230P8875P44537K74910j33589L39961N31981
$$ 42797695 42918239 43803011 44013640 43786410 43865285 44609822 44884732 44751143 45091104 45623085
4216D5623085l8530N91808j15895L0841K26702L58335N62988K62846L90575J58923
$$ 45623085 45584555 46176363 46060468 46091309 46318011 46676346 47239334 47502180 47892755 48051678
4206D8051678K66617L65747n0291K62366M91483N99101O04020J33604N81431O4946
$$ 48051678 48318295 48684042 48633751 48896117 49387600 49986701 50590721 50724325 51305756 51370702
4196E1370702q3401J069365L41177Q687L36401N60453N55102K90112K50633K92696
$$ 51370702 51287301 52356666 52697843 52706530 53042931 53603384 54158486 54448598 54699231 54991927
4186E4991927N40304L45524J61379O84093P46741L8519O42966J154159Q30409
$$ 54991927 55532231 55877755 56039134 56723227 57469968 57508487 58151453 59305612 60136021
4177F0136021L86226J67105R06288R32383J64686P40592M21928O1334J120509
$$ 60136021 60522247 60689352 61595640 62528023 62692709 63433301 63855229 63916563 65037072
4168F5037072Q05629K54865R41214J064781L70320K90223J112651J150223Q75655
$$ 65037072 65842701 66097566 67038780 68103561 68473881 68764104 69876755 71026978 71902633
4159G1902633K83642N80474R01619J039678J067055Q30388N96717J116366J247222
$$ 71902633 72186275 72766749 73668368 74708046 75775101 76605489 77202206 78318572 79565794
4150G9565794J096420P84115J033375J077448R69595J551287J156271J284588
$$ 79565794 80662214 81446329 82479704 83557152 84526747 86078034 87234305 88518893
4142H8518893R16086J474289J478023J119225J078060J204231J635324J577840
$$ 88518893 89434979 90909268 92387291 93506516 94584576 95788807 97424131 99001971
4134I9001971Q05780O86866J456618J699390J233066J337228J613036J758016
$$ 99001971 99807751 100494617 101951235 103650625 104883691 106220919 107833955 109591971
4126A09591971J276070J344552J784507J220895J294842J972861K071623Q20209
$$ 109591971 110868041 112212593 113997100 115217995 116512837 118485698 120557321 121377530
4118A21377530J337873J842429J823019J742263J542984J176490J698090J708066
$$ 121377530 122715403 124557832 126380851 128123114 129666098 130842588 132540678 134248744
4110A34248744J250448J916941K098532J469528J570189J780972J661900J378304
$$ 134248744 135499192 137416133 139514665 140984193 142554382 144335354 145997254 147375558
4102A47375558J547236J389464J194818J750585J841748J674692J921906K046396
$$ 147375558 148922794 150312258 151507076 153257661 155099409 156774101 158696007 160742403
4094A60742403J134151J239114J962600J849875J410520K058050J616984Q79840
$$ 160742403 161876554 163115668 165078268 166928143 168338663 170396713 172013697 172893537
4086A72893537J729178J694571J303719J789571J623960J452814J398627J668393
$$ 172893537 174622715 176317286 177621005 179410576 181034536 182487350 183885977 185554370
4078A85554370J564404J858069J801323J817579J283443J472249J566185J116811
$$ 185554370 187118774 188976843 190778166 192595745 193879188 195351437 196917622 198034433
4070A98034433J442381J584136J961941J446802R93295J198907J313724J016822
$$ 198034433 199476814 201060950 203022891 204469693 205462988 206661895 207975619 208992441
4062B08992441J105069J223589R85389J102142J249850J197261L62125N54967
$$ 208992441 210097510 211321099 212306488 213408630 214658480 215855741 216217866 216772833
4054B16772833J500576O17613N80886K04996J248483N66487L95170M46161K40057
$$ 216772833 218273409 218891022 219471908 219676904 220925387 221491874 221887044 222333205 222573262
4045B22573262K42673L4397K80714j71351p0309k41358k05075l87392J37473k07564
$$ 222573262 222815935 222850332 223131046 222959695 222889386 222648028 222442953 222055561 222193034 221985470
4035B21985470n34577k59605m41811n73001p22663m79276q76522j192154r70745
$$ 221985470 221450893 221191288 220749477 220176476 219453813 218974537 218098015 216905861 215935116
4026B15935116r00363j115926j333900j374066j238596q11456j328112j875344
$$ 215935116 215034753 213918827 212584927 211210861 209972265 209160809 207832697 205957353
4018B05957353j214436j028330k042277j525152j167869j391064j740835j427268
$$ 205957353 204742917 203714587 201672310 200147158 198979289 197588225 195847390 194420122
4010A94420122j343460j627192j812224k087328j123308j406011j628620j748628
$$ 194420122 193076662 191449470 189637246 187549918 186426610 185020599 183391979 181643351
4002A81643351k080830j537016j674599j478838k112876j709751j176104j927451
$$ 181643351 179562521 178025505 176350906 174872068 172759192 171049441 169873337 167945886
3994A67945886j864134j669662j708794j754981j911976j944814j421960j777731
$$ 167945886 166081752 164412090 162703296 160948315 159036339 157091525 155669565 153891834
3986A53891834j553145j432067j357168j690947j772350j973597j984868j614712
$$ 153891834 152338689 150906622 149549454 147858507 146086157 144112560 142127692 140512980
3978A40512980j142861j340806j538176j492759j741803j322972j512010j221604
$$ 140512980 139370119 138029313 136491137 134998378 133256575 131933603 130421593 129199989
3970A29199989j663295j806280j031190j374480j485443j351990j505080j553980
$$ 129199989 127536694 125730414 124699224 123324744 121839301 120487311 118982231 117428251
3962A17428251j174841j278687j358073j033417j304145j138208j278337n80939
$$ 117428251 116253410 114974723 113616650 112583233 111279088 110140880 108862543 108281604
3954A08281604j300735j625090j180518j037951o32460j058961j209192j113682
$$ 108281604 106980869 105355779 104175261 103137310 102504850 101445889 100236697 99123015
3946I9123015j032301q16290r81802q39620j145381m68412j194002j082706p10352
$$ 99123015 98090714 97274424 96292622 95453002 94307621 93839209 92645207 91562501 90852149
3937I0852149r82003p99907j064171r56005r76912p46748o83784m82956r87883
$$ 90852149 89870146 89070239 88006068 87050063 86073151 85326403 84642619 84159663 83171780
3928H3171780p86391k05799j220491r65359j108338q37296n49735m25794o77828
$$ 83171780 82385389 82179590 80959099 79993740 78885402 78048106 77498371 77072577 76394749
3919G6394749p86504q6255r02091l77716q95753r22960l32458o06448q51802n54263
$$ 76394749 75608245 75521990 74619899 74242183 73346430 72423470 72091012 71484564 70632762 70078499
3909G0078499n39014q87908p21657n31747m45587m79653o88825k80427n63723
$$ 70078499 69539485 68651577 67929920 67398173 66952586 66472933 65784108 65503681 64939958
3900F4939958o72427o14675m64030o26527m07061j041777j66783p41356o78224
$$ 64939958 64267531 63652856 63188826 62562299 62155238 61113461 60946678 60205322 59527098
3891E9527098j9619o47393o35124n51649n71079n68311J50247k09467n90963o27514
$$ 59527098 59507479 58860086 58224962 57673313 57102234 56533923 56684170 56474703 55883740 55256226
3881E5256226p02555j57857J319o06404n410l78224n10582m81358m82349k36548
$$ 55256226 54553671 54395814 54397133 53790729 53785319 53407095 52896513 52415155 51932806 51696258
3871E1696258k6822m04928n42252m47405N1793k28608m58484k54141k17357k22434
$$ 51696258 51669436 51264508 50722256 50274851 50326644 50098036 49639552 49385411 49168054 48945620
3861D8945620n77719l38625l97202J66596J54535n18932m58011k67140j09728
$$ 48945620 48367901 48029276 47632074 47798670 47953205 47434273 46976262 46709122 46599394
3852D6599394J18344k51060k45930k5753l45231n51265k10301J19891j13396R0394
$$ 46599394 46717738 46466678 46220748 46194995 45849764 45298499 45088198 45208089 45094693 45185087
3842D5185087m60303k19889J35316l98692m20181j38546o5989L46214R5152l00054
$$ 45185087 44724784 44504895 44640211 44241519 43821338 43682792 43616803 43963017 44058169 43758115
3832D3758115l10029k21020k12269j42723J62768J04540n56201k70696o1009p887
$$ 43758115 43448086 43227066 43014797 42872074 43034842 43139382 42583181 42312485 42251476 42243589
3822D2243589j44253o2066l44037j01642K12598l3435o28144q1382K53404j087478
$$ 42243589 42099336 42037270 41693233 41591591 41804189 41770754 41142610 41061228 41314632 40227154
3812D0227154J3283L55063L69794j65456J3258o89557k74916K86907N9376o44557
$$ 40227154 40240437 40595500 40965294 40799838 40813096 40123539 39848623 40135530 40194906 39550349
3802C9550349r8579k97715M51807n5975j38817K4728j94828r6853J13363K63087
$$ 39550349 39451770 39154055 39605862 39549887 39411070 39435798 39240970 39144117 39257480 39520567
3792C9520567l15827o2283l96232m06864o7693K39399m72791j58251N4406k14875
$$ 39520567 39204740 39142457 38746225 38339361 38271668 38511067 38038276 37880025 37934431 37719556
3782C7719556l30917q4965M03627K923n21204j75981M47341k7213m14351J93743
$$ 37719556 37388639 37303674 37707301 37710224 37189020 37013039 37460380 37433167 37018816 37212559
3772C7212559k65476k66447j23645P8750K20011n4910p25380k77809l2023L40499
$$ 37212559 36947083 36680636 36556991 36635741 36855752 36800842 36075462 35797653 35765630 36106129
3762C6106129l75191m43912K33458k6476l49590J84387O5730J62821p96292p2710
$$ 36106129 35730938 35287026 35520484 35494008 35144418 35328805 35394535 35557356 34761064 34688354
3752C4688354l06333K45441N47849l77943O8634n12709k7446J27284m50417l37138
$$ 34688354 34382021 34627462 35175311 34797368 34866002 34353293 34325847 34453131 34002714 33665576
3742C3665576M06566K66431j90058k66004j61629o6973M2952n7813P4460j26325
$$ 33665576 34072142 34338573 34148515 33882511 33720882 33653909 33696861 33639048 33713508 33587183
3732C3587183n17378j02519j0390O28883k95745o70260n31289L23958K24729n60711
$$ 33587183 33069805 32967286 32956896 33585779 33290034 32619774 32088485 32412443 32637172 32076461
3722C2076461O6860K72833J75523m22543l6949k27355L1448m33433j85725J04208
$$ 32076461 32143321 32416154 32591677 32169134 32132185 31904830 31936278 31502845 31317120 31421328
3712C1421328J02402j92126J62010r8246Q3029l17369o5132J37083J43694j66986
$$ 31421328 31523730 31331604 31493614 31395368 31478397 31161028 31095896 31232979 31376673 31209687
3702C1209687K7826L22758m27469m04645n68824M40480J19368l46576P0250K94491
$$ 31209687 31237513 31560271 31132802 30728157 30159333 30599813 30719181 30372605 30442855 30737346
3692C0737346l61665k77747m36057L44550M51938l05156p1602L32789j99530j48704
$$ 30737346 30375681 30097934 29661877 30006427 30458365 30153209 30081607 30414396 30214866 30066162
3682C0066162L98056j33005k14333l38943L49469k0319k17049Q80006o1200n72378
$$ 30066162 30464218 30331213 30116880 29777937 30127406 30107087 29890038 30770044 30708844 30136466
3672C0136466K44092k03211l43400L672J00012K55536r2855m87352k30022L07046
$$ 30136466 30380558 30177347 29833947 29837619 29937631 30193167 30100312 29612960 29382938 29689984
3662B9689984L3291R9711L98082O95813m35122m72197O12746J31770k78065K00309
$$ 29689984 29723275 29822986 30221068 30916881 30481759 30009562 30622308 30754078 30476013 30676322
3652C0676322R6286k70041J48338K67622L79365n8792l23432m1570L86009R1997
$$ 30676322 30772608 30502567 30650905 30918527 31297892 31239100 30915668 30874098 31260107 31352104
3642C1352104J07104J16442K54800L15412J74052l26636J8081M36568j60580l06706
$$ 31352104 31459208 31575650 31830450 32145862 32319914 31993278 32011359 32447927 32287347 31980641
3632C1980641L74323o9860N32113l45192L37906L52380N13816M00171m28212k27689
$$ 31980641 32354964 32285104 32817217 32472025 32809931 33162311 33676127 34076298 33648086 33420397
3622C3420397M88585j65838m77540O33287J64961k48341K39808O48858L38323
$$ 33420397 33908982 33743144 33265604 33898891 34063852 33815511 34055319 34704177 35042500
3613C5042500M51922L71889p7139Q5738j88759k53398O86229q4713L50284M90699
$$ 35042500 35494422 35866311 35789172 35874910 35686151 35432753 36118982 36034269 36384553 36875252
3603C6875252J11937L29814O62641j9566K76416m6886K71415J06655M35327K88366
$$ 36875252 36987189 37317003 37979644 37960078 38236494 38189608 38461023 38567678 39003005 39291371
3593C9291371L06370J90049k1131P85703J81339l22943O03608P84482N5389M35209
$$ 39291371 39597741 39787790 39766659 40552362 40733701 40410758 41014366 41798848 41854237 42289446
3583D2289446l0898M20361M21124Q25670L30040m2413K03247J17984M79544L87114
$$ 42289446 42258548 42678909 43100033 43925703 44255743 44213330 44416577 44534561 45014105 45401219
3573D5401219L12016J028432L20164L86577K28867J41606Q72879P00270N45715
$$ 45401219 45713235 46741667 47061831 47448408 47677275 47818881 48691760 49392030 49937745
3564D9937745L58678J82890K67125R13898P07730M35840L21363N94068N12258
$$ 49937745 50296423 50479313 50746438 51660336 52368066 52803906 53125269 53719337 54231595
3555E4231595P61171N37901J016967N80973M22692M39025R66482M09889K26283
$$ 54231595 54992766 55530667 56547634 57128607 57551299 57990324 58956806 59366695 59592978
3546E9592978Q24308O29453L97040J006200J240673N55169N85690J155965N30983
$$ 59592978 60417286 61046739 61443779 62449979 63690652 64245821 64831511 65987476 66518459
3537F6518459O02274J355052J314915N54531N28637Q56971Q10067R53584N71921
$$ 66518459 67120733 68475785 69790700 70345231 70873868 71730839 72540906 73494490 74066411
3528G4066411O29006J249033J270157Q31371J608005J184834Q08525J144053R27826
$$ 74066411 74695417 75944450 77214607 78045978 79653983 80838817 81647342 82791395 83719221
3519H3719221J213431J321653J074014J277139J040586J437907J528160J246792
$$ 83719221 84932652 86254305 87328319 88605458 89646044 91083951 92612111 93858903
3511I3858903J778911J548351J371732N59728J252358J431610J422250J569896
$$ 93858903 95637814 97186165 98557897 99117625 100369983 101801593 103223843 104793739
3503A04793739J124306J314156J702304J456902R05416R55571J735415J435791
$$ 104793739 105918045 107232201 108934505 110391407 111296823 112252394 113987809 115423600
3495A15423600J381947J076869J222094P09677Q02883Q40556J078162M99293L26753
$$ 115423600 116805547 117882416 119104510 119814187 120617070 121457626 122535788 123035081 123361834
3486A23361834R06126N97790Q06954J92396K86499K0628m2069K34434J66211p10665
$$ 123361834 124267960 124865750 125672704 125865100 126151599 126172227 126130158 126364592 126530803 125820138
3476A25820138K2045o26822p41547q74119o66040r66873r73588j084965j284341
$$ 125820138 125842183 125215361 124473814 123599695 122933655 121966782 120993194 119908229 118623888
3467A18623888j215895r23928j651344j128058j218039j370647r97735q16963
$$ 118623888 117407993 116484065 114832721 113704663 112486624 111115977 110118242 109301279
3459A09301279j033006o87054p00161r96453o61025l08356n35874k02213k41205
$$ 109301279 108268273 107581219 106881058 105884605 105223580 104915224 104379350 104177137 103935932
3450A03935932m27360k47979l96813k77018j74160l67274l98521p29860r79091
$$ 103935932 103508572 103260593 102863780 102586762 102412602 102045328 101646807 100916947 99937856
3441I9937856j250664j060967j636138j078134j217197j821713j532109j433855
$$ 99937856 98687192 97626225 95990087 94911953 93694756 91873043 90340934 88907079
3433H8907079j607431j686046j471214j833967j793520j629478j233855o49437
$$ 88907079 87299648 85613602 84142388 82308421 80514901 78885423 77651568 77002131
3425G7002131j157940j453343o16373q61900p93818r83712j016755o28985p25793
$$ 77002131 75844191 74390848 73774475 72912575 72118757 71135045 70118290 69489305 68763512
3416F8763512o49718m63011j142732r31330n31607m35673o85061p78110r93101
$$ 68763512 68113794 67650783 66508051 65576721 65045114 64609441 63924380 63146270 62153169
3407F2153169r57585j396400r01433j596611p17175r21339j309354m74682r15279
$$ 62153169 61195584 59799184 58897751 57301140 56583965 55662626 54353272 53878590 52963311
3398E2963311j033298j111833o76784j203494j640505j004653j105959n49027
$$ 52963311 51930013 50818180 50141396 48937902 47297397 46292744 45186785 44637758
3390D4637758n63861j005170l87481j085442o62207m93496o91661p16216l90599
$$ 44637758 44073897 43068727 42681246 41595804 40933597 40440101 39748440 39032224 38641625
3381C8641625n1787r91972n95878n33014k18451n12995m73582q55003j50889m09627
$$ 38641625 38589838 37597866 37001988 36468974 36250523 35737528 35263946 34408943 34258054 33848427
3371C3848427m71704m83093l79212n19228o09276q6484j38140p52266L0645k40704
$$ 33848427 33376723 32893630 32514418 31995190 31385914 31299430 31161290 30409024 30439669 30198965
3361C0198965j58088m89791m06791l19363m93376n28599p63896K77629m81603
$$ 30198965 30040877 29551086 29144295 28824932 28331556 27802957 27039061 27316690 26835087
3352B6835087M95667k08599l03631l73141k68085J69473p25438n84413p4261j40887
$$ 26835087 27330754 27122155 26818524 26445383 26177298 26346771 25621333 25036920 24962659 24821772
3342B4821772L56080l72726l78207m32731k64655P1193l60758R8333l87647j83611
$$ 24821772 25177852 24805126 24426919 23994188 23729533 23800726 23439968 23538301 23150654 22967043
3332B2967043l92825N0730k76874j41361J51920j55240k11968p3859l50707j44754
$$ 22967043 22574218 22624948 22348074 22206713 22358633 22203393 21991425 21917566 21566859 21422105
3322B1422105n17683k16727N32203m17887O2335o67857j12089J36366P4073k72817
$$ 21422105 20904422 20687695 21219898 20802011 20864346 20196489 20084400 20220766 20294839 20022022
3312B0022022r2669m31569p115L71797k36855k88220o14493k51930L81352j31598
$$ 20022022 19929353 19497784 19490669 19862466 19625611 19337391 18722898 18470968 18852320 18720722
3302A8720722O31250m47194o68034J54069r6711L85921r0006j90463J15321k9293
$$ 18720722 19351972 18904778 18236744 18390813 18294102 18680023 18590017 18399554 18514875 18485582
3292A8485582p19556k56752N95560L7324K81205j75430k82218m0215o32905K30509
$$ 18485582 17766026 17509274 18104834 18142158 18423363 18247933 17965715 17925500 17292595 17523104
3282A7523104o816k15659M05107l49829k19418L78948M723l56242k80608M1267
$$ 17523104 17516288 17300629 17705736 17355907 17136489 17515437 17520160 17163918 16883310 16924577
3272A6924577p6200L06709j56978l13051j7685l99256j85766N17829J49803l29490
$$ 16924577 16848377 17155086 16998108 16685057 16667372 16268116 16082350 16600179 16749982 16420492
3262A6420492K64949p1043k86597J56455J71885r9184R1496M51194l34917q6138
$$ 16420492 16685441 16614398 16327801 16484256 16656141 16556957 16648453 17099647 16764730 16678592
3252A6678592K95234l3693O2513k88061j80913K83714L48828L52415J89041k42190
$$ 16678592 16973826 16940133 17002646 16714585 16533672 16817386 17166214 17518629 17707670 17465480
3242A7465480j03404p5952R8705M45879q2285K6261j45553j34744J29228O6793
$$ 17465480 17362076 17286124 17384829 17830708 17748423 17774684 17629131 17494387 17623615 17690408
3232A7690408l6817M64713K68897L59945O8880j92367j74914K08148k47791m0854
$$ 17690408 17653591 18118304 18387201 18747146 18816026 18623659 18448745 18656893 18409102 18368248
3222A8368248K69685N8806J0885K58626k46783j49388N86935L09622K03244n2803
$$ 18368248 18637933 18696739 18707624 18966250 18719467 18570079 19157014 19466636 19669880 19617077
3212A9617077L4758n0847J17423Q9149Q1944P9033l41288J29867O08177Q6618
$$ 19617077 19651835 19600988 19718411 19807560 19889504 19968537 19627249 19757116 20365293 20451911
3202B0451911L38724k37849J78577o4527K02781M30059j10379L98328M47657j22922
$$ 20451911 20790635 20552786 20731363 20666836 20869617 21299676 21189297 21587625 22035282 21912360
3192B1912360l13995p9296O31609J40587o38539L2470j45767M39145L81833L46260
$$ 21912360 21598365 21519069 22150678 22291265 21652726 21685196 21539429 21978574 22360407 22706667
3182B2706667k27577j02185J99938K76317K43671M0295M77334l39524J33552M6032
$$ 22706667 22479090 22376905 22576843 22853160 23096831 23137126 23614460 23274936 23408488 23454520
3172B3454520K44364o4571l88943J50821J12672L9066K40287k39329M129j04503
$$ 23454520 23698884 23634313 23245370 23396191 23508863 23547929 23788216 23548887 23553016 23448513
3162B3448513K35450J38450j41352j93315K29585Q4033J49858m56446K22968N74410
$$ 23448513 23683963 23822413 23681061 23487746 23717331 23801364 23951222 23494776 23717744 24292154
3152B4292154l38087j02986k89439j18463k80672k14252n19411r570N2891M1228
$$ 24292154 23954067 23851081 23561642 23443179 23162507 22948255 22428844 22419274 22472165 22513393
3142B2513393N2104P9580n49513j60066j13213k94514k0512m06392m75367k12651
$$ 22513393 22565497 22645077 22095564 21935498 21822285 21527771 21507259 21100867 20625500 20412849
3132B0412849j89290K76952j02298o51455j87406N0592k14238k08847J6644Q9732
$$ 20412849 20223559 20500511 20398213 19746758 19559352 19609944 19395706 19186859 19203503 19293235
3122A9293235l15994n56367l79403q9996P0178j81103k67132j99447j29525o5318
$$ 19293235 18977241 18420874 18041471 17951475 18021653 17840550 17573418 17373971 17244446 17179128
3112A7179128j69047J15060m01761m32867J5536o85467J12926j01493m17396k43768
$$ 17179128 17010081 17125141 16723380 16290513 16306049 15620582 15733508 15632015 15214619 14970851
3102A4970851m05502l38374J1325k28051j71752L85961p06267N1410j26550Q6269
$$ 14970851 14565349 14226975 14238300 14010249 13838497 14224458 13518191 13569601 13443051 13529320
3092A3529320k90826r9834k33170k64366K3992k60590k23702l40563K09322k32601
$$ 13529320 13238494 13138660 12905490 12641124 12665116 12404526 12180824 11840261 12049583 11816982
3082A1816982k85513P8647m58742r1804k44552q097o9932L0651k4905j99741J4449
$$ 11816982 11531469 11610116 11151374 11059570 10815018 10806921 10736989 10767640 10742735 10542994 10557443
3071A0557443m22734K0958j13160m80105N62799k46924n75006p0870r5876R2678
$$ 10557443 10134709 10155667 10042507 9562402 10125201 9878277 9303271 9232401 9136525 9229203
3061I229203J51725M6032n12281o3668M70874m57298p18735K81286K00693J83713
$$ 9229203 9380928 9426960 8914679 8851011 9321885 8864587 8145852 8427138 8627831 8811544
3051H811544l76676l37032r4750R4594K26232k98199l84716J55949K0938K42335
$$ 8811544 8434868 8097836 8003086 8097680 8323912 8025713 7640997 7796946 7817884 8060219
3041H060219l98540N938m1459k72276o1163J48225k20205m24078J9468P52858
$$ 8060219 7661679 7667617 7626158 7353882 7292719 7440944 7220739 6796661 6816129 7568987
3031G568987q4268l14681l89475R520J75798n3116j338k27106k94410k28161l812
$$ 7568987 7484719 7170038 6780563 6790083 6965881 6912765 6911427 6684321 6389911 6161750 6157938
3020F157938K41108j68047k32046K72053O03301l3941o79172m22649J50922O15867
$$ 6157938 6399046 6230999 5998953 6271006 6874307 6840366 6161194 5738545 5889467 6505334
3010F505334O0976j88625o8401l77992J93880k1405k77425j19025K86364m5558
$$ 6505334 6566310 6377685 6309284 5931292 6125172 6103767 5826342 5707317 5993681 5948123
3000E948123j53235L80941p9143M07688l19285o2359m9005n26197Q6114k03104
$$ 5948123 5794888 6175829 6096686 6504374 6185089 6122730 6073725 5547528 5633642 5430538
2990E430538j19542N34114p6289n10490q7629j43875j80606L56345K87288L32506
$$ 5430538 5310996 5845110 5768821 5258331 5170702 5026827 4846221 5202566 5489854 5822360
2980E822360p0702k95863K93270n18222o7310K64976j92897j93875L45870M19604
$$ 5822360 5751658 5455795 5749065 5230843 5163533 5428509 5235612 5041737 5387607 5807211
2970E807211l79029k96700k07309m43337J76321J05435Q3082j5797J51736l96380
$$ 5807211 5428182 5131482 4924173 4480836 4657157 4762592 4845674 4829877 4981613 4585233
2960D585233O378K35404k39486L07036L48885J15977n42591j76844R3596L41607
$$ 4585233 4591611 4827015 4587529 4894565 5243450 5359427 4816836 4639992 4733588 5075195
2950E075195k24567l98375k95514J82699k53525L8769Q3180J63798J44167j84056
$$ 5075195 4850628 4452253 4156739 4339438 4085913 4124682 4207862 4371660 4515827 4331771
2940D331771M22087N9657q1408r5735k37895r476O7126p2226k41658k66947j70155
$$ 4331771 4753858 4813515 4732107 4636372 4398477 4389001 4456127 4383901 4142243 3875296 3705141
$$ [...]
##END NTUPLES=NMR SPECTRUM
##END=
