##TITLE=1H_EC-3315(11)
 CDCl3
 8sc, 
 16.2.2024
##JCAMPDX= 6.0         $$ Bruker NMR JCAMP-DX V2.0
##DATA TYPE= NMR SPECTRUM
##DATA CLASS= NTUPLES
##ORIGIN= UXNMR, Bruker Analytische Messtechnik GmbH
##OWNER= root
$$ XWIN-NMR		Version 3.5
$$ Fri Feb 16 14:47:30 2024 Russian Standard Time (UT+4h)  she@DPX200
##.OBSERVE FREQUENCY= 200.1313
##.OBSERVE NUCLEUS= ^1H
##.ACQUISITION MODE= SIMULTANEOUS
##.ACQUISITION SCHEME= undefined
##.AVERAGES= 8
##.DIGITISER RES= 18
##SPECTROMETER/DATA SYSTEM= spect
##.PULSE SEQUENCE= zg30
##.SOLVENT NAME= DMSO
##.SHIFT REFERENCE= (INTERNAL, DMSO, 0, 15.4362)
##AUDIT TRAIL= $$ (NUMBER, WHEN, WHO, WHERE, WHAT)
$$ ##TITLE= Audit trail, XWIN-NMR		Version 3.5
$$ ##JCAMPDX= 5.01
$$ ##ORIGIN= Bruker BioSpin GmbH
$$ ##OWNER= she
$$ F:/spectra/data/she/nmr/H-F/1/pdata/1/auditp.txt
$$ ##AUDIT TRAIL=  $$ (NUMBER, WHEN, WHO, WHERE, WHAT)
(   1,<2024-02-16 14:46:18.18 +0400>,<she>,<DPX200>,
      <created by zg, POWCHK disabled, PULCHK disabled
       configuration hash MD5:
       00 E9 B6 7A A2 85 ED C7 34 08 36 98 17 FE 4E 26
       data hash MD5: 16K
       3C 96 95 C5 A2 0F 91 EF AD 9E 3F 5B 67 0B E2 CB>)
(   2,<2024-02-16 14:46:20.54 +0400>,<she>,<DPX200>,
      <Start of raw data processing
       efp BC_mod = 2 LB = 0.24 FT_mod = 6 PKNL = 1 PHC0 = -24960.59 PHC1 = 14.25264 SI = 16K 
       data hash MD5: 16K
       8F FB 62 2A 37 B0 D6 E1 CF 32 BF 29 2D 0B 16 90>)
(   3,<2024-02-16 14:46:42.00 +0400>,<she>,<DPX200>,
      <pk PHC0 = 3.022259 PHC1 = -5.4 
       data hash MD5: 16K
       B5 08 86 CC 2F B0 39 F2 DF 01 F9 31 BB D1 20 57>)
(   4,<2024-02-16 14:46:45.53 +0400>,<she>,<DPX200>,
      <abs ABSG = 5 
       data hash MD5: 16K
       EB 2B 8B 78 04 44 3B F0 D6 2E C4 D3 63 11 C1 D1>)
$$ ##END=
$$ 
$$ hash MD5
$$ 77 21 11 2E AC 8C 07 77 FC 53 00 60 02 11 D0 93
##$RELAX= 
##$RELAX= 
##$RELAX= 
##$RELAX= 
##$RELAX= 
##$RELAX= 
$$ Bruker specific parameters
$$ --------------------------
##$DU= <F:/spectra>
##$EXPNO= 1
##$NAME= <H-F>
##$PROCNO= 1
##$TYPE= <nmr>
##$USER= <she>
##$AMP= (0..31)
100 100 100 100 100 100 100 100 100 100 100 100 100 100 100 100 100 100 
100 100 100 100 100 100 100 100 100 100 100 100 100 100 
##$AQSEQ= 0
##$AQ_mod= 1
##$AUNM= <au_zg>
##$AUTOPOS= <>
##$BF1= 200.13
##$BF2= 200.13
##$BF3= 200.13
##$BF4= 200.13
##$BF5= 200.13
##$BF6= 200.13
##$BF7= 200.13
##$BF8= 200.13
##$BYTORDA= 1
##$CFDGTYP= 0
##$CFRGTYP= 5
##$CHEMSTR= <none>
##$CNST= (0..31)
1 1 145 1 1 1 1 1 1 1 1 1 1 1 1 1 1 1 1 1 1 1 1 1 1 1 1 1 1 1 1 1 
##$CPDPRG= <>
##$CPDPRG1= <>
##$CPDPRG2= <>
##$CPDPRG3= <>
##$CPDPRG4= <mlev>
##$CPDPRG5= <mlev>
##$CPDPRG6= <mlev>
##$CPDPRG7= <mlev>
##$CPDPRG8= <mlev>
##$CPDPRGB= <>
##$CPDPRGT= <>
##$D= (0..31)
0 1.2 0 0 0 0 0 0 0 0.06 0 0.03 0 0 0 0 0.0002 0 0 0 0 0 0 0 0 0 0 0 0 
0 0 0 
##$DATE= 1708080377
##$DBL= (0..7)
120 120 120 120 120 120 120 120 
##$DBP= (0..7)
150 150 150 150 150 150 150 150 
##$DBP07= 0
##$DBPNAM0= <>
##$DBPNAM1= <>
##$DBPNAM2= <>
##$DBPNAM3= <>
##$DBPNAM4= <>
$$ [...]
##$SUBNAM3= <"">
##$SUBNAM4= <"">
##$SUBNAM5= <"">
##$SUBNAM6= <"">
##$SUBNAM7= <"">
##$SUBNAM8= <"">
##$SUBNAM9= <"">
##$SW= 18.0517328524113
##$SWIBOX= (0..15)
0 0 2 0 0 0 0 0 0 0 0 0 0 0 0 0 
##$SW_h= 3612.71676300578
##$TD= 16384
##$TD0= 1
##$TE= 0
##$TE2= 300
##$TE3= 300
##$TEG= 300
##$TL= (0..7)
0 120 120 120 120 120 120 120 
##$TP= (0..7)
150 150 150 150 150 150 150 150 
##$TP07= 0
##$TPNAME0= <>
##$TPNAME1= <>
##$TPNAME2= <>
##$TPNAME3= <>
##$TPNAME4= <>
##$TPNAME5= <>
##$TPNAME6= <>
##$TPNAME7= <>
##$TPOAL= (0..7)
0.5 0.5 0.5 0.5 0.5 0.5 0.5 0.5 
##$TPOFFS= (0..7)
0 0 0 0 0 0 0 0 
##$TUNHIN= 0
##$TUNHOUT= 0
##$TUNXOUT= 0
##$USERA1= <user>
##$USERA2= <user>
##$USERA3= <user>
##$USERA4= <user>
##$USERA5= <user>
##$V9= 5
##$VALIST= <valist>
##$VCLIST= <CCCCCCCCCCCCCCC>
##$VD= 0
##$VDLIST= <DDDDDDDDDDDDDDD>
##$VPLIST= <PPPPPPPPPPPPPPP>
##$VTLIST= <TTTTTTTTTTTTTTT>
##$WBST= 1024
##$WBSW= 4
##$XGAIN= (0..3)
0 0 0 0 
##$XL= 0
##$YL= 0
##$YMAX_a= 275528
##$YMIN_a= -392259
##$ZGOPTNS= <>
##$ZL1= 120
##$ZL2= 120
##$ZL3= 120
##$ZL4= 120
##$ABSF1= 15.4494
##$ABSF2= -2.602449
##$ABSG= 5
##$ABSL= 3
##$ALPHA= 0
##$AQORDER= 0
##$ASSFAC= 0
##$ASSFACI= 0
##$ASSFACX= 0
##$ASSWID= 0
##$AUNMP= <proc_1d>
##$AZFE= 0.1
##$AZFW= 0.1
##$BCFW= 0
##$BC_mod= 2
##$BYTORDP= 0
##$COROFFS= 0
##$CY= -3
##$DATMOD= 1
##$DC= 0
##$DFILT= <>
##$DTYPP= 0
##$F1P= 0
##$F2P= 0
##$FCOR= 1
##$FTSIZE= 16384
##$FT_mod= 6
##$GAMMA= 0
##$GB= 0
##$INTBC= 1
##$INTSCL= 3.70164e-10
##$ISEN= 128
##$LB= 0.24
##$LEV0= 0
##$LPBIN= 0
##$MAXI= 10000
##$MC2= 0
##$MEAN= 0
##$ME_mod= 0
##$MI= 1.114404
##$NCOEF= 0
##$NC_proc= -7
##$NLEV= 6
##$NOISF1= 3.799351
##$NOISF2= 2.8
##$NSP= 0
##$NTH_PI= 0
##$NZP= 0
##$OFFSET= 15.43618
##$PC= 1
##$PHC0= -24957.57
##$PHC1= 8.85264
##$PH_mod= 1
##$PKNL= yes
##$PPARMOD= 0
##$PSCAL= 0
##$PSIGN= 0
##$REVERSE= no
##$SF= 200.130017114833
##$SI= 16384
##$SIGF1= 3
##$SIGF2= 2
##$SINO= 5.538805
##$SIOLD= 16384
##$SREGLST= <1H.CDCl3>
##$SSB= 0
##$STSI= 16384
##$STSR= 0
##$SW_p= 3612.71676300578
##$SYMM= 0
##$S_DEV= 0
##$TDeff= 16384
##$TDoff= 0
##$TI= <>
##$TILT= no
##$TM1= 0
##$TM2= 0
##$TOPLEV= 0
##$USERP1= <user>
##$USERP2= <user>
##$USERP3= <user>
##$USERP4= <user>
##$USERP5= <user>
##$WDW= 1
##$XDIM= 16384
##$YMAX_p= 335253049
##$YMIN_p= -641469
$$ End of Bruker specific parameters
$$ ---------------------------------
##NTUPLES= NMR SPECTRUM
##VAR_NAME=  FREQUENCY,     SPECTRUM/REAL,   SPECTRUM/IMAG
##SYMBOL=    X,             R,               I
##VAR_TYPE=  INDEPENDENT,   DEPENDENT,       DEPENDENT
##VAR_FORM=  AFFN,          ASDF,            ASDF
##VAR_DIM=   16384,         16384,           16384
##UNITS=     HZ,            ARBITRARY UNITS, ARBITRARY UNITS
##FACTOR=    0.220516191357247, 1,           1
##FIRST=     3089.24299055178, 0,            0
##LAST=      -523.473772454, 0,              0
##MIN=       -523.473772454, -641469,        0
##MAX=       3089.24299055178, 335253049,    0
$$ Real data points
##PAGE= N=1
##DATA TABLE= (X++(R..R)), XYDATA
$$ [...]
6250B0192877M54392L37773N38061L48298M96088Q0877n11100o37894r52464q54900
6240A9492008q75914o46928m59262l72415k75363k15703j10111L28141J1606M11961
6230A7288020N31630O46795N70248J036356J396816J350756J581376J850091J276411
6221B7528499J173764L34186k55676j336960k010721j914428k116136j481159
6213A9921369j207595r97877q73619o68084m78393n96073j42873l23718N1804
6204A4684941O0717J98521N03417O08690N50763O61584P44927P60493N27655j32436
6194A9169272o47274j116837p73872j322967j088162j132445r76910o08107o85129
6185A0817569p25315l84649n96550k71787j47054k41048j43533m9789k96007L1961
$$ y = [20192877, 20647269, 20985042, 21523103, 21871401, 22367489, 22448366, 21937266, 21299372, 20346908, 19492008, 18616094, 17969166, 17509904, 17137489, 16862126, 16646423, 16536312, 16864453, 16876059, 17288020, 17819650, 18466445, 19036693, 20073049, 21469865, 22820621, 24401997, 26252088, 27528499, 28702263, 29036449, 28780773, 27443813, 25433092, 23518664, 21402528, 19921369, 18713774, 17715897, 16842278, 16174194, 15695801, 15099728, 14956855, 14633137, 14684941, 14745658, 14944179, 15447596, 16056286, 16607049, 17268633, 18013560, 18774053, 19301708, 19169272, 18521998, 17405161, 16631289, 15308322, 14220160, 13087715, 12110805, 11502698, 10817569, 10092254, 9707605, 9111055, 8839268, 8692214, 8451166, 8307633, 8257844, 7961837, 7993798]
6175G993798N8378k16721m51639l9979J13646J16940J35602j23919K847K32427
6165G821380r8801J3708j05371j88348O8393J85314Q5839k85173o698M573j75037
6154G319779J11488k21185k81495j24227j41371K34937n2148J39567p9551J06771
6144G012565K77880J69133j0156N8571Q9252K0687J52165K67076J92090M40060
6134H669323L80798Q6145r5233L77355j6596j75170n7019k25529k98555j13013
6124H532506k04141j58089R2914J76056M8946L49461m8291j84998l0908o5162
6114H508294J31637L56171J49386O8046N8121K42005L81675L10985L72388K01617
6104A0780325J36715K61139J75293j32600J84920j83469m8110Q8852L50432M56603
$$ y = [7993798, 8052176, 7835455, 7383816, 7343837, 7457483, 7574423, 7710025, 7586106, 7588953, 7821380, 7722579, 7736287, 7630916, 7442568, 7510961, 7696275, 7782114, 7496941, 7490243, 7494816, 7319779, 7431267, 7210082, 6928587, 6804360, 6662989, 6897926, 6845778, 6985345, 6905794, 7012565, 7290445, 7459578, 7449422, 7507993, 7597245, 7617932, 7770097, 8037173, 8229263, 8669323, 9050121, 9136266, 9041033, 9418388, 9401792, 9226622, 9169603, 8944074, 8645519, 8532506, 8328365, 8170276, 8263190, 8439246, 8488192, 8837653, 8789362, 8604364, 8573456, 8508294, 8639931, 8996102, 9145488, 9213534, 9271655, 9513660, 9895335, 10206320, 10578708, 10780325, 10917040, 11178179, 11353472, 11220872, 11405792, 11222323, 11174213, 11263065, 11613497, 12070100]
6094A2070100J60172L19260M02809O30208N99113O75082P99391R43579J292301
6085A7892015J408935J299594J665996J800332J055189L90144m31254q42583j166340
6076B3072028j182330j068204r46710n46015n04614j93598o7860M1152L44417
6067A8948266L11584L19521R35928P87236R24765J361872J554493K033068K469465
6058B9646198K920415L224381L647443L347356K332096N85561j682442l487282
6050D0533726l925557m101233l146205k502579j728395j302968j115353j009325
6042B1702111n59216o83691k87425K26900J72571L20841N67331N14117P82227
6033B2755766J022795J227405J624056J902691J502561J075676P46205l90784
$$ y = [12070100, 12230272, 12549532, 12952341, 13582549, 14181662, 14856744, 15656135, 16599714, 17892015, 19300950, 20600544, 22266540, 24066872, 25122061, 25512205, 25080951, 24238368, 23072028, 21889698, 20821494, 19874784, 19328769, 18824155, 18630557, 18562697, 18603849, 18948266, 19259850, 19579371, 20515299, 21302535, 22227300, 23589172, 25143665, 27176733, 29646198, 32566613, 35790994, 39438437, 42785793, 45117889, 45703450, 44021008, 40533726, 36608169, 32506936, 29360731, 26858152, 25129757, 23826789, 22711436, 21702111, 21142895, 20459204, 20171779, 20398679, 20571250, 20892091, 21459422, 21973539, 22755766, 23778561, 25005966, 26630022, 28532713, 30035274, 31110950, 31857155, 31466371]
6025C1466371j341591j954895k195997j675470j606835j514636j048766o05425
6017A9522756p22340m49635k87269o17668o6436K45452j11458k862L24290P4344
6007A7909174L28535L91169L39233K04781J55979M83952M33788K91019O35747
5998B1173377Q66668J087201J101960J222877J112997J714550J377965R12806
5990C0570401O67082M39896K50629N51376J030032J472449J771872J873495J869137
5981D0496369J347035P21038P071r12810q50755j054977j221908n60501J00045
5972C8070607N12779J000965J457147J945623K430219K474499K360961J315132
5964E1567932N40464r2737n74472k96485Q04333J650435K225525L391346L754237
$$ y = [31466371, 30124780, 28169885, 25973888, 24298418, 22691583, 21176947, 20128181, 19522756, 18800416, 18350781, 18063512, 17445844, 17379408, 17624860, 17513402, 17510540, 17834830, 17909174, 18237709, 18628878, 18968111, 19172892, 19328871, 19812823, 20246611, 20537630, 21173377, 22040045, 23127246, 24229206, 25452083, 26565080, 28279630, 29657595, 30570401, 31237483, 31677379, 31928008, 32479384, 33509416, 34981865, 36753737, 38627232, 40496369, 41843404, 42564442, 42571513, 41658703, 40807948, 39752971, 38531063, 37970562, 38070607, 38583386, 39584351, 41041498, 42987121, 45417340, 47891839, 50252800, 51567932, 52108396, 52015659, 51441187, 51144702, 51949035, 53599470, 55824995, 59216341, 62970578]
5955F2970578L209756J663116m13594k626858l993782m628098m976731m137892
5947D7066495k951247k495248j478008p90219l38489K05919N35450K25290k00146
5938C9779797m38266j068851j143855r40166m73192J59478O64214J046867J037843
5929C8623869J147232J81301p22452j427879k226328k942641k848134k665641
5921B7119327k633264j979048j458426j493503j256034q55737p62459m19236r18822
5912A5342798o09690p20946q65048o11629o96223n72904k36545n18289l04611
5903A0206913m35936k86741l29538l40909m72684j72636k21113j62624j6929k79562
5893G488241j6783j19421j06224k39520Q5720j75953k57092j5374r868k98535
$$ y = [62970578, 66180334, 67843450, 67429856, 64802998, 60809216, 56181118, 51204387, 47066495, 44115248, 41620000, 40141992, 39351773, 39013284, 39219203, 39754653, 39979943, 39779797, 39341531, 38272680, 37128825, 36188659, 35715467, 35874945, 36539159, 37586026, 38623869, 39771101, 39952402, 39229950, 37802071, 35575743, 32633102, 29784968, 27119327, 24486063, 22507015, 21048589, 19555086, 18299052, 17443315, 16680856, 16261620, 15342798, 14733108, 14012162, 13147114, 12535485, 11839262, 11266358, 11029813, 10511524, 10206913, 9770977, 9484236, 9154698, 8813789, 8341105, 8168469, 7947356, 7784732, 7767803, 7488241, 7471458, 7352037, 7245813, 7006293, 7092013, 6916060, 6658968, 6643594, 6633726, 6335191]
5883F335191O5217O4328j55627j35491j98534j57836L16138N5866k95793R0435
5873E983894n0066j69434k3694K13868M7984k97237k43257J77438J04636P6818
5863E820950o5486O1663p5163K7979j8895L3552Q6130K0946l7767r0497J30860
5852E894272L1289M3644j53876R7340M06403J51877L4239K7947J6399o5968N1465
5841F535031J19395R5167k7038R9553o5931J52496l3920K94292K53003M8773J89217
5830G660038O5954k1426J09745K44386O490q3624J37663J40330M2603K42888K01751
5819H746798P9667M848J04038N4960K44014L80093K72844L8692K43374M14435
5809A0583763K76006L41725N06895L20819M69427N57491N41188N89801Q60501
$$ y = [6335191, 6400408, 6464736, 6309109, 6173618, 5975084, 5817248, 6133386, 6189252, 5893459, 5983894, 5933828, 5764394, 5740700, 5954568, 6002552, 5705315, 5462058, 5639496, 5744132, 5820950, 5755464, 5817127, 5741964, 5769943, 5751048, 5784600, 5870730, 5891676, 5853909, 5763412, 5894272, 5925561, 5969205, 5815329, 5912669, 6319072, 6470949, 6505188, 6533135, 6549534, 6483566, 6535031, 6654426, 6749593, 6722555, 6822108, 6756177, 6908673, 6874753, 7169045, 7422048, 7470821, 7660038, 7725992, 7704566, 7814311, 8058697, 8065187, 7981563, 8119226, 8259556, 8302159, 8545047, 8746798, 8826465, 8831313, 8935351, 8990311, 9234325, 9614418, 9887262, 9925954, 10169328, 10583763, 10859769, 11201494, 11708389, 12029208, 12498635, 13056126, 13597314, 14187115, 15047616]
5800A5047616O11512P50778Q69918P82220O80937N32439j0577n60535p87948o72364
5790A7243996o98767l82578k90376l46455j27675K13324J25942J67824M16241
5781A6321476N44001N56189Q78880O90927P31445J064077J317709J387678J292616
5772B4784998J657330J996657K088775J309618M21718r32621j605359j470652
5764B8250464j178002r13315m53977k78887K86884N26210O30558J243167J718250
5755B9831352J821681J960857K125847J982073J120841n8330q25157j162430j378155
5746C5418579r02054k64173l67590O6935J29881k65275m45412q43143k66468o649
5736C2254631J50148M37696Q33776J202703J560462K295869K706668L582025L833309
$$ y = [15047616, 15659128, 16409906, 17279824, 18062044, 18742981, 19275420, 19264843, 18704308, 17916360, 17243996, 16545229, 16162651, 15872275, 15525820, 15398145, 15611469, 15737411, 15905235, 16321476, 16865477, 17421666, 18300546, 18991473, 19722918, 20786995, 22104704, 23492382, 24784998, 26442328, 28438985, 30527760, 31837378, 32259096, 31326475, 29721116, 28250464, 27072462, 26159147, 25705170, 25426283, 25713167, 26239377, 26869935, 28113102, 29831352, 31653033, 33613890, 35739737, 37721810, 38842651, 38784321, 37959164, 36796734, 35418579, 34516525, 34252352, 33884762, 33951697, 34081578, 33816303, 33370891, 32527748, 32261280, 32254631, 32404779, 32842475, 33676251, 34878954, 36439416, 38735285, 41441953, 45023978, 48857287]
5727D8857287L734009K340024k52892k569431l786238m179479l894951l062743
5719C7185586k299872j415206j084171r07907p24005j20465K07581L03848N70426
5710C1715815J071254J412611J219916J560872J660435J697650J759583J654619
5702D3752755J067049K49567n79171j560311k191510k415456k471876k287110
5694C3563937j888721j378864r93885o80370m15122p3325L07956N64614R77520
5685B9983740O50937J127799J599780J693103J810805J858051J905031O35851
5677D1265097o38421j613614k358752j976157k078782j605198j493207j082655
5669B8418311p35862r36142q36919n36162k62615j33007J47739K99680J13413
$$ y = [48857287, 52591296, 54931320, 54678428, 52108997, 48322759, 44143280, 40248329, 37185586, 34885714, 33470508, 32386337, 31478430, 30754425, 30633960, 30841541, 31145389, 31715815, 32787069, 34199680, 35419596, 36980468, 38640903, 40338553, 42098136, 43752755, 44819804, 45069371, 44490200, 42929889, 40738379, 38322923, 35851047, 33563937, 31675216, 30296352, 29302467, 28622097, 28206975, 28133650, 28441606, 29006220, 29983740, 30634677, 31762476, 33362256, 35055359, 36866164, 38724215, 40629246, 41265097, 40626676, 39013062, 36654310, 34678153, 32599371, 30994173, 29500966, 28418311, 27682449, 26746307, 25909388, 25373226, 25110611, 24977604, 25125343, 25425023, 25538436]
5660B5538436K04459P61373Q29143N80209Q22470R81517O71943R50768j66502
5651C1173816o04865r26843m76690n55649l54784j68962l80654l11464l1291L95235
5641B7757849N24185O66283J064950J444352J517855J984851K253167J826300
5633C9039792J276827L65932r34649j840580k011294j920083j819905j318724
5625C0837316j054842q03178m83833k65131r4472k33854k82826K00353O15503
5616B8435036P48171J055426J322647J804353J990094K442880L314760L804961
5608D4918328M316979L673885J507813r99853k911730m157072l967501l512730
5600C8868119k562357k365266j507960j355182j232546j009805n52454r66846
$$ y = [25538436, 25742895, 26504268, 27333411, 27913620, 28736090, 29717607, 30389550, 31340318, 31173816, 30568951, 29642108, 29165418, 28609769, 28254985, 28086023, 27705369, 27393905, 27362614, 27757849, 28282034, 28948317, 30013267, 31457619, 32975474, 34960325, 37213492, 39039792, 40316619, 40682551, 39747902, 37907322, 35896028, 33975945, 32156040, 30837316, 29782474, 28979296, 28495463, 28230332, 28135860, 27902006, 27619180, 27819533, 28435036, 29183207, 30238633, 31561280, 33365633, 35355727, 37798607, 41113367, 44918328, 49235307, 52909192, 54417005, 53417152, 50505422, 46348350, 42380849, 38868119, 36305762, 33940496, 32432536, 31077354, 29844808, 28835003, 28282549, 27315703]
5592B7315703o48449k05149l80688R155K47737L75529O99662P75870Q83966J137718
5582C0211054J504882J610860J268020Q58601l71360j083280j603486j677493
5574C0717798j445968j274186j181924n92613n72615m14286m48440k05507j02041
5565B4480218m77617j58627J61696j62992l74190l8038P4447K68219M48436K93284
5555B4514836K84358J85090K10796M11524N47704N96218O21282M30046M65294
5546B8267148K62223M56189P09741M53118P60701O49370O84555Q88461J084355
5537C4215861J189903J500600J610143J571796J886627K333682K753004L117333
5529E0178949L391638K965850K370712J309269Q32435J33556n50151j246844k148457
$$ y = [27315703, 26667254, 26462105, 26081417, 26090572, 26338309, 26713838, 27413500, 28189370, 29073336, 30211054, 31715936, 33326796, 34594816, 35453417, 35082057, 33998777, 32395291, 30717798, 29271830, 27997644, 26815720, 26223107, 25650492, 25236206, 24787766, 24582259, 24480218, 24002601, 23843974, 24005670, 23842678, 23468488, 23430450, 23504897, 23773116, 24221552, 24514836, 24799194, 24984284, 25195080, 25606604, 26154308, 26750526, 27371808, 27801854, 28267148, 28529371, 28985560, 29695301, 30148419, 30909120, 31558490, 32243045, 33131506, 34215861, 35405764, 36906364, 38516507, 40088303, 41974930, 44308612, 47061616, 50178949, 53570587, 56536437, 58907149, 60216418, 61048853, 61182409, 60632258, 59385414, 57236957]
5520E7236957k575018k431162k058912j562121r11884k91152k83623m1523O28106
5511D7709668J221581J551216J921623K362433L078191L737218M357656N225046
5503G1164632N633312N234194L833526K037723P87704m43484j541598l395092
5495H3310917n387380o236344o073428n281563m469195l213768k319745j880228
5487D8449266j362665p31049k56978l20468l8157M57230N31356R07322J452780
5478D9088637J630732J839547J678890J365886R05529K08155k48801m64745j069079
5469E4934751j660214j802115j981934k019139j825766j779515j617562j393386
5461D0855120j223618j076327l25312l34323m82222r7238k2527K37930L71513
$$ y = [57236957, 54661939, 52230777, 50171865, 48609744, 47697860, 47406708, 47123085, 47081562, 47709668, 48931249, 50482465, 52404088, 54766521, 57844712, 61581930, 65939586, 71164632, 76797944, 82032138, 85865664, 87903387, 88691091, 88247607, 86706009, 83310917, 77923537, 71687193, 65613765, 60332202, 55863007, 52649239, 50329494, 48449266, 47086601, 46355552, 46098574, 45778106, 45739949, 46197179, 46728535, 47635857, 49088637, 50719369, 52558916, 54237806, 55603692, 56509221, 56717376, 56468575, 56003830, 54934751, 53274537, 51472422, 49490488, 47471349, 45645583, 43866068, 42248506, 40855120, 39631502, 38555175, 38229863, 37895540, 37413318, 37316080, 37293553, 37531483, 37902996]
5452C7902996L98769K74528J80963j24788j9908l24151j8292P4301K55020L96700
5442C8996138N67919M52024M20199O35680R73122J215987J456222J914485K078622
5433D8710398J937769K543494L194546L247878L617497M794312N986138P589475
5425H1621507Q874203J0162297J0881353Q816486K993823n425788j0043290j0058211
5417I7822380q528111o144492m990506l796148k501625j247908n03865J50093
5409G0259818M58047M20994J47164q06839j620056j986798j579879j269922n98606
5400F3423923r3540O7196n7356J2895L27590R72804J570887K178880K347253J845669
5390G2596201J333088J420547K013316K312377K642877L050979J743428Q44537
$$ y = [37902996, 38301765, 38576293, 38757256, 38632468, 38612560, 38288409, 38270117, 38344418, 38599438, 38996138, 39564057, 40016081, 40436280, 41071960, 42045082, 43261069, 44717291, 46631776, 48710398, 50648167, 53191661, 56386207, 59634085, 63251582, 68045894, 74032032, 81621507, 90495710, 100658007, 111539360, 120355846, 123349669, 117923881, 107880591, 97822380, 89294269, 83149777, 78159271, 74363123, 71861498, 70613590, 70109725, 70259818, 70717865, 71138859, 71286023, 70479184, 68859128, 66872330, 65292451, 64022529, 63423923, 63330383, 63397579, 63340223, 63353118, 63680708, 64653512, 66224399, 68403279, 70750532, 72596201, 73929289, 75349836, 77363152, 79675529, 82318406, 85369385, 87112813, 87957350]
5382H7957350L464j417104k712464l612509l422123k778621j866827q64908k09958
5373G1076300N11971N23707L19562N46644J227551K123220L042517L659628L425582
5364H6456682K779357J316257k93418j360490k649220l758773l571981k943221
5356G5975193k401763j532272j060470j269150j435332j173101q99571m96464
5348F5707070L65286P10676j78306q57093j435745k057042j756355j113321o92364
5339E8692806k43481o07659j409324k354087l211012k599226k235136k046979
5331D3985902j912455j616839j378078j164772j050402j088975r66103r28292
5323C3879986m14312q59328p09755o40396r61554j422610j458194j412940j253173
$$ y = [87957350, 87960814, 86543710, 83831246, 80218737, 76796614, 74017993, 72151166, 71286258, 71076300, 71588271, 72111978, 72431540, 72978184, 74205735, 76328955, 79371472, 83031100, 86456682, 89236039, 90552296, 90258878, 88898388, 86249168, 82490395, 78918414, 75975193, 73573430, 72041158, 70980688, 69711538, 68276206, 67103105, 66203534, 65707070, 66072356, 66783032, 66604726, 65747633, 64311888, 62254846, 60498491, 59385170, 58692806, 58449325, 57841666, 56432342, 54078255, 50867243, 48268017, 46032881, 43985902, 42073447, 40456608, 39078530, 37913758, 36863356, 35774381, 34808278, 33879986, 33465674, 32606346, 31896591, 31256195, 30294641, 28872031, 27413837, 26000897, 24747724]
5314B4747724r41401r96426q35597r58617r94957r35596q83402p84177o99747
5305A6717804n79307m16774n17566m45619o56541o83017n78100n25724m74501
5296A1840655l55444j76124l05242l28199j45105m58765j67011l34996k33327
5287I336442k29153l16670l60640m1631j7534k86168l65290k67000J04781m7444
5277G509693k54057j42085K04151k02428k22368q3454m5003j84809p5702N3926
5267F557864k40404l25170m4090j40934j83149Q4220k47659k60834J90532k13977
5257E176399p2158o947o8219J08894n287k38448K0045L5975l3212J06657k81856
5246D741843k87786k10609M9183l5157J44409J48653j12234j17082j45285j561
$$ y = [24747724, 23806323, 22809897, 21974300, 21015683, 20020726, 19085130, 18201728, 17417551, 16717804, 16138497, 15721723, 15204157, 14758538, 14101997, 13418980, 12840880, 12315156, 11840655, 11485211, 11309087, 11003845, 10675646, 10530541, 10071776, 9904765, 9569769, 9336442, 9107289, 8790619, 8429979, 8388348, 8370814, 8084646, 7719356, 7452356, 7557137, 7509693, 7255636, 7113551, 7317702, 7115274, 6892906, 6809452, 6764449, 6579640, 6503938, 6557864, 6317460, 5992290, 5948200, 5807266, 5624117, 5708337, 5460678, 5199844, 5390376, 5176399, 5104241, 5097294, 5029075, 5137969, 5132682, 4894234, 4914279, 4950254, 4917042, 5023699, 4741843, 4454057, 4243448, 4292631, 4257474, 4401883, 4550536, 4438302, 4321220, 4175935, 4174374]
5236D174374j25321Q472q6285N2205M1302j39606j12920J6993l5981K31108M5682
5225D070023j64998k25754O546J04916P639R287m4224j24469K8996J6177k06952
5214C477187j05042n7229K02619l8277M0895j88892j60262j6537K13832l6707
5204C331587L9926M6678K67938J14259j83280k14366J35258q1181j5927M4574
5194C485466j66367l8700J83240k2139r8789k17689o8768J41284q3004J78783
5184C293317K46325p4489k92587R2222l7652R134K67301J17041j02196j25317
5174C393099j33332M00261k586k37019P373Q3825j32539Q1166j18633K667L3718
5163C378000R9054j0940q6262p8197J75313O3448l42476j10457k33294L63738
$$ y = [4174374, 4049053, 4057525, 3971240, 4023445, 4064747, 3925141, 3812221, 3829214, 3793233, 4024341, 4070023, 3905025, 3679271, 3685817, 3790733, 3798372, 3807659, 3763435, 3638966, 3667962, 3684139, 3477187, 3372145, 3314916, 3517535, 3479258, 3520153, 3331261, 3170999, 3154462, 3368294, 3331587, 3371513, 3418191, 3686129, 3800388, 3617108, 3402742, 3538000, 3456819, 3440892, 3485466, 3319099, 3280399, 3463639, 3441500, 3342711, 3125022, 3056254, 3197538, 3114534, 3293317, 3539642, 3465153, 3172566, 3264788, 3227136, 3236270, 3503571, 3620612, 3518416, 3393099, 3259767, 3660028, 3657442, 3420423, 3427796, 3511621, 3379082, 3460248, 3341615, 3344282, 3378000, 3477054, 3466114, 3379852, 3301655, 3476968, 3540416, 3197940, 3087483, 2854189, 3217927]
5153C217927J50510M9493M1443L0288J47694j31177m2159p6287j06328J28601
5143C410005N2663k7594j24222k8053K9721J42335o1501j06416K4777j57476K6338
5132C180577o7119Q0330P9264r3609J52323O4942k31971O5081P9807q7051K76810
5121C499384l9311k21304K2228Q7907L7874k0615J74042l683j05062j19163R0514
5110C402811J54627j60464n2299J54202J31158k80053k79002o9530J43947Q9783
5100C235180O2728K12940J74268l587l67497L6787J5767K98696Q7440l81712L9795
5089C410805J59010J49113p0395J27711j30298j87304L3339J59891J59466M2998
5079C854336o2150P6171J10288J10303M0903k06728L3081K24123O1674l8138L9774
$$ y = [3217927, 3368437, 3417930, 3459373, 3489661, 3637355, 3506178, 3464019, 3387732, 3281404, 3410005, 3462668, 3435074, 3310852, 3282799, 3312520, 3454855, 3393354, 3286938, 3311715, 3154239, 3180577, 3113458, 3193788, 3273052, 3179443, 3331766, 3396708, 3164737, 3229818, 3309625, 3222574, 3499384, 3460073, 3238769, 3260997, 3348904, 3386778, 3366163, 3540205, 3536522, 3431460, 3312297, 3402811, 3557438, 3396974, 3344675, 3498877, 3630035, 3349982, 3070980, 3001450, 3145397, 3235180, 3297908, 3510848, 3685116, 3681529, 3314032, 3350819, 3366586, 3665282, 3752722, 3371010, 3410805, 3569815, 3718928, 3648533, 3776244, 3645946, 3458642, 3491981, 3651872, 3811338, 3854336, 3792186, 3868357, 3978645, 4088948, 4129851, 3923123, 3956204, 4180327, 4242001, 4203863, 4243637]
5068D243637k77530J03113j9207K18257L5539k26365P4902k02395J74009J8532
5058D142492M1718k60757n419K99997k026k11214L3908J46468k3448K53221j2765
5047D402175m7081r4611J23890R336l02697L291K01086j80988n7302j54556j3602
5036C888941K02237J06607K06927j5880J8467L1943k16924j29095N124K13381
5026D311728L32343n3535k30281K7332K0269m5475j8254M9548J47110j62995n943
5015D371847M6712j39388O8533J40887J97216J61758N6504j46887q7513N3520
5005D723189j429q0976l3577j2524O7451Q8699M2672q0615N3000k05452o5385
4994D495053K55227j16497O9645M9732J86507R7921j48892n7349J41673j18761
$$ y = [4243637, 3966107, 4069220, 4050013, 4268270, 4303809, 4077444, 4152346, 3949951, 4123960, 4142492, 4184210, 3923453, 3918034, 4218031, 4216005, 4004791, 4038699, 4185167, 4161719, 4414940, 4402175, 4355094, 4260483, 4384373, 4393709, 4091012, 4094303, 4295389, 4114401, 4057099, 3902543, 3888941, 4091178, 4197785, 4404712, 4388832, 4407299, 4439242, 4222318, 4093223, 4098347, 4311728, 4644071, 4590536, 4360255, 4387587, 4407856, 4362381, 4344127, 4393675, 4540785, 4377790, 4371847, 4418559, 4279171, 4347704, 4488591, 4685807, 4847565, 4904069, 4757182, 4669669, 4723189, 4721760, 4640784, 4607207, 4594683, 4662134, 4750833, 4793505, 4712890, 4765890, 4560438, 4495053, 4750280, 4633783, 4703428, 4753160, 4939667, 5037588, 4888696, 4831347, 4973020, 4854259]
4984D854259m7139K13995j22349p0177J72471J60288J12331k43084q5699L15661
4974E260557q8009l5956J08881k87612J23545M59808q206k72073R4655M6703K62883
4963E665176k13553P3479J64998K18475O8116N8807o9623Q7794k0750N333M6104
4952F084356j79866K33709O5246k44141j57030J13717J9457J39331o2354K76577
4942F289002j39413k0784K10269J08410P1842o6714n953m2553J77037R1934o6225
4931F606852L2415r779r1663J5721K34085J03491J06789J31601m127j48009K8658
4920G006034J83343K74329K24505L30492K75963j18488p7967j43630k29173j05245
4910G620163k31353L755m4315Q9952q5638j70093K25846J45899r7912r5511J49981
$$ y = [4854259, 4807120, 5021115, 4898766, 4828589, 5001060, 5161348, 5273679, 5030595, 4944896, 5260557, 5172548, 5136592, 5245473, 4957861, 5081406, 5541214, 5533008, 5260935, 5355590, 5402293, 5665176, 5451623, 5525102, 5690100, 5908575, 5976691, 6035498, 5965875, 6053669, 6032919, 6038252, 6084356, 5904490, 6138199, 6203445, 5959304, 5802274, 5915991, 5935448, 6074779, 6012425, 6289002, 6149589, 6128805, 6339074, 6447484, 6519326, 6452612, 6446659, 6404106, 6581143, 6673077, 6606852, 6639267, 6629488, 6537825, 6553546, 6787631, 6891122, 6997911, 7129512, 7125385, 6977376, 7006034, 7189377, 7463706, 7688211, 8018703, 8294666, 8176178, 8098211, 7954581, 7725408, 7620163, 7388810, 7392565, 7348250, 7438202, 7352564, 7182471, 7408317, 7554216, 7456304, 7360793, 7510774]
4899G510774J20922J718K683k70273L25601L8475p3710o598O0368L13095J21856
4888H144911K1326l4066J42228o1057J88612J04454j81935J79849Q3323J26666
4878H714311k4072P6477J86658J14645P7518P835K84850J52355J47149j19223
4868I618503J20202L6496K04502M40144J36584O4264P0233K11826K16682L70151
4858A1489587K41116R2112K28012K47887N3491J03867J12978K65782J47645K58946
4848A3241423M15279J95808L22517J88020L08104M70552K85510K23343K19234
4839A5869790J53259L51782J43621M72856L60360K66706L85428K84299Q1127K42038
4829A8611266N56560N03665K80838L94777M77042M14937L17938K92074P15126
$$ y = [7510774, 7631696, 7633414, 7636097, 7365824, 7691425, 7729900, 7656190, 7649592, 7709960, 8023055, 8144911, 8166237, 8132171, 8274399, 8213342, 8401954, 8506408, 8324473, 8504322, 8587645, 8714311, 8690239, 8766716, 8953374, 9068019, 9145537, 9153372, 9438222, 9590577, 9737726, 9618503, 9738705, 9775201, 9979703, 10419847, 10556431, 10620695, 10690928, 10902754, 11119436, 11489587, 11730703, 11822815, 12050827, 12298714, 12352205, 12456072, 12569050, 12834832, 12982477, 13241423, 13656702, 13852510, 14175027, 14363047, 14671151, 15141703, 15427213, 15650556, 15869790, 16023049, 16374831, 16518452, 16991308, 17351668, 17618374, 18003802, 18288101, 18369228, 18611266, 19167826, 19671491, 19952329, 20347106, 20824148, 21239085, 21557023, 21849097, 22564223]
4820B2564223O61542M70023O60847M65366O86140M52983P99990M98243M38961
4811B7698318R12418Q42701O21591P40949J188751R70989J168050J099483J059472
4802C6302722J606331J462496J229355J597952J262245J171234J178736J129334
4794D6940405J054185J134009J387654J159095Q64522R49310J177222J294057
4786E5960459J324205J751716J824687J925208K336886K516976K951122L112582
4778G3703841L006070L455402L132314K827729K372891K294296J816262J658430
4770I4267235J388055J004066Q30441M41227M34424K60963m7174N9646O25675
4761I9264558M63093R44189J354671J689209K068781K413880K665387L114595
$$ y = [22564223, 23225765, 23695788, 24356635, 24822001, 25508141, 25961124, 26761114, 27259357, 27698318, 28610736, 29453437, 30075028, 30815977, 32004728, 32975717, 34143767, 35243250, 36302722, 37909053, 39371549, 40600904, 42198856, 43461101, 44632335, 45811071, 46940405, 47994590, 49128599, 50516253, 51675348, 52539870, 53489180, 54666402, 55960459, 57284664, 59036380, 60861067, 62786275, 65123161, 67640137, 70591259, 73703841, 76709911, 80165313, 83297627, 86125356, 88498247, 90792543, 92608805, 94267235, 95655290, 96659356, 97489797, 97931024, 98365448, 98626411, 98579237, 98638883, 99264558, 99727651, 100671840, 102026511, 103715720, 105784501, 108198381, 110863768, 113978363]
4753A13978363L584029L502048L714765L756583L541168L417714K733862J976912
4745A40205444J070550K16558n94358j199029j582585k001817j981387j712862
4737A32420514j579090j666861j487836j290647j330924j362004q81297o77889
4729A22143966j78131k61042k17052n2039k55615m26720m95999n33301j203020
4720A18521047j653425k070260k863366l549388l970051m747356n030683m947789
4712H9688729m920242m518272m241297l519699l167445l007352k754875k305627
4704F1253920j973961j262195j052599j037956j013784r67961r13212r08543q05849
4695E1317860j135677j196741j779732j659007j808900j895884j761961j935496
$$ y = [113978363, 117562392, 121064440, 124779205, 128535788, 132076956, 135494670, 138228532, 140205444, 141275994, 141492552, 140898194, 139699165, 138116580, 136114763, 134133376, 132420514, 130841424, 129174563, 127686727, 126396080, 125065156, 123703152, 122821855, 122143966, 121965835, 121704793, 121487741, 121435702, 121180087, 120753367, 120257368, 119724067, 118521047, 116867622, 114797362, 111933996, 108384608, 104414557, 99667201, 94636518, 89688729, 84768487, 80250215, 76008918, 72489219, 69321774, 66314422, 63559547, 61253920, 59279959, 58017764, 56965165, 55927209, 54913425, 53945464, 53032252, 52123709, 51317860, 50182183, 48985442, 47205710, 45546703, 43737803, 41841919, 40079958, 38144462]
4687C8144462j794880j404097j772767j821326j481799j310461j492182j291757
4679B5775193j233249j162025p71669q53586r77303p84351p65450p65632o40443
4670A7821485o60070l24647l82903l95465n28335m09522l43339n82121l49059
4661A3846024k44671k11852k92144m05142l17290m09265k00301m21714k40309
4652A1103336l2308k15309j52626k67459l48071j92421N1483j43602m48674k15679
4642I138670j05059o9943j39780j99714j82321k0206K8993k57227n4738k26514
4632G912161J08368l75625k85521r2765n4515K86362l1784j53027p9769j24985
4622G108900J07245m1217j91178K01312J34041O9014k561j45414J14110j04066
$$ y = [38144462, 36349582, 34945485, 33172718, 31351392, 29869593, 28559132, 27066950, 25775193, 24541944, 23379919, 22608250, 21754664, 20777361, 19993010, 19227560, 18461928, 17821485, 17161415, 16836768, 16453865, 16058400, 15530065, 15120543, 14777204, 14195083, 13846024, 13601353, 13389501, 13097357, 12692215, 12374925, 11965660, 11765359, 11343645, 11103336, 11071028, 10855719, 10703093, 10435634, 10087563, 9895142, 9946625, 9803023, 9354349, 9138670, 9033611, 8963668, 8823888, 8624174, 8441853, 8421647, 8450640, 8193413, 8138675, 7912161, 8020529, 7644904, 7359383, 7266618, 7212103, 7498465, 7466681, 7313654, 7233885, 7108900, 7216145, 7174928, 6983750, 7185062, 7319103, 7388117, 7385556, 7240142, 7354252, 7250186]
4612G250186l04754j65564j04040O8283j39864q4695Q3084j22488N0692q696o404
4601F515740L69208o0783k48779q9952L16549j98299O4672k7398p1607K44480
4591F813831J07514K5695O0750j98492l74398j50641J47679p3282j40263k62219
4581E956174J33L1465k42569J1337j3460R3551p3468n9545q3196K08234q4369
4570E744287J44926J6941n0463p6164k04978j02581k17959J52877J24606k26830
4560E304662j10781J6997J06226j58970k44401k52538K02209J26092j05051j22979
4550D761466o5419j77882m3175L38580j1726q9083k04552k4728j21929O6503L3923
4539D461978j42271J6923m1006r3606J9308K2490j10832O5872J36186J66553J20231
$$ y = [7250186, 6945432, 6779868, 6675828, 6744111, 6604247, 6519552, 6602636, 6480148, 6530840, 6522144, 6515740, 6884948, 6824165, 6575386, 6485434, 6801983, 6603684, 6668356, 6640958, 6569351, 6813831, 6921345, 6947040, 7007790, 6809298, 6434900, 6284259, 6431938, 6358656, 6218393, 5956174, 5956307, 5987772, 5745203, 5756540, 5743080, 5836631, 5763163, 5703618, 5620422, 5828656, 5744287, 5889213, 5906154, 5855691, 5779527, 5574549, 5471968, 5254009, 5406886, 5531492, 5304662, 5193881, 5210878, 5317104, 5158134, 4913733, 4661195, 4863404, 4989496, 4884445, 4761466, 4696047, 4518165, 4474990, 4813570, 4801844, 4712761, 4508209, 4483481, 4361552, 4428055, 4461978, 4319707, 4336630, 4295624, 4202018, 4221326, 4243816, 4132984, 4198856, 4335042, 4501595, 4621826]
4528D621826k02113j20753J06390R3611n7071m1861p2444O8216m8819p0174k03322
4517D073486K57493L35367j6355j75138J21863J38756j97747k26073o1757K49584
4507D499479k3317J80565O5887N2841o5516K1314J87813J03097j41837o4269M1613
4496D857670j87964L803P0296J91194j99861J581J41992K88129r6783k28426L2127
4485D873758Q2138K41029m9231J56634j18192K25242j10678m4029m648K5115J69702
4474E446840j81728j28525P8092m0105m165J42595k09513m8458J43689R2911j94769
4463E096864K06692j3838N0486l6288N7189L067J23147o7689m7892R9538J17546
4452E588822p4215O3412p1289k74821K01920n9287J34881j75341j03022j05771
$$ y = [4621826, 4419713, 4298960, 4405350, 4498961, 4441890, 4400029, 4327585, 4395801, 4346982, 4276808, 4073486, 4330979, 4666346, 4649991, 4474853, 4596716, 4735472, 4537725, 4311652, 4249895, 4499479, 4476162, 4656727, 4722614, 4775455, 4709939, 4731253, 4919066, 5022163, 4880326, 4816057, 4857670, 4669706, 4673509, 4743805, 4934999, 4735138, 4736719, 4878711, 5166840, 5070057, 4841631, 4873758, 4955896, 5196925, 5147694, 5304328, 5186136, 5411378, 5300700, 5256671, 5252023, 5277138, 5446840, 5265112, 5136587, 5214679, 5174574, 5170409, 5313004, 5103491, 5055033, 5198722, 5291633, 5096864, 5303556, 5289718, 5340204, 5303916, 5361105, 5364172, 5487319, 5419630, 5371738, 5471276, 5588822, 5514607, 5578019, 5506730, 5231909, 5433829, 5374542, 5509423, 5334082, 5231060, 5125289]
4442E125289p2316Q4304J03023Q7346r9469j42212k796n3829j51948q866M9282
4431D917808Q5618n4008l4328J60842L6486l8183K10998J23062l68318q126J06199
4420E138050J72681R079K93548J00382J89423K90295J67563j73638k06719k85647
4410E695017m57781k22657p7006j7520m2764M2642n4032n2294j78977r2555P470
4399D549543j27978K3651J88676o2791q465o7925j31824o1742J68447k30585m6398
4388D192609m2934j40920J68197R6180q4180J9106k30558J04717K53559J5622
4378D351398J5967j48933o4695n0643J65461J21283Q7882L304r167o6014J2299
4367D418142j4272O6593l44719J87202p7399J53035N1692j76371K2463J18242
$$ y = [5125289, 5052973, 5137277, 5240300, 5327646, 5228177, 5085965, 5083169, 5029340, 4877392, 4868526, 4917808, 5003426, 4949418, 4915090, 5075932, 5112418, 5074235, 5285233, 5408295, 5039977, 5031851, 5138050, 5310731, 5319810, 5613358, 5713740, 5903163, 6193458, 6361021, 6187383, 5980664, 5695017, 5237236, 5014579, 4937573, 4920053, 4877289, 4919931, 4865899, 4813605, 4634628, 4542073, 4549543, 4421565, 4445216, 4633892, 4571101, 4562636, 4494711, 4362887, 4301145, 4469592, 4239007, 4192609, 4149675, 4008755, 4176952, 4273132, 4188952, 4208058, 3977500, 4082217, 4335776, 4351398, 4367365, 4218432, 4153737, 4103094, 4268555, 4389838, 4477720, 4481024, 4471857, 4405843, 4418142, 4403870, 4470463, 4125744, 4312946, 4235547, 4388582, 4440274, 4263903, 4286366, 4404608]
4357D404608J83295n432o6077j75291K40464J00185j92851O9882J79571M8694
4347D787048L6570J5763q9902M0752P7525n2204n4309k20053J02644j32788L114
4336D514160J58698Q2787k52762J74767O4309J26076M6644J51871k14527k80945
4326D571078P1060K57522K37816l45459q7608J17651K53241k986k79840N6358
4316D848833k5388J12490J9790n6474k2964K83406K00549k19199j46228N971j7185
4305D983601n556L1034Q822R7644r3465j69435Q0149K5148M1655J37045J8064
4294E154706k33413L4632L532K58832j64847j30693K34300J89326k0014j09400
4284E216961N4412j48563m026J84044L098M0010K36324p7478l03347j15310L01575
$$ y = [4404608, 4587903, 4582471, 4516394, 4341103, 4581567, 4681752, 4488901, 4558783, 4738354, 4787048, 4823618, 4839381, 4749479, 4790231, 4867756, 4815552, 4761243, 4541190, 4643834, 4511046, 4514160, 4672858, 4755645, 4502883, 4677650, 4741959, 4868035, 4914679, 5066550, 4852023, 4571078, 4642138, 4899660, 5137476, 4792017, 4704409, 4822060, 5075301, 5072315, 4792475, 4848833, 4823445, 4935935, 4955725, 4899251, 4876287, 5159693, 5360242, 5141043, 4994815, 5000786, 4983601, 4978045, 5009079, 5017901, 5115545, 5022080, 4852645, 4932794, 4957942, 4999597, 5136642, 5154706, 4921293, 4955925, 4959457, 5218289, 5053442, 4922749, 5157049, 5346375, 5326361, 5216961, 5271373, 5122810, 5118784, 5302828, 5305926, 5345936, 5582260, 5504782, 5201435, 5086125, 5387700]
4273E387700j13258J52124K3280j99863O6633M9980Q2468J6665j57650J02741
4263E410820o6638l1629J72467q8031L4043J43762k82577P7220J38831j19565
4253E388703J37503J61591O4389J37894j15288j89028j0601J35121r0305J52905
4243E772884J41239J35825O9013j55259J45181K44247o4154J4604J24050O9824
4233F497454j30841R4027R3871P6865p9465r3537J56498J11367J40791J43062
4223G010092j83547k59287Q6004K85361N0330j04300J5440M8215J39496Q0675
4213G168479N7744K25900p6605J10751Q2857J62849j280j26706K30613J95517
4203H030119n507j23482P2179J07259J7276k487J34067J93679k03554J51211J14448
$$ y = [5387700, 5274442, 5426566, 5449846, 5249983, 5316616, 5366596, 5449064, 5465729, 5308079, 5410820, 5344182, 5312553, 5485020, 5396989, 5431032, 5574794, 5292217, 5369437, 5508268, 5388703, 5526206, 5687797, 5752186, 5890080, 5774792, 5585764, 5575163, 5710284, 5619979, 5772884, 5914123, 6049948, 6118961, 5963702, 6108883, 6353130, 6288976, 6303580, 6427630, 6497454, 6366613, 6460640, 6554511, 6631376, 6551911, 6458374, 6614872, 6726239, 6867030, 7010092, 6826545, 6567258, 6653262, 6938623, 6988953, 6884653, 6900093, 6948308, 7087804, 7168479, 7226223, 7452123, 7375518, 7486269, 7569126, 7731975, 7730695, 7603989, 7834602, 8030119, 8024612, 7901130, 7973309, 8080568, 8097844, 8095357, 8229424, 8423103, 8219549, 8370760, 8485208]
4192H485208j0008J97386q9795J62518j12952J30229J74921K88605k27103M6175
4182I045184K89776N6420J76108J43302J59164m4994j699K26004J51794N0183
4172A0251242Q0483L34100M5003K22204Q7351o0290K54004J21306J2123R776K83719
4161A1641021L70099Q3831J27902J22111K31929K17212J46131K02678J07151L30179
4151A3580244L15983J81559L33864L95492L58186L06262L30446M15973K23415
4142A6441424J41301M11632L67872K95463M90830L20272L47435O50014L88411
4133A9854654L59815M12742M38457O29422P14954N78799L23141M42180M48279
4124B4202443P91687N69521R85305N91760N46070Q16618Q25474Q40466O10906
$$ y = [8485208, 8475200, 8672586, 8582791, 8745309, 8632357, 8762586, 8937507, 9226112, 8999009, 9045184, 9334960, 9391380, 9567488, 9710790, 9869954, 9824960, 9823261, 10049265, 10201059, 10251242, 10331725, 10665825, 10710828, 10933032, 11020383, 10960093, 11214097, 11335403, 11347526, 11357302, 11641021, 12011120, 12094951, 12222853, 12344964, 12576893, 12794105, 12940236, 13142914, 13250065, 13580244, 13896227, 14077786, 14411650, 14807142, 15165328, 15471590, 15802036, 16218009, 16441424, 16582725, 16994357, 17362229, 17657692, 18148522, 18468794, 18816229, 19466243, 19854654, 20214469, 20627211, 21065668, 21695090, 22410044, 22988843, 23311984, 23754164, 24202443, 24994130, 25563651, 26548956, 27140716, 27686786, 28503404, 29328878, 30169344, 30780250]
4115C0780250Q92744M14340P42638P14905P49752P80620O95276O23777N57591
4106C6951893O00458P25423O62925Q25394R19352P17091P06419P84279Q03743
4097D3696977Q71045J223123J160829Q75006J275750R32827Q76022Q36595J118037
4088E2866211J053999P45498J102756J197534R89432Q68954J321779J089226J113104
4079F2348493J211353J209048J134767J060944J211613Q27601R11584J236149
4071G1151552J540393J406157J297637J544955J645787J712171J724874J668886
4063H3692412J566513J468605J272864J310848J071661J372209J440003J545337
4055I4740452J136595J639923J537070J657127J465963J332596J396336J551110
$$ y = [30780250, 31672994, 32087334, 32829972, 33544877, 34294629, 35075249, 35770525, 36394302, 36951893, 37552351, 38277774, 38940699, 39766093, 40685445, 41402536, 42108955, 42893234, 43696977, 44568022, 45791145, 46951974, 47826980, 49102730, 50035557, 50911579, 51748174, 52866211, 53920210, 54665708, 55768464, 56965998, 57955430, 58824384, 60146163, 61235389, 62348493, 63559846, 64768894, 65903661, 66964605, 68176218, 69003819, 69915403, 71151552, 72691945, 74098102, 75395739, 76940694, 78586481, 80298652, 82023526, 83692412, 85258925, 86727530, 88000394, 89311242, 90382903, 91755112, 93195115, 94740452, 95877047, 97516970, 99054040, 100711167, 102177130, 103509726, 104906062, 106457172]
4047A06457172K083373J468211J504113J471216J171630J286363J168310J013033
4039A17623421O23681O06123O84071L25989K27035J7049l13364p93265n92024
4030A18408716m57828q49365q06167q28943q95852p06483q12924j248211q94189
4021A10908754q08793j345737r64782j093368j112099j094190j048451j165410
4013A02275924j519128j441856j616540j892250k051893k183420k241187k401481
4005H6928169k271767k266996k443751k139219j341968j716991j570704j143201
3997G2033572j186426j117356j284381j326640j404112j281765j119824j196410
3989F2116658j151623j010802j211431r14732r95557q85051j141411j024398j056938
$$ y = [106457172, 108540545, 110008756, 111512869, 112984085, 114155715, 115442078, 116610388, 117623421, 118247102, 118853225, 119537296, 119863285, 120090320, 120107369, 119794005, 119000740, 118408716, 117950888, 117101523, 116295356, 115466413, 114570561, 113864078, 113051154, 111802943, 110908754, 110099961, 108754224, 107789442, 106696074, 105583975, 104489785, 103441334, 102275924, 100756796, 99314940, 97698400, 95806150, 93754257, 91570837, 89329650, 86928169, 84656402, 82389406, 79945655, 77806436, 76464468, 74747477, 73176773, 72033572, 70847146, 69729790, 68445409, 67118769, 65714657, 64432892, 63313068, 62116658, 60965035, 59954233, 58742802, 57828070, 56832513, 55947462, 54806051, 53781653, 52724715]
3980E2724715j196779j197253j225807j149067r65283r30623r18451j161507q61595
3971D3118350q73743o76243q87814q81817r62552j165146r27777q92641p30520
3962C5120097r81799n66812p43459q06230r20283o41111m79171p45348n17538
3953B8718346p62172o37860o42404l15125j25341o56882n97421n33000m41014
3944B4007127o89570k42909n55073m69984m32402j91427n59261m62289m07409
3935A9996803k47604j06156m73163k93648k20645m65529p23640k22161p3174l32170
3925A6838913j37985k22311j98627k98166l65080m6338k60611j56199k28535M1649
3915A4966710k7341k82624j43137j97380j07585K11642r1907l21347n3400m6170
$$ y = [52724715, 51527936, 50330683, 49104876, 47955809, 46990526, 46059903, 45141452, 43979945, 43118350, 42244607, 41568364, 40680550, 39798733, 38836181, 37671035, 36743258, 35850617, 35120097, 34138298, 33571486, 32828027, 32021797, 31101514, 30460403, 29981232, 29235884, 28718346, 27956174, 27318314, 26675910, 26360785, 26235444, 25578562, 24981141, 24448141, 24007127, 23317557, 23074648, 22519575, 22049591, 21617189, 21425762, 20866501, 20404212, 19996803, 19749199, 19643043, 19169880, 18876232, 18655587, 18190058, 17466418, 17244257, 17171083, 16838913, 16700928, 16478617, 16279990, 15981824, 15616744, 15570406, 15309795, 15153596, 14925061, 14966710, 14939369, 14656745, 14513608, 14316228, 14208643, 14420285, 14328378, 14007031, 13953631, 13907461]
3905A3907461k07509k61612k90684N6603r1371l2425j43934k63350k74516l849
3895A2394814j63730n2559J22347n5600j04175j07308L8353k70955q7047j00110
3885A1614030J32015r3112l0488J37949j58952o4388o8759k07772J71875o7930
3875A1364468q6755M5677O4584l07896o0551N9682L2447k58942k05226O0790P5069
3864A0783347j07193o3563O3184o0233J37109k4255L7650P2440l0755k26985J0882
3853A0591628J28942k40370P2383K15889l22122p9609O7740K6889K24153N2952
3843A0738475j79429j52851P6825L08164k01395l980r72j02187P5106M38239M0016
3832A1036011j08561o8672K93881J06688j15199j20566k6732K54023j99806J53846
$$ y = [13907461, 13699952, 13438340, 13147656, 13204259, 13112888, 13080463, 12936529, 12673179, 12398663, 12394814, 12231084, 12178525, 12300872, 12245272, 12141097, 12033789, 12072142, 11801187, 11714140, 11614030, 11746045, 11652933, 11622445, 11760394, 11601442, 11537054, 11468295, 11260523, 11432398, 11364468, 11277713, 11323390, 11387974, 11080078, 11019527, 11079209, 11111656, 10852714, 10647488, 10708278, 10783347, 10676154, 10612591, 10675775, 10615542, 10752651, 10728396, 10766046, 10838486, 10807731, 10580746, 10591628, 10720570, 10480200, 10552583, 10768472, 10446350, 10366741, 10434481, 10461370, 10685523, 10738475, 10559046, 10406195, 10483020, 10791184, 10589789, 10585809, 10584837, 10482650, 10557756, 10995995, 11036011, 10927450, 10858778, 11152659, 11259347, 11144148, 11023582, 10996850, 11250873, 11051067, 11204913]
3822A1204913K58096O0631J35706M332R7206J37567j90214K2313K73755N8449
3812A2062754J97348L55724j457J46277M22045J8727Q5751J76067L22038K19317
3802A4004591J26261K12608M94013K88572O83775O34254N95654Q36148J021767
3793A8897643J343532J715124K188085K845870L493757L290118K324873l75299
3785C5723703l009929m024524l600539k652969j966309j550913j262697r86580
3777A6669243p19654m23243l94827p13695j28325q0655j61251k98983l20527j52743
3767A3275340n5804k8087j75854l3116j55138k15071j61419r9939L8578K02744
3757A2592234j25318j26387m6302J679J0133m8394J4155o1130P5189j32371l178
$$ y = [11204913, 11463009, 11523640, 11659346, 11663678, 11760884, 11898451, 11708237, 11730550, 12004305, 12062754, 12260102, 12615826, 12614369, 12760646, 13182691, 13201418, 13287169, 13463236, 13785274, 14004591, 14130852, 14343460, 14837473, 15126045, 15809820, 16444074, 17039728, 17875876, 18897643, 20241175, 21956299, 24144384, 26990254, 30484011, 33774129, 36099002, 35723703, 32713774, 28689250, 25088711, 22435742, 20469433, 18918520, 17655823, 16669243, 15949589, 15526346, 15131519, 14417824, 14289499, 14208844, 14047593, 13748610, 13428083, 13275340, 13219536, 13191449, 13015595, 12982479, 12827341, 12612270, 12450851, 12350912, 12389490, 12592234, 12466916, 12340529, 12294227, 12295906, 12306039, 12257645, 12271800, 12210670, 12285859, 12153488, 12150310]
3746A2150310N2737J54920k29758j13858j7141k41588j88586P9137K94880M9161
3736A1990214l32228K6809L41639N0294k47088n0885j6996k5758K20581J71042
3726A2127624l2043j63354K69969L51308n4235Q9590k7669k4553J24932M0558
3716A2702127r3571n6889K94758R5426M6044p2536m4583J08287R7334Q4546k419
3705A3158524J4617j9889J25209n9781k1407J28507J76589K18055K57701K58500
3695A4236625J23294K2766m1007K53676J40494L02444R8364K7185J83265k0770
3685A5326336J61481Q0470j35562J16467J73516J35118K32068J78881N14374M30764
3675A7213913M48398L16414M74726O33183O76298P52389J301055J643150J779667
$$ y = [12150310, 12203047, 12357967, 12128209, 12014351, 11997210, 11755622, 11567036, 11646173, 11941053, 11990214, 11657986, 11684795, 12026434, 12076728, 11829640, 11778755, 11761759, 11736001, 11956582, 12127624, 12095581, 11932227, 12202196, 12553504, 12499269, 12588859, 12561190, 12536637, 12661569, 12702127, 12608556, 12551667, 12846425, 12941851, 12987895, 12915359, 12870776, 12979063, 13076397, 13160943, 13158524, 13173141, 13153252, 13278461, 13218680, 13197273, 13325780, 13502369, 13720424, 13978125, 14236625, 14359919, 14382685, 14341678, 14595354, 14735848, 15038292, 15136656, 15163841, 15347106, 15326336, 15487817, 15568287, 15432725, 15549192, 15722708, 15857826, 16089894, 16268775, 16783149, 17213913, 17662311, 17978725, 18453451, 19086634, 19762932, 20515321, 21816376, 23459526, 25239193]
3666B5239193K569007K906809K866651J152696j636353l196404l130626k249856
3658B4521117j431887r26265o14936n31640m04040k17511O8206m5726q9947j75451
3648B0151920j5865J71946k6189K02837J63424M6622J06163J78696L93253J28684
3638B1501491K98901P3127J57302J90447M30058L18815L51157L83395M06736L67246
3628B4478675M48124L97144L15653P14014L85338M18515N37385L55681M34576
3619B8485105L32138K68888N06462N93599N78252M87223N48982P46335M86994
3610C3033978M52374O87489N20656N98973M20172P80722P77505R37332O87074
3601C8896275Q70972J136098Q61346R75899R18437O68451P37403R52420Q37566
$$ y = [25239193, 27808200, 30715009, 33581660, 34734356, 33098003, 29901599, 26770973, 24521117, 23089230, 22162965, 21548029, 21016389, 20612349, 20394838, 20463044, 20417318, 20327371, 20151920, 20136055, 20308001, 20281812, 20484649, 20648073, 20694695, 20800858, 20979554, 21372807, 21501491, 21800392, 21873519, 22030821, 22221268, 22651326, 22970141, 23321298, 23704693, 24111429, 24478675, 24926799, 25323943, 25639596, 26353610, 26738948, 27157463, 27694848, 28050529, 28485105, 28817243, 29086131, 29592593, 30186192, 30764444, 31251667, 31800649, 32546984, 33033978, 33486352, 34173841, 34694497, 35293470, 35713642, 36494364, 37271869, 38209201, 38896275, 39767247, 40903345, 41764691, 42740590, 43659027, 44327478, 45064881, 46017301, 46854867]
3592D6854867P61145O01796O88957N91091O17509N00160N76600Q58136O59927
3583E2710188M45391Q23666O66044J077724R38098Q74617J119838J414914J568487
3574F1638967J433658J684444J721991J971147J955655K161367K079495J986203
3566G6632927J659858J774499J920955K125002J897849J804212K126469J793347
3558I1735118J746901J976963J827464J697844J620840J758544K046432K060940
3550A06471046K045356K479272K205191K883891L309267L097225L178759L420109
3542A29090116L647600L692228L333578L230257L092371L245352L652978L898053
3534A56882533M195758N016866N733402O508619P725547Q641978R901702J1085581
$$ y = [46854867, 47616012, 48217808, 48906765, 49497856, 50115365, 50615525, 51192125, 52050261, 52710188, 53155579, 53979245, 54645289, 55723013, 56661111, 57535728, 58655566, 60070480, 61638967, 63072625, 64757069, 66479060, 68450207, 70405862, 72567229, 74646724, 76632927, 78292785, 80067284, 81988239, 84113241, 86011090, 87815302, 89941771, 91735118, 93482019, 95458982, 97286446, 98984290, 100605130, 102363674, 104410106, 106471046, 108516402, 110995674, 113200865, 116084756, 119394023, 122491248, 125670007, 129090116, 132737716, 136429944, 139763522, 142993779, 146086150, 149331502, 152984480, 156882533, 161078291, 166095157, 171828559, 178337178, 186062725, 194704703, 204606405, 215691986]
3526B15691986J2284507J3043492J3122112J2520235J1996889J1268903R785597
3519B99713721P212401M226438J249060j199037k903174m580088n581681o130519
3511B92007121o605784o740275p750791r101927j0827868j1717180j2024893j2103373
3503B15135030j1102399j0409464r973618q907132q266618q039562p562821o915357
3495A43958059o472897n639208n667650n216451m910722m370865l911217l679443
3487A04089606l361728l118501k973462k654474k424860k470395k117222k324813
3479H2644151k308298k084176k014888k003375k206048k553577k202281j834319
3471F5437189j995152j823201j683439j617072j406683j483814j762170j234338
$$ y = [215691986, 227976493, 241019985, 254142097, 266662332, 278659221, 289928124, 299713721, 306926122, 311152560, 312401620, 311202583, 308299409, 303719321, 298137640, 292007121, 285401337, 278661062, 270910271, 261808344, 250980476, 239263296, 227238403, 215135030, 204032631, 193623167, 183649549, 174742417, 166475799, 158436237, 150873416, 143958059, 137485162, 131845954, 126178304, 120961853, 116051131, 111680266, 107769049, 104089606, 100727878, 97609377, 94635915, 91981441, 89556581, 87086186, 84968964, 82644151, 80335853, 78251677, 76236789, 74233414, 72027366, 69473789, 67271508, 65437189, 63442037, 61618836, 59935397, 58318325, 56911642, 55427828, 53665658, 52431320]
3463E2431320j016973j375467j362894p76692j152095j438181n55709o34451p58672
3454D3360186o75737q30711p99379p69389p30475j044170j096165o50169q49554
3445C5914437r58121r13347o61877n25335n47734n63722m98126p08374l50772
3436C0187029l13646m26503m46558k16131n17212m65114n56883l54572k38941
3427B6651469l11716l62195m00773l08767j38357j86408j91913o4456k74782k61135
3417B4150967m25667k49269q776l23014k35290n43498k73840N9773k83644k14042
3407B1653700j26553k62059l28327k23277O6986j39103k62266j04038j69572j18519
3397A9986972l71450o1954n4962N8728l14604k00006k57093j62518r8281k21397
$$ y = [52431320, 51414347, 50038880, 48675986, 47899294, 46747199, 45309018, 44753309, 44118858, 43360186, 42684449, 41853738, 41054359, 40284970, 39554495, 38510325, 37414160, 36763991, 35914437, 34956316, 34042969, 33381092, 32855757, 32308023, 31744301, 31246175, 30537801, 30187029, 29873383, 29446880, 29000322, 28784191, 28266979, 27801865, 27244982, 26890410, 26651469, 26339753, 25977558, 25576785, 25268018, 25129661, 24943253, 24751340, 24686884, 24412102, 24150967, 23725300, 23476031, 23467255, 23144241, 22908951, 22365453, 22091613, 22151386, 21867742, 21653700, 21527147, 21265088, 20936761, 20713484, 20780470, 20641367, 20379101, 20275063, 20105491, 19986972, 19615522, 19553568, 19498606, 19557334, 19242730, 19042724, 18785631, 18623113, 18524832, 18303435]
3387A8303435P8416L0426P9728l28921j16822p6216n4130j40730j67880o6584
3377A7540722l37210p4130J10335o5324L5719j82171l1188k68539j26539j27516
3367A6474159r8302K69631j49900J55896j60337q8895R8966k96197l57300J58276
3357A6005997O2177p229J4158l5061k20546O1986j6365o6744J91512j91505k96707
3346A5501673j00391l2395K1278j58970l8369m96634j13979K65101r3592j9695
3336A4734027R8634j70829k62178l8902J438j19186j10299M1881L2989Q0821J6257
3325A4304653o2815M9360R7080P6082k39272j45375J96405J3257N4107k674k19086
3314A4121722n2245L18847j61019o576l3440J316J41295k2878J80370j66919Q02
$$ y = [18303435, 18381851, 18412277, 18492005, 18163084, 18046262, 17970046, 17915916, 17775186, 17607306, 17540722, 17203512, 17129382, 17239717, 17174393, 17210112, 17027941, 16996753, 16728214, 16601675, 16474159, 16375857, 16645488, 16495588, 16651484, 16491147, 16402252, 16501218, 16205021, 15847721, 16005997, 16068174, 16060945, 16075103, 16040042, 15819496, 15881482, 15865117, 15798373, 15989885, 15798380, 15501673, 15401282, 15368887, 15390165, 15231195, 15192826, 14696192, 14582213, 14847314, 14753722, 14734027, 14832661, 14661832, 14399654, 14360752, 14362190, 14243004, 14132705, 14174586, 14207575, 14288396, 14304653, 14241838, 14291198, 14388278, 14464360, 14225088, 14079713, 14276118, 14289375, 14343482, 14340808, 14121722, 14069477, 14388324, 14227305, 14220729, 14187289, 14188605, 14329900, 14307022, 14487392, 14320473, 14321275]
3303A4321275p4946j16765L1098k9501J12880M9164O593K08630k4201J99203K495
3292A4685925J5646K99906J40373k08543M817K85517K69318L40998r5122K30618
3282A5969453M42937K25605O2070J6243J39362K76283k4184K22926P4575K69391
3272A7674661K88045M35439J82506L19609K68568J52853M80966O74606K94863
3263B0772116L64523L28844N52089M24310k2917K08754K21558J77433K81212K10947
3253B3518869K35272M56786M55121M33391L66723N01223K11511N77569M53021
3244B7209486N73002O86645K19532M25894N85344N21324P53368N69877P76727
3235C2321199P28182N86789J034437P30756P21768N56045M03093N91633R10880
$$ y = [14321275, 14246329, 14129564, 14160662, 14131161, 14244041, 14293205, 14299798, 14508428, 14484227, 14683430, 14685925, 14701571, 15001477, 15141850, 14933307, 14938124, 15223641, 15492959, 15833957, 15738835, 15969453, 16412390, 16637995, 16700065, 16716308, 16855670, 17131953, 17107769, 17330695, 17405270, 17674661, 17962706, 18398145, 18580651, 18900260, 19168828, 19321681, 19802647, 20477253, 20772116, 21136639, 21465483, 22017572, 22441882, 22418965, 22627719, 22849277, 23026710, 23307922, 23518869, 23754141, 24210927, 24666048, 25099439, 25466162, 25967385, 26178896, 26756465, 27209486, 27782488, 28469133, 28688665, 29114559, 29699903, 30221227, 30974595, 31544472, 32321199, 33049381, 33636170, 34670607, 35401363, 36123131, 36679176, 37082269, 37673902, 38584782]
3226C8584782P70563Q61772J234390R74246J023581J367892J437558J381884J630438
3217D9267106J802780J846406K108222K512463K525718K502238K611131K999290
3209F8175354L143372L617249M077873M461696M518464M766899M857354M511326
3201A02129587L844097L086362J764307M46271R3205l15906j82238j32214k9151
3192A10704320L33076M58979N84792L84013L67222P84610P22452J345730K127780
3183A17812974K197581K845858L319357L887128M839060N621552P313161R388318
3175A57224989J1263546J3745940J5973687J5214504Q258101m433017j4899473
3168B02348277j7750202j7108997j4636272j1779888r622036p538116n679948
$$ y = [38584782, 39355345, 40217117, 41451507, 42425753, 43449334, 44817226, 46254784, 47636668, 49267106, 51069886, 52916292, 55024514, 57536977, 60062695, 62564933, 65176064, 68175354, 71318726, 74935975, 79013848, 83475544, 87994008, 92760907, 97618261, 102129587, 105973684, 109060046, 110824353, 111270624, 111363829, 111047923, 110865685, 110733471, 110704320, 111037396, 111496375, 112081167, 112465180, 112832402, 113617012, 114339464, 115685194, 117812974, 120010555, 122856413, 126175770, 130062898, 134901958, 140523510, 147836671, 157224989, 168488535, 182234475, 198208162, 213422666, 221680767, 217247750, 202348277, 184598075, 167489078, 152852806, 141072918, 131450882, 123912766, 118232818]
3161A18232818m321494l214870k677271k537570j877820j196457r88683m66542
3153A00952111M4530M99868J037387J201295J535387J334986J782463K317878
3145A10705905K185036J890181J336534K20896n91908k016266l967091n331097
3137A04432190n741835o555135o314650n154148m576363m351341l519621k665572
3129F5553525k355469j709135j650503j542627j383357j286937j531539j406107
3121E2687851j124343j256700j585092j627843j312497j548861j797059j817459
3113D0617997j904127j650083j972353j397405j382887j398323j346248j240815
3105B8325756j074932r05687q39421r05819q57594p82085n16666m61579n19871
$$ y = [118232818, 113911324, 110696454, 108019183, 105481613, 103603793, 102407336, 101418653, 100952111, 100996641, 101496509, 102533896, 103735191, 105270578, 106605564, 108388027, 110705905, 112890941, 114781122, 116117656, 116338552, 115746644, 113730378, 109763287, 104432190, 98690355, 92135220, 85820570, 80666422, 76090059, 71738718, 68219097, 65553525, 63198056, 61488921, 59838418, 58295791, 56912434, 55625497, 54093958, 52687851, 51563508, 50306808, 48721716, 47093873, 45781376, 44232515, 42435456, 40617997, 38713870, 37063787, 35091434, 33694029, 32311142, 30912819, 29566571, 28325756, 27250824, 26345137, 25505716, 24599897, 23742303, 22960218, 22443552, 21981973, 21462102]
3096B1462102n35430l81558m98874l84294q13222o51302n56197n12690l85866
3087A6742669l74829m67751n98794m51199m51705j54501k32448m01539l32516
3078A3277387k27657l3502o11848m53522j54104l38365l56176j27490k45970m28788
3068A0299965j77651j0803j76059j4955l14873k24633j10398j34181j01208o5001
3058H970203j81735j69080j30760j67312j83334r9639j06146k35629k51721m0726
3048G404121J33346k60573j33462l74137k50853l09603k21258J64047j9046k26320
3038E906262J3950k62848Q9082r9309j19607r1052K4654j6532o2820M6015q2779
3027E345016o8266k27775N2532q8014m6627L847j95869j23718L7094j47572j38602
$$ y = [21462102, 20926672, 20545114, 20046240, 19661946, 18848724, 18197422, 17641225, 17128535, 16742669, 16367840, 15900089, 15301295, 14850096, 14398391, 14243890, 14011442, 13609903, 13277387, 13049730, 13016228, 12404380, 11950858, 11796754, 11458389, 11102213, 10974723, 10728753, 10299965, 10122314, 10111511, 9935452, 9920497, 9605624, 9380991, 9270593, 9136412, 9035204, 8970203, 8788468, 8619388, 8488628, 8321316, 8137982, 8038343, 7932197, 7696568, 7444847, 7404121, 7537467, 7276894, 7143432, 6769295, 6518442, 6208839, 5987581, 6151628, 6132582, 5906262, 5920212, 5657364, 5746446, 5647137, 5527530, 5436478, 5461132, 5444600, 5381780, 5427795, 5345016, 5276750, 5048975, 5101507, 5013493, 4966866, 4970713, 4774844, 4651126, 4688220, 4540648, 4402046]
3016D402046j47725k28220l1710J2294j39069n3641j27524l23074K55496P6528
3006C695401j9290j82031j07517J36693j88575K6215k29933p589J22711l6715
2996C209370j42744o5231o0832K9231k12727r5218p2150R5087j72586j9070L05215
2985B798345j02619r3101k2548O1020j08941k6615k34404M0531K93248j53162
2975B451754r7455K0726j28558r15q0345R8019j04590l33579J9388Q0608J29814
2964B054867O4911k21936j4082N0043p661j20271J44117J26814j32382n9037m4823
2953A840560J5970Q1956k45075J47449P9935k94074J29158Q4852K778N8513o9517
2942A832505p5633k3324p15M9115l11450L5175K22800j2853k87853n3531K93859
$$ y = [4402046, 4254321, 4026101, 3994391, 4006685, 3867616, 3813975, 3686451, 3363377, 3618873, 3695401, 3676111, 3494080, 3386563, 3523256, 3334681, 3360896, 3130963, 3123374, 3246085, 3209370, 3066626, 3001395, 2940563, 2969794, 2757067, 2661849, 2589699, 2684786, 2512200, 2493130, 2798345, 2695726, 2602625, 2580077, 2641097, 2532156, 2505541, 2271137, 2311668, 2604916, 2451754, 2354299, 2375025, 2246467, 2245552, 2165207, 2263226, 2158636, 1825057, 1844445, 1925053, 2054867, 2119778, 1897842, 1883760, 1933803, 1926142, 1805871, 1949988, 2076802, 1944420, 1885383, 1840560, 1856530, 1938486, 1693411, 1840860, 1920795, 1626721, 1755879, 1840731, 1843509, 1902022, 1832505, 1756872, 1733548, 1732833, 1781948, 1470498, 1505673, 1728473, 1715620, 1427767, 1374236, 1668095]
2931A668095R7682k43932M5076Q4977J6173K33924j645j61047j57003J61193J37765
2920A881258L6187J8038j24764J6560j64669J05058k6956J38572q1376O3710k5739
2909A835879k32892J0764j2918j10700L47229J00468l92649p2914N3604K19408
2899A745279p1802J30603m6669j3172K52778k4967n686J00830J49896r8289o0053
2888B058748J0983q0103n1721r8182j5527j61241o1849j32607Q6286J21168m4867
2877A631088n8368j36522j10372m0092p2046l7885j12458K48804J4566n1907J70090
2866A444898N0240j61784J96980j70055J68220j02326n1254J28826M2631K165
2856A548541j33347M978j08700m3031l80234M9997O1049R4560J1678m5017j8678
$$ y = [1668095, 1765777, 1521845, 1566921, 1651898, 1668071, 1901995, 1900350, 1739303, 1582300, 1743493, 1881258, 1917445, 1935483, 1810719, 1827279, 1662610, 1767668, 1740712, 1879284, 1797908, 1861618, 1835879, 1602987, 1613751, 1600833, 1490133, 1837362, 1937830, 1545181, 1472267, 1525871, 1745279, 1673477, 1804080, 1757411, 1744239, 1997017, 1972050, 1966364, 2067194, 2217090, 2118801, 2058748, 2069731, 1989628, 1937907, 1839725, 1824198, 1662957, 1601108, 1468501, 1554787, 1675955, 1631088, 1572720, 1436198, 1325826, 1285734, 1213688, 1175803, 1063345, 1312149, 1326715, 1274808, 1444898, 1495138, 1333354, 1530334, 1360279, 1528499, 1426173, 1374919, 1503745, 1546376, 1548541, 1415194, 1420172, 1311472, 1268441, 888207, 938204, 999253, 1093813, 1105491, 1060474, 1041796]
2845A041796p6798M0779N0090J01501j98805k53306K62097l0616l1000J21223
2835A026961n166J14425k05692Q0741l1183k01533M5139k1605M1086J07086J47861
2824A098120L1544j61214j64082j12509K0818N8383n8588O7834R4287k5489j085
2813H48019O543n1463j0929L0190o6175l69755o740J988p1601J33509J98634k9027
2801F13193O1973p1745k04415P2544q2940P3839K9694j5346K31618k65569l4956
2790D07890Q8627L8340j91597n4495N7800J43548K6242k29621K25623q3237q5930
2779C43190O1293L0790J29418M9571j42691m5317P4688j38781J7743j4460J01361
2768D66805k31700J75007J43183p3625l7909m5380L7546p2788q7146Q5986J04783
$$ y = [1041796, 964998, 1005777, 1055867, 1157368, 958563, 705257, 967354, 936738, 905738, 1026961, 1021795, 1136220, 930528, 1011269, 980086, 778553, 823692, 802087, 843173, 950259, 1098120, 1129664, 968450, 804368, 691859, 712677, 771060, 712472, 780306, 874593, 849104, 848019, 854562, 803099, 792170, 822360, 756185, 386430, 379690, 381678, 310077, 443586, 642220, 613193, 675166, 603421, 399006, 471550, 388610, 462449, 492143, 476797, 708415, 442846, 407890, 496517, 534857, 343260, 288765, 346565, 490113, 516355, 286734, 512357, 429120, 343190, 404483, 435273, 564691, 614262, 471571, 426254, 500942, 362161, 379904, 365444, 466805, 235105, 410112, 553295, 479670, 441761, 396381, 433927, 361139, 273993, 359979, 464762]
2757D64762j38528P2694K23849j2683j6573j49597j44997J69180q9708j3866j33443
2746B31090j57613M2985K05566R8890n4336j80552k37412K43819J76738J78528
2736E47703L0003j85355L0262k53483P6500p2280J12477j3705O5463n1606J4221
2725C00200j94226j4605J31647J51374p9966q7765O292J02521J06830k05790J32519
2714C49031j109K1867J46676j47336o8277J34650R0139j36213p9538L5494r7419
2703B47965P9492K1703m00577N2955L6252P8046M610K4807k7623k14672J70756
2692G3714p5472J23336N6384N6108J45361N9384j80447j06983r6330M9430N5616
2681A60101j41934l3684J83817l14390M01766L4586J06976o1593j08423O4980
$$ y = [464762, 326234, 398928, 622777, 610094, 593521, 443924, 298927, 468107, 378399, 364533, 231090, 73477, 116462, 322028, 420918, 366582, 186030, -51382, 192437, 369175, 547703, 577706, 392351, 422613, 169130, 245630, 173350, 285827, 272122, 337585, 285979, 300200, 105974, 91369, 223016, 374390, 294424, 206659, 212951, 315472, 422302, 216512, 349031, 347922, 369789, 516465, 369129, 300852, 435502, 525641, 389428, 309890, 345384, 247965, 327457, 349160, -51417, 1538, 37790, 115836, 120446, 145253, 117630, -97042, 73714, -1758, 121578, 177962, 234070, 379431, 438815, 258368, 151385, 55055, 104485, 160101, 18167, -15517, 168300, -146090, 255676, 290262, 397238, 335645, 227222, 292202]
2671B92202k32825J56591M5874J20440j75531o1097r2013p3210O7676J69915N4171
2660B72193k03853j38537J01604K73815l8589j23080q6584R8094m6417n7937L83472
2649D34181R6059k34450p2022K46766Q3086N7108J39867J17090k85743J04652
2639F86594O4675j12468O621n7996q4665j46071N2231j4829j16158l9783q9627
2628A48524k59064M5965K37320J91004k29189j88965r4720J29275J44302n5526
2618F8926J09069l1236k339o2425j98291L47592j43448o6435r3221k29572J11563
2607a89817J24428L2845Q0057M3437q6552J47172r0721P9807J10034j2688k5479
2596B12523J7761j31949j84139m8265K29195L8442J9955m9025Q529k02993k61014
$$ y = [292202, 59377, 215968, 261842, 382282, 206751, 145654, 53641, -19569, 48107, 218022, 272193, 68340, -70197, 31407, 305222, 266633, 143553, 56969, 155063, 108646, 50709, 434181, 530240, 295790, 223768, 470534, 553620, 610728, 750595, 867685, 581942, 686594, 751269, 638801, 645422, 587426, 502761, 356690, 408921, 394092, 277934, 238151, 148524, -110540, -64575, 172745, 363749, 134560, -54405, -149125, -19850, 124452, 68926, 177995, 146759, 144420, 81995, -116296, 231296, 87848, 21413, -71808, -301380, -189817, -65389, -32544, 47513, 90950, 4398, 151570, 60849, 140656, 250690, 238002, 212523, 230284, 98335, -85804, -134069, 95126, 133568, 153523, 104498, 113027, -89966, -350980]
2585c50980K42193L27218M4374l0549r5408k6154j40011o974R9564J18171M5763
2574B27207N7716l0659l4052J5240O1901k3194P7655k6518k072L9352n5825p3093
2562B33658J5948n6063l01703J64450K03995R0739j29533L3446J188j18646J16659
2551B54138l0265J21990r866m3075q8124p3997J7029M4635o0677J6244K32695
2540C80727j84960j02985O3021J84466o3461J33772O2440k14032P7198j54968
2530A81218j32550l70k9498J96650l6063J5254M4095K24905j6038k90715N4987
2519B11875J36706j71843j76855K33153J61942N9642p6480J45835n6660r1043
2509C76272O2819j68777K43986o0132K19574q9869l0287p9645n8625J18710j4155
$$ y = [-350980, -108787, 218431, 262805, 232256, 136848, 110694, -29317, -36291, 63273, 181444, 227207, 284923, 254264, 220212, 235452, 297353, 274159, 351814, 325296, 323224, 362576, 306751, 233658, 249606, 193543, -108160, 56290, 260285, 351024, 221491, 254937, 256125, 137479, 254138, 223873, 345863, 335997, 292922, 204798, 130801, 147830, 192465, 131788, 148032, 380727, 195767, 92782, 155803, 340269, 276808, 410580, 473020, 258988, 336186, 181218, 48668, 48298, 18800, 215450, 179387, 194641, 238736, 463641, 447603, 156888, 211875, 348581, 176738, -117, 233036, 394978, 454620, 378140, 523975, 467315, 376272, 439091, 270314, 514300, 454168, 673742, 583873, 553586, 473941, 415316, 534026, 519871]
2498E19871p1783j29803J77518M6019r8903n7803n0222q6446K20964O149r2576
2487C82985J22396J72793p5508M1103J39918p6004m1201j62680p0780K98695J2528
2476G44245q8323J33718l8050K33364Q1071L7362J4304K31154j2148r2218K5371
2465A269850r7891m8040j4346M9258n0773N8703K57907j4192n9257M2127k6664
2454A366682J42591k11472j80032K41494L80118K3438J21524j5672N4671L7266
2444A960608L9459q5712p7538l6603j0221L33701j4742J35961k20845j89674M38788
2433B273182k165j0720K675J90169K3803K0474J32135P5972K32602L75851Q2540
2422C396518q872j57680J42175K49489N4081K49046p1981K04476J12885L51856
$$ y = [519871, 448088, 318285, 495803, 541822, 442919, 385116, 334894, 248448, 469412, 475561, 382985, 505381, 678174, 602666, 643769, 783687, 707683, 666482, 503802, 433022, 731717, 744245, 655922, 789640, 751590, 984954, 1066025, 1103387, 1117691, 1348845, 1336697, 1244479, 1269850, 1171959, 1123919, 1109573, 1158831, 1108058, 1166761, 1424668, 1410476, 1351219, 1393346, 1366682, 1509273, 1297801, 1117769, 1359263, 1739381, 1762819, 1884343, 1868671, 1923342, 1960608, 2000067, 1914355, 1836817, 1800214, 1789993, 2123694, 2108952, 2244913, 2024068, 1834394, 2273182, 2271017, 2260297, 2262972, 2453141, 2476944, 2497418, 2629553, 2705525, 2938127, 3313978, 3396518, 3387646, 3229966, 3372141, 3621630, 3675711, 3924757, 3852776, 4057252, 4170137, 4521993]
2412D521993K74312R4688J15411L60013K42114j6349J67097K38910M91436k6074
2402F463551K69305K90493M42381K07695Q4576N4314O05645L32968M60284N95008
2392I806220N41959P90331Q01624O66156Q54128O54490O55690Q72502J188692
2383A6831792J775616K572072K974892L857575N207192O807512Q544698J1312486
2375E9883835J5274333J4473408K597134j4623608j8022928j4842670r930824
2368C4808680o324057m914034l570065k549517k009762j552804j172555r49429
2360A1766457n74833l61653n16330q45369j012551p13110p02852p96141l25997
2351E917621k45249n41878n85661j21081l85274j82840j40440j28945k84891k05190
$$ y = [4521993, 4796305, 4890993, 5006404, 5366417, 5608531, 5592182, 5759279, 5998189, 6489625, 6463551, 6732856, 7023349, 7465730, 7673425, 7758001, 7812315, 8417960, 8750928, 9211212, 9806220, 10348179, 11138510, 11940134, 12606290, 13460418, 14114908, 14770598, 15643100, 16831792, 18607408, 21179480, 24154372, 28011947, 33219139, 40026651, 48571349, 59883835, 75158168, 89631576, 92228710, 77605102, 59582174, 44739504, 34808680, 28484623, 23570589, 20000524, 17451007, 15441245, 13888441, 12715886, 11766457, 11191624, 10829971, 10313641, 9468272, 8455721, 7742611, 7039759, 6243618, 5917621, 5672372, 5130494, 4544833, 4423752, 4038478, 3855638, 3715198, 3586253, 3301362, 3096172]
2341C096172J9726j80866r7536r9371j73353k07854j60690J7505j67242N1775
2331B098266J8108j33399k56661J42184q7222j4114p5262l24Q3560k01732k81835
2320A291569R5224N333n4934r9178p6083n8667R5774k27659P4481J82558J7941
2309A246359n9450K455o4655j02673K4307p8832m7202j48338o5313K15738j57122
2298G65274j25984J95202j09411q2833j03617K8025j61879R1794L14920j93814
2288F17677k26478K82767K2728j1327n3705k2184k81240N4339R1644j11447j1574
2277C51200q7082p2371J42968q8356M028K6042K5225q4122J42115k1073j51359
2266A87215J13322L4952K21999r4350j26085M3001j33191j26523O147r6320l1937
$$ y = [3096172, 3115898, 2935032, 2837496, 2738125, 2564772, 2356918, 2196228, 2213733, 2046491, 2098266, 2116374, 1982975, 1726314, 1868498, 1781276, 1767162, 1691900, 1691576, 1775136, 1573404, 1291569, 1386793, 1392126, 1337192, 1238014, 1161931, 1103264, 1199038, 971379, 1045860, 1228418, 1246359, 1186909, 1189364, 1124709, 1022036, 1046343, 967511, 920309, 771971, 706658, 922396, 765274, 639290, 834492, 725081, 642248, 538631, 566656, 404777, 496571, 811491, 617677, 391199, 673966, 696694, 685367, 631662, 609478, 328238, 382577, 474221, 362774, 351200, 264118, 191747, 334715, 246359, 250387, 276429, 301654, 217532, 359647, 338574, 187215, 300537, 335489, 557488, 463138, 337053, 380054, 246863, 120340, 126487, 30167, -1770]
2255a770J34409N3784Q1425O5048J41881k76396m6707j90317O5212J51805Q1259
2244B59633Q3253j77747j13678J92872m6749j62308J19225J0916j23792J1010
2234E2635n9381J80800O0438l50643J01697J01550J06052j98343o8279J78621
2224A05147J57000j53314j02539l2145J82947k9775k5586J93330j04111L9555
2214B30509J52549k05405q9600n9191p9306K03090N3922k20583M1854l0179k6835
2203b9175j51926k05379K41200l7711J30508J27800k49726K87126J22951j11238
2193A24430k75193k0831J08706q8080K73397J47965m5164J2718j51065o4022J49812
2182A72673m0133j083J89149j87203l4082J3913M7053j48057K3812m7174K06113
$$ y = [-1770, 132639, 186423, 267848, 332896, 474777, 198381, 151674, -38643, 26569, 178374, 259633, 342886, 165139, 51461, 244333, 197584, 35276, 154501, 165417, 41625, 52635, -6746, 174054, 234492, -116151, -14454, 87096, 193148, -5195, -73474, 105147, 262147, 108833, 6294, -25851, 157096, 127321, 101735, 295065, 190954, 230509, 383058, 177653, 88053, 28862, -50444, 152646, 206568, -14015, 27839, -2340, -29175, -181101, -386480, -145280, -182991, -52483, 75317, -174409, 112717, 235668, 124430, -150763, -171594, -62888, -150968, 122429, 270394, 225230, 237948, 86883, 22861, 172673, 132540, 131457, 320606, 133403, 99321, 113234, 160287, 12230, 36042, -11132, 194981]
2171A94981j13060m1755o7012L9729N9643J3815J58601j36621J7037Q0570O3111
2160B69039k16105j05585M2344N3716O528J2761q1963j08300p4285P6950J37893
2149A2993K57971j10392k02969J13564J28045j35013k01340L921j81116k4064
2139c38400Q8162J22113R3638j01883j14651K10224L24246k35006r2282O3440
2129A9601j68665J13563K39725J6339n337j73365J1503P911J19161P0615n3083
2118A97968l12006j14628j9537J14900n4731O4631K07748K732q4843o7049j0805
2107g5620Q6822J35922J66796J22446j23497r0910J5658j77192n5396k8757R9982
2096G6254j23912J18080L460k84639m074O5449K97251j35970j06044K75597L799
$$ y = [194981, 81921, 40166, -26846, 12883, 72526, 86341, 244942, 108321, 125358, 205928, 269039, 52934, -52651, -10307, 43409, 49937, 62698, -19265, -127565, -201850, -124900, 12993, 270964, 160572, -42397, 71167, 199212, 64199, -137141, -133220, -314336, -338400, -250238, -128125, -34487, -136370, -251021, -40797, 283449, 48443, -43839, 19601, -149064, -35501, 204224, 220563, 215226, 41861, 53364, 61275, 180436, 251051, 197968, -114038, -228666, -248203, -133303, -188034, -123403, 84345, 87077, 2234, -64815, -75620, 11202, 147124, 313920, 436366, 312869, 221959, 237617, 60425, 5029, -23728, 76254, -47658, 70422, 73882, -210757, -214831, -149382, 147869, 11899, -94145, 181452, 185251]
2085A85251k96233K1166k0405k897l3896q4523R1183O9690J02469m1881r2179
2074a02255K03605L752N6319p8677L7184J73339l40929j94721K40776j05190k40436
2063c47233K34275j9598j26596J02198K28082J16218j69358j32249M439J17206
2053G384K64061o334k1046k7968j80573p2564O7709l06050j20126K6228J86199
2042a83080n083k0867j9181M043J20421q7073j19257o3654j1250Q5071J43567
2031a56343J14017r614j44870J63148n4775j64433K94036K9025k50439J62033
2021a8215J06188J0563M9342j93651j63353R9718M3109M67j9455m3523o562K23268
2009H7896j90272P7814o0536q1091J41948J80793N4193j80838j48159k4876l9301
$$ y = [185251, -110982, -89816, -110221, -113118, -147014, -231537, -140354, -70664, 31805, -10076, -102255, 101350, 105102, 161421, 82744, 119928, 293267, -47662, -242383, -1607, -106797, -347233, -112958, -132556, -259152, -156954, 71128, 187346, 17988, -114261, -109822, 7384, 271445, 265111, 244065, 216097, 35524, -37040, 30669, -275381, -395507, -369279, -183080, -188163, -209030, -228211, -224168, -103747, -190820, -310077, -373731, -384981, -299910, -156343, -42326, -51940, -196810, -33662, -88437, -252870, 41166, 70191, -180248, -18215, 87973, 98536, 147878, -45773, -209126, -109408, -66299, -65832, -85287, -128810, -135372, 87896, -102376, -24562, -85098, -166189, -24241, 156552, 210745, 29907, -118252, -143128, -182429]
1998a82429K28794k7375n7833j55671k09774J83201K27762r4688r852R5071j9671
1987b2465o9046N2028L7232R0425J8276k55976j38138J89496j02437k3687K66952
1976D2660j04686j15427J85005l810K5752j00539k05364j2781N4809n3116J67204
1965a20293O4065K990N9653j13428N5986J017J72084j04682N3853j28081m2675
1954i9511L2937q5404M5040j3625m8548J13177J07650K3078q6963j15329k80767
1943d08265o1476K94022J56503k40635J02984L1240j2347J50098J37754Q7314
1933B37192m9443j83525R5869q6189O2857k28475j4724j02515q8163Q7300K1152
1922b48664L5216q892J18702o0748L08lP0236j68303K10839J20855k35854j2851
$$ y = [-182429, 46365, 18990, -38843, -194514, -404288, -221087, 6675, -88013, -97865, -2794, -22465, -91511, -39483, -2251, 88174, 106450, -149526, -287664, -98168, -200605, -224292, 42660, -62026, -177453, 7552, 3742, 29494, -71045, -276409, -289190, -234381, -287497, -120293, -56228, -53238, 6415, -107013, -51027, -50010, 122074, 17392, 71245, -56836, -99511, -66574, -151978, -106938, -120563, -169111, -55934, 51716, 74794, -12169, -127498, -408265, -469741, -175719, -19216, -259851, -156867, -125627, -137974, 12124, 149878, 237192, 187749, 4224, 100093, 13904, 76761, -151714, -166438, -268953, -357116, -269816, -248664, -213448, -222340, -103638, -164386, -164078, -164081, -93845, -262148, -51309, 69546, -166308, -179159]
1910a79159M4529j097J90056m6575j39995j0057J37472J48045p3900j58722K13459
1899A24056r4652K8638k169j96927P4511J3019k1992j36202q752q5605J03694
1888b02381K27972o9214k13542j67342K05870J26126m9876j65040j76004J2941
1878d70490K28939L7131m5086o2556O6780P4574o5091k73978K77238L5768L3812
1867a62959J86360k5140R3190Q5286j20029l6569o8863r0076j43580J54001J36344
1856G965L896J15578j2873j22540k73211l325l8697J46688o3222P608j4717R6091
1844a50759n0336M5933j21204K96689j16505k50627J81030J50462J02142R6389
1834A83214j27645k91998k12087P8780K54752P5468O7907p6814K4444k5473o7288
$$ y = [-179159, -134630, -135727, 54329, 7754, -132241, -142298, -4826, 143219, 69319, -89403, 124056, 29404, 58042, 55873, -141054, -66543, -53524, -75516, -211718, -220470, -306075, -202381, 25591, -43623, -257165, -424507, -218637, -92511, -142387, -307427, -483431, -470490, -241551, -204420, -249506, -312062, -245282, -170708, -235799, -509777, -232539, -196771, -162959, 23401, -1739, 91451, 176737, 56708, 20139, -48724, -138800, -282380, -128379, 7965, 11861, 127439, 114566, -7974, -281185, -284510, -323207, -176519, -239741, -232133, -246850, -150759, -201095, -155162, -276366, 20323, -96182, -346809, -165779, -15317, 86825, 183214, 55569, -236429, -448516, -369736, -114984, -39516, 28391, -48423, -23979, -49452, -116740]
1823a16740j9060m9093J16518R1325j42310k4148J50799p3124r7914j53644R1770
1812b25621J42199n5933j14289K36083n3122J24831l0472j30978n1627L5689L297
1801a19943j61249K51499J55166m2697k52275R123J37385N728k30764J15586r7502
1790b29943p3076K01933j23968K0430r3708o7634K07515q5668o3479J02370J51689
1779e3539J73685N1533j61512J52710O144m1793j33740o7205j36726M5111K3447
1768a41885P3826q0211R3146K6603j53427k38143J61263M04175k93569p5798m172
1757b28192O8540K08116L8219M2090o5178j51225M8528J60604M0828O215j17243
1746E1302q7311k1550j5934l8387J73226o1930J16692J21478j32328p5072m4874
$$ y = [-116740, -135800, -184893, -68375, 22950, -119360, -143508, 7291, -65833, -163747, -317391, -225621, -83422, -139355, -253644, -17561, -70683, 54148, 23676, -107302, -158929, -123240, -119943, -281192, -29693, 125473, 82776, -169499, -160376, -22991, -17263, -248027, -132441, -229943, -303019, -101086, -225054, -204624, -298332, -365966, -158451, -244119, -307598, -205228, -53539, 120146, 171679, 10167, 162877, 169021, 127228, -6512, -73717, -210443, -165332, -141885, -68059, -148270, -55124, -28521, -181948, -420091, -258828, 145347, -148222, -224020, -228192, -159652, 48464, 86683, 128773, 63595, -87630, -39102, 121502, 162330, 168545, 51302, -36009, -57559, -73493, -111880, 61346, -584, 116108, 237586, 105258, 30186, -14688]
1735a4688j26202j64685J96319P3478J39392N4212k99976M2140q0002k02890J48419
1724b34483k3854J07588L85j48767N3060k9456R1085P4858L9776m503J0326J5620
1712d8365j00567l0411J39983l1711q7969J634n7980o335K82744R3437p512J16868
1700B63816j19430j03152J04969k01408k05208L6704L4324J45036j64309J98439
1690a0219p8014K11006j2338j35447k28194j59931M5323J66502q6388M7551N56
1679b39593K66850n4060M0999j5238j57792J55164R2169K33489k26712k23128
1669a27852k7065k7131j05056N1368J65914K5387r7169j28988k68035K08984J28489
1658b01154J22525J53010j19858k35716K50805j78916O3310J06685N6516L3238
$$ y = [-14688, -140890, -305575, -109256, -35778, 103614, 157826, -142150, -100010, -180012, -382902, -234483, -258337, -150749, -150364, -299131, -246071, -275527, -184442, -109584, -69808, -74311, -63985, -48365, -148932, -179343, -39360, -71071, -159040, -157406, -215386, -221721, 61023, 154460, 146948, 263816, 144386, 41234, 146203, -55205, -260413, -223709, -189385, -44349, -208658, -10219, -88233, 122773, 110435, -25012, -253206, -413137, -367814, -201312, -287700, -240149, -239593, 27257, -26803, 14196, -1042, -158834, -3670, 88499, 321988, 95276, -127852, -154917, -182048, -287104, -235736, -69822, -44435, -141604, -270592, -538627, -329643, -201154, -78629, 74381, -45477, -281193, -30388, -209304, -145994, -39309, 17207, 50445]
1648E0445j78770l9248o7230J11508q5956p7774M0752K21636j11876Q3611j33390
1637a86292J70254K1404p0208j99434m5256J51076L9054R0980O005k09039K15378
1626a6078K59046l08228j15598P4018K74488m4804j01024n6080k4349K8834M9546
1615A9771l6233K68078j76639J26220Q8150j34194p6256k4503m8632j28018j70369
1604b92625j3643K23486J04062j12848J68908P941k72036J08463K22973k0056
1594A24625j07506j78570p5265K45662n9500j41838j37919K24847J59302J05534
1584A59372M1161r3413j26138q5163o2452j3072K8254k9749J68874J80104m6627
1573A21151j39231J00631k3987j19589k81742K52608M1006j67308R6108J05974
$$ y = [50445, -128325, -167573, -234803, -123295, -209251, -287025, -246273, -24637, -136513, -52902, -186292, -16038, 5366, -64842, -264276, -309532, -158456, -119402, -28422, -22417, -231456, -16078, 242968, -65260, -180858, -106840, 167648, 122844, 21820, -34260, -58609, -29775, 19771, -16462, 251616, 74977, 201197, 289347, 155153, 78897, 54394, 5762, -122256, -292625, -306268, -82782, 21280, -91568, 77340, 85281, -186755, -78292, 144681, 124625, 17119, -161451, -236716, 8946, -50554, -192392, -330311, -105464, 53838, 159372, 200533, 107120, -19018, -104181, -166633, -179705, -151451, -181200, -12326, 167778, 121151, -18080, 82551, 58564, -61025, -342767, -90159, -49153, -216461, -120353, -14379]
1563a4379j79134R7127J15213m0259j8618K9138O5218P2893Q7218j11676q2977
1552A9764k08611P5583L6090n6566K922K5119J76675L415j23686n3055j04890
1541b07240R2442j67390K05793N3175j01096J20767Q724k65033J82404K91766
1531B14312k37867J23286k4966j74145R6321P0993r8970j38297O1055J85977n809
1520G1890l6782P6395R7537j68667R9804l0073k11769J62013K43954l32814k00308
1509b28820O9342n6352K34462j64440j63960P8701J94341j99752J33621p9799
1499a82656j72950L841M4552J29196J6748J06699N6196j4994q2835M8027M9630
1488A454K3062O7032q5887R548K04508k65489m37882J33231L78988P1102r9243
$$ y = [-14379, -193513, -96386, 18827, -21432, -40050, -10912, 54306, 127199, 214417, 102741, 19764, -188847, -113264, -77174, -133740, -130818, -105699, 70976, 74391, -49295, -102350, -207240, -114798, -282188, -76395, -23220, -124316, -3549, 5175, -259858, -77454, 214312, -23555, 99731, 74765, -99380, -3059, 67934, -31036, -169333, -108278, 77699, 71890, 35108, 111503, 209040, 40373, 140177, 110104, -101665, 60348, 304302, -28512, -228820, -159478, -215830, 18632, -145808, -309768, -231067, -36726, -236478, -102857, -182656, -355606, -351765, -307213, -178017, -161269, -54570, 1626, -13368, -96203, -48176, 1454, 24516, 91548, 5661, 15209, 219717, -45772, -483654, -350423, 28565, 99667, 424]
1477D24J7829p4561p8228j83717m6932L07172M6057k08696K60562J52522j61179
1466C1253l9834j3697k862k9667J68068K1605R1002k14453J25349j83191j29680
1455a76107J67664j79299p8503L0850L22768n2658r9756l8722O8457R821R600
1444a5885m1741k85195J01114J34932j11721K34950m818M0668J89833j91908R8568
1433A48797l44473j02280L25514R9242p7909m8168j4693M4237P0566J03691m3816
1422A60708j13489j4708j346j7455n1227j7551n9954N3906m8481o719N8049q4871
1410a43138K0423J28916j14154j706J83446k54681o2504J61278k65718L2162J30132
1399a85544j18969J4247L4530J96727N6811j7640j11351q666K0387j6726J28369
$$ y = [424, 18253, -56308, -134536, -318253, -365185, -58013, -11956, -220652, 39910, 192432, 31253, -8581, -22278, -25140, -54807, 113261, 134866, 225868, 11415, 136764, -46427, -176107, -8443, -187742, -266245, -235395, 87373, 34715, -65041, -103763, -35306, -25485, -15885, -57626, -342821, -241707, -106775, -218496, 16454, 11636, 52304, 242137, 50229, 148797, -195676, -297956, 27558, 126800, 48891, 723, -13970, 30267, 100833, 204524, 160708, 47219, 32511, 31165, 13710, -37517, -55068, -115022, -61116, -109597, -116316, -58267, -143138, -122715, 6201, -107953, -109659, 73787, -180894, -243398, -82120, -347838, -315676, -185544, -304513, -290266, -255736, -59009, -2198, -19838, -131189, -139855, -119468, -136194, -7825]
1388g825p7814j50208J04151J31290j0802j31040R1934l0859k3274J8806O8418
1377a7223M888M5132J945K223K2624q4092J88197o2501J14369k79510N5611R2830
1365H4493R3041k02531J3819Q5001r9308l6759Q945J44175o5780J1019J25665
1354A61780n0380k19846R4549l944K658K7587j29224m6199K32528J22025k63457
1343g1923K46752J68217l7303k50039k65155R183l3379J79826N1623J29341n3054
1332G4089j50090m3385p7272j09083Q1059J9085K82424K9750M2975j83049k65336
1321b98833N8145r4633K34555J73329j28873j40173j13279R5093J0328L5595P1067
1310i7679l9432m5389J9430L79520n8919j76210q0025p6595N3152j44554J75188
$$ y = [-7825, -85639, -235847, -131696, -406, -11208, -142248, -50314, -81173, -104447, -85641, -17223, -12335, 32797, 34742, 36965, 59589, -24503, 163694, 101193, 215562, -63948, -8337, 84493, 177534, -24997, -11178, 73823, -25485, -62244, -53299, 90876, 25096, 36115, 161780, 111400, -108446, -13897, -17841, -15183, 12404, -116820, -163019, 69509, 191534, -71923, 174829, 343046, 305743, 55704, -209451, -200268, -233647, -53821, -2198, 127143, 74089, -76001, -119386, -196658, -305741, -224682, -205597, 76827, 106577, 149552, -33497, -298833, -240688, -335321, -100766, 72563, -56310, -196483, -309762, -214669, -204341, -168746, -97679, -137111, -182500, -163070, 216450, 157531, -18679, -98704, -175299, -122147, -266701, -91513]
1299i1513J35214J1119p7746r7995j09519N6270L81603k52696q6002L1011J69694
1288F9440q8964r1152K16381k2149K8102j9619j52452j08997J03565P9789j08066
1277i4122Q5856r1776J71281O6299j12789Q1692j93955M7762J44309q625j10211
1266a4279M8099M4295m9747k16762L1461M0602j68470j21410K91374j32456Q6810
1255a60483P4704j63699L58j20538R4163L9379J30236N6562j34967o5680K55813
1244E848n0608J2279P9374j6902l6852j71550J58914l1333k10904j44390L60519
1233d5605L4986k05889K12078J28503r0215j13160j5208P7346L5951o6896O5839
1222A7730M8861n0026l7136j23683J13390M9352p0972R6648P7318j5644p9275
$$ y = [-91513, 43701, 54820, -22926, -120921, -230440, -174170, 207433, -45263, -131265, -100254, 69440, -19524, -110676, 105705, 83556, 111658, 92039, -60413, -169410, -65845, 13944, -94122, -8266, -100042, 71239, 137538, 24749, 106441, -87514, -39752, 104557, 95932, -14279, 33820, 78115, 28368, -188394, -156933, -116331, -284801, -406211, -114837, -247293, -160483, -85779, -249478, -249120, -369658, -275495, -236116, -105880, -49318, -184285, -249965, 5848, -44760, -32481, 46893, 29991, -6861, -178411, -19497, -50830, -261734, -406124, -45605, -10619, -216508, -4430, 124073, 33858, -79302, -94510, -17164, 18787, -48109, 17730, 66591, 16565, -20571, -144254, -30864, 18488, -52484, 44164, 121482, 105838, 26563]
1211B6563k9615j47448j9097P4910P050M1968L6616n3812r1243M3654K26037j1276
1199A04307k39900R134O4655P9095P2467m6961J25433j57838r4699J28450n1000
1188f857o2491Q9325j95193K31352O6793m7414R9045k77189J42690J06960l5062
1177A11959q5954k7061O3892k4398K5544P3718j39369j3997O2383j56612J39479
1166B9584k14668J24591K02892p5555j55039p0148M2167K08141n924j05291j984
1155b1234o2801K65642j58650j68100R2189J42498j19780j07887R6247K30884
1145A89008r9566K37577r3866n2462r8649l33305J36512K36002n8579j39519Q2607
1134E760p3963k17523J57240m964r716K09064k68839P0180O6957l2569q3875M29588
$$ y = [26563, -3052, -150500, -169597, -94687, -87637, -45669, -9053, -62865, -154108, -110454, 115583, 104307, -135593, -126459, -61804, 17291, 89758, 42797, 168230, 10392, -84307, 44143, -6857, -69348, 19977, -175216, 56136, 122929, 75515, 174560, -102629, 40061, 147021, 111959, 26005, -1056, 62836, 38438, 63982, 137700, -1669, -15666, 46717, -109895, 29584, -185084, -60493, 142399, 66844, -88195, -158343, -116176, 91965, 86041, -19250, -21234, -84035, 181607, 22957, -145143, -52954, 89544, -30236, -138123, -41876, 189008, 89442, 327019, 233153, 180691, 82042, -251263, -114751, 121251, 62672, -76847, 5760, -68203, -285726, -128486, -133450, -143166, 65898, -202941, -132761, -65804, -98373, -182248, 247340]
1122B47340j44040j02451K8385O6463R5282o871L9153j81246p4485j38860l2336
1111b03666J99556j27501n1776J47346l7921P299J20643J28195R0131j38196k51395
1100a17285K5268J35619R0110k32159L1456l3338q1970Q6985J81765j60756k9124
1089a03429K17125j74897j80263O9251k3225J32398J06874K48358k9207j64235
1079I8750K18377k84942k35676o9239J89107J11286l5590p9048J02990m9829J95896
1068A62082N0033k80754l09647O3115K03499j66322L17844K6192M3936k19946
1058a09968J74925p4562j97088K1882J4190Q7140p1461n5908L18942J26374k92281
1047e7815k39961J90287p6128p3942J15626K34172J2458o8356J01698J9600K20406
$$ y = [247340, 103300, 849, 29234, 95697, 190979, 184108, 223261, 42015, -32470, -171330, -203666, -4110, -131611, -183387, -36041, -73962, -66663, 53980, 182175, 272306, 134110, -117285, -92017, 43602, 133712, -98447, -66991, -100329, -182299, -95314, 86451, -74305, -103429, 113696, -61201, -241464, -172213, -195438, -63040, 43834, 292192, 262985, 98750, 317127, 32185, -203491, -272730, -83623, 27663, -7927, -86975, 16015, -33814, 162082, 212115, -68639, -378286, -315171, -111672, -277994, 39850, 66042, 109978, -109968, 64957, -9605, -206693, -184811, -170621, -83481, -154942, -210850, 108092, 234466, -57815, -297776, -107489, -183617, -257559, -141933, 92239, 104697, 36341, 138039, 157639, 378045]
1036C78045j94863j23265J50706J5198j32531l4977k44954o438Q5104p3313J69279
1025a2009J6717j55964R6698J16738k9388j73796P8889j56256N8645L984K5505
1014a30237J31509r0823R1925J56446p6252l8958n5563J59854l2190m5267M0801
1003A11245p0984k01713P260J26046m2635K00483M1293J3517Q0048j08068j23524
992C2968J44556m5675L8235J02623P9429k73281Q8722r9300J37132r8258J3458
981A20609j79911k46401p3615l560K96560j83739L7647j6270L8465J60248P4928
970B4961j12606N9451O3543n3588n8437L7265O7920j34191j56761J13011l8754
959a88186L23017k16198o1589K71040J46959q4449K44854p7938l00749K02881
$$ y = [378045, 183182, 59917, 210623, 225821, 93290, 58313, -186641, -193079, -107975, -181288, -12009, 4708, -151256, -54558, 62180, 32792, -141004, -62115, -218371, -159726, -155742, -130237, 1272, -89551, 2374, 158820, 82568, 43610, -11953, 147901, 115711, 70444, 111245, 40261, -161452, -154192, -28146, -70781, 129702, 170995, 184512, 264560, 156492, 32968, 177524, 131849, 170084, 272707, 352136, 78855, 167577, 68277, 205409, 107151, 120609, -59302, -305703, -379318, -382878, -86318, -270057, -232410, -248680, -210215, -49967, 24961, -87645, -28194, 35349, -18239, -76676, -39411, 28509, -105682, -262443, -149432, -188186, 134831, -81367, -142956, 128084, 275043, 190594, 435448, 357510, 56761, 259642]
949B59642o5139j79401K0228J95016j63387J03782j07327m8784O3870j49731J24177
938E2946k86883N5304N6254P828K39783R5157j31243j21916J87113j1571k19695
927g6923p1138J13177M5646p0755J46335K14366n4356j39381j41995J95802j30731
916C0047r2464J95605J55201m1808j05631k0553j19153J27442J64529o6669r1474
905A35072l931J4355k81120l6635O526q8131k8157r2452J32116K87872K50673
894B96188k8162l47081n3853J34230J71782J7929J83099j61298J0241J8662j3393
883B28344M7198j11423j028j2804j34815J49546J02119j55719K8709k43267J41760
872C8620M985j54978j2661j00564K19368J25809J14533j16594j12386L61060j34362
$$ y = [259642, 194503, 15102, 35330, 230346, 66959, 170741, 63414, 14630, 78500, -71231, 52946, -233937, -178633, -122379, -114551, 125232, 220389, 89146, -32770, 154343, 142772, -76923, -148061, -34884, 10762, -59993, 86342, 300708, 246352, 106971, -35024, 160778, 30047, -62417, 133188, 288389, 246581, 140950, 120397, 1244, 128686, 293215, 226546, 135072, 131141, 145496, -135624, -172259, -165733, -253864, -282021, -374473, -242357, 45515, 296188, 268026, -79055, -132908, 1322, 173104, 191033, 374132, 212834, 223075, 241737, 228344, 275542, 164119, 163091, 150287, 15472, 165018, 267137, 111418, 140127, -103140, 38620, 43605, -111373, -124034, -224598, -5230, 120579, 235112, 118518, 6132, 367192, 232830]
861B32830l12051p3983m6787O1237J75485O5845N8833m52254R3500K17111J3357
850C3123r5380R0283L1339k17800O4150P720K9253O3178J99281q742l65183o3952
838b32730J30010J17345O9127j32623J71863P1567l6144l00644l6606P2342j68770
827b75263K75509J15812j56966Q0189L3806k4805k4507J69834j66870l5203Q7467
816G9003k26165M2714J24238o0896j78740J50788J74751j3882J08430r3876j822
805A04543j24900j33685J3470o941L4655K47569r2442K8849J48773j71959n7156
794i224k38772K13182J34625j9412L8785J55160l5161p1237j62432n3253J16617
783F8878n1869p1636j03246j8160K18577L4997K5448k16593J5511k1146j05202
$$ y = [232830, -79221, -153204, -199991, -138754, 36731, 102576, 161409, -290845, -197345, 19766, 33123, -62257, 28026, 59365, -158435, -94285, -86565, -57312, 5866, 205147, 196405, -168778, -232730, -102720, 14625, 83752, -48871, 122992, 194559, 158415, -142229, -178835, -106493, -275263, 246, 116058, -40908, 39281, 73087, 48282, 23775, 193609, 26739, -8464, 79003, -147162, -104448, 19790, -41106, -219846, -69058, 105693, 91811, 200241, 106365, 104543, -20357, -154042, -140572, -147513, -112858, 134711, 42269, 71118, 219891, 47932, -9224, -247996, -34814, 99811, 80399, 119184, 274344, 239183, 167946, 5514, -47739, 68878, 17009, -54627, -157873, -176033, 42544, 77541, 102989, -113604, -98093, -119239, -224441]
772b24441R4131J39951J01188m3839j46258O8938J07222K0400L6967j47656j32956
761a26353j78835Q6935K20600j6240J50998m6611J09365N7047l40193L6758J78980
750A32451l3557J21350l6361k26927j21006o1877K03947p2762J41751J6211J85610
739B48830j09664P3820k02976M8709Q3298o3868l0800R9287j44326r7742P4215
728b1217R759j5087j03244j2199O2487k9318m9284J60088Q5193J44540R3923j03516
716B22125q9461J13563j65684j13506k26153J81429j05574R7778J03290J35971
706A53778O2462k61101R695r4296P8912Q5158K75508k27234J06232j59280j24412
695i4578J9654j19685J39522J60492J25298j88393q81k34307j26509K16689q268
$$ y = [-224441, -130310, 9641, 110829, 66990, -79268, -10330, 96892, 117292, 154259, 6603, -126353, -305188, -218253, 2347, -13893, 137105, 90494, 199859, 256906, -83287, -46529, 132451, 98894, 220244, 183883, -43044, -164050, -225927, -21980, -94742, 47009, 63220, 248830, 139166, 212986, 10010, 58719, 142017, 78149, 47349, 146636, 2310, -95432, -21217, -11458, -26545, -129789, -141988, -79501, -108819, -158103, 1985, 87178, 231718, 325641, 222125, 132664, 246227, 80543, -32963, -259116, -77687, -183261, -85483, 17807, 153778, 216240, -44861, -35166, -129462, -50550, 34608, 310116, 82882, 189114, 29834, -94578, -74924, -194609, -55087, 105405, 230703, 42310, 41429, -192878, -319387, -102698, -110966]
684a10966p0461Q4625o3507R2880J26490K4641O3706o267J7776J01010j60787
673I9140n1743L9365m5118j95523R5476J62441k0394j13400J33789j53302J26419
662G7150k14563j37454J42773n3145M6843j7594J73092j16784j78628J38825L7695
651a01790J27002P5288J02406j1163J22023k5153k66612O8882r9886R3609j18353
640c3747j19169O3180j04174j575p192P4679K00926L8597q9083K5687m1326N8688
628F5491O9328Q3060m7681m8900J21582j16860Q8702j56050N4988K29966k72571
617G1055k41436J36240J13318J50015l3536j87366P0650J33438k17346J82110
607A77142J03508l70645L0801j60217p1660K53310L22354j42626k22350j1842
$$ y = [-110966, -181427, -96802, -160309, -67429, 59061, 83702, 147408, 141141, 158917, 259927, 99140, 47397, 86762, 41644, -153879, -58403, 104038, 83644, -29756, 104033, -49269, 77150, -137413, -274867, -132094, -185239, -138396, -155990, 17102, -99682, -278310, -139485, -101790, 25212, 100500, 202906, 191743, 313766, 288613, 22001, 90883, -9003, 84606, -33747, -152916, -89736, -193910, -195485, -202677, -127998, 72928, 111525, 22442, 48129, 6803, 65491, 134819, 217879, 170198, 121298, 242880, 126020, 214722, 58672, 113660, 343626, 71055, -170381, -34141, 79177, 229192, 195656, 8290, 78940, 212378, -4968, 177142, 280650, -89995, -59194, -219411, -291071, -37761, 284593, 141967, -80383, -92225]
597i2225k4898N4718R9895J00479N141j78190O2632m370j63553J41083l1634j73645
585b04567o2951l528K58602m3197M811J19154m6762k5048j03640J32308q824J59504
573A75862n2921J20113j18972j7677P1290N0847R860j21714o1426l6670J11114
562A29706L0060j02180o2830J03068O9368l9410R2737j11888n1311j65537P5590
551c2627L4490M8973p3686l2998J47144p6513J40645M9012j66284m7681R983J52785
539A53243o3357r1938J31505l7633k67974j25321J93697K06775J43806L4201r8775
528A78229k40031n6017L16061Q9044l0458L095k14440q3091R5573P9503R8172
517B35640j34400p6375K02261k37583N819N0397J0990q5416j12739n8370K9034
$$ y = [-92225, -117123, -62405, 37490, 137969, 143110, -35080, 27552, 23182, -140371, 712, -30922, -204567, -267518, -271046, -12444, -55641, -50830, 68324, 21562, -3486, -107126, 25182, 16358, 175862, 122941, 243054, 124082, 106405, 177695, 228542, 238402, 116688, 55262, 18592, 129706, 159766, 57586, -5244, 97824, 167192, 127782, 220519, 108631, 57320, -108217, -32627, 1863, 50836, -22850, -55848, 91296, 14783, 155428, 204440, 38156, -9525, 458, 153243, 89886, -2052, 129453, 91820, -176154, -301475, -107778, 98997, 242803, 277004, 178229, -61802, -117819, 198242, 287286, 256828, 259923, 45483, -37608, 57965, 137468, 235640, 101240, 24865, 227126, -10457, -4638, 45759, 56749, -28667, -141406, -199776, -170742]
506a70742P5946J7107Q7363N4981K3645K1147k15849K25552K63898j98072n8861
495A26115K9402p5623J09398j04036r6762j14066K0528o7544j26529J52293J41674
484e150k1800P0898O0844p7821J11830r1172J20939L1846K3229J54506q7865l64491
$$ y = [-170742, -94796, -77689, 9674, 64655, 88300, 109447, -106402, 119150, 383048, 184976, 126115, 155517, 79894, 189292, 85256, -11506, -125572, -105044, -172588, -299117, -146824, -5150, -26950, 43948, 104792, 26971, 138801, 47629, 168568, 200414, 223643, 378149, 290284, -74207]
$$ [...]
##END NTUPLES=NMR SPECTRUM
##END=
