##TITLE=1H_EC-3315(1)
 CDCl3
 8 sc, 
 14.2.2024
##JCAMPDX= 6.0         $$ Bruker NMR JCAMP-DX V2.0
##DATA TYPE= NMR SPECTRUM
##DATA CLASS= NTUPLES
##ORIGIN= UXNMR, Bruker Analytische Messtechnik GmbH
##OWNER= root
$$ XWIN-NMR		Version 3.5
$$ Wed Feb 14 13:33:13 2024 Russian Standard Time (UT+4h)  she@DPX200
##.OBSERVE FREQUENCY= 200.1313
##.OBSERVE NUCLEUS= ^1H
##.ACQUISITION MODE= SIMULTANEOUS
##.ACQUISITION SCHEME= undefined
##.AVERAGES= 8
##.DIGITISER RES= 18
##SPECTROMETER/DATA SYSTEM= spect
##.PULSE SEQUENCE= zg30
##.SOLVENT NAME= CDCl3
##.SHIFT REFERENCE= (INTERNAL, CDCl3, 0, 15.4318)
##AUDIT TRAIL= $$ (NUMBER, WHEN, WHO, WHERE, WHAT)
$$ ##TITLE= Audit trail, XWIN-NMR		Version 3.5
$$ ##JCAMPDX= 5.01
$$ ##ORIGIN= Bruker BioSpin GmbH
$$ ##OWNER= she
$$ F:/spectra/data/she/nmr/H-F/1/pdata/1/auditp.txt
$$ ##AUDIT TRAIL=  $$ (NUMBER, WHEN, WHO, WHERE, WHAT)
(   1,<2024-02-14 13:29:38.14 +0400>,<she>,<DPX200>,
      <created by zg, POWCHK disabled, PULCHK disabled
       configuration hash MD5:
       00 E9 B6 7A A2 85 ED C7 34 08 36 98 17 FE 4E 26
       data hash MD5: 16K
       91 66 DF 24 E3 9E 85 A7 17 A1 8F 35 86 92 4F 73>)
(   2,<2024-02-14 13:29:40.70 +0400>,<she>,<DPX200>,
      <Start of raw data processing
       efp BC_mod = 2 LB = 0.24 FT_mod = 6 PKNL = 1 PHC0 = -24949.13 PHC1 = 11.25264 SI = 16K 
       data hash MD5: 16K
       36 0B B0 B8 4A B9 D2 86 D0 FE 39 CD AD CA 0A AE>)
(   3,<2024-02-14 13:30:07.71 +0400>,<she>,<DPX200>,
      <pk PHC0 = 1.727709 PHC1 = -1.4 
       data hash MD5: 16K
       98 BF AC F3 2F E7 00 E0 A2 DC DC 1E 5E 0F 7B 35>)
(   4,<2024-02-14 13:30:12.00 +0400>,<she>,<DPX200>,
      <abs ABSG = 5 
       data hash MD5: 16K
       69 E6 8E AB AD 2C 26 DE D9 68 48 D9 79 5C ED DE>)
(   5,<2024-02-14 13:32:49.85 +0400>,<she>,<DPX200>,
      <abs ABSG = 5 
       data hash MD5: 16K
       EF 76 5A 6E 80 C3 A8 56 7E C2 89 DB AC C1 AD 35>)
$$ ##END=
$$ 
$$ hash MD5
$$ 3B BA 30 39 6A 5D 43 FC 10 3D 04 FB C6 68 B4 13
##$RELAX= 
##$RELAX= 
##$RELAX= 
##$RELAX= 
##$RELAX= 
##$RELAX= 
$$ Bruker specific parameters
$$ --------------------------
##$DU= <F:/spectra>
##$EXPNO= 1
##$NAME= <H-F>
##$PROCNO= 1
##$TYPE= <nmr>
##$USER= <she>
##$AMP= (0..31)
100 100 100 100 100 100 100 100 100 100 100 100 100 100 100 100 100 100 
100 100 100 100 100 100 100 100 100 100 100 100 100 100 
##$AQSEQ= 0
##$AQ_mod= 1
##$AUNM= <au_zg>
##$AUTOPOS= <>
##$BF1= 200.13
##$BF2= 200.13
##$BF3= 200.13
##$BF4= 200.13
##$BF5= 200.13
##$BF6= 200.13
##$BF7= 200.13
##$BF8= 200.13
##$BYTORDA= 1
##$CFDGTYP= 0
##$CFRGTYP= 5
##$CHEMSTR= <none>
##$CNST= (0..31)
1 1 145 1 1 1 1 1 1 1 1 1 1 1 1 1 1 1 1 1 1 1 1 1 1 1 1 1 1 1 1 1 
##$CPDPRG= <>
##$CPDPRG1= <>
##$CPDPRG2= <>
##$CPDPRG3= <>
##$CPDPRG4= <mlev>
##$CPDPRG5= <mlev>
##$CPDPRG6= <mlev>
##$CPDPRG7= <mlev>
##$CPDPRG8= <mlev>
##$CPDPRGB= <>
##$CPDPRGT= <>
##$D= (0..31)
0 1.2 0 0 0 0 0 0 0 0.06 0 0.03 0 0 0 0 0.0002 0 0 0 0 0 0 0 0 0 0 0 0 
0 0 0 
##$DATE= 1707902977
##$DBL= (0..7)
$$ [...]
##$SUBNAM3= <"">
##$SUBNAM4= <"">
##$SUBNAM5= <"">
##$SUBNAM6= <"">
##$SUBNAM7= <"">
##$SUBNAM8= <"">
##$SUBNAM9= <"">
##$SW= 18.0517328524113
##$SWIBOX= (0..15)
0 0 2 0 0 0 0 0 0 0 0 0 0 0 0 0 
##$SW_h= 3612.71676300578
##$TD= 16384
##$TD0= 1
##$TE= 0
##$TE2= 300
##$TE3= 300
##$TEG= 300
##$TL= (0..7)
0 120 120 120 120 120 120 120 
##$TP= (0..7)
150 150 150 150 150 150 150 150 
##$TP07= 0
##$TPNAME0= <>
##$TPNAME1= <>
##$TPNAME2= <>
##$TPNAME3= <>
##$TPNAME4= <>
##$TPNAME5= <>
##$TPNAME6= <>
##$TPNAME7= <>
##$TPOAL= (0..7)
0.5 0.5 0.5 0.5 0.5 0.5 0.5 0.5 
##$TPOFFS= (0..7)
0 0 0 0 0 0 0 0 
##$TUNHIN= 0
##$TUNHOUT= 0
##$TUNXOUT= 0
##$USERA1= <user>
##$USERA2= <user>
##$USERA3= <user>
##$USERA4= <user>
##$USERA5= <user>
##$V9= 5
##$VALIST= <valist>
##$VCLIST= <CCCCCCCCCCCCCCC>
##$VD= 0
##$VDLIST= <DDDDDDDDDDDDDDD>
##$VPLIST= <PPPPPPPPPPPPPPP>
##$VTLIST= <TTTTTTTTTTTTTTT>
##$WBST= 1024
##$WBSW= 4
##$XGAIN= (0..3)
0 0 0 0 
##$XL= 0
##$YL= 0
##$YMAX_a= 350151
##$YMIN_a= -408379
##$ZGOPTNS= <>
##$ZL1= 120
##$ZL2= 120
##$ZL3= 120
##$ZL4= 120
##$ABSF1= 15.43177
##$ABSF2= -2.620079
##$ABSG= 5
##$ABSL= 3
##$ALPHA= 0
##$AQORDER= 0
##$ASSFAC= 0
##$ASSFACI= 0
##$ASSFACX= 0
##$ASSWID= 0
##$AUNMP= <proc_1d>
##$AZFE= 0.1
##$AZFW= 0.1
##$BCFW= 0
##$BC_mod= 2
##$BYTORDP= 0
##$COROFFS= 0
##$CY= -3
##$DATMOD= 1
##$DC= 0
##$DFILT= <>
##$DTYPP= 0
##$F1P= 0
##$F2P= 0
##$FCOR= 1
##$FTSIZE= 16384
##$FT_mod= 6
##$GAMMA= 0
##$GB= 0
##$INTBC= 1
##$INTSCL= 3.70164e-10
##$ISEN= 128
##$LB= 0.24
##$LEV0= 0
##$LPBIN= 0
##$MAXI= 10000
##$MC2= 0
##$MEAN= 0
##$ME_mod= 0
##$MI= 1.114404
##$NCOEF= 0
##$NC_proc= -7
##$NLEV= 6
##$NOISF1= 3.799351
##$NOISF2= 2.8
##$NSP= 0
##$NTH_PI= 0
##$NZP= 0
##$OFFSET= 15.43177
##$PC= 1
##$PHC0= -24947.4
##$PHC1= 9.85264
##$PH_mod= 1
##$PKNL= yes
##$PPARMOD= 0
##$PSCAL= 0
##$PSIGN= 0
##$REVERSE= no
##$SF= 200.130017996903
##$SI= 16384
##$SIGF1= 3
##$SIGF2= 2
##$SINO= 5.538805
##$SIOLD= 16384
##$SREGLST= <1H.CDCl3>
##$SSB= 0
##$STSI= 16384
##$STSR= 0
##$SW_p= 3612.71676300578
##$SYMM= 0
##$S_DEV= 0
##$TDeff= 16384
##$TDoff= 0
##$TI= <>
##$TILT= no
##$TM1= 0
##$TM2= 0
##$TOPLEV= 0
##$USERP1= <user>
##$USERP2= <user>
##$USERP3= <user>
##$USERP4= <user>
##$USERP5= <user>
##$WDW= 1
##$XDIM= 16384
##$YMAX_p= 372062365
##$YMIN_p= -676188
$$ End of Bruker specific parameters
$$ ---------------------------------
##NTUPLES= NMR SPECTRUM
##VAR_NAME=  FREQUENCY,     SPECTRUM/REAL,   SPECTRUM/IMAG
##SYMBOL=    X,             R,               I
##VAR_TYPE=  INDEPENDENT,   DEPENDENT,       DEPENDENT
##VAR_FORM=  AFFN,          ASDF,            ASDF
##VAR_DIM=   16384,         16384,           16384
##UNITS=     HZ,            ARBITRARY UNITS, ARBITRARY UNITS
##FACTOR=    0.220516191357247, 1,           1
##FIRST=     3088.36047280769, 0,            0
##LAST=      -524.356290198088, 0,           0
##MIN=       -524.356290198088, -676188,     0
##MAX=       3088.36047280769, 372062365,    0
$$ Real data points
##PAGE= N=1
##DATA TABLE= (X++(R..R)), XYDATA
$$ [...]
$$ plain form
11877 57401 -50675 -142475 -194927 -177197 -93779 -99556 20157 95456 -136744 -63128 -30285
11866 -30285 -102514 87132 131941 71006 19127 -93684 90888 -20098 464 43537 164895
11855 164895 160251 -158188 -118616 47417 111061 -8954 113560 224364 63124 -188851
11845 -188851 -223353 -277654 -285074 -127102 91358 79465 108649 147142 196817 -18820 -235542
11834 -235542 -63872 -51540 -65709 21361 110810 97767 70460 -19683 -193277 -145890 -72759
11823 -72759 26199 4131 2897 -51168 -120045 7432 -101141 2986 -100132 -138971 -125269
11812 -125269 -145149 2919 137395 27155 -177794 -80447 5795 -55334 -38889 104853
11802 104853 66395 -228748 -202905 -41946 -118618 -132309 -199492 -157069 -39395 -185637 -200482
$$ packed form
11877E7401j08076r1800n2452J7730Q3418n777J19713P5299k32200P3616L2843
11866c0285p2229J89646M4809o0935n1879j12811J84572j10986K0562M3073J21358
11855A64895m644l18439L9572J66033O3644j20015J22514J10804j61240k51975
11845a88851l4502n4301p420J57972K18460j1893K9184L8493M9675k15637k16722
11834b35542J71670J2332j4169Q7070Q9449j3043k7307r0143j73594M7387P3131
11823g2759R8958k2068j234n4065o8877J27477j08573J04127j03118l8839J3702
11812a25269j9880J48068J34476j10240k04949R7347Q6242o1129J6445J43742
11802A04853l8458k95143K5843J60959p6672j3691o7183M2423J17674j46242j4845
$$ plain form
11791 -200482 -216428 -46843 -36504 -65170 69235 -139558 -298742 -455484 -182051 -82527
11781 -82527 -209960 -206062 -136306 -67559 -61175 165351 162459 136272 -26244 85815 62998
11770 62998 90556 -147395 -198665 -12135 -13408 75814 -34300 -78169 -94296 79387 247484
11759 247484 34186 55897 138425 154423 -24013 34304 258152 44412 -123892 -92809
11749 -92809 -75837 -123096 -154891 -10579 143279 316146 -46745 -59323 30653 -42426 -39748
11738 -39748 -62153 52256 184294 193066 -12232 74453 -76191 -335762 -170708 -61277
11728 -61277 -199742 -135453 -243096 -223787 -379804 -92002 -251444 -153372 74513 83289 -140493
11717 -140493 -328277 -191847 -76200 28102 -11436 -152695 -131718 -160745 -266249 -380209
$$ packed form
11791b00482j5946J69585J0339k8666J34405k08793j59184j56742K73433R9524
11781h2527j27433L898O9756O8747O384K26526k892k6187j62516J12059k2817
11770F2998K7558k37951n1270J86530j273Q9222j10114m3869j6127J73683J68097
11759B47484k13298K1711Q2528J5998j78436N8317K23848k13740j68304L1083
11749i2809J6972m7259l1795J44312J53858J72867l62891j2578Q9976p3079K678
11738c9748k2405J14409J32038Q772k05298Q6685j50644k59571J65054J09431
11728f1277j38465O4289j07643J9309j56017K87802j59442R8072K27885Q776k23782
11717a40493j87784J36430J15647J04302l9538j41259K0977k9027j05504j13960
$$ plain form
11707 -380209 -150620 -180003 -153196 -117461 -184774 7808 -33215 51138 55083 164628 53321
11696 53321 -130306 127685 68944 34196 92936 -41876 -127905 128480 4780 19542 -55085
11685 -55085 -67703 288635 195428 -36876 -24792 -23165 -68369 31268 92459 -29446 -222965
11674 -222965 -261970 6919 28367 -66299 81835 -60664 -137264 -214063 -157628 -123895 35904
11663 35904 47783 94048 -23547 -105603 226973 53380 -189255 -157769 -671 222413
11653 222413 402409 236158 67423 44965 -75196 37572 -115081 -40525 -19763 -11010
11643 -11010 -36141 2902 -192961 51558 -88879 -147993 -242325 -234582 19405 -57019 -100139
11632 -100139 83697 156140 -22621 -137083 -139139 -31472 174467 -65839 -153203 -143791 -202080
$$ packed form
11707c80209K29589k9383K6807L5735o7313J92582m1023Q4353L945J09545j11307
11696E3321j83627K57991n8741l4748N8740j34812q6029K56385j23700J4762p4627
11685e5085j2618L56338r3207k32304J2084J627m5204R9637O1191j21905j93519
11674b22965l9005K68889K1448r4666J48134j42499p6600p6799N6435L3733J59799
11663C5904J1879M6265j17595q2056L32576j73593k42635L1486J57098K23084
11653B22413J79996j66251j68735k2458j20161J12768j52653P4556K0762Q753
11643a1010k5131L9043j95863K44519j40437n9114r4332P743K53987p6424m3120
11632a00139J83836P2443j78761j14462k056J07667K05939k40306q7364R412n8289
$$ plain form
11621 -202080 -122529 -142173 88432 -70239 -50151 138665 173862 -108731 47621 182443
11611 182443 93057 70170 126206 -57160 11283 38631 -66791 41990 -77881 38927
11601 38927 141887 121459 3332 -200172 -184551 -180550 -253384 -182262 66595 81363 -12167
11590 -12167 43693 130886 -282821 81679 183028 100400 203522 182269 109009 2610 -12416
11579 -12416 62479 23613 -20662 1073 -94221 65963 20956 -136461 71500 41656 -8918
11568 -8918 113143 23387 -40467 -139498 190455 -98130 101026 81608 -105460 -219258 -95065
11557 -95065 62247 -155743 -97239 -84044 -63470 61365 -108778 -23812 -3372 253404 346570
11546 346570 287052 202755 133538 169582 76428 38120 106889 121430 -79688 -54343 99831
$$ packed form
11621b02080P9551j9644K30605j58671K0088J88816L5197k82593J56352J34822
11611A82443q9386k2887N6036j83366O8443K7348j05422J08781j19871J16808
11601C8927J02960k0428j18127k03504J5621M001p2834P1122K48857J4768r3530
11590a2167N5860Q7193m13707L64500J01349q2628J03122k1253p3260j06399j5026
11579a2416P4895l8866m4275K1735r5294J60184m5007j57417K07961k9844n0574
11568h918J22061q9756o3854r9031L29953k88585J99156j9418j87068j13798J24193
11557i5065J57312k17990N8504J3195K0574J24835j70143Q4966K0440K56776R3166
11546C46570n9518q4297o9217L6044r3154l8308O8769J4541k01118K5345J54174
$$ plain form
11535 99831 29920 21113 34119 25527 87786 -70821 -156782 -219194 -133877 -169939 -130544 -205086
11523 -205086 26391 14020 128460 -390 -193725 -15222 -7620 -141871 -194061 -192688 -93143
11512 -93143 47392 219593 39950 -73377 32181 65219 159078 -172588 754 33364
11502 33364 -92193 -112804 -108751 -36992 -106829 -236427 69213 87289 -74395 136296 70476
11491 70476 174475 -16458 -27270 -52757 -115350 95802 -113999 87085 162249 168734 95955
11480 95955 16919 145168 1981 -10615 85378 76968 78685 118008 22925 -112957 -105763 -168930
11468 -168930 -223644 52676 120697 200333 223997 228886 58060 156826 74545 -117455 69016
11457 69016 155566 50731 -76208 -11012 192176 177650 39775 -18147 44656 -44627 -120699
$$ packed form
11535I9831o9911q807J3006q592O2259j58607q5961o2412Q5317l6062L9395p4542
11523b05086K31477j2371J14440j28850j93335J78503P602j34251n2190J373R9545
11512i3143J40535J72201j79643j13327J05558L3038R3859l31666J73342L2610
11502C3364j25557k0611M053P1759o9837j29598L05640J8076j61684K10691o5820
11491G0476J03999j90933j0812k5487o2593K11152k09801K01084P5164O485p2779
11480I5955p9036J28249j43187j2596R5993q410J717L9323r5083j35882P194o3167
11468a68930n4714K76320O8021P9636K3664M889j70826R8766q2281j92000J86471
11457F9016Q6550j04835j26939O5196K03188j4526j37875n7922O2803q9283p6072
$$ plain form
11446 -120699 -283298 -80526 -86298 -110026 -99293 -15885 -72223 -4478 -24277 -26761 -139072
11435 -139072 -33855 80850 -161374 -293609 -230432 -128772 -153972 -146014 -134999 -19666
11425 -19666 32755 104709 147293 -78599 -101608 -122802 -285363 -15443 59159 152934 311538
11414 311538 185093 -60364 13612 -255383 -286935 85 -76454 22864 233955 164298
11404 164298 286414 120830 127200 19616 191362 217258 272677 254250 52500 135465 69179
11393 69179 126202 151784 62019 267820 281978 238561 253655 204769 187382 169973 242563
11382 242563 368920 261329 132039 88748 56098 6591 89048 -97542 -80074 -33651 -168607
11371 -168607 -29504 144575 202079 200367 159366 97634 18106 112183 33780 -66779 -140313
$$ packed form
11446a20699j62599K02772n772k3728J0733Q3408n6338O7745j9799k484j12311
11435a39072J05217J14705k42224j32235O3177J01660k5200P958J1015J15333
11425a9666N2421P1954M2584k25892k3009k1194j62561K69920P4602R3775J58604
11414C11538j26445k45457P3976k68995l1552K87020p6539R9318K11091o9657
11404A64298J22116j65584O370j07584J71746K5896N5419j8427k01750Q2965o6286
11393F9179N7023K5582q9765K05801J4158m3417J5094m8886j7387j7409P2590
11382B42563J26357j07591j29290m3291l2650m9507Q2457j86590J7468M6423j34956
11371a68607J39103J74079N7504j712m1001o1732p9528R4077p8403j00559p3534
$$ plain form
11360 -140313 -152840 -220186 -169778 -134647 191276 77471 -202227 35447 96586 92319 -97329
11349 -97329 -156409 -91364 -145829 -149534 -145139 -4572 23015 37305 378320 312409 166381
11338 166381 99180 -23238 46013 -77169 -130040 19646 172632 256550 303516 143113
11328 143113 195308 114235 62066 303717 73319 119359 -17504 -62990 -16265 -3092 69738
11317 69738 -19388 134685 251085 157936 428913 166369 -79125 -9819 -10904 -117799 -178416
11306 -178416 -236354 -76803 -109738 -204800 -182101 -48192 68955 85933 142879 248318 192838
11295 192838 284414 160461 283303 160219 57194 129079 128167 283796 238015 332744 360723
11284 360723 189942 134971 140979 4666 -42510 17343 109579 -18675 -58520 45972 -20056
$$ packed form
11360a40313j2527o7346N0408L5131L25923j13805k79698K37674O1139m267j89648
11349i7329n9080O5045n4465l705M395J40567K7587J4290L41015o5911j46028
11338A66381o7201j22418O9251j23182n2871J49686J52986Q3918M6966j60403
11328A43113N2195q1073n2169K41651k30398M6040j36863m5486M6725J3173P2830
11317F9738q9126J54073J16400r3149K70977k62544k45494O9306j085j06895o0617
11306a78416n7938J59551l2935r5062K2699J33909J17147J6978N6946J05439n5480
11295A92838R1576j23953J22842j23084j03025P1885r12J55629m5781R4729K7979
11284C60723j70781n4971O008j36313m7176N9853R2236j28254l9845J04492o6028
$$ plain form
11273 -20056 89477 54633 -32596 -197960 38529 7061 -27092 47010 -70705 -89928 63189
11262 63189 -24043 -148876 -142756 -141542 -87605 -139743 -127721 -182997 -245791 -214330 -67985 -111746
11250 -111746 50051 85750 58461 222987 100154 221762 344803 324308 561919 337482
11240 337482 108500 118384 -19011 86219 281718 235696 157048 166550 189027 40420 -31854
11229 -31854 -126329 -174757 -141717 -169643 -223276 -68931 -1692 85432 26682 22012 -131424
11218 -131424 14754 173163 109840 38082 1618 -97160 123911 104030 110517 -114315 -67157
11207 -67157 198004 317731 147726 180297 87016 81336 168052 176796 287832 161636 110665
11196 110665 -25179 -46103 -74180 -199076 -11953 402349 329246 356179 142657 -83906
$$ packed form
11273b0056J09533l4844q7229j65364K36489l1468l4153P4102j17715j9223J53117
11262F3189q7232j24833O120J214N3937n2138J2022n5276o2794L1461J46345m3761
11250a11746J61797L5699k7289J64526j22833J21608J23041k0495K37611k24437
11240C37482k28982R884j37395J05230J95499m6022p8648R502K2477j48607p2274
11229c1854r4475m8428L3040k7926n3633J54345O7239Q7124n8750m670j53436
11218a31424J46178J58409o3323p1758l6464r8778K21071j9881O487k24832M7158
11207f7157K65161J19727j70005L2571r3281n680Q6716Q744J11036j26196n0971
11196A10665j35844k0924k8077j24896J87123M14302p3103K6933k13522k26563
$$ plain form
11186 -83906 181619 170760 -69572 -83199 -33477 -75165 16683 -73181 72798 579 -93029
11175 -93029 30049 -8287 6518 -214566 79727 75037 -73170 -45697 -94537 -18644 28873
11164 28873 15225 91038 141127 113183 -85936 -177329 -136002 46473 178035 62267 131200
11153 131200 100350 -102888 77656 41508 -44550 -98899 21941 207090 315928 131891
11143 131891 16024 -162752 -356713 -270348 -167335 -142059 -170057 11156 78558 -48173
11133 -48173 -136627 -135146 -192829 -56851 -92191 -104590 -46811 -86560 98287 197952 106910
11122 106910 82295 166549 -36876 -214067 -20319 -78497 -77383 -52569 -68659 87606 -58910
11111 -58910 -35299 230218 -55043 78743 168271 115545 13183 -164079 101760 88532
$$ packed form
11186h3906K65525j0859k40332j3627M9722m1688R1848q9864J45979p2219r3608
11175i3029J23078l8336J4805k21084K94293m690j48207K7473m8840P5893M7517
11164B8873j3648P5813N0089k7944j99119r1393M1327J82475J31562j15768O8933
11153A31200l0850k03238J80544l6148q6058n4349J20840J85149J08838j84037
11143A31891j15867j78776j93961Q6365J03013K5276k7998J81213O7402j26731
11133d8173q8454J481n7683J35978l5340j2399N7779l9749J84847R9665r1042
11122A06910k4615Q4254k03425j77191J93748n8178J114K4814j6090J56265j46516
11111e8910K3611K65517k85261J33786Q9528n2726j02362j77262K65839j3228
$$ plain form
11101 88532 205443 30928 -70552 -114770 -97698 -33224 161667 -78147 -239985 10272
11091 10272 -144504 45184 73183 -30471 -86472 -6141 153433 140947 20425 137522
11081 137522 -99395 -217578 -147300 -69304 67787 92301 94932 16131 -138202 -349036 -237210
11070 -237210 -415536 -395276 -352873 -160795 4897 -81998 13231 315436 45417 -217369
11060 -217369 -43959 -139738 -149047 142046 7977 -154761 104304 228917 244609 96768
11050 96768 64133 -4937 -6148 -156767 -202561 130697 321954 249058 325788 123433 17730
11039 17730 188530 67343 -102850 -255358 -205170 52840 159615 148593 158448 -70754
11029 -70754 -244170 -317140 -139163 -225600 -319374 -184520 -177213 -273897 -94217 155072 108078
$$ packed form
11101H8532J16911j74515j01480m4218J7072O4474J94891k39814j61838K50257
11091A0272j54776J89688K7999j03654n6001Q0331J59574j2486j20522J17097
11081A37522k36917j18183P0278P7996J37091K4514K631p8801j54333k10834J11826
11070b37210j78326K0260M2403J92078J65692q6895R5229L02205k70019k62786
11060b17369J73410r5779r309K91093j34069j62738K59065J24613J5692j47841
11050I6768l2635o9070j211j50619m5794L33258J91257p2896P6730k02355j05703
11039A7730J70800j21187j70193j52508N0188K58010J06775j1022R855k29202
11029g0754j73416p2970J77977q6437r3774J34854P307r6684J79680K49289m6994
$$ plain form
11018 108078 49193 15947 -12139 105555 89059 -50069 -90528 -191322 -47938 -12987 -14888
11007 -14888 -164939 -174690 163396 54708 68648 26176 -33895 -101462 -110957 -152288 -106309
10996 -106309 -78721 -53796 19774 55140 229128 116575 257133 139289 89764 -72762
10986 -72762 -57865 -60571 26817 240826 150991 234422 113376 46403 223883 283771 199214
10975 199214 27399 -125431 -73765 -35470 -74552 20714 -22321 64 -195182 -64746 -153036
10964 -153036 -272376 9445 67256 298 7314 29836 3114 10118 307979 93162 -113133
10953 -113133 -43076 140915 -25672 -124296 189353 276182 138403 192480 128327 45780 150626
10942 150626 373988 111922 12346 288103 188781 29996 -124608 -6681 72002 118691
$$ packed form
11018A08078n8885l3246k8086J17694j6496j39128m0459j00794J43384L4951j901
11007a4888j50051r751L38086j08688J3940m2472o0071o7567r495m1331M5979
10996a06309K7588K4925P3570L5366J73988j12553J40558j17844m9525j62526
10986g2762J4897k706Q7388K14009q9835Q3431j21046o6973J77480N9888q4557
10975A99214j71815j52830N1666L8295l9082R5266m3035K2385j95246J30436q8290
10964a53036j19340K81821N7811o6958P016K2522k6722P004K97861k14817k06295
10953a13133P0057J83991j66587r8624L13649Q6829j37779N4077o4153q2547J04846
10942A50626K23362k62066r9576K75757r9322j58785j54604J17927P8683M6689
$$ plain form
10932 118691 69850 119116 94133 -68007 -91604 -37664 -164945 61249 -49269 -98211 -190266
10921 -190266 -23691 288894 138452 -2797 48072 120394 120400 210836 138163 -64089 63829
10910 63829 288190 284943 183635 274894 114372 50163 118197 176486 81200 28659 239821
10899 239821 179787 77301 -31600 38462 100352 35532 -70094 2701 -157865 -265384
10889 -265384 -313496 -48438 264878 254058 122717 -55392 50357 98926 167108 -47884
10879 -47884 -129842 -56806 197316 60822 13725 138640 391527 143553 284922 297611
10869 297611 119330 -170677 -258102 -157118 33815 -57302 144621 361124 320354 151717
10859 151717 94356 243992 27558 -36290 -33424 80285 10658 98352 249657 167438 -136607
$$ packed form
10932A18691m8841M9266k4983j62140k3597N3940j27281K26194j10518m8942r2055
10921a90266J66575L12585j50442j41249N0869P2322OR0436p2673k02252J27918
10910F3829K24361l247j01308R1259j60522o4209O8034N8289r5286n2541K11162
10899B39821o0034j02486j08901P0062O1890o4820j05626P2795j60566j07519
10889b65384m8112K65058L13316j0820j31341j78109J05749M8569O8182k14992
10879d7884q1958P3036K54122j36494m7097J24915K52887k47974J41369J2689
10869B97611j78281k90007q7425J00984J90933r1117K01923K16503m0770j68637
10859A51717n7361J49636k16434o3848K866J13709o9627Q7694J51305q2219l04045
$$ plain form
10848 -136607 -5027 -24805 -16509 -42454 -70601 80906 -136703 -148839 100339 -9477 -23093
10837 -23093 -43867 113789 189567 198070 342036 330238 21396 -49650 175859 130311 108683
10826 108683 120599 85392 302886 120985 237641 125887 14888 29244 9221 -24857
10816 -24857 16380 44527 208492 108813 -167288 -114612 -139703 45344 -34274 149849 98988
10805 98988 108862 125399 160655 157138 23826 176525 146355 214007 55720 57086 66246 13917
10793 13917 -96130 111680 186512 50680 -13492 52736 -170133 -88762 99179 261423
10783 261423 268120 85724 235202 307021 124840 106455 152679 203830 389080 511164 8816
10772 8816 -37303 4766 -17861 -167939 23483 102810 -112412 -21583 28768 -25344 192564
$$ packed form
10848a36607J31580j9778Q296k5945k8147J51507k17609j2136K49178j09816j3616
10837b3093k0774J57656P5778Q503J43966j1798l08842p1046K25509m5548k1628
10826A08683J1916l5207K17494j81901J16656j11754j10999J4356k0023l4078
10816b4857M1237K8147J63965r9679k76101N2676k5091J85047p9618J84123n0861
10805I8988R874J6537L5256l517j33312J52699l0170O7652j58287J366R160n2329
10793A3917j10047K07810P4832j35832o4172O6228k22869Q1371J87941J62244
10783B61423O697j82396J49478P1819j82181j8385M6224N1151J85250J22084n02348
10772H816m6119M2069k2627j50078J91422P9327k15222R0829N0351n4112K17908
$$ plain form
10761 192564 174272 -16649 19850 105691 681 -80918 68759 -108926 -46487 24293 48059
10750 48059 125045 258539 236491 400541 251747 202922 -15870 152035 -234207 -95781
10740 -95781 107575 -158791 -201980 107876 37043 -106057 -74439 -23083 -75850 171035 46825
10729 46825 -86210 -63039 -45127 5292 -43493 -34709 93767 113004 81207 44634 -13326
10718 -13326 65789 -55321 65393 69995 225774 228152 101396 161468 124544 72346 106042
10707 106042 -58434 110950 274942 190283 28248 285357 250406 266967 391473 289669
10697 289669 120713 173570 170449 -16104 -95261 82488 19085 -202326 -88097 11049 210081
10686 210081 339582 353729 225492 301914 250763 223880 71006 84241 22530 95868 410312
$$ packed form
10761A92564j8292j90921L6499Q5841j05010q1599J49677j77685O2439P0780K3766
10750D8059P6986J33494k2048J64050j48794m8825k18792J67905l86242J38426
10740i5781K03356k66366m3189L09856p0833j43100L1618N1356n2767K46885j24210
10729D6825j33035K3171J7912N0419m8785Q784J28476J9237l1797l6573n7960
10718a3326P9115j21110J20714M602J55779K378j26756O0072l6924n2198L3696
10707A06042j64476J69384J63992q4659j62035K57109l4951J6561J24506j01804
10697B89669j68956N2857l121j86553p9157J77749o3403k21411J14229R9146J99032
10686B10081J29501J4147j28237P6422n1151k6883j52874J3235o1711P3338L14444
$$ plain form
10675 410312 303504 299705 135220 28793 141160 140573 121435 60099 116112 -195 96503
10664 96503 325665 364189 40399 51934 69643 54144 162513 229584 124687 26330 -8804
10653 -8804 -102621 -143040 -17463 110552 272308 420062 392661 299076 229026 21995 -50646
10642 -50646 179330 259401 402639 175652 303210 585592 532825 132778 237932 41386
10632 41386 -84504 -47137 112566 134734 108259 209121 153299 254731 330532 320729 152882
10621 152882 300571 481793 275579 340690 182728 354732 390850 328464 289163 118480
10611 118480 6169 67710 152870 204332 377398 579356 445300 446339 503575 374957 306490
10600 306490 313161 268017 385917 499607 380246 575342 361098 449154 340930 293662
$$ packed form
10675D10312j06808l799j64485j06427J12367n87j9138o1336N6013j16307R6698
10664I6503K29162L8524l23790J1535J7709j5499J08369O7071j04897r8357l5134
10653h804r3817m0419J25577J28015J61756J47754k7401r3585p0050k07031p2641
10642e0646K29976Q0071J43238k26987J27558K82382n2767m00047J05154j96546
10632D1386j25890L7367J59703K2168k6475J00862n5822J01432P5801r803j67847
10621A52882J47689J81222k06214O5111j57962J72004L6118o2386l9301j70683
10611A18480j12311O1541Q5160N1462J73066K01958j34056J039N7236j28618o8467
10600C06490O671m5144J17900J13690j19361J95096k14244Q8056j08224m7268
$$ plain form
10590 293662 244503 250079 195847 73155 135966 376613 256865 130389 71612 359435 482401
10579 482401 276156 496163 576038 457584 537577 635195 446139 554581 712426 721139
10569 721139 607581 537370 464891 505513 407478 241129 460536 474325 335503 341495 408902
10558 408902 363043 454802 424197 552413 536527 433542 561814 401665 673702 659270
10548 659270 655301 698828 545675 537529 726851 582443 535050 667433 434663 585312 1058175
10537 1058175 966522 853362 912784 977458 1189428 1217740 1389488 1553390 1605001 1876566
10527 1876566 1999922 1992260 1800473 1809552 1821696 1664370 1754533 1350272 973097 967265 1163926
10516 1163926 1045016 907902 934415 1025350 981315 924823 665722 754964 1034182 1022622
$$ packed form
10590B93662m9159N576n4232j22692O2811K40647j19748j26476n8777K87823J22966
10579D82401k06245K20007P9875j18454P9993R7618j89056J08442J57845Q713
10569G21139j13558p0211p2479M0622r8035j66349K19407J3789j38822N992O7407
10558D08902m5859R1759l0605J28216j5886j02985J28272j60149K72037j4432
10548F59270l969M3527j53153q146J89322j44408m7393J32383k32770J50649M72863
10537A058175r1653j13160N9422O4674K11970K8312J71748J63902N1611K71565
10527A876566J23356p662j91787R079J2144j57326R0163m04261l77175n832J96661
10516A163926j18910j37114K6513R0935m4035n6492k59101Q9242K79218j1560
$$ plain form
10506 1022622 994329 934284 883627 820808 940583 1004840 1020322 1108951 1276201 1241140 1184246
10495 1184246 1233476 1549441 1671045 1735201 1632771 1393575 1648974 1857144 2273226 2489417
10485 2489417 2611067 3069920 3424895 3680099 3924273 4189879 4348105 4283073 4115602 3584156
10475 3584156 3174449 2910103 2808474 2337937 1945744 1644297 1551829 1475112 1403504 1446887
10465 1446887 1262282 1177197 1332431 1302471 1270357 1385448 1309358 1027411 912093 1099041
10455 1099041 1188743 1340411 1336261 1126411 982174 1310558 1399067 1792626 1767367 1579628
10445 1579628 1460684 1678824 1793252 1861462 2155064 2214110 2270114 2592548 3084021 3320273
10435 3320273 3681824 3820919 4057188 4068051 3806409 3597824 3245499 2933556 2517736 2048344
$$ packed form
10506A022622k8293o0045n0657o2819J19775O4257J5482Q8629J67250l5061n6894
10495A184246M9230L15965J21604O4156j02430k39196K55399K08170M16082K16191
10485B489417J21650M58853L54975K55204K44174K65606J58226o5032j67471n31446
10475C584156m09707k64346j01629m70537l92193l01447r2468p6717p1608M3383
10465A446887j84605q5085J55234k9960l2114J15091p6090k81947j15318J86948
10455A099041Q9702J51668m150k09850j44237L28384Q8509L93559k5259j87739
10445A579628j18944K18140J14428O8210K93602N9046N6004L22434M91473K36252
10435C320273L61551J39095K36269J0863k61642k08585l52325l11943m15820m69392
$$ plain form
10425 2048344 1829585 1722078 1516604 1436142 1427480 1447950 1250440 1166919 1045550 966194
10415 966194 940017 1014526 1136736 1095900 1244240 1166596 784553 692850 817355 865313 828178
10404 828178 704652 757722 848387 792913 807507 816991 1141991 1154389 972729 1216217 1322993
10393 1322993 1345055 1160385 1425904 1646713 1849618 1998128 1982343 1826391 1966147 1819189
10383 1819189 1592263 1576826 1544766 1493691 1297894 1191419 944160 984565 1077379 862061
10373 862061 571222 339201 622843 626505 581322 734749 645933 698425 719288 690868 694190
10362 694190 697410 448444 384836 450762 527604 483926 433352 483514 446935 459324 478309
10351 478309 490498 395349 537896 703846 800547 915286 550187 687531 797693 752371
$$ packed form
10425B048344k18759j07507k05474q0462q662K0470j97510q3521j21369p9356
10415I66194k6177P4509J22210m0836J48340p7644l82043r1703J24505M7958l7135
10404H28178j23526N3070R0665n5474J4594R484L25000J2398j81660K43488J06776
10393A322993K2062j84670K65519K20809K02905J48510j5785j55952J39756j46958
10383A819189k26926j5437l2060n1075j95797j06475k47259M0405R2814k15318
10373H62061k90839k32021K83642L662m5183J53427q8816N2492K0863k8420L322
10362F94190L220k48966o3608O5926P6842m3678n0574N0162l6579J2389J8985
10351D78309J2189r5149J42547J65950R6701J14739l65099J37344J10162m5322
$$ plain form
10341 752371 895575 1066258 1182766 1060571 812406 638249 501980 479972 526746 616738
10331 616738 467652 697272 853591 781848 482304 270834 116829 222082 414660 338097
10321 338097 302514 599297 268852 238436 595809 519996 343876 351095 554551 581115 500478
10310 500478 391283 465494 475012 626770 614347 703105 658929 487568 540184 286863 157800
10299 157800 295639 357161 632030 607821 577855 470405 425830 279029 373964 594248
10289 594248 560851 489748 370250 209781 480041 416547 285132 375549 387967 415877 522979
10278 522979 403070 495385 233627 159055 498417 618444 460739 634012 654345 617791
10268 617791 586201 402777 425237 389272 535125 534731 495330 432251 595601 484271 521487
$$ packed form
10341G52371J43204J70683J16508j22195k48165j74157j36269k2008M6774Q9992
10331F16738j49086K29620J56319p1743k99544k11470j54005J05253J92578p6563
10321C38097l5583K96783l30445l0416L57373p5813j76120P219K03456K6564q0637
10310E00478j09195P4211R518J51758j2423Q8758m4176j71361N2616k53321j29063
10299A57800J37839O1522K74869k4209k9966j07450m4575j46801R4935K20284
10289E94248l3397p1103j19498j60469K70260o3494j31415R0417J2418K7910J07102
10278E22979j19909R2315k61758p4572L39362J20027j57705J73273K0333l6554
10268F17791l1590j83424K2460l5965J45853l94l9401o3079J63350j11330L7216
$$ plain form
10257 521487 683899 708267 599872 639163 787265 897810 865105 786215 717779 619062 950185
10246 950185 1059570 945123 979992 913311 997105 1054720 863941 824257 685695 767127 703658
10235 703658 644740 499272 626639 665120 883741 915866 741526 703634 737255 964802
10225 964802 844046 651609 797741 786260 724653 697428 643862 756217 911939 966771
10215 966771 906536 969422 927717 998835 989372 841486 902160 982375 798544 881188 1229821
10204 1229821 1179042 956844 920922 1044733 993566 812371 913742 625486 657446 532179
10194 532179 605505 659338 761694 965637 987903 787443 643772 718202 878834 708334
10184 708334 477087 601587 677531 702475 789890 674914 722455 728268 673550 491200 647689
$$ packed form
10257E21487J62412K4368j08395L9291J48102J10545l2705p8890o8436r8717L31123
10246I50185J09385j14447L4869o6681Q3794N7615j90779l9684j38562Q1432o3469
10235G03658n8918j45468J27367L8481K18621L2125j74340l7892L3621K27547
10225I64802j20756j92437J46132j1481o1607k7225n3566J12355J55722N4832
10215I66771o0235O2886m1705P1118r463j47886O0674Q0215j83831Q2644L48633
10204A229821n0779k22198l5922J23811n1167j81195J01371k88256L1960j25267
10194E32179P3326N3833J02356K03943K2266k00460j43671P4430J60632j70500
10184G08334k31247J24500P5944K4944Q7415j14976M7541N813n4718j82350J56489
$$ plain form
10173 647689 514682 554424 550559 485387 676008 600472 651257 709335 587473 548546 570725
10162 570725 811554 923717 999309 935096 764238 968843 980406 1050082 1025213 1022974 960610
10151 960610 800644 724207 808027 1008120 1322982 1170444 948002 953431 894069 1017499
10141 1017499 1042982 1092280 1029420 1032255 1135082 1213874 1169846 1201970 1160022 1020731 1067926
10130 1067926 1153990 1112216 1252389 1278359 1201164 1079069 1044579 1306041 1263091 1272811 1007388
10119 1007388 1079962 1197557 1250774 1192303 1091108 1159020 1264912 1334104 1515377 1354420
10109 1354420 1398153 1396637 1506568 1469810 1353277 1224197 1153243 1133782 1189792 1200482 1365628
10098 1365628 1236258 1208995 1149142 1114817 1428175 1263146 1058889 1233209 1350435 1188184
$$ packed form
10173F47689j33007L9742l865o5172J90621p5536N0785N8078j21862l8927K2179
10162E70725K40829J12163P5592o4213j70858K04605J1563O9676k4869k239o2364
10151I60610j59966p6437Q3820K00093L14862j52538k22442N429n9362J23430
10141A017499K5483M9298o2860K835J02827P8792m4028L2124m1948j39291M7195
10130A067926Q6064m1774J40173K5970p7195j22095l4490K61462m2950R720k65423
10119A007388P2574J17595N3217n8471j01195O7912J05892O9192J81273j60957
10109A354420M3733j516J09931l6758j16533j29080p0954j9461N6010J0690J65146
10098A365628j29370k7263n9853l4325L13358j65029k04257J74320J17226j62251
$$ plain form
10088 1188184 1117974 1330775 1317484 1062183 1194911 1317891 1426609 1322830 1273026 1423729
10078 1423729 1382739 1397637 1652207 1607183 1474137 1432530 1418631 1428839 1503997 1782407 1961154
10067 1961154 1911999 1915916 1758663 1874306 1999277 2090568 2120330 2134588 2052002 1796582 1626991
10056 1626991 1815208 2117097 2081206 2034709 2042788 2056758 1873484 1786594 1815152 1937269 2006010
10045 2006010 2154709 1996110 1871452 1781506 1775654 1722995 1778720 1782293 1807268 1798808 1561285
10034 1561285 1620130 1803693 1918110 1854195 1796430 1725821 1652943 1869827 2064362 2018252
10024 2018252 2274121 2183650 2156965 1973310 2066793 2029884 1956289 2029804 1938834 1900159 1858562
10013 1858562 2114932 2204037 2344277 2679098 2479446 2394190 2432799 2209059 2137056 2141527
$$ packed form
10088A188184p0210K12801j3291k55301J32728J22980J08718j03779m9804J50703
10078A423729m0990J4898K54570m5024j33046m1607j3899J0208P5158K78410J78747
10067A961154m9155L917j57253J15643J24971R1291K9762J4258q2586k55420j69591
10056A626991J88217L01889l5891m6497Q079J3970j83274q6890K8558J22117O8741
10045B006010J48699j58599j24658q9946n852n2659N5725L573K4975q460k37523
10034A561285N8845J83563J14417o3915n7765p0609p2878K16884J94535m6110
10024B018252K55869r0471k6685j83655R3483l6909p3595P3515r0970l8675m1597
10013A858562K56370Q9105J40240L34821j99652q5256L8609k23740p2003M471
$$ plain form
10003 2141527 2119227 2225432 2236686 2342508 2291902 2289490 2321266 2621263 2692412 2350018 2482571
9992 2482571 2644612 2612516 2993721 2994351 2968356 3025794 3081297 3259475 3292108 3628734 3809989
9981 3809989 3947459 4124206 4389168 4446314 4486195 4660268 4521166 4476942 4000918 3630828
9971 3630828 3461414 3077750 3317259 3420769 3165381 3142002 3194598 3031483 3311754 3273530
9961 3273530 3115656 3105066 3152321 3217829 3213202 3040887 2819512 3027097 3069559 3156069 3254170
9950 3254170 3254367 3508712 3298156 3226807 3517144 3447131 3413878 3291102 3186713 3298362 3387570
9939 3387570 3531948 3491668 3796885 3927239 3640397 3534441 3718960 3989140 4251193 4176162
9929 4176162 4098447 4300955 4291007 4410944 4569428 4564553 4590940 4715003 4690616 4676889 5118066
$$ packed form
10003B141527k2300J06205J1254J05822n0606k412L1776K99997P1149l42394J32553
9992B482571J62041l2096L81205O30k5995N7438N5503J78178L2633L36626J81255
9981C809989J37470J76747K64962N7146L9881J74073j39102m4224m76024l70090
9971C630828j69414l83664K39509J03510k55388k3379N2596j63115K80271l8224
9961C273530j57874j0590M7255O5508m627j72315k21375K07585M2462Q6510R8101
9950C254170J97K54345k10556p1349K90337p0013l3253j22776j04389J11649Q9208
9939C387570J44378m0280L05217J30354k86842j05956J84519K70180K62053p5031
9929D176162p7715K02508r948J19937J58484m875K6387J24063k4387j3727M41177
$$ plain form
9918 5118066 5162710 5023310 5123404 5544879 5648721 5703226 5851151 5890146 5893872 5918405 6125650
9907 6125650 6195080 6218531 6422446 6528344 6424963 6772251 6988625 7161579 7336756 7291570
9897 7291570 7352409 7658517 7574585 7845162 8113579 8231334 7998472 7996745 8251511 8412769
9887 8412769 8409963 8387533 8547024 8707142 8545068 8389944 8363646 8318057 8487673 8447296 8204751
9876 8204751 8444491 8715126 8780246 8653886 8585881 8492561 8593289 8899173 8884508 9116654
9866 9116654 9034121 8631765 8925749 9363562 9191141 9326744 9523036 9653033 10024098 10092353
9856 10092353 10075992 10330431 10621518 10921824 11184959 11615734 12058115 12484061 13112808 13774388
9846 13774388 14208210 15217837 16087136 17036953 17819538 18813956 19626335 20349604 21064388
$$ packed form
9918E118066M4644j39400J00094M21475J03842N4505J47925L8995L726K4533K07245
9907F125650O9430K3451K03915J05898j03381L47288K16374J72954J75177m5186
9897G291570O0839L06108q3932K70577K68417J17755k32862j727K54766J61258
9887H412769k806k2430J59491J60118j62074j55124k6298m5589J69616m0377k42545
9876H204751K39740K70635O5120j26360o8005r3320J00728L05884j4665K32146
9866I116654q2533m02356K93984M37813j72421J35603J96292J29997L71065O8255
9856A0092353j6361K54439K91087L00306K63135M30775M42381M25946O28747O61580
9846A3774388M33822J009627Q69299R49817P82585R94418Q12379P23269P14784
$$ plain form
9837 21064388 22174705 23081934 23466140 24153742 24503364 24695978 24709843 24298628 24194399
9828 24194399 24211041 23860001 23672724 23167644 22568820 21884109 20892095 20202879 19891560 19531799
9818 19531799 19088822 18680633 18196098 17972549 17800288 17568835 17379476 17520183 17764134
9809 17764134 17960434 18106738 18106892 18213388 18275027 18468923 18799201 19250354 19589911 20269467
9799 20269467 20912972 21495438 22275590 23237730 24094422 24803836 26061731 26937751 27888657
9790 27888657 28981159 29755257 30653099 31472384 32246138 32869819 33713188 34348216 34759111
9781 34759111 35087148 35602897 36055088 36515395 37266454 37939512 38352842 38524967 38666726
9772 38666726 39601291 40591932 41784514 43416050 45118629 47340145 50045153 53466489
$$ packed form
9837B1064388J110317R07229L84206O87602L49622J92614J3865m11215j04229
9828B4194399J6642l51040j87277n05080n98824o84711r92014o89216l11319l59761
9818A9531799m42977m08189m84535k23549j72261k31453j89359J40707K43951
9809A7764134J96300J46304J54J06496O1639J93896L30278M51153L39557O79556
9799B0269467O43505N82466P80152R62140Q56692P09414J257895Q76020R50906
9790B7888657J092502P74098Q97842Q19285P73754O23681Q43369O35028M10895
9781C4759111L28037N15749M52191M60307P51059O73058M13330J72125J41759
9772C8666726R34565R90641J192582J631536J702579K221516K705008L421336
$$ plain form
9764 53466489 57416893 61522423 64206442 65620872 65973683 64908890 63917849 63137907 63201144
9755 63201144 63579481 63948897 63258778 61910739 59045005 54990646 50938037 46943552 43261987
9746 43261987 40103574 37612583 35508627 33831453 32203569 31167675 30413037 29848788
9738 29848788 29385285 29157708 29031759 28919948 29088556 29315113 29349267 29526122 29551530 29960619
9728 29960619 30478541 31047710 31577066 31967477 32619983 33026740 33333088 33889223 34317469
9719 34317469 35056031 35730365 36336913 37009392 37909496 38720810 39695385 40941543 42600990
9710 42600990 44224152 45610618 47241182 48673043 50304037 51716031 53084858 53910113
9702 53910113 54661784 55404108 56155315 57141292 58083133 58701862 59699325 61002657 62583597
$$ packed form
9764E3466489L950404M105530K684019J414430L52811j064793r91041p79942O3237
9755F3201144L78337L69416o90119j348039k865734m054359m052609l994485l681565
9746D3261987l158413k490991k103956j677174j627884j035894p54638n64249
9738B9848788m63503k27577j25949j11811J68608K26557L4154J76855K5408M09089
9728B9960619N17922N69169N29356L90411O52506M06757L06348N56135M28246
9719C4317469P38562O74334O06548O72479R00104Q11314R74575J246158J659447
9710D2600990J623162J386466J630564J431861J630994J411994J368827Q25255
9702E3910113P51671P42324P51207R85977R41841O18729R97463J303332J580940
$$ plain form
9693 62583597 64603630 66719476 69328911 72900442 77554050 83108078 89850757 96773610
9685 96773610 103092395 107271377 108644541 107380502 104260836 101764369 101196750 102579100
9677 102579100 105617415 108639454 109304540 107209780 102030936 94813866 87454129 81433543
9669 81433543 76496035 72145451 68795798 65906011 63498570 61497104 59540103 57860670
9661 57860670 56644539 55495574 54762847 53772997 52611708 51206899 49823316 48578306
9653 48578306 47304609 46484990 46004819 45540072 45099363 44544895 44007771 43600394 42961247
9644 42961247 42290455 42239246 42145302 42556381 43100031 43877568 45068270 46210485 47353520
9635 47353520 48959589 50522811 51506030 52351009 53089695 53748398 54260529 54342473 53618899
$$ packed form
9693F2583597K020033K115846K609435L571531M653608N554028O742679O922853
9685I6773610O318785M178982J373164j264039l119666k496467n67619J382350
9677A02579100L038315L022039O65086k094760n178844p217070p359737o020586
9669H1433543m937508m350584l349653k889787k407441k001466j957001j679433
9661E7860670j216131j148965p32727r89850j161289j404809j383583j245010
9653D8578306j273697q19619m80171m64747m40709n54468n37124m07377o39147
9644D2961247o70792n1209r3944M11079N43650P77537J190702J142215J143035
9635D7353520J606069J563222R83219Q44979P38686O58703N12131Q1944p23574
$$ plain form
9626 53618899 52794833 51915673 50529144 49222183 47472528 45928954 44815663 43683745
9618 43683745 42658248 41587436 40470967 39416183 38883767 38289591 38063294 37990716 38175315
9609 38175315 38380336 38453551 38005341 37654416 37713521 38059170 38690310 39802361 40835395
9600 40835395 41710974 42008034 42091502 42084742 41624504 41281912 40877503 40298322 39308373 38334259
9590 38334259 37290697 35737310 34157314 32611365 31320612 30058972 28716148 27268164
9582 27268164 25783558 24313786 22706414 21055982 19726044 18792843 17709804 16949738
9574 16949738 16332506 15672988 15295203 15181085 14845807 14295818 13646500 13301066 13174884
9565 13174884 12939042 12811580 12492881 12072112 11515875 10921627 10523312 10231388 9568096
$$ packed form
9626E3618899q24066q79160j386529j306961j749655j543574j113291j131918
9618D3683745j025497j070812j116469j054784n32416n94176k26297p2578J84599
9609C8175315K05021P3215m48210l50925N9105L45649O31140J112051J033034
9600D0835395Q75579K97060Q3468o760m60238l42592m04409n79181r89949r74114
9590C8334259j043562j553387j579996j545949j290753j261640j342824j447984
9582B7268164j484606j469772j607372j650432j329938r33201j083039p60066
9574A6949738o17232o59518l77785j14118l35278n49989o49318l45434j26182
9565A3174884k35842j27462l18699m20769n56237n94248l98315k91924o63292
$$ plain form
9556 9568096 9203946 9146213 8805105 8566154 8512731 8291495 8146975 8041462 7783485 7673850
9546 7673850 7615194 7336866 7470642 7301526 6819881 6805430 6690714 6379271 6479711 6333348
9536 6333348 6194258 6092383 6264939 6466743 6231778 6129308 6076182 6229907 5951985 5648987
9526 5648987 5525891 5919846 5857789 6026363 5794258 5702052 5772130 5628717 5673030 5715171
9516 5715171 5807762 5891159 5968677 6056254 5885114 5988200 5839526 5706915 5647211 5680784 5652202
9505 5652202 5596559 5371826 5175625 5217597 5253356 5247255 4989729 5363725 5493417 5264039
9495 5264039 5170543 5262455 4917648 4880930 4917944 4936261 5055065 4999628 4789264 4896122 4788834
9484 4788834 4671839 4669527 4778743 4526544 4267267 4222965 4516041 4325425 4318951 4237330 4212071
$$ packed form
9556I568096l64150n7733l41108k38951n3423k21236j44520j05513k57977j09635
9546G673850n8656k78328J33776j69116m81645j4451j14716l11443J00440j46363
9536F333348j39090j01875J72556K01804k34965j02470n3126J53725k77922l02998
9526E648987j23096L93955o2057J68574k32105r2206P0078j43413M4313M2141
9516E715171R2591Q3397P7518Q7577j71140J03086j48674j32611n9704L3573k8582
9505E652202n5643k24733j96201M1972L5759o101k57526L73996J29692k29378
9495E264039r3496R1912l44807l6718L7014J8317J18804n5437k10364J06858j07288
9484D788834j16995k312J09216k52199k59277m4302K93076j90616o474q1621k5259
$$ plain form
9473 4212071 4246625 4197005 4080790 3989919 3715196 3890460 4004775 3676309 3948467 4097029
9463 4097029 4105949 4017177 3894853 3858299 3893884 3735574 4041526 4252642 4212162 4120975 4136753
9452 4136753 4049404 3922014 3707220 3817331 4026860 4087333 4013049 4129415 4009734 4053274
9442 4053274 3999579 3818929 3727727 3766360 3882022 3799209 4069483 4287088 4268712 3963345
9432 3963345 3768952 3909358 3909949 3947189 3918012 4227733 4381115 4345585 4390832 4242980 4235232
9421 4235232 4500768 4481683 4621051 4815471 4853933 4881437 4897845 4522491 4764428 4982093
9411 4982093 4876133 4857529 5115694 5253312 5127232 5241424 5356059 5593102 5662223 5528351
9401 5528351 5777774 6353327 6677658 6701089 6960446 6960862 6697017 6546264 6294380 6046542
$$ packed form
9473D212071L4554m9620j16215r0871k74723J75264J14315l28466K72158J48562
9463D097029Q920q8772j22324l6554L5585j58310L05952K11116m0480r1187J5778
9452D136753q7349j27390k14794J10111K09529O0473p4284J16366j19681M3540
9442D053274n3695j80650r1202L8633J15662q2813K70274K17605j8376l05367
9432C963345j94393J40406N91L7240k9177L09721J53382l5530M5247j47852p748
9421D235232K65536j9085J39368J94420L8462K7504J6408l75354K41937K17665
9411D982093j05960j8604K58165J37618j26080J14192J14635K37043O9121j33872
9401E528351K49423N75553L24331K3431K59357M16k63845j50753k51884k47838
$$ plain form
9391 6046542 6130248 5909752 5628791 5969907 5892617 5949633 5919149 5875138 6029798 5958983 6040231
9380 6040231 6075379 5966269 6132868 6377403 6414735 6394609 6526806 6597439 6804191 6935824
9370 6935824 7107753 7360073 7723804 7732118 7970817 8050613 8197521 7962238 7705683 7756611
9360 7756611 7879185 7943910 8038784 8177261 8645943 8843109 9271665 9515947 9101304 8907061
9350 8907061 8921325 9017956 8866992 8847156 8949058 8746374 8411422 8110544 7780036 7271759
9340 7271759 7298689 7537806 7354401 7151391 7374499 7597381 7509097 7352116 7441880 7392036
9330 7392036 7758271 8292143 8575192 9007441 9274570 9779269 10552534 11393013 12161681 12783596
9320 12783596 13182194 13540092 13286356 12844662 12296483 12461220 12919501 12987332 12996843 12451925
$$ packed form
9391F046542Q3706k20496k80961L41116p7290N7016l0484m4011J54660p0815Q1248
9380F040231L5148j09110J66599K44535L7332k0126J32197P0633K06752J31633
9370F935824J71929K52320L63731Q314K38699P9796J46908k35283k56555N0928
9360G756611J22574O4725R4874J38477M68682J97166M28556K44282m14643j94243
9350H907061J4264R6631j50964j9836J01902k02684l34952l00878l30508n08277
9340G271759K6930K39117j83405k03010K23108K22882q8284j56981Q9764m9844
9330G392036L66235N33872K83049M32249K67129N04699P73265Q40479P68668O21915
9320A2783596L98598L57898k53736m41694n48179J64737M58281O7831R511n44918
$$ plain form
9310 12451925 11495291 10543858 9791018 9142278 8617544 8371212 8038299 7865007 7639033
9301 7639033 7648340 7554527 7521671 7378558 7279973 7260909 7307128 7162737 6916517 7026611 6987191
9290 6987191 6989963 7034651 7116084 7233530 7169630 6936811 7058808 7106176 6933425 7435334 7662257
9279 7662257 7656373 7684255 7659327 7758630 7750146 8169451 8095880 7966382 8155137 8124533 8159739
9268 8159739 8152302 8245392 8139223 8331309 8327400 8248168 8341229 8390867 8660913 8587986 8586924
9257 8586924 8770803 8930004 9159324 9230914 9466017 9507754 9958324 10172101 10215063 10685239
9247 10685239 10725519 10865211 11016852 11161895 11345010 11395022 11205731 11205113 11457530 11422403
9237 11422403 11516597 11690909 11741229 11947920 12295400 12144251 12479882 12745004 12617769 12545476
$$ packed form
9310A2451925r56634r51433p52840o48740n24734k46332l32913j73292k25974
9301G639033R307r3813l2856j43113r8585j9064M6219j44391k46220J10094l9420
9290F987191K772M4688Q1433J17446o3900k32819J21997M7368j72751N01909K26923
9279G662257n884K7882k4928R9303q484M19305p3571j29498J88755l0604L5206
9268H159739p437R3090j06169J92086l909p9232R3061M9638K70046p2927j062
9257H586924J83879J59201K29320P1590K35103M1737M50570K13777M2962M70176
9247A0685239M0280J39692J51641J45043J83115N0012j89291o18K52417l5127
9237A1422403R4194J74312N0320K06691L47480j51149L35631K65122j27235p2293
$$ plain form
9227 12545476 12695545 12938020 13089589 12969991 13063938 13652604 13736527 13619717 14129026 14611121
9217 14611121 14901421 15384343 15734263 16054299 16270677 16853052 17279354 17557508 18089881
9208 18089881 18559353 18780311 19332662 19950381 20425267 20737672 21571641 22576357 23255724
9199 23255724 23992361 24558011 24951513 25165609 25122680 25514381 26218899 27136256 27597835 28032815
9189 28032815 28028561 28008905 28116074 28085193 28252370 28548607 29004479 29537488 30149681 31097146
9179 31097146 31797581 32370299 33137256 34100451 35341555 36592683 38097308 40129816 42080837
9170 42080837 44643386 47743280 51017106 54720660 58779056 62542451 65212650 67234896
9162 67234896 69444834 71348741 72643570 74341957 76534850 79055964 81208918 82623487
$$ packed form
9227A2545476J50069K42475J51569j19598R3947N88666Q3923j16810N09309M82095
9217A4611121K90300M82922L49920L20036K16378N82375M26302K78154N32373
9208A8089881M69472K20958N52351O17719M74886L12405Q33969J004716O79367
9199B3255724P36637N65650L93502K14096m2929L91701P04518R17357M61579M34980
9189B8032815m254j9656J07169l0881J67177K96237M55872N33009O12193R47465
9179C1097146P00435N72718P66957R63195J241104J251128J504625K032508J951021
9170D2080837K562549L099894L273826L703554M058396L763395K670199K022246
9162F7234896K209938J903907J294829J698387K192893K521114K152954J414569
$$ plain form
9154 82623487 83367003 82969501 81094067 78476103 75651379 73729794 72945777 72905751 73027178
9145 73027178 72353937 71084893 69301777 67161936 65893772 65125992 65029723 65154504 65606372
9136 65606372 66284854 66884771 67967182 69758125 71985090 75029632 78710507 82704179
9128 82704179 87264365 91926521 96242358 99815773 102281737 103969424 104835667 104839683 105175261
9119 105175261 107095036 109976360 113142852 115135162 114325577 111106109 106792665 101706206
9111 101706206 97021124 93893344 91655055 89936316 88594290 86725507 84384305 81509663
9103 81509663 78435689 76380058 75391215 75107214 75460834 75696756 76521972 77813164 79725265
9094 79725265 82371966 85286010 87674166 89487810 90593836 90787855 90712050 89413457 87554536
$$ packed form
9154H2623487P43516l97502j875434k617964k824724j921585p84017m0026J21427
9145G3027178o73241j269044j783116k139841j268164p67780r6269J24781M51868
9136F5606372O78482N99917J082411J790943K226965L044542L680875L993672
9128H2704179M560186M662156M315837L573415K465964J687687Q66243M016L35578
9119A05175261J919775K881324L166492J992310q09585l219468m313444n086459
9111A01706206m685082l127780k238289j718739j342026j868783k341202k874642
9103H1509663l073974k055631r88843k84001L53620K35922Q25216J291192J912101
9094G9725265K646701K914044K388156J813644J106026J94019p5805j298593j858921
$$ plain form
9085 87554536 85673985 83022555 79880257 76074710 71316146 66754735 62444282 58465491
9077 58465491 54611550 51582828 49122926 47135428 45643963 45214851 45302859 45284020 45401025
9068 45401025 45846005 46745776 48552666 50414159 52312951 54604668 57084857 59557474
9060 59557474 62078079 64372653 66088693 67516002 68107564 67696495 66269167 64387827
9052 64387827 62144364 59426040 56681835 53356872 50051127 46868680 44371101 42432249
9044 42432249 40702541 39485569 38488392 37960578 37780683 37803548 38149392 38895584 39644399
9035 39644399 39942917 40956994 41814083 42084264 42683603 43382053 43805090 44137828 44098113
9026 44098113 43982940 44139953 44334135 44166070 44017488 44081655 43473835 43338009 42973113 42210238
$$ packed form
9085H7554536j880551k651430l142298l805547m758564m561411m310453l978791
9077E8465491l853941l028722k459902j987498j491465m29112Q8008j8839J17005
9068D5401025M44980Q99771J806890J861493J898792K291717K480189K472617
9060E9557474K520605K294574J716040J427309N91562m11069j427328j881340
9052F4387827k243463k718324k744205l324963l305745l182447k497579j938852
9044D2432249j729708j216972r97177n27814j79895K2865L45844P46192P48815
9035C9644399K98518J014077Q57089K70181N99339O98450M23037L32738l9715
9026D4098113j15173J57013J94182j68065j48582O4167o07820j35826l64896p62875
$$ plain form
9016 42210238 41642162 41103127 40508531 39892735 39410296 39121249 38880085 38507559 38066401
9007 38066401 38295671 38648208 39028042 39104159 39460719 40354826 41060551 41911689 43093333
8998 43093333 44228477 44859899 45617160 46511521 46701177 46834400 46979034 46826128 46378548
8989 46378548 46396983 46602338 46598016 46711095 47011663 47199805 47680545 48423447 49216933 49947056
8979 49947056 50601546 51461457 52690963 54172762 55886104 57315132 58838888 60437738
8971 60437738 62097345 63947206 65953310 67952723 69856552 71663993 73435353 75215698
8963 75215698 76956387 78926850 80618946 82079244 83786383 85651095 88224184 91226031
8955 91226031 94802143 98370372 101952754 104537643 106159650 107293392 108823894 111262843
$$ packed form
9016D2210238n68076n39035n94596o15796m82439k89047k41164l72526m41158
9007C8066401K29270L52537L79834P6117L56560Q94107P05725Q51138J181644
8998D3093333J135144O31422P57261Q94361J89656J33223J44634j52906m47580
8989D6378548J8435K05355m322J13079L00568J88142M80740P42902P93486P30123
8979D9947056O54490Q59911J229506J481799J713342J429028J523756J598850
8971F0437738J659607J849861K006104J999413J903829J807441J771360J780345
8963G5215698J740689J970463J692096J460298J707139J864712K573089L001847
8955I1226031L576112L568229L582382K584889J622007J133742J530502K438949
$$ plain form
8947 111262843 114605877 118702242 122698734 126057593 128092569 128108593 127292026 125810241
8939 125810241 124487866 124118723 125943036 128994320 133857411 140230889 148753831 159623570
8931 159623570 173788092 192324948 216978605 248371776 289492921 328006821 358248531
8924 358248531 372062365 334074490 281106689 236154420 201775345 181641709 167262763
8917 167262763 158241755 151388604 145756969 139928572 134850785 130438767 127830451 125777051
8909 125777051 124156903 123104971 123055847 123256794 123955121 125061892 126313149 127601168 129031819
8900 129031819 129812371 129630352 128163077 124981053 119558961 113271098 107270862 102097742
8892 102097742 98104636 95472845 93566405 92036278 90725316 89968580 89255932 88612803
$$ packed form
8947A11262843L343034M096365L996492L358859K034976J6024q16567j481785
8939A25810241j322375l69143J824313L051284M863091O373478Q522942J0869739
8931A59623570J4164522J8536856K4653657L1393171M1121145L8513900L0241710
8924C58248531J3813834l7987875n2967801m4952269l4379075k0133636j4378946
8917A67262763r021008o853151n631635n828397n077787m412018k608316k053400
8909A25777051j620148j051932m9124K00947O98327J106771J251257J288019J430651
8900A29031819P80552j82019j467275l182024n422092o287863o000236n173120
8892A02097742l993106k631791j906440j530127j310962p56736p12648o43129
$$ plain form
8884 88612803 88035511 87409058 86884451 86364074 85834646 85153075 83376451 81463027 80255018
8875 80255018 79735761 80085872 81007594 82415201 84056707 85979008 88061899 90493311 93099247
8866 93099247 94968528 96378642 97321889 97502907 97405269 97593809 97462045 96657095 94436853
8857 94436853 91154265 86753540 82098002 77635347 73927528 71226316 69751832 68769802
8849 68769802 68323559 68283578 68799564 69294254 69536880 69460819 69033511 68189572 67170104 66739841
8839 66739841 66356105 66400029 66581194 66975512 67920348 68929575 70353556 72503877 74816963
8830 74816963 77225840 79861124 82551114 84576101 85755046 85886657 84917478 83013049
8822 83013049 81175612 79555457 78921998 78778859 79238663 80233306 81292867 82752730 84215914
$$ packed form
8884H8612803n77292o26453n24607n20377n29428o81571j776624j913424j208009
8875H0255018n19257L50111R21722J407607J641506J922301K082891K431412K605936
8866I3099247J869281J410114R43247J81018r7638J88540j31764q04950k220242
8857I4436853l282588m400725m655538m462655l707819k701212j474484r82030
8849F8769802m46243l9981N15986M94690K42626p6061m27308q43939j019468m30263
8839F6739841l83736M3924J81165L94318R44836J009227J423981K150321K313086
8830G4816963K408877K635284K689990K024987J178945J31611r69179j904429
8822H3013049j837437j620155o33459j43139M59804R94643J059561J459863J463184
$$ plain form
8813 84215914 86331207 88589412 91035674 93060436 94486794 95574764 95901869 95876856 95154161
8804 95154161 93138080 90871787 88944254 87654917 86997488 86510271 85592183 83537589 80672319
8795 80672319 77566511 74520812 71803769 69671246 68505099 67919693 67612770 67169929 66846218
8786 66846218 66774510 66504717 66097961 65577317 65155118 64886964 65179602 66275849 67838313
8777 67838313 69715190 71489597 73032896 74474236 75780779 76887235 78016983 78866393
8769 78866393 79511236 79596856 78952753 77571834 76195918 74644995 72882520 71798828 70978162
8760 70978162 70998460 71548247 72450752 73099086 73087255 71772275 69222387 65953966 62566910
8751 62566910 58785782 54749703 51002802 47446629 44333217 41430908 38989935 37413533
$$ packed form
8813H4215914K115293K258205K446262K024762J426358J087970L27105k5013p22695
8804I5154161k016081k266293j927533j289337o57429m87217r18088k054594k865270
8795H0672319l105808l045699k717043k132523j166147n85406l06923m42841l23711
8786F6846218p1708k69793m06756n20644m22199k68154K92638J096247J562464
8777F7838313J876877J774407J543299J441340J306543J106456J129748Q49410
8769G8866393O44843Q5620o44103j380919j375916j550923j762475j083692q20666
8760G0978162K0298N49787R02505O48334j1831j314980k549888l268421l387056
8751F2566910l781128m036079l746901l556173l113412k902309k440973j576402
$$ plain form
8743 37413533 36399330 36224722 36293414 36816818 37326966 37988729 37826072 36907274 35519653
8734 35519653 33725369 32267761 30663761 29009689 27448567 25935586 24251652 22902298
8726 22902298 21747297 20634206 19784641 19160805 18705647 17971449 17502987 16816876 16474019
8717 16474019 16059131 15805905 15459656 14990209 14717438 14438106 14150160 13859031 13715850
8708 13715850 13557377 13435572 13374726 13169275 13071378 12881205 12719465 12742330 12628853 12664736
8698 12664736 12541796 12444264 12102935 11999332 11999227 11975529 12063374 12112056 11878681 11483062 11461441
8687 11461441 11588084 11906203 11921453 11968157 12007135 11827586 11883797 11907454 11696540 11566010
8677 11566010 11654562 11526395 11487052 11576678 11789465 11630321 12028674 11862765 11743328 11701466
$$ packed form
8743C7413533j014203j74608O8692N23404N10148O61763j62657r18798j387621
8734C5519653j794284j457608j604000j654072j561122j512981j683934j349354
8726B2902298j155001j113091q49565o23836m55158p34198m68462o86111l42857
8717A6474019m14888k53226l46249m69447k72771k79332k87946k91129j43181
8708A3715850j58473j21805o0846k05451r7897j90173j61740K2865j13477L5883
8698A2664736j22940r7532l41329j03603j05k3698Q7845M8682k33375l95619k1621
8687A1461441J26643L18119J5250M6704L8978j79549N6211K3657k10914j30530
8677A1566010Q8552j28167l9343Q9626K12787j59144L98353j65909j19437m1862
$$ plain form
8667 11701466 11835157 11854467 11846029 11935881 12097928 12284150 12324324 12252806 12137753 12420988
8657 12420988 12453376 12422229 12466688 12402902 12378895 12637544 12627347 12746676 12882442 13070516
8647 13070516 13371562 13266698 13472669 13693037 13868764 14245207 14402649 14452080 14564144 14961122
8637 14961122 15293640 15631427 15821465 16169710 16734397 17085871 17417596 17858378 18136488
8628 18136488 18285011 18526795 18495768 18852119 19108687 19425424 19801227 20228693 21103395 21629742
8618 21629742 22318273 23528756 24273145 25218032 26541639 27543135 28290671 28936836 29424910
8609 29424910 29675591 29893931 29972790 30195198 30639339 31345119 32714706 33868872 35301945
8600 35301945 36680089 37429750 37849064 37822739 36880856 36372667 35930144 35189845 34742966
$$ packed form
8667A1701466J33691J9310q438Q9852J62047J86222M0174p1518j15053K83235
8657A2420988L2388l1147M4459o3786k4007K58649j0197J19329J35766J88074
8647A3070516L01046j04864K05971K20368J75727L76443J57442M9431J12064L96978
8637A4961122L32518L37787J90038L48245N64687L51474L31725M40782K78110
8628A8136488J48523K41784l1027L56351K56568L16737L75803M27466Q74702N26347
8618B1629742O88531J210483P44389R44887J323607J001496P47536O46165M88074
8609B9424910K50681K18340P8859K22408M44141P05780J369587J154166J433073
8600C5301945J378144P49661M19314k6325r41883n08189m42523p40299m46879
$$ plain form
8591 34742966 34747959 34750740 34843310 34893099 34885082 34358086 33341577 32726934 32147299 31823626 31646956
8580 31646956 31828270 31687124 32146993 32206982 32735453 33701888 34261337 35225291 36436244
8571 36436244 37625949 38606150 39310056 39446560 39276889 38956100 39002258 39343578 39640978
8562 39640978 40764961 42470260 44199829 45572704 46575428 46903650 46384685 44996328
8554 44996328 43188473 41447761 39656678 38118075 37289449 36455132 35847038 35118908 34508979
8545 34508979 33690269 32656260 31306835 29803805 28448275 27520382 26277380 25398036 24542884
8536 24542884 23674044 23112799 22612295 22533348 22710759 22741597 22826270 22823141 22460142 22086695
8526 22086695 21496479 21243587 21013897 20621677 20668891 20974427 21523362 22314941 22857775 23367622
$$ packed form
8591C4742966M993K781R2570M9789q017n26996j016509o14643n79635l23673j76670
8580C1646956J81314j41146M59869N9989N28471R66435N59449R63954J210953
8571C6436244J189705R80201P03906J36504j69671l20789M6158L41320K97400
8562C9640978J123983J705299J729569J372875J002724L28222n18965j388357
8554D4996328j807855j740712j791083j538603q28626q34317o08094p28130o09929
8545C4508979q18710j034009j349425j503030j355530r27893j243002q79344q55152
8536B4542884q68840n61245n00504p8947J77411L0838Q4673l129l62999l73447
8526B2086695n90216k52892k29690l92220M7214L05536N48935P91579N42834N09847
$$ plain form
8516 23367622 23067530 22556221 21675150 20576817 19677664 18683219 18006469 17525186 16875722
8507 16875722 16666572 16453584 16266318 15939113 15209305 14374484 13539860 13091616 12703894
8498 12703894 12147997 11551252 11084364 10480815 9828020 9676623 9521187 9203700 8928168
8489 8928168 8713555 8541831 8339074 8266983 8105810 7780083 7815398 7847002 7732743 7597827
8479 7597827 7337894 7287737 7445178 7432324 7173936 7105327 7182832 7138626 7118226 7016809 6994367
8468 6994367 7105891 7265570 7235453 7306498 7318621 7051663 6781175 6985814 7206879 7314318
8458 7314318 7286799 7420171 7522955 7522150 7639702 7907813 8341031 8274472 8438604 8984451
8448 8984451 9054656 9070571 8888937 8429987 8024911 8144677 8372668 8513625 8467378 8570956
$$ packed form
8516B3367622l00092n11309q81071j098333q99153r94445o76750m81283o49464
8507A6875722k09150k12988j87266l27205p29808q34821q34624m48244l87722
8498A2703894n55897n96745m66888o03549o52795j51397j55436l17487k75532
8489H928168k14613j71724k02757p2091j61173l25727L5315L1604j14259j34916
8479G597827k59933n0157J57441j2854k58388o8609P7505m4206k0400j01417k2442
8468F994367J11524J59679l0117P1045J2123k66958k70488K04639K21065J07439
8458G314318k7519J33372J02784q05J17552K68111M33218o6559J64132N45847
8448H984451P0205J5915j81634m58950m05076J19766K27991J40957m6247J03578
$$ plain form
8438 8570956 8942248 9000940 9001711 9099161 9105157 9486948 9274566 9021858 8962037 8884574 8946753
8427 8946753 9144474 9195113 9333547 9613590 9504247 9843085 10502759 10613821 10592336 10910086
8417 10910086 11288308 11555209 11505889 11701035 11747982 11952623 11908659 11754653 11562767 11356218
8407 11356218 11165203 10740801 10562579 10968214 11150762 11078655 11385833 11558146 11800426 12017640
8397 12017640 11905904 12325864 12418054 12413296 12086386 11845743 11682332 11435823 11158666 11010456
8387 11010456 10883677 10848318 10724360 10686702 10870773 10955682 10814042 10888922 11051336 11089474
8377 11089474 11118102 10905992 10817134 10605215 10295150 9804839 9552854 9467146 8940277 8676140
8367 8676140 8432740 8256664 8167072 8043859 8142841 8324595 8384097 8287939 7911562 7795525
$$ packed form
8438H570956L71292N8692P71R7450N996L81791k12382k52708n9821p7463O2179
8427H946753J97721N0639J38434K80043j09343L38838O59674J11062k1485L17750
8417A0910086L78222K66901m9320J95146M6947K04641m3964j54006j91886k06549
8407A1356218j91015m24402j78222M05635J82548p2107L07178J72313K42280K17214
8397A2017640j11736M19960R2190m758l26910k40643j63411k46509k77157j48210
8387A1010456j26779l5359j23958l7658J84071Q4909j41640P4880J62414L8138
8377A1089474K8628k12110q8858k11919l10065m90311k51985q5708n26869k64137
8367H676140k43400j76076q9592j23213R8982J81754N9502r6158l76377j16037
$$ plain form
8357 7795525 8324991 8041829 7894187 7742550 7190134 6861502 6785896 6522902 6292300 6046264
8347 6046264 5773695 5501224 5553552 5657469 5568816 5387031 5210525 5050611 5083534 5105373
8337 5105373 5071805 4958256 4887041 4933742 4628108 4463445 4326094 4254967 4184825 4064153
8327 4064153 4007796 3855620 3830026 3942507 3764315 3718707 3701548 3572429 3635573 3569703 3609884
8316 3609884 3659011 3470616 3599279 3508528 3272390 3238460 3299043 3404462 3542622 3636892
8306 3636892 3683792 3910309 3721323 3720583 3787478 3771213 3903722 3940914 3935310 3779378 4116907
8295 4116907 4011620 3758821 4042128 4068886 4152886 4254076 4421071 4446227 4486851 4615350
8285 4615350 4579333 4375491 4493847 4643775 4515166 4454183 4679677 4864833 4792963 4659132
$$ packed form
8357G795525N29466k83162j47642j51637n52416l28632p5606k62994k30602k46036
8347F046264k72569k72471N2328J03917q8653j81785j76506j59914L2923K1839
8337E105373l3568j13549p1215M6701l05634j64663j37351p1127p0142j20672
8327D064153n6357j52176k5594J12481j78192m5608j7159j29119O3144o5870M0181
8316C609884M9127j88395J28663r0751k36138l3930O0583J05419J38160R4270
8306C636892M6900K26517j88986p40O6895j6265J32509L7192n604j55932L37529
8295D116907j05287k52799K83307K6758Q4000J01190J66995K5156M0624J28499
8285D615350l6017k03842J18356J49928j28609o0983K25494J85156p1870j33831
$$ plain form
8275 4659132 4863901 5066713 4795490 4938178 5213521 5363273 5445304 5394425 5613287 5582137
8265 5582137 5835253 5925334 6014620 6118878 6031472 6043300 6263406 6351405 6380885 6521323 6585804
8254 6585804 6869895 6987725 7259472 7521193 7714677 8294389 8867640 8898136 9360451 9866271
8244 9866271 10267889 10528370 10772508 10762007 10547710 10311952 10555826 10728641 10834862 11047107
8234 11047107 11401553 11770018 12115650 12800090 13230660 13524752 14037064 14360994 14698147
8225 14698147 14949901 14855330 14707084 14424300 14144857 13919438 13817103 13521611 13575234 13744047
8215 13744047 13827002 14099817 14037897 14172577 14414403 14756808 14892128 14868181 14937681 15160655
8205 15160655 14995948 14978304 14630464 14168276 13880440 13521020 13192877 12771073 12851969 12974541
$$ packed form
8275D659132K04769K02812k71223J42688K75343J49752Q2031n0879K18862l1150
8265E582137K53116R0081Q9286J04258q7406J1828K20106Q7999K9480J40438O4481
8254F585804K84091J17830K71747K61721J93484N79712N73251L0496M62315N05820
8244I866271M01618K60481K44138j0501k14297k35758K43874J72815J06221K12245
8234A1047107L54446L68465L45632O84440M30570K94092N12312L23930L37153
8225A4698147K51754r4571j48246k82784k79443k25419j02335k95492N3623J68813
8215A3744047Q2955K72815o1920J34680K41826L42405J35320k3947O9500K22974
8205A5160655j64707j7644l47840m62188k87836l59420l28143m21804Q0896J22572
$$ plain form
8195 12974541 12950665 13268933 13762673 13441783 14361364 14941023 15472473 15728224 15950298 16029974
8185 16029974 16075964 15832907 15388592 14884641 14083425 13651019 13149460 12756156 12217415 11925720
8175 11925720 12241352 12605310 12694132 12899606 13149285 13247832 13174352 13001356 12610267 12221495
8165 12221495 11537747 10680259 9804551 9153509 8584427 8417759 8024457 7668283 7478607
8156 7478607 7352469 7100027 7033535 7154931 7162667 7224343 7079292 6943795 6906239 6777286
8146 6777286 6736846 6395607 6056511 5702278 5428422 5011804 4876006 4824835 4578378 4638585
8136 4638585 4383963 4311404 4402280 4260503 4572108 4758542 4811769 4761930 4763178 4557764 4379130
8125 4379130 4203309 3891481 3624276 3487233 3415077 3145224 3201656 3026244 2915566 2747020
$$ packed form
8195A2974541k3876L18268M93740l20890R19581N79659N31450K55751K22074P9676
8185A6029974M5990k43057m44315n03951q01216m32406n01559l93304n38741k91695
8175A1925720L15632L63958Q8822K05474K49679R8547p3480j72996l91089l88772
8165A2221495o83748q57488q75708o51042n69082j66668l93302l56174j89676
8156G478607j26138k52442o6492J21396P736O1676j45051j35497l7556j28953
8146F777286m0440l41239l39096l54233k73856m16618j35798n1171k46457O0207
8136D638585k54622p2559R0876j41777L11605J86434N3227m9839J248k05414j78634
8125D379130j75821l11828k67205j37043p2156k69853N6432j75412j10678j68546
$$ plain form
8115 2747020 2877365 2767569 2629923 2574887 2692100 2792699 2645263 2573176 2630925 2590684
8105 2590684 2406464 2353174 2395051 2249156 2301795 2162477 1935252 1896816 1885251 1937052 1993553
8094 1993553 2002924 1912105 1725128 1792664 1866883 1691400 1676679 1746534 1703888 1510434 1417533
8083 1417533 1630411 1682810 1640126 1506601 1524325 1721463 1711593 1540451 1439213 1493300 1474862
8072 1474862 1547484 1605561 1511864 1254915 1441472 1404776 1376148 1435854 1091937 1203833 1250460
8061 1250460 1221517 901681 856250 997821 1013971 1031170 973308 1114686 779925 911652
8051 911652 1127662 1153890 1196573 989629 1115443 1117377 875038 856074 773193 890010 883510
8040 883510 823303 689941 804466 770475 654380 727135 836595 1092050 892506 712643
$$ packed form
8115B747020J30345j09796j37646n5036J17213J00599j47436p2087N7749m0241
8105B590684j84220n3290M1877j45895N2639j39318k27225l8436j1565N1801N6501
8094A993553R371r0819j86977O7536P4219j75483j4721O9855m2646j93454r2901
8083A417533K12878N2399m2684j33525J7724J97138r870j71142j01238N4087j8438
8072A474862P2622N8077r3697k56949J86557l6696k8628N9706l43917J11896M6627
8061A250460k8943l19836m5431J41571J6150J7199n7862J41378l34761J31727
8051I11652K16010K6228M2683k06944J25814J934k42339j8964q2881J16817o500
8040H83510o0207j33362J14525l3991j16095P2755J09460K55455j99544j79863
$$ plain form
8030 712643 826704 925407 937292 1006359 936879 839263 908174 817472 753078 661112 1035362
8019 1035362 1243198 909565 893865 900056 832693 701053 531265 800106 939004 926556
8009 926556 650883 558733 796777 735726 644916 591616 811191 912696 654988 569534 652521
7998 652521 427092 278514 423748 501536 505122 301122 260091 327524 380727 365346 412019
7987 412019 267948 309257 611240 570986 503926 537542 530317 444853 358557 393255 398897 396721
7975 396721 173380 181663 125867 152369 259379 219964 377199 440355 463127 592053 553179
7964 553179 390250 412768 245571 114190 341006 711170 570681 440806 354258 489599
7954 489599 505963 405597 116070 289743 334557 253547 257492 411963 528276 610182 524152
$$ packed form
8030G12643J14061R8703J1885O9067o9480r7616O8911r0702o4394r1966L74250
8019A035362K07836l33633j5700O191o7363j31640j69788K68841J38898j2448
8009I26556k75673r2150K38044o1051r0810n3300K19575J01505k57708q5454Q2987
7998F52521k25429j48578J45234P7788L586k04000m1031O7433N3203j5381M6673
7987D12019j44071M1309L01983m0254o7060L3616p225q5464q6296L4698N642k176
7975C96721k23341Q283n5796K6502J07010l9415J57235O3156K2772J28926l8874
7964E53179j62929K2518j67197j31381K26816L70164j40489j29875q6548J35341
7954D89599J6364j00366k89527J73673M4814q1010L945J54471J16313Q1906q6030
$$ plain form
7943 524152 412502 507643 348989 471933 604853 602466 774038 850322 722982 586483
7933 586483 718408 756188 685906 658670 808267 915497 695269 618880 763916 931670
7923 931670 914504 1099758 1191789 1017799 957225 802677 799291 877472 870521 698757 631780
7912 631780 754286 826877 748713 583870 645483 713434 728964 716983 550659 639594 789199
7901 789199 715631 889470 997351 743490 584443 881814 955297 1022406 915663 928064
7891 928064 1187499 1452215 1140917 1019735 1021219 885031 930221 884511 947390 906666 1203649
7880 1203649 1143079 851419 734777 707196 638872 653307 630302 906809 993393 800958 800830
7869 800830 644661 786166 1080360 879243 705722 799815 672615 613681 1000789 1117527
$$ packed form
7943E24152j11650R5141j58654J22944J32920k387J71572P6284j27340j36499
7933E86483J31925L7780p0282k7236J49597J07230k20228p6389J45036J67754
7923I31670j7166J85254R2031j73990o0574j54548l386P8181o951j71764o6977
7912F31780J22506P2591p8164j64843O1613O7951J5530j1981j66324Q8935J49605
7901G89199p3568J73839J07881k53861j59047K97371P3483O7109j06743J2401
7891I28064K59435K64716l11298j21182J484j36188M5190m5710O2879m0724K96983
7880A203649o0570k91660j16642k7581o8324J4435k3005K76507Q6584j92435j28
7869H00830j56169J41505K94194k01117j73521R4093j27200n8934L87108J16738
$$ plain form
7859 1117527 861358 785980 778204 649869 584173 604235 558418 609499 565648 487703 662148
7848 662148 481406 484635 710290 507403 630421 627153 420861 380232 594271 627615 889093
7837 889093 915624 640912 816840 586912 510104 518147 502619 710561 663174 944039 770704
7826 770704 820899 718090 682377 730175 847532 810745 728499 614803 772961 821081 711808
7815 711808 817919 832378 708042 609199 571251 850202 793309 763962 672411 1091720 983484
7804 983484 389073 640096 449038 667157 539619 683575 762052 924898 924102 617518
7794 617518 703759 906602 667503 654874 712737 649572 487676 682208 1048706 942003
7784 942003 682020 607283 694568 624611 661436 676440 531590 596115 655077 432753 667060
$$ packed form
7859A117527k56169p5378p776j28335o5696K0062m5817N1081m3851p7945J74445
7848F62148j80742L229K25655k02887J23018l268k06292m0629K14039L3344K61478
7837H89093K6531k74712J75928k29928p6808Q043j5528K07942m7387K80865j73335
7826G70704N0195j02809l5713M7798J17357l6787q2246j13696J58158M8120j09273
7815G11808J06111J4459j24336r8843l7948K78951n6893k9347r1551M19309j08236
7804I83484n94411K51023j91058K18119j27538J43956P8477J62846p96l06584
7794F17518Q6241K02843k39099j2629N7863o3165j61896J94532L66498j06703
7784I42003k59983p4737Q7285o9957L6825J5004j44850O4525N8962k22324K34307
$$ plain form
7773 667060 1038315 858863 779985 648781 910137 946798 1000029 843146 768932 1023437
7763 1023437 1060586 1117040 837022 638969 871900 960188 670335 691473 595182 716317
7753 716317 864601 750959 817859 808331 899280 869920 1118303 999690 947640 958736 706688
7742 706688 727046 759443 672934 699179 677258 962308 1061512 1093440 1093785 1009886 884973 780674
7730 780674 1117941 1297002 1321619 1289156 1335721 1468480 1368948 1225547 1435268 1459861 1489579
7719 1489579 1388098 1617942 1623315 1735231 1818018 1809331 2028091 1912778 1767445 1834141 2059174
7708 2059174 1985470 1845428 1898449 2157584 2128455 2202087 2400371 2704734 3053876 3357201
7698 3357201 3779719 4105652 4556109 4669791 4772476 4428991 4311937 4405562 4194789 4141962
$$ packed form
7773F67060L71255j79452p8878j31204K61356L6661N3231j56883p4214K54505
7763A023437L7149N6454k80018j98053K32931Q8288k89853K1138r6291J21135
7753G16317J48284j13642O6900r528R0949k9360K48383j18613n2050J1096k52048
7742G06688K0358L2397q6509K6245k1921K85050R9204L1928L45q3899j24913j04299
7730G80674L37267J79061K4617l2463M6565J32759r9532j43401K09721K4593K9718
7719A489579j01481K29844N373J11916Q2787q687K18760j15313j45333O6696K25033
7708B059174p3704j40042N3021K59135k9129P3632J98284L04363L49142L03325
7698C357201M22518L25933M50457J13682J02685l43485j17054R3625k10773n2827
$$ plain form
7688 4141962 4467285 4828974 5510385 6107837 6710974 7042481 7077680 6923879 6257782 5428725
7678 5428725 4430245 3495107 2920440 2500468 2254404 1945356 1602127 1429404 1400170 1446426
7668 1446426 1431343 1320535 1239627 1379753 1616149 1189613 891788 916562 1016069 930819
7658 930819 765695 838706 928674 932369 577161 507662 522462 451169 553548 720677 811175
7647 811175 942319 864274 759181 537723 467133 551293 603575 560762 573676 331407 541102
7636 541102 619987 585139 438979 225917 369437 436507 378412 453063 347875 446687 440133
7625 440133 399254 430381 328555 161984 249967 194194 131646 288404 359089 440917 115562
7614 115562 250693 296302 233862 248456 150839 242131 82443 -90921 31199 212787 265259
$$ packed form
7688D141962L25323L61689O81411N97452O03137L31507L5199j53801o66097q29057
7678E428725r98480r35138n74667m19972k46064l09048l43229j72723k9234M6256
7668A446426j5083j10808q0908J40126K36396m26536k97825K4774R9507q5250
7658I30819j65124P3011Q9968L695l55208o9499J4800p1293J02379J67129R0498
7647H11175J31144p8045j05093k21458p0590Q4160N2282m2813J2914k42269K09695
7636E41102P8885l4848j46160k13062J43520O7070n8095P4651j05188R8812o554
7625D40133m0879L1127j01826j66571Q7983n5773o2548J56758P0685Q1828l25355
7614A15562J35131M5609o2440J4594r7617R1292j59688j73364J22120J81588N2472
$$ plain form
7603 265259 142974 18227 -57218 50710 104173 -8447 -2068 129011 351414 387207 134481
7592 134481 243713 364706 177797 134160 211062 131621 84063 346069 254962 191020 378106
7581 378106 498481 318486 276166 295672 145310 108588 152029 165975 167174 278007 405673
7570 405673 369927 307893 184748 91962 217945 33286 326676 270877 318155 321163 252089
7559 252089 306673 278552 323170 329063 496072 534510 470255 500396 571808 430525 464479
7548 464479 533199 306987 176234 -148905 284241 241585 87710 234401 278187 313493
7538 313493 281223 296509 167167 3108 64488 85387 147497 447262 442368 437613 464277
7527 464277 362468 385794 320942 364731 279915 329750 511966 135709 74826 130697 277700
$$ packed form
7603B65259j22285j24747p5445J07928N3463j12620O379J31079K22403L5793k52726
7592A34481J09232J20993j86909m3637P6902p9441m7558K62006r1107o3942J87086
7581C78106J20375j79995m2320J9506j50362l6722M3441J3946J199J10833J27666
7570D05673l5746o2034j23145r2786J25983j84659K93390n5799M7278L008o9074
7559B52089N4584k8121M4618N893J67009L8438o4255L0141P1412j41283L3954
7548D64479O8720k26212j30753l25139M33146m2656j53875J46691M3786L5306
7538C13493l2270J5286j29342j64059O1380K0899O2110K99765m894m755K6664
7527D64277j01809K3326o4852M3789q4816M9835J82216l76257o0883N5871J47003
$$ plain form
7516 277700 397336 231946 379800 534380 396992 415763 271718 117760 -19874 290991
7506 290991 394073 366710 437006 291914 64202 273780 326159 121119 108342 220688
7496 220688 394065 463332 113295 191074 150692 97220 82850 268464 202154 140641 82806
7485 82806 260248 354737 202673 135341 44889 147822 151325 150815 209920 153091 175514 299916
7473 299916 360616 349730 286022 308415 505568 276107 131336 399958 362821 470105 538713
7462 538713 369149 497968 423569 469808 343540 209588 449841 413452 523180 484570
7452 484570 487450 259015 474055 439095 414076 590817 611893 628616 665696 496240 647068
7441 647068 504935 504171 527386 546531 531414 484409 640854 762487 542385 623089 744392
$$ packed form
7516B77700J19636j65390J47854J54580j37388J8771j44045j53958j37634L10865
7506B90991J03082k7363P0296j45092k27712K09578N2379k05040j2777J12346
7496B20688J73377O9267l50037P7779m0382n3472j4370J85614o6310o1513n7835
7485H2806J77442R4489j52064o7332r0452J02933L503n10N9105n6829K2423J24402
7473B99916O0700j0886o3708K2393J97153k29461j44771K68622l7137J07284O8608
7462E38713j69564J28819p4399M6239j26268j33952K40253l6389J09728l8610
7452D84570K880k28435K15040l4960k5019J76741K1076J6723L7080j69456J50828
7441F47068j42133p64K3215J9145j5117m7005J56445J21633k20102Q0704J21303
$$ plain form
7430 744392 561161 450205 397595 404994 449908 327089 320504 413939 608534 765981 575124
7419 575124 396291 427902 269713 344203 337793 343047 208321 169639 500922 512858 709077
7408 709077 620998 538786 578830 588881 456885 307252 454473 489843 349161 418942 390448
7397 390448 444380 288069 475322 471910 487651 550562 437877 283350 272420 316058 336632
7386 336632 315818 267755 217412 256031 171479 250567 178827 328600 355269 165486 251540
7375 251540 155525 224427 273505 237330 88205 276653 239212 405775 367407 294758 190175
7364 190175 -42593 170006 112348 140953 260291 201079 322778 125849 37956 56952 149327
7353 149327 382928 270515 273107 220825 233187 153643 13967 -40989 20682 -58462 -28717
$$ packed form
7430G44392j83231j10956n2610P399M4914j22819o585R3435J94595J57447j90857
7419E75124j78833L1611j58189P4490o410N254j34726l8682L31283J1936J96219
7408G09077q8079q2212M0044J0051j31996j49633J47221L5370j40682O9781k8494
7397C90448N3932j56311J87253l412J5741O2911j12685j54527j0930M3638K0574
7386C36632k0814m8063n0343L8619q4552P9088p1740J49773K6669j89783Q6054
7375B51540r6015O8902M9078l6175j49125J88448l7441J66563l8368p2649j04583
7364A90175k32768K12599n7658K8605J19338n9212J21699j96929q7893J8996R2375
7353A49327K33601j12413K592n2282J2362p9544j39676n4956O1671p9144K9745
$$ plain form
7342 -28717 -157229 126818 157742 37998 20969 91387 216020 -123918 -122667 -160893 -161509
7331 -161509 -215563 -137388 -120441 -80481 13994 26500 -46837 -40144 21656 -113936 -152051 -170740
7319 -170740 -246464 -69062 -92146 -129060 50116 13666 -39182 -149843 -64064 -38856 -34053
7308 -34053 10331 -130373 -17135 -92377 -391632 -277400 -251272 -209259 -112414 -176999 -152707
7297 -152707 -128698 -160832 -268526 -212327 -23777 -74779 -211176 -243435 -38601 21605 -27358
7286 -27358 38035 88251 -97040 -84504 105927 71209 167014 -20 52332 -65738 -326381
7275 -326381 5254 167582 -71403 -68981 -133008 -245908 -258686 -303695 -326595 -149322 -164765
7264 -164765 -226097 -94332 -113194 -159595 -165634 -45323 298 -54710 -134757 -214074 -163120
$$ packed form
7342b8717j28512K84047L0924j19744j7029P0418J24633l39938J251l8226o16
7331a61509n4054P8175J6947L9960R4475J2506p3337O693O1800j35592l8115j8689
7319a70740p5724J77402k3084l6914J79176l6450n2848j10661Q5779K5208M803
7308c4053M4384j40704J13238p5242k99255J14232K6128M2013R6845o4585K4292
7297a52707K4009l2134j07694N6199J88550n1002j36397l2259K04834O0206m8963
7286b7358O5393N0216j85291J2536J90431l4718R5805j67034N2352j18070k60643
7275c26381L31635J62328k38985K422o4027j12900j2778m5009k2900J77273j5443
7264a64765o1332J31765j8862m6401o039J20311M5621n5008q0047p9317N0954
$$ plain form
7253 -163120 16915 -53440 -23210 106024 -130074 -263236 -242444 -290043 -157524 110803
7243 110803 13715 -32470 -132520 -294278 -263325 -88048 -102944 -83360 -133860 -102876 -179472
7232 -179472 82173 32978 -40320 225987 136537 166356 -24232 -148948 -21687 -15429 -356067
7221 -356067 -408285 -283956 -185912 -294453 -183643 -62296 -6685 -43927 -88269 -73789 118268
7210 118268 164323 92461 251735 225266 67846 -83147 25542 54238 5347 113084 -120537
7199 -120537 -320367 -231151 -193838 -228686 -237900 -237060 -277034 -193391 -17315 59345 164747 158917
7187 158917 -26057 -48591 -121330 -170481 -123461 -129158 -146752 -156454 -153799 -181306 -84564 -70786
7175 -70786 -155891 -27077 -115470 24278 -22607 -1434 51962 5502 156421 -79704 -89788
$$ packed form
7253a63120J80035p0355L0230J29234k36098j33162K0792m7599J32519K68327
7243A10803r7088m6185j00050j61758L0953J75277j4896J9584n0500L0984p6596
7232a79472K61645m9195p3298K66307q9450K9819j90588j24716J27261O258l40638
7221c56067n2218J24329R8044j08541J10810J21347N5611l7242m4342J4480J92057
7210A18268M6055p1862J59274k6469j57420j50993J08689K8696m8891J07737k33621
7199a20537j99830Q9216L7313l4848r214Q40l9974Q3643J76076P6660J05402n830
7187A58917j84974k2534p2739m9151M7020n697j7594r702K655k7507R6742J3778
7175g0786q5105J28814q8393J39748m6885K1173N3396m6460J50919k36125j0084
$$ plain form
7164 -89788 -113599 -11120 67754 -182417 -190304 -165310 -386407 -304988 -232896 -181481 -201043
7153 -201043 -159483 59866 315543 226083 169900 254878 423216 374064 460315 571711 464807
7142 464807 294857 450294 352188 204352 109712 176337 439359 334052 196554 189523 258314
7131 258314 238859 325562 62828 73326 203913 95036 127868 154079 49871 78591 -39677
7120 -39677 -108596 210131 153309 -42022 131748 231076 106958 -51249 103674 -47741
7110 -47741 -85560 -59887 -192788 -295108 -72177 -199193 106938 290895 162892 147460
7100 147460 91328 18684 37437 -19300 -129076 -126846 -131595 -52193 -184414 -6614 -42136
7089 -42136 -130275 -43995 142169 71745 -175045 -52187 24231 -182260 -255771 -154792 -79001
$$ packed form
7164h9788k3811J02479P8874k50171p887K4994k21097Q1419P2092N1415j9562
7153b01043M1560K19349K55677q9460n6183Q4978J68338m9152Q6251J11396j06904
7142D64807j69950J55437r8106j47836r4640O6625K63022j05307j37498p031O8791
7131B58314j9455Q6703k62734J0498J30587j08877L2832K6211j04208K8720j18268
7120c9677o8919L18727n6822j95331J73770R9328j24118j58207J54923j51415
7110d7741l7819K5673j32901j02320K22931j27016L06131J83957j28003j5432
7100A47460n6132p2644J8753n6737j09776K230m749P9402j32221J77800l5522
7089d2136q8139Q6280J86164p0424k46790J22858P6418k06491p3511J00979P5791
$$ plain form
7078 -79001 -63551 11445 -174631 -189777 -119598 -83736 108059 -39882 -312320 -268986 50339
7067 50339 200861 163644 1809 17525 362292 218932 18298 75449 175036 183256 861
7056 861 -118111 -105208 72885 146692 149029 181606 176341 147844 18953 -150414 -35659 -59348
7044 -59348 -18770 -107052 -282087 -82663 56176 -88388 -128232 -265485 -276976 -146512 101403
7033 101403 107197 207027 437987 258895 94170 78563 109587 -53369 -120793 -66150 -42653
7022 -42653 177323 92926 -4237 63813 140353 354371 461011 310363 169249 -12977 97000
7011 97000 144030 121912 65834 -229469 -139433 96692 176821 159393 149364 112056 57738
7000 57738 67271 186182 3542 72764 258462 44738 -2582 190444 217443 -54321 -252522
$$ packed form
7078g9001J5450P4996j86076j5146P0179L5862J91795j47941k72438M3334L19325
7067E0339J50522l7217j61835J5716L44767j43360k00634N7151R9587Q220j82395
7056H61j18972J2903J78093P3807K337L2577n265k8497j28891j69367J14755k3689
7044e9348M0578q8282j75035J99424J38839j44564l9844j37253j1491J30464K47915
7033A01403N794R9830K30960j79092j64725j5607L1024j62956o7424N4643K3497
7022d2653K19976q4397r7163O8050P6540K14018J06640j50648j41114j82226J09977
7011I7000M7030k2118n6078k95303R0036K36125Q0129j7428j0029l7308n4318
7000E7738R533J18911j82640O9222J85698k13724m7320J93026K6999k71764j98201
$$ plain form
6989 -252522 35531 50302 49005 244239 439476 192179 47549 -154669 -113945 -64077 -221074
6978 -221074 -228932 -45350 -29446 73382 -32808 -10440 120687 6465 41104 191806 65802
6967 65802 87074 -50403 -322893 -54185 202389 211153 33438 -8900 159182 282068 152781
6956 152781 136524 245461 -19544 50508 76797 -137599 -100246 -29597 74660 118714 75748
6945 75748 107685 37352 -3687 -40300 -50739 -37657 -33654 -93776 3981 -187233 133 312621
6933 312621 119600 526 -23509 -41072 -83056 -82481 -198410 90067 21849 68466 -73607
6922 -73607 -5329 -5397 116125 60709 163511 75958 140428 9321 -253876 -68577 -115161
6911 -115161 95397 28186 -131572 13970 63191 58157 123066 285595 118373 45241 211198
$$ packed form
6989b52522K88053J4771j297J95234J95237k47297j44630k02218M0724M9868j56997
6978b21074p858J83582J5904J02828j06190K2368J31127j14222L4639J50702j26004
6967F5802K1272j37477k72490K68708K56574Q764j77715m2338J68082J22886j29287
6956A52781j6257J08937k65005P0052K6289k14396L7353P0649J04257M4054m2966
6945G5748L1937p0333m1039l6613j0439J3082M003o0122R7757j91214J87366L12488
6933C12621j93021j19074k4035j7563m1984N75j15929K88477o8218M6617j42073
6922g3607O8278o8J21522n5416J02802q7553O4470j31107k63197J85299m6584
6911a15161K10558o7211j59758J45542M9221n034O4909J62529j67222p3132J65957
$$ plain form
6900 211198 346811 357158 309991 20804 159761 41056 -113136 -182733 -321093 -164035
6890 -164035 -98565 -2374 56907 -71091 43839 140346 -21123 -52726 -49176 -61626 -9397
6879 -9397 140561 167458 168029 52445 279320 326665 330593 314857 319674 302121 238559 82364
6867 82364 -113802 -69929 27866 62661 5665 124284 201973 21884 -4099 235458 263206
6856 263206 323370 375260 76972 31492 109400 114391 38569 319370 156405 127755 -8281
6845 -8281 14467 255421 235213 210022 16653 57524 165156 291242 109955 105744 -17238
6834 -17238 26708 35147 100076 273762 131477 93290 21063 -67948 26066 260597 183646
6823 183646 50355 70399 168221 150855 267174 105511 152348 145460 -61761 96997 123141
$$ packed form
6900B11198J35613J0347m7167k89187J38957j18705j54192o9597j38360J57058
6890a64035O5470R6191N9281j27998J14930R6507j61469l1603L550j2450N2229
6879i397J49958K6897N71j15584K26875M7345L928j5736M817j7553o3562j56195
6867H2364j96166M3873R7795L4795n6996J18619P7689j80089k5983K39557K7748
6856B63206O0164N1890k98288m5480P7908M991p5822K80801j62965k8650j36036
6845h281K2748K40954k0208k5191j93369M0871J07632J26086j81287m211j22982
6834a7238M3946Q439O4929J73686j42285l8187p2227q9011R4014K34531p6951
6823A83646j33291K0044R7822j7366J16319j61663M6837o888k07221J58758K6144
$$ plain form
6812 123141 243634 88340 223265 -100827 -111688 151950 137642 228193 178762 185177 87967
6801 87967 335026 273357 185101 218045 225805 294480 336093 429149 405246 419605 557387 549183
6789 549183 640199 413789 415676 380772 251022 334070 562741 368452 308668 360712 395499
6778 395499 604826 648213 570207 336589 220097 183250 231007 162511 186566 159399 70974
6767 70974 -24366 245733 263013 254481 141763 -9834 76508 368530 233458 49847 133740
6756 133740 114235 424628 347392 239529 311599 487226 540181 600232 591111 461172 286154
6745 286154 168443 112578 377575 417211 259975 411827 473622 396566 290145 361951 314555
6734 314555 344896 282905 381311 574808 697429 577961 389171 420292 373250 170218 206865
$$ packed form
6812A23141J20493j55294J34925l24092j0861K63638j4308R0551m9431O415r7210
6801H7967K47059o1669q8256L2944P760O8675M1613R3056k3903J4359J37782q204
6789E49183R1016k26410J887l4904j29750Q3048K28671j94289n9784N2044L4787
6778C95499K09327M3387p8006k33618j16492l6847M7757o8496K4055k7167q8425
6767G0974r5340K70099J7280q532j12718j51597Q6342K92022j35072j83611Q3893
6756A33740j9505L10393p7236j07863P2070J75627N2955O0051r121j29939j75018
6745B86154j17711n5865K64997L9636j57236J51852O1795p7056j06421P1806m7396
6734C14555L0341o1991R8406J93497J22621j19468j88790L1121m7042k03032L6647
$$ plain form
6723 206865 401753 491876 342838 467578 665888 482597 352872 342827 456725 743871
6713 743871 766721 652825 655830 491813 637321 405526 436309 521231 365283 139650 188185
6702 188185 517941 398694 502783 375164 499976 480190 498364 537038 343802 667987
6692 667987 557696 338573 543524 471839 472551 749707 824195 786897 691818 663590 610953
6681 610953 653579 694733 612353 720361 505623 287002 578353 695969 659281 694872 477630
6670 477630 507767 611947 648227 555024 687784 660040 656601 647903 683280 994116 1014434
6659 1014434 851360 858054 904261 1018524 939624 914509 1077575 955556 734492 932021
6649 932021 1068925 952305 831597 1060472 1048130 1120364 934228 808703 1268290 1246959
$$ packed form
6723B06865J94888R0123j49038J24740J98310j83291j29725j0045J13898K87146
6713G43871K2850j13896L005j64017J45508k31795L0783Q4922j55948k25633M8535
6702A88185L29756j19247J04089j27619J24812j9786J8174L8674j93236L24185
6692F67987j10291k19123K04951p1685P12K77156P4488l7298r5079k8228n2637
6681F10953M2626M1154q2380J08008k14738k18621K91351J17616l6688L5591k17242
6670D77630L0137J04180L6280r3203J32760k7744l439q698L5377L10836K0318
6659A014434j63074O694M6207J14263p8900k5115J63066j22019k21064J97529
6649I32021J36904j16620j20708K28875j2342P2234j86136j25525M59587k1331
$$ plain form
6639 1246959 1168370 1019733 1289005 1443643 1519941 1332335 1146140 1247884 1260611 1066808
6629 1066808 1086429 1090281 1241868 1317109 1378611 1203389 1269330 1348485 1485007 1682853 1417532
6618 1417532 1327768 1279536 1230780 1172798 1445516 1679555 1681791 1450084 1169928 1341875 1395108
6607 1395108 1464667 1548731 1740003 1726369 1792569 1706310 1578479 1594814 1638959 1713658 1786648
6596 1786648 1889283 1757880 1704715 2016003 2186002 2186779 2205823 2373684 2504877 2275202
6586 2275202 2231150 2088392 2269400 2390919 2205262 2163620 2359613 2361095 2194171 2309050
6576 2309050 2433536 2644429 2473195 2688279 2848947 2817774 2710110 2772992 3019401 2819203
6566 2819203 2891349 2911815 3083300 2676925 2552249 2625413 2643969 2718946 2726013 2548207 2727929
$$ packed form
6639A246959p8589j48637K69272J54638P6298j87606j86195J01744J2727j93803
6629A066808J9621L852J51587P5241O1502j75222O5941P9155J36522J97846k65321
6618A417532q9764m8232m8756n7982K72718K34039K236k31707k80156J71947N3233
6607A395108O9559Q4064J91272j3634O6200q6259j27831J6335M4145P4699P2990
6596A786648J02635j31403n3165L11288J69999P77J9044J67861J31193k29675
6586B275202m4052j42758J81008J21519j85657m1642J95993J482j66924J14879
6576B309050J24486K10893j71234K15084J60668l1173j07664O2882K46409k00198
6566B819203P2146K0466J71485m06375j24676P3164J8556P4977P067j77806J79722
$$ plain form
6555 2727929 2876979 2970859 2952890 3085855 3245392 3289972 3366551 3465888 3387659 3590592 3601788
6544 3601788 3437155 3522889 3640655 3565045 3454106 3432766 3499541 3688455 3751030 3637127
6534 3637127 3780100 3845734 3827338 4037447 4221936 4378094 4280891 4222621 4177451 4180000 4084619
6523 4084619 4162215 4244124 4356412 3993325 4001166 4158730 4126839 4030174 3758025 3665448 3697773
6512 3697773 3638734 3719555 3448970 3465752 3679838 3561923 3393720 3386768 3198974 3044567
6502 3044567 3068587 3192748 3065654 3097246 2931317 2700459 2675254 2533978 2472581 2315358
6492 2315358 2014679 2154606 2043232 2089352 2175809 2140345 2056293 2185743 2235988 1938623
6482 1938623 2196087 2284689 2048597 2083174 2212568 2332157 2262475 2365203 2603416 2201501
$$ packed form
6555B727929J49050R3880j7969J32965J59537M4580P6579R9337p8229K02933J1196
6544C601788j64633Q5734J17766p5610j10939k1340O6775J88914O2575j13903
6534C637127J42973O5634j8396K10109J84489J56158r7203n8270m5170K549r5381
6523D084619P7596Q1909J12288l63087P841J57564l1891r6665k72149r2577L2325
6512C697773n9039Q0821k70585J6782K14086j17915j68203o952j87794j54407
6502C044567K4020J24161j27094L1592j65929k30858k5205j41276o1397j57223
6492B315358l00679J39927j11374M6120Q6457l5464q4052J29450N0245k97365
6482A938623K57464Q8602k36092L4577J29394J19589o9682J02728K38213m01915
$$ plain form
6472 2201501 2064843 2034288 2033064 2099820 2324507 2191049 2408242 2444334 2583359 2703658
6462 2703658 2484663 2492811 2662712 2863260 2812694 2661887 2535316 2648873 2685992 2750761
6452 2750761 2703414 2685966 2990249 2899853 2744965 2801056 2866516 3031580 3017102 3169474 3366964
6441 3366964 3209140 3309630 3521269 3625751 3743931 3700598 3870273 3863368 4025442 4049169
6431 4049169 4235445 4200126 4265108 4363361 4439193 4640502 4564372 4729466 4772735 4951000 5226467
6420 5226467 5350793 5355633 5349055 5137611 5021454 4981348 5214621 5336679 5644771 5908688
6410 5908688 6170197 6150349 6215099 6247520 6656789 7029504 7124505 6896135 7216147 7478898
6400 7478898 7704572 7976727 8048133 8411749 8841140 9044272 9191206 9412362 9563646 9945528
$$ packed form
6472B201501j36658l0555j224O6756K24687j33458K17193L6092J39025J20299
6462B703658k18995Q148J69901K00548n0566j50807j26571J13557L7119O4769
6452B750761m7347j7448L04283r0396j54888N6091O5460J65064j4478J52372J97490
6441C366964j57824J00490K11639J04482J18180m3333J69675o905J62074K3727
6431D049169J86276l5319O4982R8253P5832K01309p6130J65094M3269J78265K75467
6420E226467J24326M840o578k11444j16157m0106K33273J22058L08092K63917
6410E908688K61509j9848O4750L2421M09269L72715R5001k28370L20012K62751
6400G478898K25674K72155P1406L63616M29391K03132J46934K21156J51284L81882
$$ plain form
6390 9945528 10221574 10581677 10832168 11203077 11710248 12174502 12887948 13657813 14399877 15016306
6380 15016306 15172177 15021018 14782000 14572992 14147872 13763829 13701818 13455111 13345578 13531377
6370 13531377 13702947 14150421 14307010 14603997 15037134 15497335 15900202 16670559 17255785
6361 17255785 17918181 18921917 19810741 21148692 22634473 23961077 25125760 25815730 25874516
6352 25874516 24942372 23728443 22070855 20570270 19434242 18560498 18096383 17780722 17595216
6343 17595216 17565259 17661883 18203930 18641651 18911140 19351298 19870263 20181311 20616760 20935462
6333 20935462 21210464 21892798 22253769 22801126 23697384 24213269 24518003 24631753 24260964
6324 24260964 23963907 23762101 23669250 23511751 23452037 23935914 24862047 25946600 27114176
$$ packed form
6390I945528K76046L60103K50491L70909N07171M64254P13446P69865P42064O16429
6380A5016306J55871j51159k39018k09008m25120l84043o2011k46707j09533J85799
6370A3531377J71570M47474J56589K96987M33137M60201M02867P70357N85226
6361A7255785O62396J003736Q88824J337951J485781J326604J164683O89970N8786
6352B5874516r32144j213929j657588j500585j136028q73744m64115l15661j85506
6343A7595216k9957R6624N42047M37721K69489M40158N18965L11048M35449L18702
6333B0935462K75002O82334L60971N47357Q96258N15885L04734J13750l70789
6324B4260964k97057k01806r2851j57499n9714M83877R26133J084553J167576
$$ plain form
6315 27114176 28314753 29823003 31410243 32689733 33196360 33056468 32269058 31351768 30158531
6306 30158531 28908491 28086673 27426323 26803491 26398692 26417665 26355680 26700994 27138595 27385172
6296 27385172 27986061 28835876 30219059 31967884 34090865 36419004 38975054 42008925
6288 42008925 45036736 47799810 49441943 49842958 48526226 46128855 42922734 39549336
6280 39549336 36472911 33885188 31820761 30409951 29075154 27949457 27364200 26909185
6272 26909185 26756026 26665208 26616976 27113046 27567858 28255516 29039552 30005209 31366841 32358089
6262 32358089 33468696 34333070 34462120 33986839 32791424 31187572 29414784 27674355 26576259
6253 26576259 25556586 24428087 23540047 22863764 22611428 22613996 22427875 22759662 23108536
$$ packed form
6315B7114176J200577J508250J587240J279490N06627j39892p87410r17290j193237
6306C0158531j250040q21818o60350o22832m04799J8973o1985L45314M37601K46577
6296B7385172O00889Q49815J383183J748825K122981K328139K556050L033871
6288D2008925L027811K763074J642133M01015j316732k397371l206121l373398
6280C9549336l076425k587723k064427j410810j334797j125697n85257m55015
6272B6909185j53159r0818m8232M96070M54812O87658P84036R65657J361632R91248
6262C2358089J110607Q64374J29050m75281j195415j603852j772788j740429j098096
6253B6576259j019673j128499q88040o76283k52336K568j86121L31787L48874
$$ plain form
6244 23108536 23429031 24080695 24622913 25039206 25453567 25500653 25570643 25162956 24568474 23869621
6234 23869621 23116109 22472168 22027280 21624012 21225556 21026200 21112548 21593868 22196539 22564546
6224 22564546 23346476 24174075 25199033 26205435 27381292 28739486 29976583 31020794
6216 31020794 32284580 33477730 33958750 33850682 33215784 31986780 30286130 28823508 27465723
6207 27465723 26208005 25064051 23966360 23093246 22363545 21958512 22043335 22134198 21667751
6198 21667751 21597815 21639691 21846643 22184910 22691034 23487150 23824109 24356542 24533337 24341646
6188 24341646 23798464 23213735 22545979 21535776 20494879 19468058 18720675 18126589 17579071
6179 17579071 16943435 16351704 15674016 14661535 14086984 13622046 12941434 12583621 12522531
$$ packed form
6244B3108536L20495O51664N42218M16293M14361M7086O9990m07687n94482o98853
6234B3869621p53512o43941m44888m03268l98456j99356Q6348M81320O02671L68007
6224B2564546P81930Q27599J024958J006402J175857J358194J237097J044211
6216C1020794J263786J193150M81020j08068o34898j229004j700650j462622j357785
6207B7465723j257718j143954j097691q73114p29701m05033Q4823R0863m66447
6198B1667751o9936M1876K06952L38267N06124P96116L36959N32433J76795j91691
6188B4341646n43182n84729o67756j010203j040897j026821p47383n94086n47518
6179A7579071o35636n91731o77688j012481n74551m64938o80612l57813o1090
$$ plain form
6170 12522531 12399412 12375063 12156714 12230592 12018819 11940935 11996591 11930352 12079130 12446264
6160 12446264 12602625 12619024 12653126 12503927 12426651 12285537 12338454 12450657 12518321 12458895
6150 12458895 12511794 12651260 12951961 13119884 13034106 13021121 12943194 12950979 13013554 13055651 12935738
6139 12935738 13268563 13305657 13676912 13935709 14168043 14469777 14837166 15352847 15918169 16351268
6129 16351268 16489185 16590095 16507025 16673631 16637866 16687312 17076051 17106836 17434872 18063043
6119 18063043 18002091 17943439 17793874 17341006 17128248 16991074 17110085 17196352 17121418 17288304
6109 17288304 17294198 17409811 17658159 17814407 18412169 18977833 19223232 19722663 19896102 19786172
6099 19786172 19670933 19798900 19901324 20224337 20672653 20839707 21146160 21816287 22136173
$$ packed form
6170A2522531j23119k4349k18349P3878k11773p7884N5656o6239J48778L67134
6160A2446264J56361J6399L4102j49199p7276j41114N2917J12203O7664n9426
6150A2458895N2899J39466L00701J67923q5778j2985p7927P785O2575M2097j19913
6139A2935738L32825L7094L71255K58797K32334L01734L67389N15681N65322M33099
6129A6351268J37917J00910q3070J66606l5765M9446L88739L0785L28036O28171
6119A8063043o0952n8652j49565m52868k12758j37174J19011Q6267p4934J66886
6109A7288304N894J15613K48348J56248N97762N65664K45399M99431J73439j09930
6099A9786172j15239J27967J02424L23013M48316J67054L06453O70127L19886
$$ plain form
6090 22136173 22381774 22719316 23088985 23550934 24460767 25281162 25953883 27078275 28509286
6081 28509286 29461967 30166709 30269284 29554622 28842444 27792797 26456192 25427489 24671532
6072 24671532 24009184 23702494 23495203 23438744 23623769 23803664 24454408 24989291 25524666 26532032
6062 26532032 27507279 28744500 30235233 32095778 34005744 36481126 39313843 41994834
6054 41994834 44249917 45625724 45757070 44197905 41221221 37608764 34207486 31235575
6046 31235575 28823942 26940539 25447517 24542517 24056423 23506842 23342737 23204751 23251576
6037 23251576 23540881 23780366 24325737 24881580 25830580 26899109 27980531 29038182 30325443
6028 30325443 31551136 32404303 32737651 32443680 31207651 29484023 27604798 25817497 24220771
$$ packed form
6090B2136173K45601L37542L69669M61949R09833Q20395O72721J124392J431011
6081B8509286R52681P04742J02575p14662p12178j049647j336605j028703p55957
6072B4671532o62348l06690k07291n6459J85025J79895O50744N34883N35375J007366
6062B6532032R75247J237221J490733J860545J909966K475382K832717K680991
6054D1994834K255083J375807J31346j559165k976684l612457l401278k971911
6046C1235575k411633j883403j493022r05000m86094n49581j64105j37986M6825
6037B3251576K89305K39485N45371N55843R49000J068529J081422J057651J287261
6028C0325443J225693Q53167L33348k93971j236029j723628j879225j787301j596726
$$ plain form
6019 24220771 23191694 22440038 21705889 21294789 21013426 20409540 20137296 20368606 20127923
6010 20127923 20073627 20205379 20211434 20693230 21031910 21430129 21837819 22186251 22891435 23363478
6000 23363478 23935961 24443767 25053998 25503007 26463380 27807308 28944498 30245024 31529037
5991 31529037 33066857 34681973 35635389 36461255 37154274 38032648 38571623 39423876 40821889
5982 40821889 42416240 43927875 45466053 46418082 46773319 46580846 45545272 44571805 43506132
5973 43506132 42871122 42635676 42593188 43326063 44670984 46165615 48350507 51036471 53666753
5964 53666753 56158350 57824448 58844416 59095878 59141721 59175807 60062582 61915787 64269213
$$ packed form
6019B4220771j029077p51656p34149m11100k81363o03886k72244K31310k40683
6010B0127923n4296J31752O055M81796L38680L98219M07690L48432P05184M72043
6000B3363478N72483N07806O10231M49009R60373J343928J137190J300526J284013
5991C1529037J537820J615116R53416Q25866O93019Q78374N38975Q52253J398013
5982D0821889J594351J511635J538178R52029L55237j92473j035574r73467j065673
5973D3506132o35010k35446m2488P32875J344921J494631K184892K685964K630282
5964E3666753K491597J666098J019968K51462M5843L4086Q86775J853205K353426
$$ [...]
##END NTUPLES=NMR SPECTRUM
##END=
