##TITLE=1H_EC-3314(2)
 CDCl3
 8 sc, 
 8.2.2024
##JCAMPDX= 6.0         $$ Bruker NMR JCAMP-DX V2.0
##DATA TYPE= NMR SPECTRUM
##DATA CLASS= NTUPLES
##ORIGIN= UXNMR, Bruker Analytische Messtechnik GmbH
##OWNER= root
$$ XWIN-NMR		Version 3.5
$$ Thu Feb  8 14:12:53 2024 Russian Standard Time (UT+4h)  she@DPX200
##.OBSERVE FREQUENCY= 200.1313
##.OBSERVE NUCLEUS= ^1H
##.ACQUISITION MODE= SIMULTANEOUS
##.ACQUISITION SCHEME= undefined
##.AVERAGES= 8
##.DIGITISER RES= 18
##SPECTROMETER/DATA SYSTEM= spect
##.PULSE SEQUENCE= zg30
##.SOLVENT NAME= CDCl3
##.SHIFT REFERENCE= (INTERNAL, CDCl3, 0, 15.4935)
##AUDIT TRAIL= $$ (NUMBER, WHEN, WHO, WHERE, WHAT)
$$ ##TITLE= Audit trail, XWIN-NMR		Version 3.5
$$ ##JCAMPDX= 5.01
$$ ##ORIGIN= Bruker BioSpin GmbH
$$ ##OWNER= she
$$ F:/spectra/data/she/nmr/H-F/1/pdata/1/auditp.txt
$$ ##AUDIT TRAIL=  $$ (NUMBER, WHEN, WHO, WHERE, WHAT)
(   1,<2024-02-08 14:11:33.87 +0400>,<she>,<DPX200>,
      <created by zg, POWCHK disabled, PULCHK disabled
       configuration hash MD5:
       00 E9 B6 7A A2 85 ED C7 34 08 36 98 17 FE 4E 26
       data hash MD5: 16K
       9E 6E 97 B3 DE A1 71 93 EA A9 A4 3C BE 6B D1 BF>)
(   2,<2024-02-08 14:11:36.46 +0400>,<she>,<DPX200>,
      <Start of raw data processing
       efp BC_mod = 2 LB = 0.24 FT_mod = 6 PKNL = 1 PHC0 = -24594.05 PHC1 = 13.45268 SI = 16K 
       data hash MD5: 16K
       5E CA 77 38 55 DB C6 68 05 8F 72 29 DF 99 33 F1>)
(   3,<2024-02-08 14:11:53.78 +0400>,<she>,<DPX200>,
      <pk PHC0 = -4.211158 PHC1 = 2.6 
       data hash MD5: 16K
       CB E7 B8 32 73 E7 65 A5 F1 55 FC 66 AE D6 0F 33>)
(   4,<2024-02-08 14:11:57.51 +0400>,<she>,<DPX200>,
      <abs ABSG = 5 
       data hash MD5: 16K
       38 91 A1 AD B8 59 90 C3 D9 AC 9C 1A D1 CC 32 DC>)
$$ ##END=
$$ 
$$ hash MD5
$$ 94 F6 69 3C 58 BA 40 C2 11 98 ED 51 AD 00 B2 F1
##$RELAX= 
##$RELAX= 
##$RELAX= 
##$RELAX= 
##$RELAX= 
##$RELAX= 
$$ Bruker specific parameters
$$ --------------------------
##$DU= <F:/spectra>
##$EXPNO= 1
##$NAME= <H-F>
##$PROCNO= 1
##$TYPE= <nmr>
##$USER= <she>
##$AMP= (0..31)
100 100 100 100 100 100 100 100 100 100 100 100 100 100 100 100 100 100 
100 100 100 100 100 100 100 100 100 100 100 100 100 100 
##$AQSEQ= 0
##$AQ_mod= 1
##$AUNM= <au_zg>
##$AUTOPOS= <>
##$BF1= 200.13
##$BF2= 200.13
##$BF3= 200.13
##$BF4= 200.13
##$BF5= 200.13
##$BF6= 200.13
##$BF7= 200.13
##$BF8= 200.13
##$BYTORDA= 1
##$CFDGTYP= 0
##$CFRGTYP= 5
##$CHEMSTR= <none>
##$CNST= (0..31)
1 1 145 1 1 1 1 1 1 1 1 1 1 1 1 1 1 1 1 1 1 1 1 1 1 1 1 1 1 1 1 1 
##$CPDPRG= <>
##$CPDPRG1= <>
##$CPDPRG2= <>
##$CPDPRG3= <>
##$CPDPRG4= <mlev>
##$CPDPRG5= <mlev>
##$CPDPRG6= <mlev>
##$CPDPRG7= <mlev>
##$CPDPRG8= <mlev>
##$CPDPRGB= <>
##$CPDPRGT= <>
##$D= (0..31)
0 1.2 0 0 0 0 0 0 0 0.06 0 0.03 0 0 0 0 0.0002 0 0 0 0 0 0 0 0 0 0 0 0 
0 0 0 
##$DATE= 1707387093
##$DBL= (0..7)
120 120 120 120 120 120 120 120 
##$DBP= (0..7)
150 150 150 150 150 150 150 150 
##$DBP07= 0
##$DBPNAM0= <>
##$DBPNAM1= <>
##$DBPNAM2= <>
##$DBPNAM3= <>
##$DBPNAM4= <>
$$ [...]
##$SUBNAM3= <"">
##$SUBNAM4= <"">
##$SUBNAM5= <"">
##$SUBNAM6= <"">
##$SUBNAM7= <"">
##$SUBNAM8= <"">
##$SUBNAM9= <"">
##$SW= 18.0517328524113
##$SWIBOX= (0..15)
0 0 2 0 0 0 0 0 0 0 0 0 0 0 0 0 
##$SW_h= 3612.71676300578
##$TD= 16384
##$TD0= 1
##$TE= 0
##$TE2= 300
##$TE3= 300
##$TEG= 300
##$TL= (0..7)
0 120 120 120 120 120 120 120 
##$TP= (0..7)
150 150 150 150 150 150 150 150 
##$TP07= 0
##$TPNAME0= <>
##$TPNAME1= <>
##$TPNAME2= <>
##$TPNAME3= <>
##$TPNAME4= <>
##$TPNAME5= <>
##$TPNAME6= <>
##$TPNAME7= <>
##$TPOAL= (0..7)
0.5 0.5 0.5 0.5 0.5 0.5 0.5 0.5 
##$TPOFFS= (0..7)
0 0 0 0 0 0 0 0 
##$TUNHIN= 0
##$TUNHOUT= 0
##$TUNXOUT= 0
##$USERA1= <user>
##$USERA2= <user>
##$USERA3= <user>
##$USERA4= <user>
##$USERA5= <user>
##$V9= 5
##$VALIST= <valist>
##$VCLIST= <CCCCCCCCCCCCCCC>
##$VD= 0
##$VDLIST= <DDDDDDDDDDDDDDD>
##$VPLIST= <PPPPPPPPPPPPPPP>
##$VTLIST= <TTTTTTTTTTTTTTT>
##$WBST= 1024
##$WBSW= 4
##$XGAIN= (0..3)
0 0 0 0 
##$XL= 0
##$YL= 0
##$YMAX_a= 547537
##$YMIN_a= -788583
##$ZGOPTNS= <>
##$ZL1= 120
##$ZL2= 120
##$ZL3= 120
##$ZL4= 120
##$ABSF1= 15.43067
##$ABSF2= -2.62118
##$ABSG= 5
##$ABSL= 3
##$ALPHA= 0
##$AQORDER= 0
##$ASSFAC= 0
##$ASSFACI= 0
##$ASSFACX= 0
##$ASSWID= 0
##$AUNMP= <proc_1d>
##$AZFE= 0.1
##$AZFW= 0.1
##$BCFW= 0
##$BC_mod= 2
##$BYTORDP= 0
##$COROFFS= 0
##$CY= -3
##$DATMOD= 1
##$DC= 0
##$DFILT= <>
##$DTYPP= 0
##$F1P= 0
##$F2P= 0
##$FCOR= 1
##$FTSIZE= 16384
##$FT_mod= 6
##$GAMMA= 0
##$GB= 0
##$INTBC= 1
##$INTSCL= 3.70164e-10
##$ISEN= 128
##$LB= 0.24
##$LEV0= 0
##$LPBIN= 0
##$MAXI= 10000
##$MC2= 0
##$MEAN= 0
##$ME_mod= 0
##$MI= 1.114404
##$NCOEF= 0
##$NC_proc= -5
##$NLEV= 6
##$NOISF1= 3.799351
##$NOISF2= 2.8
##$NSP= 0
##$NTH_PI= 0
##$NZP= 0
##$OFFSET= 15.49348
##$PC= 1
##$PHC0= -24598.26
##$PHC1= 16.05268
##$PH_mod= 1
##$PKNL= yes
##$PPARMOD= 0
##$PSCAL= 0
##$PSIGN= 0
##$REVERSE= no
##$SF= 200.130005648355
##$SI= 16384
##$SIGF1= 3
##$SIGF2= 2
##$SINO= 5.538805
##$SIOLD= 16384
##$SREGLST= <1H.CDCl3>
##$SSB= 0
##$STSI= 16384
##$STSR= 0
##$SW_p= 3612.71676300578
##$SYMM= 0
##$S_DEV= 0
##$TDeff= 16384
##$TDoff= 0
##$TI= <>
##$TILT= no
##$TM1= 0
##$TM2= 0
##$TOPLEV= 0
##$USERP1= <user>
##$USERP2= <user>
##$USERP3= <user>
##$USERP4= <user>
##$USERP5= <user>
##$WDW= 1
##$XDIM= 16384
##$YMAX_p= 400543485
##$YMIN_p= -396299
$$ End of Bruker specific parameters
$$ ---------------------------------
##NTUPLES= NMR SPECTRUM
##VAR_NAME=  FREQUENCY,     SPECTRUM/REAL,   SPECTRUM/IMAG
##SYMBOL=    X,             R,               I
##VAR_TYPE=  INDEPENDENT,   DEPENDENT,       DEPENDENT
##VAR_FORM=  AFFN,          ASDF,            ASDF
##VAR_DIM=   16384,         16384,           16384
##UNITS=     HZ,            ARBITRARY UNITS, ARBITRARY UNITS
##FACTOR=    0.220516191357247, 1,           1
##FIRST=     3100.71018561715, 0,            0
##LAST=      -512.006577388629, 0,           0
##MIN=       -512.006577388629, -396299,     0
##MAX=       3100.71018561715, 400543485,    0
$$ Real data points
##PAGE= N=1
##DATA TABLE= (X++(R..R)), XYDATA
$$ [...]
8117C26897k8391j45800n9159R2852O7135j00894p0508J30460o2382M0102q085
8106A82227L1002K4325k8231m0240n8201J7505J05007j15443j07245K28932l9771
8095A99867L2910m7477k567J51383j51333q3394J12313N7577n7344q007Q979Q7339
8083C00246p3411j22745J13707J14787q4456j21323P934L648J5811K796j35846
8072B1148m7964L8996N3883M5723q0993q3425R8219J33994l6894j4395n1864J17640
8060A94068q7641Q8071k8130n6300j11925K5700R6314j07404m1747r5772J28252
8049C486L0156m0734j6931P9532J6412L3861k3234O2474j67372j2475o5033J64420
8037F4562L6097o6609P3717k8070o6471l7357o7984M1985K4439J0513P2222j1535
$$ plain form
8117 326897 298506 152706 93547 186399 253534 152640 82132 212592 150210 190312 182227
8106 182227 213229 237554 209323 169083 110882 128387 233394 117951 10706 239638 199867
8095 199867 232777 185300 182733 334116 182783 99389 211702 269279 211935 203928 212907 300246
8083 300246 226835 104090 217797 332584 248128 126805 134739 138387 154198 156994 21148
8072 21148 -26816 12180 66063 111786 30793 -52632 45587 179581 142687 128292 76428 194068
8060 194068 106427 194498 166368 110068 -1857 23843 120157 12753 -28994 -124766 3486
8049 3486 33642 -7092 -24023 55509 71921 105782 82548 145022 -22350 -34825 -99858 64562
8037 64562 100659 34050 107767 79697 13226 -24131 -92115 -50130 -25691 -15178 57044 45509
8025D5509m9544j4789P6241J37787k39731j36035J73451l7041j8081l426q046
8014g3705P5228l9135o9981N0332n4877L0505k06352J96428J01402k10589l5682
8003b36426O7459O4491P509j47658m4359K21115N9360j23946j5046M4177N4336
7992d8988J065j79442J32253J86312j58240l1574q9076Q7815k4266k9582P7244
7981g6479L0491M4800J95425k22937o0960L4732J2981R435p6960L7682M7358Q1231
7969E6799r2956j0655J15116N8736j08896q4510N8534K3993L8319j15357j5795
7958g6672Q4786P5204o381q3610R0737l5229j21046k0103J22727P6210N6501j07917
7946E5207n133J24247m6915j10732m4421Q1349J2053L0080n5968q5968J38465
$$ plain form
8025 45509 -4035 -18824 57417 195204 -44527 -180562 -7111 -44152 -62233 -65659 -73705
8014 -73705 1523 -37612 -107593 -57261 -112138 -81633 -287985 -91557 9845 -200744 -236426
8003 -236426 -168967 -104476 -96967 -244625 -288984 -67869 -8509 -132455 -147501 -103324 -48988
7992 -48988 -47923 -227365 -95112 91200 -67040 -98614 -187690 -99875 -124141 -153723 -76479
7981 -76479 -45988 -1188 194237 -28700 -89660 -54928 -41947 -32512 -109472 -71790 -24432 56799
7969 56799 -36157 -46812 68304 127040 18144 -66366 -7832 16161 54480 -60877 -76672
7958 -76672 8114 83318 76937 -6673 84064 48835 -72211 -92314 30413 106623 163124 55207
7946 55207 50074 174321 127406 16674 -27747 53602 65655 95735 39767 -46201 92264
7935I2264N6153O1277o3524j7522m8443n0391m3844J9762K4508n2391o4122p5763
7923a62036K02364N3086j74857q7344j4004J77193K0786r757j33018M4300J2632
7912g0655p393M496K5565o0213N665O4187J9422m8957q3371L7137J90507l8754
7900C7636j52966p9814n7273J68365J80425l8086q6384N6233K0963Q7243J19461
7889B55803j88416l6978K1491m3565M6570O8757m870M5757r7614o2747J08264
7878A12452J7961J7632j32971N6317L400J2384N9109m8732m8119P2379M25n486
7866A16751M3881J695J20632l4902m9516J6441N7271J52409k00479j02968R4152
7855B15367P3576n9612j71636j8822J61196p3243k3785k4187M4573N7345n5087
$$ plain form
7935 92264 148417 209694 146170 128648 80205 29814 -14030 5732 30240 -22151 -86273 -162036
7923 -162036 40328 93414 -81443 -168787 -182791 -5598 15188 5431 -127587 -83287 -70655
7912 -70655 -78048 -73552 -47987 -108200 -102535 -38348 -18926 -67883 -151254 -114117 76390 37636
7900 37636 -115330 -195144 -252417 -84052 96373 58287 -28097 28136 49099 136342 255803
7889 255803 67387 30409 51900 8335 54905 123662 118792 164549 66935 4188 112452
7878 112452 130413 148045 15074 71391 74791 87175 146284 97552 49433 121812 122237 116751
7866 116751 160632 162327 282959 248057 198541 214982 272253 424662 224183 121215 215367
7855 215367 288943 229331 57695 38873 200069 126826 103041 78854 123427 180772 125685
7844A25685l3683J1935n1576j9993M2796K2682q1822n1081Q4214N2099M9852j55003
7832c895r4386K19703o4120m6916L107m4671o7698k6509L1774K01104l3350j67233
7820i3090J37760J24578J2129j25806l8387J17281m5473n651m2813l8945K20139
7809B21722o5025j8519J9865j57987K7976m0509R3753M6237n5092L0858Q8775
7798A92054j91669l0436J31161j01187L7957J4755P1381J21017m1851j02999M2921
7787A43104p942j05348r9325Q2480J80163r9183j94588L276J48553K2800p5410
7776a420n0671o4298J30191m6834p8525j03109K2491P9674N2846m0241m8970q9818
7764b38684J30673l7617j16218N4724J32153n6080l5930m6437N027j0582J2305
$$ plain form
7844 125685 92002 103937 52361 32368 75164 97846 16024 -35057 49157 101256 151108 -3895
7832 -3895 -98281 121422 57302 10386 13493 -31178 -98876 -125385 -93611 107493 74143 -93090
7820 -93090 44670 169248 181377 55571 17184 134465 88992 83341 40528 1583 221722
7809 221722 156697 138178 158043 56 28032 -12477 81276 127513 72421 103279 192054
7798 192054 385 -30051 101110 -77 37880 52635 124016 245033 203182 100183 143104
7787 143104 135162 29814 -69511 12969 193132 93949 -100639 -97363 51190 73990 -1420
7776 -1420 -52091 -116389 13802 -33032 -111557 -214666 -192175 -112501 -59655 -99896 -148866 -238684
7764 -238684 -108011 -145628 -261846 -207122 -74969 -131049 -166979 -213416 -208389 -218971 -206666
7753b06666j9196J41477J11896L0972j89110k3142J11278l2039o6952R345J27172
7742d965M8056q0771j84454R1299P1718L6477n111q4063J56957J30099k23550
7731d8308m1605J02975P5528k4907j1271n9882P3956l3026K512r7820L2034K7307
7719b507q2281k7077N9133j27946j5973K38371n5527k4765J15534O356j9881q2984
7707a9547O311k4516m7465K8506N3740l594K0908j07193K6764K17222j02670j34988
7695h6522J62520M1653q194q4317n1390K1600P2811R8290j70588N3404n388p9008
7683c5129j4814R5308p1834P218M9269N7687l3861p7737j93511O0614J15381l5705
7671g7114J8243l6957n837P8200M9384n4355J25311j5842o2429j04281J47127
$$ plain form
7753 -206666 -225862 -84385 27511 58483 -130627 -153769 -42491 -74530 -141482 -132137 -4965
7742 -4965 43091 -37680 -222134 -130835 -59117 -22640 -27751 -111814 45143 175242 -48308
7731 -48308 -89913 13062 88590 63683 52412 -7470 66486 33460 35972 -61848 -29814 -2507
7719 -2507 -84788 -111865 -52732 -180678 -196651 41720 -13807 -38572 76962 83318 63437 -19547
7707 -19547 -13236 -37752 -85217 -56711 -2971 -6565 14343 -92850 -66086 151136 48466 -86522
7695 -86522 75998 117651 109457 25140 -26250 -4650 68161 166451 -4137 49267 43879 -35129
7683 -35129 -49943 45365 -26469 -19251 30018 87705 53844 -23893 -217404 -156790 -41409 -77114
7671 -77114 -58871 -95828 -101665 -23465 25919 -28436 96875 81033 18604 -85677 61450
7660F1450M3983j43187j00134Q7982J45280R4513n6383j97721P2222J11549j62817
7649d3263P8760j7625m8562j3924Q8960J2676j69909O0563R5434k9988J62183
7638A75305j20448j29758J91550m3996o3279n4656J7570J7668l5229N2836p5728
7627f8165j6614N2860n4685K3507Q6846l6072k8198j18452j01788J80532L7768
7616d2461l5915o8400L8875J15567K7133j13012j35227q765K58831j6298n2809
7605c2481j49518J15059J41092o4928j01070Q538O7022j17431j20970N8964J17381
7594g8342Q7911j40049R6709J00716p353j10162k42737j0228K30153k5093j8850
7583a17325p353M3167J33930j23861k8381O7230N4764j32355r4957O4724J05953
$$ plain form
7660 61450 105433 -37754 -137888 -49906 95374 189887 133504 -64217 8005 119554 -43263
7649 -43263 35497 17872 -30690 -44614 44346 57022 -112887 -52324 43110 13122 175305
7638 175305 54857 -74901 116649 72653 9374 -45282 -27712 -10044 -45273 7563 -68165
7627 -68165 -84779 -31919 -86604 -63097 23749 -12323 -40521 -158973 -260761 -80229 -42461
7616 -42461 -78376 -146776 -107901 7666 34799 -78213 -213440 -222205 36626 20328 -32481
7605 -32481 -181999 -66940 74152 9224 -91846 -83308 -16286 -133717 -254687 -195723 -78342
7594 -78342 9569 -130480 -33771 66945 59592 -50570 -293307 -303535 -73382 -98475 -117325
7583 -117325 -124678 -81511 52419 -71442 -99823 -32593 22171 -110184 -205141 -140417 -34464
7572c4464l9593j34780J0488K77211l5460J0702j38300q8517K00438q2987L4086
7561b1176K6662J8762Q0211r9796k0429O4833n3868K5695n59p4131J60698O0951
7549A67853r8636k6653M1828K6847p4000j35289o6718R1428O7745m2783j6483
7538f4861N7630J65413r1835M2730J3730j35857N6863M6359j53001R3623J02918
7527A33712N3832j36512p8851J03111n9977j1579j3932n1295R4882j02078l8226
7516a06913Q5706J3638q413k7066L2570j1950L5364J0538r7620J3895Q5077J4885
7504C9711J2127k5469q8657O5784J1153k3650K4249L6444Q3140r463k0082L699
7492A08986j47102k5832L5095M4244n2856J41896n9509L0358J76648j28585j9904
$$ plain form
7572 -34464 -74057 -208837 -198349 78862 43402 54104 -84196 -172713 27725 -55262 -21176
7561 -21176 5486 24248 104459 4663 -15766 49067 -4801 20894 20335 -53796 106902 167853
7549 167853 69217 42564 84392 111239 37239 -98050 -164768 -73340 -5595 -48378 -64861
7538 -64861 -7231 158182 66347 109077 122807 -13050 43813 90172 -62829 30794 133712
7527 133712 187544 51032 -27819 75292 15315 3736 -10196 -61491 33391 -68687 -106913
7516 -106913 -21207 -7569 -15982 -43048 -10478 -22428 12936 23474 -74146 -60251 24826 39711
7504 39711 51838 26369 -62288 3496 14649 -9001 15248 51692 134832 125369 105287 108986
7492 108986 -38116 -63948 -28853 15391 -37465 104431 44922 75280 251928 123343 103439
7481A03439p010l7537l4408n541j32935M8480J04455l5474j9779O0860m4545R0473
7469I0478Q7656k45590j46200K07590l6114P8324k4753l4668N6557K28840p2973
7458A89147j6109K1294n6544j37486J06162O9536r6589j9239J14006R1667p4315
7447A91530l9612r7110j8820J88443K5989m9829l9406J42970l637m9424n5061
7436A96033j13879o683J77206p4554n1353L1097k9050K8881M2671j0750q2605
7425A07014P5327j06682M9152q6096R7142M8407Q036N398K9481O0196j48994j09176
7413B9205J70868Q5939j64908j93538J27908J07949N4597j79746j29227J65835
7403G4882K07340n8844k0343j08452Q7600J37852J687j07576j01547K10535J12549
$$ plain form
7481 103439 96429 58892 24484 18943 -113992 -65512 38943 3469 -16310 44550 5 90478
7469 90478 178134 -67456 -213656 -6066 -42180 36144 11391 -23277 33280 262120 189147
7458 189147 173038 194332 137788 302 106464 176000 79411 60172 174178 265845 191530
7447 191530 151918 54808 35988 224431 250420 200591 161185 304155 300518 251094 196033
7436 196033 82154 75471 252677 178123 126770 157867 128817 157698 200369 189619 107014
7425 107014 182341 75659 124811 38715 135857 184264 192300 197698 227179 287375 138381 29205
7413 29205 200073 286012 121104 -72434 55474 163423 218020 38274 -90953 74882
7403 74882 282222 223378 203035 94583 182183 320035 321722 214146 112599 323134 435683
7392D35683k56260J7731J01456K7867j07863n5739m1844O5870J3582j72769J11932
7381A39646R5949j2170r5008K6535j1290q0092q5943N0500l2110Q5390P586r48
7369H8045J29178j15142n8500J9407Q1260P296j4564o4992J7725M4063j8223l7886
7357G7667j18421K88631P742j48899L3422M9028k3478O1059j43755Q3923N5592
7346B22511p3157O344k8691P6435m3205l4024k9813J25060m6196R208k4873Q557
7334A68156O9267k5244N6145P1028o3814j9194m4230L7160J42957k2681q7571
7323B81979P6518J6706m8490r6878q5380n872p447O5842j00188J1124l3134Q0188
7311A54968L6547r8270M9077O934J7832j9410j7467j29124Q0379J10641o0158
$$ plain form
7392 435683 179423 197154 298610 326477 218614 162875 121031 186901 200483 27714 139646
7381 139646 235595 223425 128417 154952 143662 63570 -22373 28127 -3983 81407 88993 88045
7369 88045 217223 102081 43581 62988 144248 151544 136980 71988 89713 133776 115553 77667
7357 77667 -40754 247877 255619 106720 140142 189170 165692 226751 82996 166919 222511
7346 222511 149354 155698 127007 203442 160237 126213 96400 221460 175264 184472 159599 168156
7334 168156 237423 212179 268324 339352 275538 256344 212114 249274 392231 369550 281979
7323 281979 358497 375203 326713 229835 144455 138583 131136 196978 96790 107914 74780 154968
7311 154968 191515 93245 142322 149256 167088 147678 130211 1087 81466 192107 131949
7300A31949l6884R7586J4009n2227j39092p5586J44637r8196J1447K2152M0263
7289F0058J2333J9399o7367O7206R684j53702P9981R8071N7757L6810l5567m1022
7277A43641M6095o786k7432Q3577j2382n8712m8821J44863K1310r5319l0580P0932
7265B30386K5424j0464K3655r5909J5005R9110k2514R276L3021M3536j4616k6181
7253C09729L5168p5346r14o494o6878j4252Q0417K9040J8606n289M1616J03655
7241D49058q4082o8142j01079J4724L431J04683O8736q8314j31502m997k0015
7230A42501M9578r8012k22022j6843J89422O0033j94970M57O7588O0845j4922
7219B3655P6689p4096Q1795o257J01594j49659Q82M5201j02925P764N7816L4531
$$ plain form
7300 131949 95065 192651 206660 154433 15341 -60245 84392 -13804 -2357 19795 60058
7289 60058 72391 91790 24423 91629 101313 -52389 27592 125663 183420 220230 184663 143641
7277 143641 189736 182950 155518 239095 226713 168001 119180 264043 285353 190034 159454 230386
7265 230386 255810 245346 269001 173092 188097 287207 264693 273969 306990 350526 335910 309729
7253 309729 344897 269551 268637 262143 195265 181013 261430 290470 309076 303787 345403 449058
7241 449058 364976 296834 195755 210479 213910 318593 387329 299015 167513 162516 142501
7230 142501 192079 94067 -127955 -144798 44624 104657 -90313 -89856 -22268 38577 23655
7219 23655 100344 26248 108043 101786 203380 53721 54603 99804 -3121 4643 62459 96990
7207I6990o3993M7427L2641Q7742q257j59904k555P7273P4754N7023j12613K3928
7195A50456M1623P2350k5030p7503j69158J9077K38159j9870L5300q4533l6308
7184A44563N3158j08549k05688O2205O0490J04456m4253n6452P2117N0003K1206
7173A53256n4098k6441j5214m2054Q7899J3111J1867J36621O2380k9006o4144
7162B34177r0011j03760J73987j55024L3857Q1297P7520R1725Q9714k9835j87864
7151B15783L50O2211N7178m9901q2138j0087R4383o6579o7883J3886L4615m2734
7139A59084K9276k1061q6052J7982L6301K9685j20899O6462K9422k5182M4564
7128A59582K3136J4103o941L032j4322R3368N7294j66031j29081Q5580J5874P9382
$$ plain form
7207 96990 32997 80424 113065 200807 192550 32646 30091 107364 182118 239141 126528 150456
7195 150456 192079 264429 239399 161896 -7262 11815 249974 230104 265404 180871 144563
7184 144563 197721 89172 -116516 -54311 6179 110635 66382 9930 82047 132050 153256
7173 153256 99158 72717 57503 15449 103348 116459 128326 264947 327327 298321 234177
7162 234177 144166 40406 214393 59369 93226 174523 252043 343768 433482 403647 215783
7151 215783 216133 278344 335522 285621 203483 193396 287779 221200 153317 167203 201818 159084
7139 159084 188360 167299 81247 99229 135530 165215 44316 110778 140200 115018 159582
7128 159582 182718 196821 189880 192912 178590 271958 329252 163221 34140 119720 135594 214976
7116B14976J3187j58459N4482P0432M6352j52420m1103l0430J06864J12184j97035
7105C9030p2821J28580j02089q443Q6800j3175L2103P8598P0960j73020o7577
7094a054p7366p2103L7081j08008n0457K25889J60671j28223J80915J310p7024
7083I1631r5686j0836P8001j82391q2809J77838J15352o4700R5399k2563J58800
7072B58036m0618j76390m2580J92833q1382k4936N3431O4434k2937j55864O2275
7061H6302R2351P234P9643o2344j50278J07657P3865o8038l5237n1233O7389J56402
7049C03713q8121q7488J37322p0740L9753N1480j6979P412K2132K9021j49986
7038A77519j10052J66299P7758J5024J8193p1225P7553k794j15948P7450J66237
$$ plain form
7116 214976 228163 69704 124186 194618 240970 88550 47447 17017 123881 236065 39030
7105 39030 -33791 94789 -7300 -15743 71057 57882 89985 168583 239543 66523 -1054
7094 -1054 -78420 -150523 -113442 -221450 -271907 -46018 114653 -13570 167345 168655 91631
7083 91631 -4055 -14891 63110 -119281 -202090 -24252 91100 26400 121799 99236 258036
7072 258036 217418 41028 -1552 191281 109899 84963 138394 202828 179891 24027 86302
7061 86302 178653 185887 265530 203186 52908 160565 234430 166392 131155 79922 147311 303713
7049 303713 215592 128104 265426 194686 234439 285919 268940 276352 298484 327505 177519
7038 177519 67467 233766 311524 326548 344741 273516 351069 348275 232327 309777 476014
7027D76014j41466q8595N0790J0355j2482n1997j05741K39269N4042p5672N389
7016C59906K340n5575k1561J76676m0627k64961L129O7388R2121J317l1061n2788
7004B36304R0910N4283m2916k7926q606p1678J8721R5881j02860p6994N2940K51
6992B18310q2833j5895P9433R4531j3951O2955m428R0941l7310j65667J29568
6981C55654m4833K5229p1000J3734J2880M9504n0885o9700J75710j5573r7982
6970B82738p4678o378p5636J03053K0217M3950M3440k2186q7629o7310J14716
6959B74297j15339L752O9207j41311R0308m0034m3769O6473o6143q7299l6495
6948b6353k4948R8727m8169r5214R1940J06296Q3842M5028p4690j54564L8214
$$ plain form
7027 476014 334548 245953 296743 307098 294616 242619 136878 376147 430189 354517 359906
7016 359906 362246 306671 285110 461786 421159 156198 159327 226715 318836 320153 289092 236304
7004 236304 327214 381497 338581 310655 302049 230371 249092 344973 242113 165119 218059 218310
6992 218310 135477 119582 199015 293546 279595 342550 338122 429063 391753 226086 355654
6981 355654 310821 336050 265050 278784 291664 341168 290283 220583 396293 380720 282738
6970 282738 208060 201682 126046 229099 249316 293266 336706 314520 226891 159581 274297
6959 274297 158958 162710 231917 90606 180914 140880 97111 163584 97441 10142 -26353
6948 -26353 -51301 47426 -743 -95957 -4017 102279 186121 231149 156459 1895 40109
6937D0109J42825P9536l5402j00986J61390J37555k4109L430n0569j38100K8389
6926B44068k708N390q2685k2069n546J33414J55298m5629j00229O3311J4156m0652
6914C16119L7489K5308J02286J4986K941n3493R152l400r5534n809p6471J73426
6902D47000M1008k11476O6042J0357L335k9158L0207J04140q4438l0146N197M0813
6890C92881N7067j69095m164J47299R6042o9005k7510K0652J02802O608j45998
6879D07579l0568M233O797K5663J96555r3586m518N3847o5968m4027r0148N2413
6867D18272m8821m5432l0824J90357J39957l3451j97509J24934R0505j29816m8447
6856D29725n1559K3812L8962L3344l101Q6896R9836j55249m5563J92246L2558
$$ plain form
6937 40109 182934 262470 227068 126082 287472 425027 400918 404348 353779 215679 244068
6926 244068 241360 246750 164065 141996 136450 269864 425162 379533 279304 342615 356771 316119
6914 316119 353608 378916 481202 496188 499129 445636 454788 451388 355854 350045 273574 447000
6902 447000 488008 276532 342574 352931 356266 327108 357315 461455 377017 346871 352068 392881
6890 392881 449948 280853 276689 423988 520030 451025 423515 444167 546969 553577 407579
6879 407579 377011 381244 388041 413704 610259 516673 512155 566002 500034 456007 365859 418272
6867 418272 369451 324019 293195 483552 623509 590058 392549 517483 607988 478172 429725
6856 429725 378166 401978 440940 474284 471183 558079 657915 502666 457103 649349 681907
6845F81907M3542O355p5231J67929N2373j39969j47592k4371J38707J0466j20042
6834E94074J1585M0683J36467J60126r2755n2841m1708n8276O1411K0575k31522
6823E47819r2116O9919K59859K0217m9011J1358j26227J43913l3572q3928j7522
6812F50709o6182K281K19164M7370j60039j04158J14138M3629l8226q2975o877
6801F18834L2995R4677m1249m3428J89096j82156O6658K07450p3018j08973L5427
6790G96313J2484O6953R6067n1846J49520O7756j80158o3759R4780L2560r5402
6779I25268l9570R5346R0988l0589Q044N2590J60072J9914j78242N2094R6199
6768A252114p9554p6239k2209R8751K14093N0620r3485n753n3960K5283j05884
$$ plain form
6845 681907 725449 731804 656573 824502 876875 736906 589314 564943 703650 714116 594074
6834 594074 605659 646342 782809 942935 850180 797339 755631 697355 758766 779341 547819
6823 547819 455703 525622 785481 805698 756687 768045 641818 785731 752159 668231 650709
6812 650709 584527 586808 805972 853342 693303 589145 703283 746912 708686 625711 618834
6801 618834 651829 746506 705257 661829 850925 668769 735427 942877 869859 760886 796313
6790 796313 808797 875750 971817 919971 1069491 1137247 957089 893330 988110 1020670 925268
6779 925268 885698 981044 1072032 1041443 1049487 1102077 1262149 1282063 1103821 1155915 1252114
6768 1252114 1172560 1096321 1074112 1172863 1386956 1437576 1344091 1338338 1284378 1309661 1203777
6757A203777n5281L8254J9422P973L8194Q5885M6810L0587l8591N1154M9167l3642
6745A443709Q8032L7551o77R5475N3917M3981M6095O4270j9414j6115K5911k3943
6733A838792l6648J99768J89110J3337J072l9323l5289Q3559k5847M6267M1125
6722B275923k2484J26699Q5112K5394j2455J88825Q487Q0523Q8451Q3822Q2208
6711C010505J04333J51952R7182K92944M7858j03819N9663J24702Q7372L8700
6701C911392K52315J75775K38922J88585Q2385m9936J51709L31834J02670l1330
6691E354321R8421K16200K05590J63853k0891P0835O7973L9291l6553j28262j51804
6680E878974r7430l3702n9852j00396j92205j23873j57387k18124l06470j96427
$$ plain form
6757 1203777 1148496 1186750 1206172 1214145 1252339 1338224 1385034 1415621 1377030 1428184 1477351 1443709
6745 1443709 1531741 1569292 1568615 1664090 1718007 1761988 1808083 1872353 1852939 1836824 1862735 1838792
6733 1838792 1802144 2001912 2191022 2204359 2205431 2166108 2130819 2214378 2188531 2234798 2275923
6722 2275923 2253439 2380138 2465250 2490644 2478189 2667014 2675501 2756024 2844475 2928297 3010505
6711 3010505 3114838 3266790 3363972 3656916 3704774 3600955 3660618 3785320 3872692 3911392
6701 3911392 4163707 4339482 4578404 4766989 4849374 4799438 4951147 5282981 5385651 5354321
6691 5354321 5452742 5668942 5874532 6038385 6017494 6088329 6156302 6195593 6159040 6030778 5878974
6680 5878974 5781544 5747842 5687990 5587594 5395389 5271516 5114129 4896005 4589535 4393108
6670D393108O1222l23108j28829N3468k12024l43992m6775j06071K9187k18610
6660C157576j33685q0763j9432j06630j96000o4798m6420P7632j2806J5498k1462
6649B568710j32679Q459l284q0445Q229p515j51345Q8637L0952j47129q095n0239
6637B124256L9741r0499P2107j21936p8139n245J17001M6208P526O2012J92206
6626B365238J7930q6845j34857K2249J21053p1557q2594N8248J4718O5621M6353
6615B335557q0913k9996j6638N6991L1476n281p3318J19857N7081j34017j30253
6604B130546j50056Q3918j1314O6563J13007o8482o5493m0074l5832j54332j08699
6593A759752n7236p7000j3588q0053n5901J66198M146j15238J8566j10510o8330
$$ plain form
6670 4393108 4454330 4131222 4002393 4055861 3843837 3499845 3453070 3346999 3376186 3157576
6660 3157576 3023891 2943128 2923696 2817066 2621066 2556268 2509848 2587480 2574674 2590172 2568710
6649 2568710 2436031 2444490 2441206 2360761 2368990 2361475 2210130 2298767 2329719 2182590 2174495 2124256
6637 2124256 2163997 2073498 2145605 2023669 1945530 1940285 2057286 2103494 2111020 2173032 2365238
6626 2365238 2383168 2296323 2161466 2183715 2304768 2233211 2150617 2208865 2223583 2289204 2335557
6615 2335557 2254644 2224648 2208010 2265001 2296477 2291196 2217878 2337735 2394816 2260799 2130546
6604 2130546 1980490 2064408 2053094 2119657 2232664 2164182 2098689 2058615 2022783 1868451 1759752
6593 1759752 1702516 1625516 1611928 1531875 1475974 1642172 1646318 1531080 1549646 1439136 1370806
6582A370806o3367q4425J26945j57724r794K2844N8877l2203r0344j00517J38303
6571A179401N1080J572l3288n9657M001k677O0333k6741n098m1934n268J7400
6559A139124R766k40573J4881J10309J188j2020k2040Q0729Q7862m8964j33061
6548I87201r9221J12835P0161j34730m0951J29403P7745L1679j14574J23435p7280
6537A065703m3928K430l8041o0620j22424P5863J1478J79528j19809L004Q532
6526I61716N9448L9528K0055M2932M1921K7116J02425o9815j26316j9380K2113
6515A101743J14763m2858M6745J83336R7122j1141j12138P416k9875O5624J963
6504A422700M6096n114L1835K6136k3684N7902q5043Q2906o9134P6934L7275J8872
$$ plain form
6582 1370806 1307439 1223014 1349959 1192235 1182441 1205285 1264162 1231959 1141615 1041098 1179401
6571 1179401 1230481 1232053 1198765 1139108 1143109 1140432 1200765 1174024 1168926 1126992 1121724 1139124
6559 1139124 1148890 908317 923198 1033507 1034695 1022675 1000635 1081364 1169226 1120262 987201
6548 987201 887980 1000815 1070976 936246 895295 1024698 1102443 1134122 1019548 1142983 1065703
6537 1065703 1021775 1024205 986164 925544 803120 878983 890461 1069989 950180 953184 961716
6526 961716 1021164 1060692 1080747 1123679 1165600 1192716 1295141 1225326 1099010 1079630 1101743
6515 1101743 1216506 1173648 1220393 1403729 1500851 1489710 1377572 1384988 1355113 1420737 1422700
6504 1422700 1468796 1463682 1495517 1521653 1497969 1555871 1470828 1553734 1484600 1561534 1598809 1617681
6492A617681l8341J1418q730J9601J23455j81161j46212J50523J37193k04143
6482A481284j35468O5084Q5446M4095j67902J1864J15129O52j55874o5796O2070
6471A340584P9606j46665J22620n9803j64970L0939J01808p7740K237p9782J27216
6460A276050L34829N1649j52910N2183P8442j09445J0409q1373j67999j7607J84637
6449A458865J78733J55523J7439o9511M9091K75574j66852n8329q1762J03550
6439A862321N7190J17070J3358k7566Q2959J95161j56408j77599R0045P4841P6631
6428B208003M3706p6594R4063K27188M680r4953J0583J91260j24160O9863n1426
6417B502213J52428J02612j6822j07356K8292J89799m914R5873Q7363J85616J66867
$$ plain form
6492 1617681 1579340 1590758 1582028 1601629 1725084 1543923 1397711 1548234 1685427 1481284
6482 1481284 1345816 1410900 1496346 1540441 1372539 1384403 1499532 1500184 1344310 1278514 1340584
6471 1340584 1420190 1273525 1396145 1336342 1171372 1202311 1304119 1226379 1228616 1148834 1276050
6460 1276050 1610879 1662528 1509618 1561801 1640243 1530798 1541207 1459834 1291835 1274228 1458865
6449 1458865 1637598 1793121 1810560 1741049 1790140 2065714 1898862 1840533 1758771 1862321
6439 1862321 1919511 2036581 2049939 2022373 2105332 2300493 2144085 1966486 2056531 2131372 2208003
6428 2208003 2251709 2175115 2269178 2496366 2501046 2406093 2416676 2607936 2483776 2553639 2502213
6417 2502213 2654641 2757253 2740431 2633075 2661367 2851166 2846252 2942125 3029488 3215104 3381971
6406C381971O2161J44220J88481K96190J11343J6355R9741L17450J55392p6316
6396D696988j67745j54411Q7681J09731n1772q3519J4882J32497J15751n0216
6386D649867O3353L10786L03093J25603P0456K33860L49792J17225J5856J61623
6376F401514R9203k8388p5958j10148K29665N8713J6200K4181j26454j27004l3093
6365F328431j97861J81553R3356k399K30126P4231J42103L41483L20098J27772
6355G638893J43992J04127J0946j83272O2935m4468m0473J15625q166k5473K18186
6344G992852K0679k1832L59204J55625K07677J29346K6926K55031K94687J77455
6334I597650M0773K67905K76190Q3192L52817L21957L42030K54547L55239K25914
$$ plain form
6406 3381971 3444132 3588352 3776833 4073023 4184366 4200721 4300462 4617912 4773304 4696988
6396 4696988 4529243 4374832 4462513 4572244 4520472 4436953 4451835 4584332 4700083 4649867
6386 4649867 4713220 5024006 5327099 5452702 5523158 5757018 6106810 6224035 6239891 6401514
6376 6401514 6500717 6472329 6396371 6286223 6515888 6574601 6590801 6614982 6488528 6361524 6328431
6365 6328431 6130570 6312123 6405479 6403080 6633206 6707437 6849540 7191023 7511121 7638893
6355 7638893 7782885 7887012 7897958 7714686 7777621 7733153 7692680 7808305 7800139 7774666 7992852
6344 7992852 8013531 7991699 8350903 8506528 8714205 8843551 8870477 9125508 9420195 9597650
6334 9597650 9638423 9906328 10182518 10265710 10618527 10940484 11282514 11537061 11892300 12118214
6324A2118214J96209M82791K56068L85711L92904L81011M28156N14817K42981
6315A5398862L41438N46090O36116N35150O46296J107871Q71585J194463J225222
6306B2503093J479380J564353J386415P09344P54813J259009J428595J950393
6298C3035395K368425K862801L669018M681662N855647P808865J0087743Q782109
6290G9151665K113331m047555o265942n165285l300062j947172r79615j74257
6282E9385108P35943K111330M292051N858209L942561N01885j356619o05235J757988
6273G6623221M928786P044091N601362N10348m976214p104797n880738l439962
6265G3306097j041412J665705L006580J410528k891071n860090n883807m097704
$$ plain form
6324 12118214 12314423 12797214 13053282 13438993 13831897 14212908 14641064 15155881 15398862
6315 15398862 15740300 16286390 16922506 17457656 18103952 19211823 20083408 21277871 22503093
6306 22503093 23982473 25546826 26933241 27642585 28397398 29656407 31085002 33035395
6298 33035395 35403820 38266621 41935639 46617301 52472948 60281813 70369556 79151665
6290 79151665 81264996 77217441 70951499 65786214 62486152 60538980 59559365 59385108
6282 59385108 60121051 62232381 66524432 72382641 76325202 76827087 75470468 74865233 76623221
6273 76623221 81552007 88596098 94197460 94707808 89731594 82626797 76746059 73306097
6265 73306097 72264685 73930390 76936970 78347498 75456427 69596337 63712530 59614826
6257E9614826k207824o59693J055455K300360M539479P154087Q818293M177338
6249H4792321m298294r508730j0046912q251842o426033m918516m046324l568320
6241C3727350l278885k874843k567529k152120j780024j224768j054550j048798
6233A7745833q94367o42570n71222o63363p22525n99633m31722m27591m58254
6224A2334586k91446q2782j45118l63507l94558m56793m73316m95022m75275k68113
6214H888656l71394l54581j97682j89316j43754k34805j56483k29108k02717j84171
6204F624645k0243j51831n7492j4840l6243K0350j58449j01725q0756n3051k19286
6193E751079p7204j31471o1863J5291n4630n6000k6179o9174j06713Q7859r0592
$$ plain form
6257 59614826 57407002 56747309 57802764 60103124 64642603 71796690 80614983 84792321
6249 84792321 80494027 70985297 60938385 52686543 46260510 41341994 37295670 33727350
6241 33727350 30448465 27573622 25006093 22853973 21073949 19849181 18794631 17745833
6233 17745833 16851466 16208896 15637674 14974311 14251786 13652153 13220431 12792840 12334586
6224 12334586 12043140 11960358 11815240 11451733 11057175 10600382 10127066 9632044 9156769 8888656
6214 8888656 8517262 8162681 7964999 7775683 7631929 7397124 7240641 7011533 6808816 6624645
6204 6624645 6604402 6452571 6395079 6380239 6343996 6364346 6205897 6104172 6023416 5970365 5751079
6193 5751079 5673875 5542404 5480541 5495832 5441202 5385202 5359023 5289849 5183136 5270995 5180403
6182E180403o8994P818m2068O0353Q1490k0199k82N8165J26188K9644m1358M2367
6170E413527J99167K61305J60885L11383L92576L54350N67724M32429p7031l64414
6160G651901m44038k02114k6371j32005j91813q7478J8662K58528L03754J29130
6150G278156J67172L8700j72557j594K12519M51279M14025K01439j14306j99511
6140H275322k11721k09733j64564q4490K20836K94506N3695j65503k36326j30729
6130G641293L4918N2402K05769L20873M50344O26172N84442M26101Q8935m68551
6120I962698p60472q41727o66357l24374l96831l67925k65030j13569j20939j19919
6110E985555j28018j15779J41978R6606K3857J79683K46757N4090M68839N51336
$$ plain form
6182 5180403 5111409 5119227 5077159 5137512 5219002 5198803 5198521 5256686 5382874 5412518 5371160 5413527
6170 5413527 5612694 5873999 6034884 6346267 6738843 7093193 7660917 8093346 8016315 7651901
6160 7651901 7207863 7005749 6979378 6847373 6655560 6568082 6586744 6845272 7149026 7278156
6150 7278156 7445328 7484028 7311471 7309877 7522396 7973675 8387700 8589139 8474833 8275322
6140 8275322 8063601 7853868 7689304 7604814 7825650 8120156 8173851 8008348 7772022 7641293
6130 7641293 7676211 7728613 7934382 8255255 8705599 9331771 9916213 10342314 10431249 9962698
6120 9962698 9202226 8360499 7694142 7369768 6972937 6605012 6339982 6226413 6105474 5985555
6110 5985555 5857537 5741758 5883736 5980342 6004199 6183882 6430639 6484729 6953568 7504904
6100G504904L76301M50954O52782N94647J26316r2820m14739n66354o53708o20232
6090G358051m32383l03349l80532k67477k15462j99556k44686k04907p9803k7048
6080E002848j67554q5453M4430J25180J16438n5831J35262L35398L09003K52147
6070F011868K95008r6060k25302j69572l20810m69511l19299j72461k69273k69640
6060C994948p2046p5357J2496k11068k40368j55214j39232k62176j53028l4712
6050B664243j362n4418j0379o4871k400J4061j37660k33821N0056J9312N6972
6039B299733Q5865j4940K8912M2847j30515L57p0372J880O9547j18953M1042q3315
6027B152088M9326L8708M61N1199K8312r2827J68277k4472J0909R7496J09457
$$ plain form
6100 7504904 7881205 8332159 8984941 9579588 9705904 9613084 9198345 8631991 7978283 7358051
6090 7358051 6925668 6622319 6241787 5974310 5758848 5559292 5314606 5109699 5029896 5002848
6080 5002848 4835294 4749841 4794271 4919451 5035889 4980058 5115320 5450718 5759721 6011868
6070 6011868 6306876 6210816 5985514 5815942 5495132 5025621 4706322 4533861 4264588 3994948
6060 3994948 3922902 3847545 3860041 3648973 3408605 3253391 3114159 2851983 2698955 2664243
6050 2664243 2662881 2608463 2598084 2533213 2530813 2544874 2407214 2173393 2223449 2242761 2299733
6039 2299733 2385598 2370658 2399570 2442417 2311902 2312259 2241887 2243767 2313314 2194361 2235403 2152088
6027 2152088 2201414 2240122 2240583 2291782 2320094 2227267 2395544 2371072 2381981 2479477 2588934
6016B588934j4568M1745n1744n7919m3156K3305r8651K4636J57484j8930O9137
6005B620273L9356q3601N1791Q8157m2506k6257P4176L002L9830l4504K8942J19837
5993B878496K01888k01451M1952J03662q5763j32852K1487m9520l7434L3589K1941
5982B795995N4657j10707l1903n2120L2926q5029l0538m8384J52239Q621K322
5971B688079N9131J78263L6176q0428O7068M0864k1954n4149O1468J06160n8292
5960C022386L3273J59194o5477j10787P7683j36696p2833O800J64141J99036j741
5949C274979q5507o6562K1686m749r6260j099n899r908K237j836K29372J21597
5937C378051j18142N595R9206k0235p3936m0154M0131j29451J16253m22j19153
$$ plain form
6016 2588934 2574366 2616111 2564367 2506448 2463292 2486597 2387946 2412582 2570066 2551136 2620273
6005 2620273 2659629 2576028 2627819 2715976 2673470 2647213 2721389 2724391 2764221 2729717 2758659 2878496
5993 2878496 3080384 2878933 2920885 3024547 2938784 2805932 2827419 2777899 2740465 2774054 2795995
5982 2795995 2850652 2739945 2708042 2655922 2688848 2603819 2573281 2524897 2677136 2685757 2688079
5971 2688079 2747210 2925473 2961649 2881221 2948289 2989153 2967199 2913050 2974518 3080678 3022386
5960 3022386 3055659 3214853 3149376 3038589 3116272 2979576 2906743 2913543 3077684 3276720 3274979
5949 3274979 3189472 3122910 3144596 3139847 3043587 3042488 3036589 3026681 3028918 3027082 3256454 3378051
5937 3378051 3259909 3265504 3364710 3344475 3270539 3230385 3270516 3141065 3257318 3256896 3137743
5926C137743j35651Q17N6735N5431m9234m9399m6367J84139M9864l4310N7046
5915C226814k5589J44724j29474P0237J56686R8791p2116O5063J2813j9965j2917
5904C515067J292m2448M246L8362l2491l7156m2618j218P0122o3367N0410l1682
5892C428519R1591K07591k3044p6113j06999K00244J95387q6838m3669N1243J99477
5881D037389r5980O6298J04257p6129K35250J78514J409K24257J01278q7034J52417
5870D841926P1178Q2143Q7744P8572J28751L22875M34158J92508J92775q6712
5860F345918j06464M4447k96977k28665O0016J61223P7934o6465Q2193J50953
5850F224113Q0252M02348J77839M4627J30881q545P0882K78501J2503L7964J38944
$$ plain form
5926 3137743 3002092 3002909 3059644 3115075 3065841 3016442 2970075 3154214 3204078 3169768 3226814
5915 3226814 3201225 3345949 3216475 3286712 3443398 3542189 3470073 3535136 3547949 3527984 3515067
5904 3515067 3516359 3473911 3478157 3516519 3484028 3446872 3404254 3403036 3473158 3409791 3460201 3428519
5892 3428519 3520110 3727701 3704657 3628544 3521545 3721789 3917176 3830338 3786669 3837912 4037389
5881 4037389 3941409 4007707 4111964 4035835 4271085 4449599 4451008 4675265 4776543 4689509 4841926
5870 4841926 4913104 4995247 5082991 5161563 5290314 5613189 6047347 6239855 6432630 6345918
5860 6345918 6239454 6283901 5986924 5758259 5818275 5979498 6057432 5990967 6073160 6224113
5850 6224113 6304365 6706713 6884552 6929179 7060060 7051515 7122397 7400898 7413401 7451365 7590309
5839G590309J26196R1071l1920R2326J4487k3024n2776p000J3298P1092r0728
5828G793331Q0412J7897p7537K07113L26656J61602J43318K05279J58652N5539
5818I072262j60296k3931k20302j00245k173q8998J94126Q6431o1178J21568L33493
5807I150757K45677R9066J18736K78565J37801O1398R6436Q3873K47267J92316
5797A0711892K67511k7442J17283K70736K06898K60392J81966K7812M16419J71636
5787A2605103J42276K95905K54360K06328K46629K86461L03089K84347Q9115L78003
5777A5091616M35646L97891K28587M66302M15011L87086M12791L02477M74010
5768A8611417M65699N53664N13749N75804M96419O17604P58892P67130Q68721
$$ plain form
5839 7590309 7716505 7807576 7775656 7867982 7882469 7859445 7806669 7799669 7812967 7884059 7793331
5828 7793331 7873743 7891640 7814103 8021216 8347872 8509474 8652792 8858071 9016723 9072262
5818 9072262 8911966 8888035 8667733 8567488 8565315 8476317 8670443 8756874 8695696 8817264 9150757
5807 9150757 9396434 9495500 9614236 9892801 10030602 10092000 10188436 10272309 10519576 10711892
5797 10711892 10979403 10951961 11069244 11339980 11546878 11807270 11989236 12017048 12433467 12605103
5787 12605103 12747379 13043284 13297644 13503972 13750601 14037062 14340151 14624498 14713613 15091616
5777 15091616 15527262 15925153 16153740 16620042 17035053 17422139 17834930 18137407 18611417
5768 18611417 19077116 19630780 20144529 20720333 21216752 21834356 22593248 23360378 24229099
5759B4229099R96383J275108J324068J535360J905278J747917J127420N50733
5751C4691366N98124P85106J140980J485260K105125K621040L199820M058353
5743E0685174N004582N895447O530326Q232002J0727297R970769K833018m079639
5735I5798976o512203n717809l958485k494063j275470l12740J156432L250710
5727G9935348N565147M721200M98704k616122k518829p20607J804163M481029
5719I1150033P454720Q087574M685764r68484m656939m741753l383932j971852
5711I5655131j31641O15973j953970n308668o383661m873254l158115j628350
5703G2833445l59815O87318J816885L782812O266472P530050L814887l099773
$$ plain form
5759 24229099 25225482 26500590 27824658 29360018 31265296 33013213 34140633 34691366
5751 34691366 35289490 36074596 37215576 38700836 40805961 43427001 46626821 50685174
5743 50685174 55689756 61585203 68115529 76347531 87074828 97045597 99878615 95798976
5735 95798976 89286773 83568964 79610479 77116416 75840946 75528206 76684638 79935348
5727 79935348 85500495 90221695 90720399 88104277 85585448 84864841 86669004 91150033
5719 91150033 98604753 106692327 111378091 110409607 105752668 101010915 97626983 95655131
5711 95655131 95523490 96139463 94185493 88876825 82493164 77619910 74461795 72833445
5703 72833445 72473630 73160948 74977833 78760645 85027117 92557167 96372054 93272281
5695I3272281p401006p625227o119134m664627l284548k825402k670148k456656
5687E6225533j917221j628130j558570j728637j477231j194231p76685o64599
5679D5280229n71074k25419j66647j87373m10419q2877K21641M64991J90872L83387
5669D4897311O92219Q62110Q80695J011450J211513J121165Q51117N62264O17562
5660E2707406N97014O23577J348660J788751K174366K453412L311298M140741
5652F9145225N006328O386176Q389941J0016893Q938284N536736M687115P292059
5644A25398757J1456648J5974925K3418228L4191008M0817845J8870678j6506108
5637B53621981l3614488l2884789k5550510k0141425j5649033j3065389j1462443
$$ plain form
5695 93272281 85871275 78246048 72126914 67462287 64177739 61352337 58682189 56225533
5687 56225533 54308312 52680182 51121612 49392975 47915744 46721513 45944828 45280229
5679 45280229 44709155 44483736 44317089 44129716 43719297 43636420 43858061 44323052 44513924 44897311
5669 44897311 45589530 46451640 47332335 48343785 49555298 50676463 51527580 52089844 52707406
5660 52707406 53304420 53927997 55276657 57065408 59239774 61693186 65004484 69145225
5652 69145225 74151553 80537729 88927670 98944563 107882847 113419583 118106698 125398757
5644 125398757 136855405 152830330 176248558 210439566 251257411 270128089 253621981
5637 253621981 220007493 187122704 161572194 141430769 125781736 112716347 101253904
5630A01253904j0388642q912375p672144o217004n046874l990738l427759k794460
5622E2803908k338503j859213j505685j113134j186129q66557m18818k21111m42305
5613D2852453m32629n24277o09395n70774l72752j34033l18817r29606j408759
5604C7551411j378069j024628p89825n20700p13301o63044o06886n87752o88146
5595C0579060m44734m08742k00219K46553Q3547k53767p23310r11007q51110m72972
5585B6643299m37376o73540o69773o19996k06639n3878l1881m68511q00047p76597
5575B1905061n78939n28455j85821R1924m2939J56175l15686o07012m06976k44635
5565A9242697j45553L5176r7752j56300l34804l96852l78429j97967k56219j81048
$$ plain form
5630 101253904 90865262 81952887 74280743 68063739 63016865 59026127 55598368 52803908
5622 52803908 50465405 48606192 47100507 45987373 44801244 43934687 43515869 43294758 42852453
5613 42852453 42419824 41895547 41286152 40715378 40342626 40208593 39889776 38960170 37551411
5604 37551411 36173342 35148714 34358889 33838189 33124888 32461844 31854958 31267206 30579060
5595 30579060 30134326 29725584 29525365 29771918 29855465 29601698 28878388 27967381 27116271 26643299
5585 26643299 26205923 25532383 24862610 24242614 24035975 23982097 23950216 23481705 22681658 21905061
5575 21905061 21326122 20797667 20611846 20703770 20660831 20817006 20501320 19894308 19487332 19242697
5565 19242697 19097144 19132320 19034568 18878268 18543464 18146612 17768183 17570216 17313997 17132949
5555A7132949k15443p897m5092q5275J29367j98807j69429k72189l03276l82912
5545A5581996j04891j90404k83820l75207n71587m37465j09175j75987r9278J13083
5535A3347265r3051L2018q9938r5270L790J17828L14115L51291J89143R8604M5782
5524A4221577J7981M8801J62031O19169M17849P1552J31016K23622M0164n63058
5514A5390704q06677o86379n40146p10601m62633l58674k16118j32075k51585
5505A1225816j23663J18459n5866N8701J53291L73633M70082N88074P70271P29372
5495A4308170L47885L65224K29240k53270o12821q00190n26487n63773n21692
5486A1972286k19275k08730m19130n94571n88301k91031j20281k50709k2606Q342
$$ plain form
5555 17132949 16917506 16909609 16864517 16779242 16908609 16709802 16540373 16268184 15964908 15581996
5545 15581996 15477105 15286701 15002881 14627674 14056087 13618622 13509447 13333460 13234182 13347265
5535 13347265 13254214 13286232 13196294 13101024 13104814 13222642 13536757 13888048 14077191 14175795 14221577
5524 14221577 14239558 14288359 14450390 15069559 15487408 15558960 15689976 15913598 15953762 15390704
5514 15390704 14584027 13897648 13357502 12646901 12184268 11825594 11609476 11477401 11225816
5505 11225816 11102153 11220612 11164746 11223447 11376738 11750371 12220453 12808527 13578798 14308170
5495 14308170 14656055 15021279 15250519 14997249 14384428 13584238 13057751 12493978 11972286
5486 11972286 11753011 11544281 11125151 10530580 9942279 9651248 9530967 9280258 9257652 9265994
5476I265994l6630k22718j82315J94342J96311M5293j78131k23593j95623k21569
5466H441361m39343l84826j44912j39227k77809j6389r3044r1634k32966k30746
5456F390465j78379k23374j06105L9631j42568j71105j9082j53947j47620k76938
5446E010978j54711p1587j05187l42999k26464m9619j60130j28054j89271j1631
5436C571325l8327j30136J1787j31121N8383p5162j06892L3400J06539J40181
5426C439977Q261R13J21724J4353Q1652J09033K2275P0561J21234P2236R4013
5415D156232J38804J90820J11907J60612L14030J98008j12857n4193l60063j46997
5405D596303J52762M198K81401K69376L71969M2062l80680l65801j15864O62k17338
$$ plain form
5476 9265994 9229364 9006646 8824331 9018673 9214984 9260277 9082146 8858553 8662930 8441361
5466 8441361 8002018 7617192 7472280 7333053 7055244 7038855 6945811 6854177 6621211 6390465
5456 6390465 6212086 5988712 5882607 5922238 5779670 5608565 5589483 5435536 5287916 5010978
5446 5010978 4856267 4784680 4679493 4336494 4110030 4060411 3900281 3772227 3582956 3571325
5436 3571325 3532998 3402862 3414649 3283528 3341911 3266749 3159857 3193257 3299796 3439977
5426 3439977 3448238 3449151 3570875 3585228 3666880 3775913 3798188 3868749 3989983 4062219 4156232
5415 4156232 4295036 4485856 4597763 4758375 5072405 5270413 5157556 5103363 4743300 4596303
5405 4596303 4749065 4753263 5034664 5304040 5676009 5718071 5337391 4971590 4855726 4856388 4639050
5394D639050j67950Q1342r6552L5735r18k03399j81916O0967p3237j19208n0699
5383C923215J44517M6064J19149P4894J92034J60182K3474k31684k28142j4322
5373D209381Q7318O5626j79450M5506n95k13251j1884J01012j74478j06730p0459
5362C751996p9998J20515O5608q3399o5984J23297L203j50963k8451r2394L7631
5351C601061J20799L858K9393m3097k8324J92344L7903j28014r7226P2449K27958
5340C989104J30600J2768J84312J11924J28209K35509K76291N58018M83444K63135
5330F373314L48668K57252j42712l17766l93101k49890j40376j57513j61477j99596
5320E216803n8041q543j30021j39615K75356N2412l9947J5363j95257J65846K70455
$$ plain form
5394 4639050 4471100 4552442 4455890 4491625 4490707 4287308 4105392 4166359 4093122 3973914 3923215
5383 3923215 4067732 4113796 4232945 4307839 4499873 4660055 4683529 4451845 4223703 4209381
5373 4209381 4296699 4362325 4182875 4228381 4227786 4014535 4002651 4103663 3929185 3822455 3751996
5362 3751996 3671998 3792513 3858121 3774722 3708738 3832035 3835238 3684275 3655824 3563430 3601061
5351 3601061 3721860 3725718 3755111 3712014 3683690 3876034 3913937 3785923 3688697 3761146 3989104
5340 3989104 4119704 4132472 4316784 4428708 4556917 4792426 5068717 5626735 6110179 6373314
5330 6373314 6721982 6979234 6836522 6518756 6125655 5875765 5735389 5577876 5416399 5216803
5320 5216803 5158762 5150219 5020198 4880583 5155939 5208351 5168404 5183767 4988510 5154356 5424811
5309E424811M1151K74454L49015K71042N04357M21884P83685P40083J068095J529499
5299A1408076J691080J599935P34739n83706j132363j140012j067312r02095p54831
5290I853511o68958p19816m35107m03972k24639k08092j49929p53j32979k2794
5280F886472l1581o8000J04134R6907P4033K40600K80587M83604O04607O49445
5270I320808R39325J162581J431153J872040J725663R15780m03835j125815j352669
5261A4485031j440738j162128r24095q18833p43364m45934m57472m20128k56933
5252G815406k01390k81936p2321l1016j29220O9312p9872j51849J19697K58877
5242G315688o171J67996L11115M47440N83508M86784O59372P44359P55017L34677
$$ plain form
5309 5424811 5465962 5740416 6089431 6360473 6864830 7286714 8070399 8810482 9878577 11408076
5299 11408076 13099156 14699091 15433830 14850124 13717761 12577749 11510437 10608342 9853511
5290 9853511 9184553 8464737 8029630 7625658 7401019 7192927 7042998 7042245 6909266 6886472
5280 6886472 6854891 6786891 6891025 6987932 7061965 7302565 7583152 8066756 8671363 9320808
5270 9320808 10260133 11422714 12853867 14725907 16451570 17367350 16963515 15837700 14485031
5261 14485031 13044293 11882165 10958070 10139237 9395873 8949939 8492467 8072339 7815406
5252 7815406 7614016 7332080 7259759 7228743 7099523 7168835 7088963 6937114 7056811 7315688
5242 7315688 7309517 7477513 7788628 8236068 8819576 9306360 9965732 10710091 11465108 11799785
5232A1799785m6103m26313n85765p34113n09737n64295l94370k76582l34592p0961
5222G856954k04792j06873j86493j77203j13951p9412q0726j21198k55708j37392
5212F393206Q8824o8259K0645j35963K47674J90675L54123N0701P2133L35638
5202G549397J89282n9157M1923O5899N5504Q7107p5612J21605L45995K44770Q0171
5191H646884J29933L19857J74324J81787J57215J01275L1131K0146j48527J55977
5181I770002J26275j938R4637j8105n4413L97987J40670J13352K05767K04709
5171A0978943L27384J68347J61589J67557K26843J18104J91421J67051L12777
5162A2820016K36229M49399M81132M29598M56198L44553L19500L23842K90324
$$ plain form
5232 11799785 11753682 11327369 10741604 10007491 9497754 8933459 8539089 8262507 7927915 7856954
5222 7856954 7652162 7545289 7358796 7181593 7067642 6988230 6907504 6786306 6530598 6393206
5212 6393206 6482030 6413771 6434416 6298453 6546127 6736802 7090925 7141626 7213759 7549397
5202 7549397 7738679 7679522 7721445 7787344 7842848 7929955 7854343 7975948 8321943 8566713 8646884
5191 8646884 8776817 9096674 9270998 9452785 9610000 9711275 9742406 9762552 9614025 9770002
5181 9770002 9896277 9894339 9988976 9970871 9916458 10314445 10455115 10568467 10774234 10978943
5171 10978943 11306327 11474674 11636263 11803820 12030663 12148767 12340188 12507239 12820016
5162 12820016 13056245 13505644 13986776 14416374 14872572 15217125 15536625 15860467 16150791
5153A6150791J34125L77718L81469M54579L93674M00780M47011N00114O23804
5144A9864065M70740M47552L99920N88562N23353M75560M25667O37246P36649
5135B4569314R08368P56701P79200Q28324R04099Q85131O74139Q37169J070356
5126C2212801J275412J087716R04606J034411Q51080J141875R56084J314293J510604
5117D2288882J940191J902656K504482K767932L323733L366814M278267M517118
5109F6890075N427828O561733P925364Q659210J0875757J3853985J8976591K1008424
5101A60178967K0432636K2929834L4762093N4688924P3793012L3758019l4795591
5094C65747894o0021695n5938810m0561626k9214762k0182352j8751054j8404112
$$ plain form
5153 16150791 16284916 16662634 17044103 17498682 17892356 18293136 18740147 19240261 19864065
5144 19864065 20334805 20782357 21182277 21770839 22294192 22769752 23195419 23832665 24569314
5135 24569314 25477682 26234383 27013583 27841907 28746006 29631137 30305276 31142445 32212801
5126 32212801 33488213 34575929 35480535 36514946 37366026 38507901 39463985 40778278 42288882
5117 42288882 44229073 46131729 48636211 51404143 54727876 58094690 62372957 66890075
5109 66890075 72317903 78879636 86805000 95464210 106339967 120193952 139170543 160178967
5101 160178967 180611603 203541437 238303530 292992454 366785466 400543485 365747894
5094 365747894 305726199 249787389 209225763 180011001 159828649 141077595 122673483
5087A22673483j6521370j2921196j0460710q355817o877416n398273m481434l151910
5079E4505357k345951j348454p08243J3328o46762k162070l331212l260013l053973
5070C7662007k471461j971798j403839j504792j769767j642749j300966j044472
5062B4552163j032828r17706p25731p84391m73536m56096m36534j02194N6241
5053A9679388R8657O23836R67747J601843J972457O64610j312951j620880j659979
5044B1014728j749676j429662j010866r40148q52020l03431k60228l15467m45867
5035A3707363p18168o28763k74571m85006l17481j87185k59266j83814j89381
5026A0463728j25395j38486R926j5957k33130k20476j55511l30747k01226q2640
$$ plain form
5087 122673483 106152113 93230917 82770207 74414390 67536974 62138701 57657267 54505357
5079 54505357 52159406 50810952 50102709 50116037 49469275 47307205 43975993 40715980 37662007
5070 37662007 35190546 33218748 31814909 30310117 28540350 26897601 25596635 24552163
5062 24552163 23519335 22601629 21875898 21091507 20617971 20161875 19725341 19623147 19679388
5053 19679388 19778045 20401881 21369628 22971471 24943928 25608538 24295587 22674707 21014728
5044 21014728 19265052 17835390 16824524 15884376 15032356 14728925 14468697 14153230 13707363
5035 13707363 12989195 12360432 12085861 11600855 11283374 11096189 10836923 10653109 10463728
5026 10463728 10338333 10199847 10209773 10193816 9960686 9740210 9584699 9253952 9052726 8970086
5016H970086k64738j23603m3017J04913j04395N0629j37763j68073o0422m7176
5006H176441n4873J52585n6596K784J02215N1020M8807J81105m7569j70679N3922
4995H439162L77607L31807K74598M34696O33306Q50339J440382J495884J942134
4986A6219915L101958M505190M463451M33453l311101l898332l261967k362825
4978A5889742j703544j061948j221403j094517r11901o75586o19391o74414l36092
4969G590946k16642j95214k24526k30740k60649j40021j33723j51724P6563j79172
4959E935098j46401j59419j01298j59243J0536q2016r8919K285k3866J2797k25154
4948D964400K4594J9637l2371n7691j78774L9130J29131q0622j77980n6393M1250
$$ plain form
5016 8970086 8705348 8581745 8538728 8643641 8539246 8589875 8452112 8284039 8223617 8176441
5006 8176441 8121568 8274153 8217557 8220341 8322556 8373576 8422383 8603488 8555919 8385240 8439162
4995 8439162 8816769 9148576 9423174 9857870 10491176 11341515 12781897 14277781 16219915
4986 16219915 19321873 23827063 28290514 28723967 25412866 21514534 18252567 15889742
4978 15889742 14186198 13124250 11902847 10808330 9896429 9220843 8601452 7927038 7590946
4969 7590946 7374304 7179090 6954564 6723824 6463175 6323154 6189431 6037707 6114270 5935098
4959 5935098 5788697 5629278 5527980 5368737 5379273 5297257 5198338 5200623 5176757 5189554 4964400
4948 4964400 4988994 5008631 4976260 4918569 4739795 4778925 4908056 4827434 4649454 4593061 4634311
4937D634311J0497k11910j79897n3847N5485j65841k5078j34031q4456L542J58410
4926D007185K18187N7932R8605K24596J89951Q1062Q0404K8329M0062R8179j10935
4915E013557J55768K144o0680K12866n7391m1183N7344J07545J20416J56069J34886
4904E801341K55883P2895J00827L4406K13110J53108k9293M4121J21610Q0824
4894F848832K28603R2170K55514N34179M78006M98455O45549L98963K80498L19044
4884A0579813L80972O04342J120627J518052J777340K309313L462986N227848
4876B6981293N611516J591437k346716l733272m042807l655306k769251j962847
4868A5674047j689560j461608j209869j076384q55690m93068o62897m84053k41064
$$ plain form
4937 4634311 4644808 4432898 4253001 4199154 4254639 4088798 4063720 3929689 3845233 3848775 4007185
4926 4007185 4225372 4283304 4381909 4606505 4796456 4877518 4957922 4986251 5026313 5124492 5013557
4915 5013557 5169325 5171469 5110789 5323655 5266264 5225081 5282425 5389970 5510386 5666455 5801341
4904 5801341 6057224 6130119 6230946 6265352 6478462 6631570 6602277 6646398 6768008 6848832
4894 6848832 7077435 7169605 7425119 7959298 8437304 8935759 9581308 9980271 10260769 10579813
4884 10579813 10960785 11565127 12685754 14203806 15981146 18290459 21753445 26981293
4876 26981293 32592809 34184246 31837530 28104258 24061451 20406145 17636894 15674047
4868 15674047 13984487 12522879 11313010 10236626 9380936 8887868 8224971 7740918 7499854
4859G499854k17297k20483j44220j67151J3377j0346r4171J7667K5546P5382N9658
4848F837816J9589J75825M30835j40103j58646j87859l1697Q2016j40839L6014
4838F922951J36309K25814J4041J1341J16941M1309j3686j05329N0826J20873
4828G521390J22014O8934N7952R650J14900J5440k6735J50381J91276l844K39121
4817H460479K27841O5722J62144L16881K53754J97775L07048K55555L90159K65794
4807A0903152K65380K69099R3660L41155K17125o091J46835K38194K99028K90396
4797A3057933J31390K92232M05207M11482O06286L96717O00586P40157P95674
4788A7437664O66996R00226P87169Q12003R73905Q15840O79861P20135Q40948
$$ plain form
4859 7499854 7282557 7062074 6917854 6750703 6764080 6753734 6659563 6677230 6702776 6778158 6837816
4848 6837816 6857405 7033230 7464065 7323962 7165316 6977457 6945760 7027776 6886937 6922951
4838 6922951 7059260 7285074 7299115 7310456 7427397 7468706 7455020 7349691 7400517 7521390
4828 7521390 7643404 7712338 7770290 7779940 7894840 7910280 7883545 8033926 8225202 8221358 8460479
4817 8460479 8688320 8754042 8916186 9233067 9486821 9684596 9991644 10247199 10637358 10903152
4807 10903152 11168532 11437631 11531291 11872446 12089571 12083480 12230315 12468509 12767537 13057933
4797 13057933 13189323 13481555 13886762 14298244 14904530 15301247 15901833 16641990 17437664
4788 17437664 18104660 19004886 19792055 20604058 21577963 22393803 23073664 23793799 24634747
4779B4634747N98467R3140p4841J2563q8402K84181L28231J56113M35336L33884
4769B6713419N00643O03081N20999O60364R81763P97835M52570K32398J84436
4760C1647508o7732r9924N375Q9367o7196k06838l45865l16470p9023l56934k89040
4749B9913228J02251J27274O273J96564J96852N1055L16197J56419j10199j38022
4739C0817892M0820P5572N6015j56121l72105o30654p73852j125391j035438o75797
4729B6220941j038659j031636q17324q41694r75997p11812q00935k60442k62997
4720A9479445l93933k33533j61001l14567o04422n19558m30023p30251p84492
4711A5307665n05458p28753o73241p83343p34533o79432n75752n43153n43984
$$ plain form
4779 24634747 25233214 25326354 25251513 25264076 25175674 25459855 25788086 25944199 26379535 26713419
4769 26713419 27214062 27817143 28338142 28998506 29980269 30778104 31230674 31463072 31647508
4760 31647508 31579776 31479852 31485227 31574594 31507398 31300560 30954695 30638225 30559202 30202268 29913228
4749 29913228 30015479 30142753 30149026 30345590 30542442 30593497 30909694 31066113 30955914 30817892
4739 30817892 30858712 30934284 30990299 30834178 30462073 29831419 29057567 27932176 26896738 26220941
4729 26220941 25182282 24150646 23333322 22491628 21515631 20803819 20002884 19742442 19479445
4720 19479445 19085512 18851979 18690978 18376411 17771989 17252431 16822408 16092157 15307665
4711 15307665 14802207 14073454 13400213 12616870 11882337 11202905 10627153 10084000 9540016
4702I540016m18517m02400k94874k94862l19433m06464k14962k08467k14594j38571
4692F626872N7359j09491j10327j13538m6997J21135k14056k46443j78411m768
4682E781335k48391o2330Q0184m288L8201r1836N394m1290j27379j46810N2777
4671E235567j96747l0051M6885K40204Q6521k40347j6201n9486N8367j67926j41282
4660D815504N8515J22356o9582R7402J55099l7244l1428O0153o082j58517j34595
4649D871581m1541O7258M9936j28709j05595M2443l8030R8468j04936o4302J5409
4638D661982m0508R4678P7452l8609R9118K6052j00156J24457R1755l8614j7316
4627D940291P7917J11531J61181K8480O6050J87175J23470K07494P4543J37628
$$ plain form
4702 9540016 9121499 8719099 8424225 8129363 7809930 7403466 7188504 6980037 6765443 6626872
4692 6626872 6684231 6574740 6464413 6350875 6303878 6425013 6210957 5964514 5786103 5781335
4682 5781335 5532944 5470614 5550798 5546510 5584711 5492875 5498269 5456979 5329600 5182790 5235567
4671 5235567 5038820 5008769 5055654 5295858 5382379 5142032 5125831 5066345 5124712 4956786 4815504
4660 4815504 4874019 4996375 4926793 5024195 5179294 5142050 5110622 5170775 5164693 5006176 4871581
4649 4871581 4830040 4897298 4947234 4818525 4712930 4755373 4717343 4815811 4710875 4646573 4661982
4638 4661982 4621474 4716152 4793604 4754995 4854113 4880165 4780009 4904466 4996221 4957607 4940291
4627 4940291 5018208 5129739 5290920 5319400 5385450 5572625 5696095 5903589 5978132 6115760
4617F115760J66950K20292L93914L54321L58990M70176O71242P18453O26598P99274
4607A0895970Q62898Q30496O38824J92925J04927k04755k55619n75889q69048
4598A1620729p51766n85736m31955l86294o10265o2831n9121l36935k08220k13609
4588G973997R6823J13807j26471j71452L7066k7485K1495j91251k5838M6313q8275
4577G658729j20328k0845J43212J7712n1528K3450M564K02302J50157N0412K48406
4566H306243J14224K13773J92547O1989K54008K12287K21406J43403K41024L12145
4556A0273049K77434J98362K14969K24328L31943L63627K14477K03629M28803
4547A2730621L31448M06042L83820M28690M05502O03480P24010P42710P61112
$$ plain form
4617 6115760 6282710 6503002 6896916 7251237 7610227 8080403 8751645 9470098 10096696 10895970
4607 10895970 11758868 12589364 13228188 13421113 13526040 13321285 13065666 12489777 11620729
4598 11620729 10868963 10283227 9851272 9464978 8854713 8791882 8732761 8395826 8187606 7973997
4588 7973997 8070820 8184627 8058156 7886704 7923770 7896285 7917780 7726529 7700691 7747004 7658729
4577 7658729 7538401 7517556 7660768 7678480 7626952 7650402 7654966 7857268 8007425 8057837 8306243
4566 8306243 8420467 8634240 8826787 8888776 9142784 9355071 9576477 9719880 9960904 10273049
4556 10273049 10550483 10748845 10963814 11188142 11520085 11883712 12098189 12301818 12730621
4547 12730621 13062069 13468111 13851931 14280621 14686123 15289603 16013613 16756323 17517435
4538A7517435R43967J170020J540581J818382K045463K627461L221021L617737
4530C4502067L452037L603408L503474L479390L739813M510955M704848M190698
4522F5686690L229813K061921K42340k354853m391206n795595o779319p045722
4514D4854069o134184m702910l938038l108235k622664j953686j754143j563785
4506A9076424j357923j094509q03446o86298q44493o16765k39763l21114m08123
4497A2703990k37571j47134j69657p7760L3901J51380j776L13211L87411N52892
4487A3508887O76903O28830Q16395Q13491N35534K65312j35168m06653n84241
4478A6119290q07109j024894q17166q05435o96017n97491n52488k66904m31821
$$ plain form
4538 17517435 18461402 19631422 21172003 22990385 25035848 27663309 30884330 34502067
4530 34502067 37954104 41557512 45060986 48540376 52280189 56791144 61495992 65686690
4522 65686690 68916503 70978424 71220764 68865911 64474705 58679110 51899791 44854069
4514 44854069 38719885 34016975 30078937 26970702 24348038 22394352 20640209 19076424
4506 19076424 17718501 16623992 15820546 15134248 14289755 13672990 13433227 13112113 12703990
4497 12703990 12466419 12319285 12149628 12071868 12105769 12257149 12255373 12568584 12955995 13508887
4487 13508887 14185790 14814620 15631015 16444506 16980040 17245352 17110184 16703531 16119290
4478 16119290 15312181 14287287 13470121 12664686 11968669 11371178 10818690 10551786 10119965
4469A0119965k14911m6294k89310j02716L7437j755Q4692N1036j9739Q8736j3367
4458I693774k16562l53328l10691k74260l33383k13808l06638j69074m6540j82698
4448G286792k62198M624l1041o8342m3849n1226o341J79524K1426j16563O7468
4437F980274J18150N4069j32351J2419J22302J7563l0478J1516J57998K97362
4427G608824J93750N4139J19290K05014J89094J68489J01048J13358J43471J91839
4417I088316L11741L0321J19546L81401K59048K69418J16035L64825N46575M96066
4407A1983292M42283O19520P75757P18380O93604R48266J257621J405964J711218
4398B0555905K246667K897736M122291N123045N606653N478144M302172K979014
$$ plain form
4469 10119965 9905054 9858760 9569450 9466734 9504171 9502416 9587108 9638144 9618405 9707141 9693774
4458 9693774 9477212 9123884 8813193 8538933 8205550 7991742 7685104 7516030 7469490 7286792
4448 7286792 7024594 7029218 6998177 6929835 6885986 6834760 6828419 7007943 7029369 6912806 6980274
4437 6980274 7098424 7152493 7020142 7032561 7154863 7172426 7141948 7153464 7311462 7608824
4427 7608824 7802574 7856713 7976003 8181017 8370111 8538600 8639648 8753006 8896477 9088316
4417 9088316 9400057 9430378 9549924 9931325 10190373 10459791 10575826 10940651 11487226 11983292
4407 11983292 12425575 13045095 13820852 14539232 15232836 16181102 17438723 18844687 20555905
4398 20555905 22802572 25700308 29822599 34945644 40552297 46030441 50332613 53311627
4390E3311627J201331j074912k532828l928301n172400n388907m703788l828469
4382B7883353k932494k511390k229968j872221j453753j193461j243276r24751
4374A3522039q50921o52622n84555o53250n36300m82801m40361m00033l80555
4365H540641j72370k52274m02626j89649j60872k11874k28064j54356j63050k33750
4355F371756j61006j54609r7988j04817q6664L1843l7171r0636J0117J36500n6084
4344E761241j79187m0733J3227O841j12039r7509n8388M2673P066j23143K0616
4333E240665O1843m741m9882j17391L7519Q2524q3561p4673m250O1942R4925O7156
4321E312076o7645K2639O4566R8011J55515P9294J736K61605J35137J00437l036
$$ plain form
4390 53311627 54512958 53438046 50905218 46976917 41804517 36415610 31711822 27883353
4382 27883353 24950859 22439469 20209501 18337280 16883527 15690066 14446790 13522039
4374 13522039 12671118 12018496 11433941 10780691 10244391 9761590 9321229 8921196 8540641
4365 8540641 8368271 8115997 7713371 7523722 7362850 7150976 6922912 6768556 6605506 6371756
4355 6371756 6210750 6056141 5958153 5853336 5766672 5798515 5761344 5670708 5680825 5817325 5761241
4344 5761241 5582054 5541321 5554548 5561389 5449350 5351841 5293453 5336126 5343192 5220049 5240665
4333 5240665 5302508 5297767 5247885 5130494 5168013 5250537 5166976 5092303 5088053 5149995 5244920 5312076
4321 5312076 5244431 5267070 5331636 5429647 5585162 5664456 5666192 5927797 6062934 6163371 6160335
4310F160335j44303k6339j38751j97461j20990q4971j31760j57836L6955k5784
4300E169095q7368N5745p0230j99728m8457L66792M3650j80973k29727J31279
4290D950078K51583m374j47042J9414J68025K33384J33175J34447J64786K27265
4280F130741J8786J76276K87175k7628j12263o9677n4107j0286j34701j098O2190
4269F265408o4601M9841N2017J28337m8760l507J39383R1378M6479q7484J5678
4258F584169N0396o6560R5525J9286k9620J6676o5575N7263J52833p1843Q9260
4247F831810K63835J46405O9288J03772J98893O3082k10299n3640K5345j63766
4237G274725N8111m3017j90811K25131j3860j45600J8205K7979k2404m4453k23463
$$ plain form
4310 6160335 6016032 5989693 5850942 5653481 5532491 5447520 5315760 5157924 5194879 5169095
4300 5169095 5081727 5137472 5067242 4867514 4819057 5185849 5229499 5048526 4818799 4950078
4290 4950078 5201661 5197287 5050245 5069659 5237684 5471068 5604243 5738690 5903476 6130741
4280 6130741 6149527 6325803 6612978 6585350 6473087 6403410 6349303 6339017 6204316 6203218 6265408
4269 6265408 6200807 6250648 6302665 6431002 6382242 6378735 6518118 6609496 6655975 6568491 6584169
4258 6584169 6634565 6568005 6663530 6682816 6653196 6669872 6604297 6661560 6814393 6742550 6831810
4247 6831810 7095645 7242050 7311338 7415110 7614003 7677085 7466786 7413146 7438491 7274725
4237 7274725 7332836 7289819 7099008 7324139 7310279 7164679 7182884 7210863 7188459 7144006 6920543
4226F920543k8430M9699m6752j55509R5240J72913P3791Q2344k1389N2122K10126
4215G404698J76972L8317J12639K25848K97788K42528L26696J02809P4668J28629
4205I131592m2437j31919R0384J05968M0540j87450r4779q6867j16802j31290
4195H576940j15270m2437P1980J22058L8104K6417J18466J51980M8711R6721K08192
4184I301862K63509J96042J51326L17377L83109L21589N4760M1313L0766J44067
4174A1205720O1695l7170k0337K2539M8473j52825k19534k31215m1455j24995
4164A0510896j05541J6567J5498j70255n8203K5526N0907J56440K57375J76176
4154A0875386K47404J97783J93084J24773P1850J01039J29477J46024J62166O079
$$ plain form
4226 6920543 6892113 6941812 6895060 6739551 6834791 7007704 7081495 7163839 7142450 7194572 7404698
4215 7404698 7581670 7619987 7732626 7958474 8256262 8498790 8825486 8928295 9002963 9131592
4205 9131592 9089155 8957236 9047620 9153588 9194128 9006678 8911899 8825032 8708230 8576940
4195 8576940 8461670 8419233 8491213 8613271 8651375 8677792 8796258 8948238 8996949 9093670 9301862
4184 9301862 9565371 9761413 9912739 10230116 10613225 10934814 10989574 11030887 11061653 11205720
4174 11205720 11267415 11230245 11209908 11232447 11280920 11128095 10908561 10677346 10635891 10510896
4164 10510896 10405355 10421922 10437420 10267165 10208962 10234488 10285395 10441835 10699210 10875386
4154 10875386 11122790 11320573 11513657 11638430 11710280 11811319 11940796 12086820 12248986 12255065
4144A2255065J67554Q0080J98218K7464j45153K3303J41750J44588M5212J79806
4134A3117887J78602K18652J76242J95432J63761L62415M59349M42391J19296
4125A5434027J15K945M3041K26176K3854P191K6318J26637j9776k41656j69033
4114A5459839k12129j14546r9622k35682p8773l050q3178r690j63955k9842J8175
4103A4447547Q4177J3900J74492K80024K27445J90943J41048N4097K26707M10243
4093A6250623J84966L65450O38565N39564L57547K41743K58796L26728k4884k28986
4083A8910112r7531J58928L35545Q2727J83471K50227J49183J71733P4841Q3962
4073B0303198n0876o356n6398J6947Q2725J22009K85827L82652M49966K35489
$$ plain form
4144 12255065 12422619 12502699 12700917 12728381 12583228 12606531 12748281 12892869 12938081 13117887
4134 13117887 13296489 13515141 13691383 13886815 14050576 14412991 14872340 15314731 15434027
4125 15434027 15434142 15437087 15480128 15706304 15730158 15737349 15763667 15890304 15870528 15628872 15459839
4114 15459839 15247710 15133164 15033542 14797860 14719087 14716037 14632859 14623169 14459214 14429372 14447547
4103 14447547 14531724 14545624 14720116 15000140 15227585 15418528 15559576 15613673 15840380 16250623
4093 16250623 16435589 16801039 17439604 17979168 18336715 18578458 18837254 19163982 19139098 18910112
4083 18910112 18812581 18971509 19307054 19389781 19573252 19823479 19972662 20144395 20219236 20303198
4073 20303198 20252322 20245966 20189568 20206515 20289240 20411249 20697076 21079728 21529694 21765183
4063B1765183J95027J99170k4959L25088L94975J97460J70111L77003O09524M61257
4053B4669839L13035N30851M81104N65716L85826K81276L64908J44713J16838
4044B7854106M41389M47233K70295J15358J15165L04307K35741J72379J60637
4035C0116610M85405O58190M05635O84242R19817P81522R26768Q23260N30316
4026C6331765J76262R2146o3685N416K19013q9487j21610J38093P6181J75052
4016C6939146o540j2412j04064J21290K76095L37810J91574m2147k87580k85327
4006C7127845k86996j38790k16257P8408L28612L12740K97456j35819o56025r08329
3996C5802845j468784j504556j291690j081440r88607p91838m25622l75878l81366
$$ plain form
4063 21765183 21960210 22159380 22134421 22459509 22854484 23051944 23222055 23599058 24208582 24669839
4053 24669839 24982874 25513725 25994829 26560545 26946371 27227647 27592555 27737268 27854106
4044 27854106 28295495 28742728 29013023 29128381 29243546 29547853 29783594 29955973 30116610
4035 30116610 30602015 31260205 31665840 32350082 33269899 34051421 34978189 35801449 36331765
4026 36331765 36508027 36600173 36536488 36541904 36760917 36671430 36549820 36687913 36764094 36939146
4016 36939146 36932606 36920194 36816130 36937420 37213515 37551325 37742899 37700752 37413172 37127845
4006 37127845 36840849 36702059 36485802 36564210 36892822 37205562 37503018 37367199 36711174 35802845
3996 35802845 34334061 32829505 31537815 30456375 29467768 28675930 28250308 27874430 27493064
3987B7493064l19896o17451o26195l81637o99379o62919m67375n05763m45284
3978B2767165j75683n14714l99298k61032j58628m22775l31775k48847k04785
3969B0049628j27378k73327m85926m66092n79914n57161m88652m57881n25512
3960A6087785l46244k15960l17110k65614j33911j66755j0070j41108j90934k57167
3950A4042912j49702j62179k91218j47794k21024m10462l28225j30742k65386
3941A1936180l92007l04779j46418m728J20681k01919l13355k23849j52065k86695
3931A0031046k37672k42253k04450R9337p9190k83823o3958j57899k89885p062
3921H564191J06207R7330j9719l4093k9622R4857M727k92505o2901K00859j9823
$$ plain form
3987 27493064 27173168 26555717 25929522 25547885 24848506 24185587 23718212 23212449 22767165
3978 22767165 22591482 22076768 21677470 21416438 21257810 20835035 20503260 20254413 20049628
3969 20049628 19922250 19648923 19162997 18696905 18116991 17559830 17071178 16613297 16087785
3960 16087785 15741541 15525581 15208471 14942857 14808946 14642191 14632121 14491013 14300079 14042912
3950 14042912 13893210 13731031 13439813 13292019 13070995 12660533 12332308 12201566 11936180
3941 11936180 11544173 11239394 11092976 11088248 11208929 11007010 10693655 10469806 10317741 10031046
3931 10031046 9793374 9551121 9346671 9446008 9366818 9082995 9019037 8861138 8571253 8564191
3921 8564191 8670398 8767728 8748009 8713916 8684294 8779151 8783878 8491373 8428472 8629331 8609508
3910H609508k87813K0874j8578M1644K09917M2967m8531P6621P0858L7274J05801
3899H860542m9027P7105K68342K97961J69415L62542L62553K37503L71287K36960
3889A1195183K00946J13286J50490N0023J20182L6459k61359j83145k7414j35577
3879A1259074l37053k74119l56871k14327p9741k98476m02621j08095m0017k07536
3869H940218j04977j39800J6812Q7442J03185J11022Q1018l1846k2533J8932m127
3858I055346j0482j95770r3854P1582R8312Q0544J48662J39747J66709l1197m3381
3847I386218J74618J00191J06053K36515L41313R2172Q6922j8758k5224j74345
3837A0305675k36503j19488k70773m94735m06121k58828j18103j68139l13301
$$ plain form
3910 8609508 8321695 8342569 8323991 8365635 8575552 8618519 8569988 8646609 8717467 8754741 8860542
3899 8860542 8811515 8888620 9156962 9454923 9624338 9986880 10349433 10586936 10958223 11195183
3889 11195183 11396129 11509415 11659905 11709928 11830110 11866569 11605210 11422065 11394651 11259074
3879 11259074 10922021 10647902 10291031 10076704 9996963 9698487 9295866 9187771 9147754 8940218
3869 8940218 8835241 8695441 8712253 8799695 8902880 9013902 9094920 9063074 9040541 9059473 9055346
3858 9055346 9044864 8849094 8755240 8826822 8925134 9005678 9154340 9294087 9460796 9429599 9386218
3847 9386218 9560836 9661027 9767080 10003595 10344908 10437080 10524002 10505244 10480020 10305675
3837 10305675 10069172 9949684 9678911 9184176 8778055 8519227 8401124 8232985 7919684
3828G919684o3167j00248m3041m1471P6152K71633J66069J55783K93915K28064
3818H863373K26889m078j70838j69457j88442k76606m37188j93995o4347N4521
3808G639832p1919l501o8926n4204j5438l16536l15116n4950k60843j24482L1771
3797F385688k04373r9916j98018j12944j30477j30492j95125j15639m8308o8539
3787E081857j96369P330J2262q8903j62228j27564k8299m2833j42464m9583K0347
3776D283553R4701j11668j06158J32070J4778j01477L7050M2965j1848j87341
3766D086625j05880N4032M6100n1265m1486K9502N3477k6802l7514N7129j3203
3755D050715j02751p4477M6788J3936J03831l8521L6549j1491P9485O2054R0529
$$ plain form
3828 7919684 7856517 7756269 7713228 7671757 7747909 8019542 8185611 8341394 8635309 8863373
3818 8863373 9090262 9086184 8915346 8745889 8557447 8280841 7843653 7649658 7585311 7639832
3808 7639832 7567913 7564412 7495486 7441282 7425844 7109308 6794192 6739242 6478399 6353917 6385688
3797 6385688 6181315 6081399 5883381 5770437 5639960 5509468 5314343 5198704 5150396 5081857
3787 5081857 4885488 4892818 4905080 4816177 4653949 4526385 4498086 4455253 4312789 4263206 4283553
3776 4283553 4378254 4266586 4160428 4292498 4307276 4205799 4242849 4285814 4273966 4086625
3766 4086625 3980745 4034777 4080877 4029612 3988126 4017628 4071105 4044303 4006789 4063918 4050715
3755 4050715 3947964 3873487 3920275 3934211 4038042 3999521 4036070 4024579 4104064 4166118 4256647
3744D256647k39730m3751N570M1854o1380j08344L5079N629Q8330j19294J9369
3733C879979J35780j84467j18637r5815l445O0506j43555k12095J53391M8844
3723C520486o9094j14154J82583j2688p0297l6878p4897m1217R941J01881k7682
3712C367984J976q0336Q7412o9684L2259p6206J07133r999j28344K8192Q2126
3701C342513p3397n8805Q9030j39315q981l3943j58174j9298O2590o4732p8986
3690B858502K08341p4821j58161O5552L7662j00233O1650o3418L6657J01104p6521
3679B896314r4351J21892o4066k5383k9764q6852p3591Q5907k8570k7036m9610
3668B624890r968O8282P9756M0682j81561n810m0160j6503J5744r0609O3093R9364
$$ plain form
3744 4256647 4016917 3973166 3978736 4020590 3959210 3850866 3885945 3891574 3979904 3860610 3879979
3733 3879979 4015759 3831292 3712655 3616840 3613395 3673901 3530346 3318251 3471642 3520486
3723 3520486 3451392 3337238 3519821 3507133 3436836 3399958 3325061 3283844 3293785 3395666 3367984
3712 3367984 3369960 3289624 3377036 3307352 3339611 3263405 3370538 3360539 3232195 3260387 3342513
3701 3342513 3269116 3210311 3299341 3160026 3151045 3117102 2958928 2939630 3002220 2937488 2858502
3690 2858502 3066843 2992022 2833861 2899413 2937075 2836842 2898492 2835074 2871731 2972835 2896314
3679 2896314 2801963 2923855 2859789 2834406 2804642 2717790 2644199 2730106 2701536 2674500 2624890
3668 2624890 2614922 2683204 2762960 2803642 2622081 2616271 2576111 2559608 2575352 2484743 2547836 2647200
3656B647200k5053j22342n2975K7845M1326K5594J6620K4437R6099k7233J5150
3645B666668M689M9210j3781K8364Q7182Q7354J01696j79459O6293j5113l6648
3634B846455M2108J57587J8751Q2528n0065M478M5052p0786j0992Q3028k3265
3623C124879N7415O3066k6412o6549M8238J85837n4987j95746j19938M372P0371
3612C090546j2041n5744j8631K14658J08631m1718p6456L0015J2690J2895J77816
3601C442661J47900J19241J25820j9083j01529l7255j09551j16571L1398l9497
3591C443534L1129J76910M4362J31248O5109L4902J14791l2808j88217k472K1600
3580C840088m6409j0643P3611P9584n9741l6933o5798l6488J30239R0665J71632
$$ plain form
3656 2647200 2622147 2499805 2446830 2474675 2516001 2541595 2558215 2582652 2678751 2651518 2666668
3645 2666668 2671357 2720567 2706786 2735150 2822332 2909686 3011382 2831923 2898216 2883103 2846455
3634 2846455 2888563 3046150 3064901 3147429 3097364 3101842 3146894 3076108 3065116 3148144 3124879
3623 3124879 3182294 3245360 3218948 3152399 3200637 3386474 3331487 3135741 3015803 3020175 3090546
3612 3090546 3078505 3022761 3004130 3218788 3327419 3285701 3209245 3239260 3251950 3264845 3442661
3601 3442661 3590561 3709802 3835622 3816539 3715010 3677755 3568204 3451633 3483031 3443534
3591 3443534 3474663 3651573 3695935 3827183 3892292 3927194 4041985 4009177 3820960 3818488 3840088
3580 3840088 3793679 3783036 3856647 3936231 3876490 3839557 3773759 3737271 3867510 3958175 4129807
3569D129807O5183J92039J4392J81075P8229j85051l9241J6244L6591K0185Q3954
3558D593407j17284L8326Q1377K24939R312N8101p4550n072O7819N3439q0944
3547D848870K0727L659J7957J76889p1027q7335m5948L3655R7002J3903j57120
3536D851232Q9774J64929O6350O1293N2412P6337J54208J75773N206n273k1283
3525E670958p4150J47509J14995R2726k2485J53290J03033n4667R9732O1271q9136
3514F203076N5764J08509J00966N878K8360N2523J77788J88035k3336J69109J44853
3503G211525M0022J13553j2492R9867J08586J65331K26914N6896M5301K33281
3493H288784J08463P6682R1845J55717K86695K87127m511K58233M56203M1711
$$ plain form
3569 4129807 4194990 4387029 4401421 4582496 4660725 4475674 4436433 4452677 4489268 4509453 4593407
3558 4593407 4476123 4514449 4595826 4820765 4830077 4888178 4813628 4808556 4876375 4929814 4848870
3547 4848870 4869597 4873256 4891213 5068102 4997075 4909740 4863792 4897447 4994449 5008352 4851232
3536 4851232 4941006 5105935 5172285 5233578 5285990 5362327 5516535 5692308 5697514 5692241 5670958
3525 5670958 5596808 5744317 5859312 5952038 5929553 6082843 6185876 6131209 6230941 6292212 6203076
3514 6203076 6258840 6367349 6468315 6474193 6502553 6555076 6732864 6920899 6897563 7066672 7211525
3503 7211525 7251547 7365100 7352608 7452475 7561061 7726392 7953306 8010202 8055503 8288784
3493 8288784 8397247 8473929 8565774 8721491 9008186 9295313 9290802 9549035 10005238 10046949
3483A0046949J39090Q5317J85519K60805J05984J65812K58450K09737L28694M28739
3473A2215096L76521N41329M17397L85493N16548O66175P21578O42108P92371
3464A7274616P34631M97696M40120K60846P9964k8275k39820l10582k00913j88378
3454A8319905j4297J4955k37364r5638k3224N24219P17097J034847J467452J436083
3444B3144035P78022m73709j111785j042116j153339j214235j126914j063565
3436A6736394r33285p90461m90472l53546m42988m05626l01492k21723j41157
3427A2655644m1162R9314m5547Q4889L10764L52300O91612O20702O53124J037520
3417A6419160J275267J775778K440281L198893L787944K294523n25738j695736
$$ plain form
3483 10046949 10186039 10271356 10456875 10717680 10823664 10989476 11247926 11457663 11786357 12215096
3473 12215096 12591617 13132946 13550343 13935836 14452384 15118559 15840137 16482245 17274616
3464 17274616 18009247 18506943 18947063 19207909 19287873 19259598 19019778 18709196 18508283 18319905
3454 18319905 18305608 18320563 18083199 17987561 17964337 18488556 19205653 20240500 21707952 23144035
3444 23144035 23922057 23448348 22336563 21294447 20141108 18926873 17799959 16736394
3436 16736394 15803109 15012648 14522176 14168630 13725642 13320016 13018524 12796801 12655644
3427 12655644 12614482 12713796 12668249 12753138 13063902 13416202 14107814 14728516 15381640 16419160
3417 16419160 17694427 19470205 21910486 25109379 28897323 31191846 30666108 28970372
3409B8970372k333419k646910k716610k392794j962755j724589j246328j127887
3401A2819080q93619p64407n32806n63133k02652j44442k53716L4270M2240o9148
3391I471667l2506P8094J72328J67682J97168L27679L08481P86171J013042J238532
3381A3728338J552031J157511J23516o46439j153076j374084j248307j179317
3373A0960173r42845p16061o73916o27696p15092n20670l21360k42349k58102
3364E942082l31159j30959l7751m5011k10954j05912k74194j38249l6899j75358
3354D455636j15941O0407r8041N6980m7314k38660j08582m3293j7088k35852q5828
3343C582424J14735o2863r0907O3642j00781j48722q9975n3373O030J41130k4
$$ plain form
3409 28970372 26636953 23990043 21273433 18880639 16917884 15193295 13946967 12819080
3401 12819080 11925461 11161054 10628248 10065115 9862463 9718021 9464305 9498575 9540815 9471667
3391 9471667 9439161 9517255 9689583 9857265 10054433 10382112 10690593 11476764 12489806 13728338
3381 13728338 15280369 16437880 16561396 15914957 14761881 13387797 12139490 10960173
3373 10960173 10017328 9301267 8627351 7999655 7284563 6763893 6442533 6200184 5942082
3364 5942082 5610923 5479964 5442213 5397202 5186248 5080336 4806142 4667893 4630994 4455636
3354 4455636 4339695 4400102 4302061 4359041 4311727 4073067 3964485 3921192 3904104 3668252 3582424
3343 3582424 3697159 3634296 3543389 3607031 3506250 3357528 3267553 3214180 3220210 3361340 3361316
3332C361316j62327Q0766P0999j0166L6431j76133N204j90654K1133m8288l7531
3321B950750l4962R8500j31268p5517K3154q9044r0842k17418J00251k1982R3028
3310B604650o4695N9442l6415M527m1259j25362J00484k02985m2740j0633j1295
3299B233719K2996P3382k63955J47774P6867j33155m1731k4884l3704j31999j5930
3288A909380k1484J48339r2289j62143p2342J47718o2192l6413k1606J63782M0945
3277A941695j94928l3341R5364q7657M6102m9159J117Q5025q6052j08569j6862
3266A592735L1296R15L9679J8362j55642J13140J21391j04708j02583m4260R00
3255A511225J9227m9267r4618K1516J02453p302j18076k3124m568M3541M658p0399
$$ plain form
3332 3361316 3198989 3279755 3350754 3340588 3377019 3200886 3206090 3015436 3036569 2988281 2950750
3321 2950750 2915788 3014288 2883020 2807503 2830657 2741613 2650771 2433353 2533604 2511622 2604650
3310 2604650 2539955 2599397 2562982 2567509 2526250 2400888 2501372 2298387 2255647 2245014 2233719
3299 2233719 2256715 2330097 2066142 2213916 2290783 2157628 2115897 2091013 2057309 1925310 1909380
3288 1909380 1887896 2036235 1943946 1781803 1709461 1857179 1794987 1758574 1736968 1900750 1941695
3277 1941695 1746767 1713426 1808790 1721133 1767235 1718076 1719193 1804218 1718166 1609597 1592735
3266 1592735 1624031 1624946 1664625 1682987 1527345 1640485 1761876 1657168 1554585 1510325 1511225
3255 1511225 1530452 1481185 1386567 1408083 1510536 1503234 1385158 1362034 1357466 1401007 1405665 1335266
3243A335266o7127J4131R8625J11508L8976q666l4824K7913K2379N7603Q220J024
3231A605028M9167P3134K0022N8571j35653J14624o422k5935K7040l6581q7422
3220A655573K02994J46476J2059M9520J00306K616J28202J72427j11752P1115
3210B429536K9620N2720K24751K81396Q3152K17624M1929K03589O6105j44796
3200C485626j22384q0212J42526R229J4728J35597Q9586J73509J39303J87799
3190D175307o1073j82547l1808r5508j24408j16278m0282n3030J09801J34275
3180C714449J15268J2034m2991L5218K27168J92008K43794L10175K13708K80776
3170E301607p2043o0605j30246j64905j69657j5074J09583J52290J64106K74699
$$ plain form
3243 1335266 1268139 1282270 1380895 1492403 1531379 1522713 1487889 1515802 1538181 1595784 1604004 1605028
3231 1605028 1654195 1727329 1747351 1805922 1670269 1784893 1778471 1752536 1779576 1742995 1655573
3220 1655573 1858567 2005043 2017102 2066622 2166928 2169544 2297746 2470173 2358421 2429536
3210 2429536 2459156 2511876 2736627 3018023 3101175 3318799 3360728 3564317 3630422 3485626
3200 3485626 3363242 3283030 3425556 3434785 3449513 3585110 3674696 3848205 3987508 4175307
3190 4175307 4114234 3931687 3899879 3804371 3679963 3563685 3523403 3470373 3580174 3714449
3180 3714449 3829717 3841751 3798760 3833978 4061146 4253154 4496948 4807123 5020831 5301607
3170 5301607 5229564 5168959 5038713 4873808 4704151 4689077 4798660 4950950 5115056 5389755
3160E389755K33948q6922r4282p5448k98191k46445j49072R300J46113j46743
3150D682013j16760O7034K17891n0817j70057l3759Q9902R4818Q0482L3242J00478
3139D994467J03098O2319n4097M0494m8104n5185J086J38519K32663M6790J43337
3128E605387R0746J44553K85091J58248j8482J52666J55277K83875j19051k05223
3118F533087j18917j71829j14099l01023k42360l08788j03167j05259m8914n0413
3108D968318p6659m6857J03893Q5762k9681J36932J5357j1071K24698J88962J10499
3097E670153P4852m9350J40805N5711J3359K596k20276k8946j06501j68794k70188
3086E113421j48937k70430j36629n9233j70501r6718r3219j88461r6186N4790
$$ plain form
3160 5389755 5623703 5536781 5442499 5367051 5068860 4822415 4673343 4682643 4828756 4682013
3150 4682013 4565253 4632287 4850178 4799361 4629304 4595545 4685447 4780265 4860747 4893989 4994467
3139 4994467 5097565 5159884 5105787 5146281 5098177 5042992 5044078 5182597 5415260 5462050 5605387
3128 5605387 5696133 5840686 6125777 6284025 6265543 6418209 6573486 6857361 6738310 6533087
3118 6533087 6414170 6242341 6128242 5827219 5584859 5276071 5172904 5067645 5018731 4968318
3108 4968318 4891659 4844802 4948695 5034457 5004776 5141708 5157065 5145994 5370692 5559654 5670153
3097 5670153 5745005 5695655 5836460 5892171 5905530 5908126 5687850 5658904 5552403 5383609 5113421
3086 5113421 4964484 4694054 4557425 4498192 4327691 4230973 4137754 3949293 3853107 3907897
3076C907897j5618q7671O2453j3454o0823k8994o6288o2246l9618j24313J1922
3065C483247J1103k92393j81868j19642k7483j20779j46995j90984j04100n4788
3055B255318P22j30802m2768r2150Q6260N0908m8838k10287k1750M1462j07747
3044A780328K8009N1644j10862r5353l692r5654P3810j40755r0736L0865M1877
3033A469481j0248j86191L1395M6019L7685n8339j10378K1128j4245q4288Q5129
3022A227148R117m7107j14462N6322N9279n5575m7597K0314j28898P5690n738
3011A048493j73433J06790n9676j44049r9K8573j34534Q9172m8207N0462o9621
3000F93871J3194K0212M9449n3111q7021l189Q7938n5155o9837n0523r362J55813
$$ plain form
3076 3907897 3892279 3804608 3867061 3853607 3792784 3763790 3697502 3635256 3595638 3471325 3483247
3065 3483247 3494350 3201957 3020089 2900447 2872964 2752185 2605190 2414206 2310106 2255318
3055 2255318 2256040 2125238 2082470 1990320 2076580 2127488 2078650 1868363 1846613 1888075 1780328
3044 1780328 1808337 1859981 1749119 1653766 1650074 1554420 1628230 1487475 1396739 1427604 1469481
3033 1469481 1459233 1273042 1304437 1350456 1388141 1329802 1219424 1240552 1226307 1142019 1227148
3022 1227148 1236265 1189158 1074696 1131018 1190297 1134722 1087125 1107439 978541 1054231 1048493
3011 1048493 875060 981850 922174 778125 778026 806599 672065 761237 713030 763492 693871
3000 693871 707065 727277 776726 723615 636594 633405 721343 666188 596351 545828 536466 692279
2988F92279Q853j13513o542R9301j26697q4861P9466n814j66861L9956K9948J9044
2976D64559n5059o6798P6832R2984r5701R3805n5651R2409m6826j46374J04560
2965D58740j7452K4099j2878P1383Q7030j5193j05363Q6485j7319j12623o0819
2954C86090J13348O8509j42653l8342j00826R0725k3547k6748L6983N1202k748
2943D11993l7106M9503l6210m2217R747R4734l9588l6207k3113P69M2073L7687
2931D32065o5308M6973J52314k31274R3181N6583k57857p6334p942Q9006J4475
2920B45882P0387p1073O1795k7067K411j34025K6053o0942O7614M2464p5448M9454
2908A97505J8708l3663N1920j47446J348M4996j27358Q2460l1857j921J19731
$$ plain form
2988 692279 701132 587619 581077 680378 553681 468820 548286 542472 375611 415567 445515 464559
2976 464559 409500 342702 419534 512518 416817 510622 454971 547380 500554 354180 458740
2965 458740 441288 465387 452509 523892 610922 595729 490366 576851 559532 446909 386090
2954 386090 499438 567947 425294 386952 286126 376851 353304 326556 363539 414741 411993
2943 411993 374887 424390 388180 345963 355710 450444 410856 374649 351536 352305 394378 432065
2931 432065 366757 413730 566044 334770 427951 484534 226677 150343 142401 231407 245882
2920 245882 316269 245196 306991 279924 282335 148310 174363 113421 181035 223499 148051 197505
2908 197505 216213 182550 234470 87024 88372 133368 6010 88470 56613 54692 174423
2897A74423j879k1499J787j1577m7520o3753K0584J91800l8858P826N8907o2272
2885B07969J6282k334j65725J10665R9684j66046J3071o1275K5674K9799L0219
2874A37983r1511O4417N9268j7149O9982N5610k15668P4516k1556J05472l3850
2863A87514q0801P6128p0622L2002O7880m9652l0463J2523K106J35449j31702
2852A50362n3941J3402l1808J32522q2880N4752k1934q3068O2180O474r964r9029
2840C7068O4488K42610j35219j6846r5043j77453O9054m169j26042J02235L9314
2829cp3810M0355P5592m4424K419q6968r1362P8637M3595M1423l413Q6947M9277
2816A18265r5445L4858J6869J2913M4697j57538p6253N6070L9280m0792j927J09844
$$ plain form
2897 174423 172544 151045 152832 141255 93735 29982 50566 242366 203508 211334 270241 207969
2885 207969 224251 221917 56192 166857 266541 100495 113566 52291 77965 107764 137983
2874 137983 46472 110889 170157 153008 222990 278600 62932 137448 115892 221364 187514
2863 187514 106713 182841 112219 144221 212101 162449 131986 144509 146615 282064 150362
2852 150362 96421 109823 78015 210537 127657 182409 160475 77407 139587 146061 136097 37068
2840 37068 101556 344166 208947 192101 97058 -80395 -11341 -15510 -141552 -39317 -3
2829 -3 -73813 -33458 42134 -2290 129 -86839 -178201 -99564 -55969 -14546 -17959 68988 118265
2816 118265 22820 57678 74547 87460 132157 -25381 -101634 -45564 -6284 -47076 -49003 60841
2804F0841N8675o3796J5750n5151J37136L5138j86879J07597J11077m8245k5737
2793A46406o9732O1494j11990l0593M9914k9121Q5585L2272r0068m2521l9201
2782c7555j6645P5472o758j06250k4027k2521P600R6200J8975o1681Q0128N9571
2770F2509j00884J00725j523L0314k0025o2578o1891L9647K8887j33768J43756
2759B5169R4477M9398j68096Q0377o9799j07509J1175k9974N3187J01183P9442
2748A19030m584O8780j95006j8916J13410k4981r5419k4906J42790J29165o5117
2737A44246J3630m9199l7580l7523j08164J84498r4809o9099m610J16520J1626
2726F9536l8040M0098j3217N9202j47914o9530J47334J1316j58803M1735J26602
$$ plain form
2804 60841 119516 55720 71470 16319 153455 188593 1714 109311 220388 172143 146406
2793 146406 76674 138168 26178 -4415 45499 16378 101963 134235 44167 1646 -37555
2782 -37555 -54200 21272 14514 -91736 -115763 -138284 -130684 -34484 -15509 -77190 2938 62509
2770 62509 -38375 62350 60827 91141 71116 8538 -53353 -13706 15181 -118587 25169
2759 25169 119646 169044 948 81325 11526 -95983 -84808 -114782 -61595 39588 119030
2748 119030 114446 183226 -11780 -30696 82714 57733 -37686 -62592 80198 209363 144246
2737 144246 157876 108677 71097 33574 -74590 109908 15099 -54000 -58610 57910 69536
2726 69536 31496 71594 58377 117579 -30335 -99865 47469 58785 -100018 -58283 68319
2715F8319J16988r6223m9224Q7285r2229n182P759M1467n0174n3704L0894k0162
2703a4186O5404j01108j46467J65008M9596j72529l610J17437M216L860N6159
2692B3780O413J0864l2270l0600k850J12079l8983j42443R4959M0288p4235J05471
2680G2473R9112j2652o8864j77746p0050J99238M6294j57447n8104Q1830M5780
2669a36K2076q4674J1984p5394N7513P3550L51P6002p0110L0801j10824M5486
2657b3375J69908J5446j83628m0524N7941J46896j41054r0503J26836R6859n5590
2646G9212k27397M2708R1914O9718j52006p4355P5993Q7046j39376J21823k8369
2635e3089m6336J12885o118n1280j2796j12985K3042N636j65405J50806k9392
$$ plain form
2715 68319 185307 89084 39860 127145 34916 29734 37493 78960 28786 -24918 5976 -14186
2703 -14186 51218 -49890 -196357 -31349 18247 -154282 -157892 -40455 -36239 -32379 23780
2692 23780 30193 41057 8787 -21813 -24663 87416 48433 -94010 949 41237 -32998 72473
2680 72473 171585 158933 90069 -87677 -157727 41511 87805 -69642 -127746 -45916 -136
2669 -136 21940 -62734 -50750 -126144 -68631 4919 5270 81272 11162 41963 -68861 -23375
2657 -23375 146533 161979 -21649 -62173 -4232 142664 1610 -88893 37943 134802 79212
2646 79212 -148185 -105477 -13563 56155 -95851 -170206 -94213 -7167 -146543 -24720 -53089
2635 -53089 -99425 13460 7342 -43938 -56734 -169719 -146677 -141041 -306446 -155640 -185032
2624a85032K0867l8730L7947O0632j84777k8013J26299O7015o0516q1875k421
2613b68604P9493N9380J2446m5361k1041j0057J03222Q0506j6080j07020J23235
2602i881K7735j31517j3575J11737J8218p3996j7782L7538J52024l1116n6868
2591A2517m7528P0038n3998m3545J37468o0191p1477J76530N3819r6594n4830
2580B2209J7908q5712R15O9276J38800K1461p3672j29009N8840N9497k35082J7340
2568a17229N6229K1014m5314j2798J7576q663J73102p3885j11880O9320N961m0858
2556f7425p1288J0793L4378O4385r865j56791J27176J04331j07188K4617Q168
2545c8709N8381L0282p6690k7517J7700o7314q9430O9499J74540L4139q1024J33830
$$ plain form
2624 -185032 -164165 -202895 -164948 -104316 -289093 -317106 -190807 -123792 -184308 -266183 -268604
2613 -268604 -189111 -129731 -117285 -162646 -183687 -193744 -90522 -10016 -26096 -133116 -9881
2602 -9881 17854 -113663 -127238 -15501 2717 -71279 -89061 -51523 100501 69385 12517
2591 12517 -35011 35027 -18971 -62516 74952 14761 -56716 119814 173633 77039 22209
2580 22209 40117 -45595 -44680 24596 163396 184857 111185 -17824 41016 100513 -134569 -117229
2568 -117229 -61000 -39986 -85300 -98098 -80522 -89185 83917 10032 -101848 -32528 -26567 -67425
2556 -67425 -138713 -127920 -93542 -29157 -39022 -195813 -68637 35694 -71494 -46877 -38709
2545 -38709 19672 49954 -26736 -54253 -36553 -103867 -193297 -123798 50742 84881 3857 137687
2533A37687p2353r7522p301N6550j5670j32225L294l7290k365M2054K9721M4733
2521e0687K18857q3481L5743n2349r840o9037j07945J62179J14512p2233J4023
2510I9742k3306j0200K255j35483N5230J145o5549P7992J52360j95314m8603Q0554
2498i177k8186q2412o2992J97224Q7014j16428O8732k1786Q9321L1482j51581
2487A211M8973J72384j03316j15550O3209M5223k7129j9799M4338j9337M4649
2476A34856M777n5223l0332l2299J5033J42596P2343j43261j0548J43838j31411
2465A10369j18709l8062J7391K45997L487j00972O776Q7943p9973m4980p7428
2454A1839P0121l0622J05601M1391j80034O5045o8366J2509l1493L9758k3819
$$ plain form
2533 137687 65334 -32188 -39489 17061 1391 -130834 -127540 -164830 -167195 -125141 -95420 -50687
2521 -50687 168170 84689 120432 68083 58243 -10794 -118739 43440 157952 85719 99742
2510 99742 76436 66236 68491 -66992 -11762 -10617 -76166 1826 154186 -41128 -89731 -9177
2498 -9177 -37363 -119775 -182767 14457 101471 -14957 53775 31989 121310 152792 1211
2487 1211 50184 222568 119252 3702 66911 112134 85005 65206 109544 90207 134856
2476 134856 139633 84410 54078 21779 36812 179408 251751 108490 97942 241780 110369
2465 110369 -8340 -46402 -29011 216986 220473 119501 126277 214220 134247 89267 11839
2454 11839 81960 51338 156939 198330 18296 83341 14975 27484 -4009 35749 11930
2443A1930J23942o1095m5958k7350O1960j808p8345l0801K6045N2961o9995j1161
2431d9675k0631J71669k0147j3862j77665J11723O719j3137o549J3641J78043
2420A80129M8434j69273q8900J46883L7897J05851q7406L2567K575j291O4865
2409B72331j5199k8562o4172o6265J14252R2313j19991m1051N591J12089k5967
2398B35369j4502o9737m7045M8174J5832j4730J29077O067L372N514k6460O9399
2386C40330p1704R0487l8221M7777k7709J1102M070O7490n3482J07799q0383r7190
2374C00366J08771J13489J48k0190O8516K7475J37866q194r3874P6321l8784J33709
2362H05619l3953O7529K17583p2988J4082K2297J16566P686p7087o6172K11857
$$ plain form
2443 11930 135872 74777 28819 1469 63429 61621 -16724 -47525 -21480 31481 -38514 -49675
2431 -49675 -70306 101363 81216 67354 -110311 1412 8131 -5006 -11555 2086 180129
2420 180129 228563 59290 -29610 117273 155170 261021 173615 206182 208757 207466 272331
2409 272331 257132 228570 164398 98133 212385 304698 184707 143656 149247 261336 235369
2398 235369 220867 151130 104085 152259 168091 153361 282438 288505 291877 297391 270931 340330
2386 340330 268626 359113 320892 368669 340960 352062 356132 423622 370140 477939 397556 300366
2374 300366 409137 522626 522774 502584 571100 598575 736441 728247 634373 710694 671910 805619
2362 805619 771666 839195 1056778 983790 997872 1020169 1136735 1144421 1067334 1001162 1213019
2351A213019J52710m1374k9418l4781J38787J50336o5835q4313J48285P7668J72031
2340A797115J17060J50605J32592J27986J81707J73614O0498K05292K31444K57367
2330C435280L77231O27615P02299J079159J285481J737361K860097M016455J878944
2321A7999922k069782k664549k828913k045348j443047r24296q53087p11476n57247
2312C902177n76421l46405j12569k39784m7349j37626l46576j36219n2408j45488
2302A761332k72250k8578k4531j69711j57244q9511q3221j4655j55106L9478K15443
2291A021446j31432k28992j05982l9220K8693n7787j22792r695J61150m924P220
2280E17685o3657O2137l2397q9288j338n2804P9129M2718j97945m9768R6108Q5144
$$ plain form
2351 1213019 1365729 1324355 1294937 1260156 1398943 1549279 1483444 1399131 1547416 1625084 1797115
2340 1797115 1914175 2064780 2197372 2325358 2507065 2680679 2741177 2946469 3177913 3435280
2330 3435280 3812511 4440126 5142425 6221584 7507065 9244426 12104523 16120978 17999922
2321 17999922 15930140 13265591 10436678 8391330 6948283 6023987 5170900 4459424 3902177
2312 3902177 3325756 2979351 2866782 2626998 2579649 2442023 2095447 1959228 1906820 1761332
2302 1761332 1489082 1460504 1435973 1266262 1109018 1019507 936286 921631 766525 806003 1021446
2291 1021446 890014 661022 555040 515820 544513 486726 363934 354239 515389 510465 517685
2280 517685 454028 516165 483768 394480 393142 340338 419467 462185 264240 214472 310580 395724
2268C95724K1914k33108Q3072Q3790j50954p036n380n2350M7823p8014P5937k2827
2256A58591J06901j4998r3319m718L8335J2876k2249m0423L3762N0205J8121o679
2244B36405p100j22623j5981J37158p1362k0757L2474q5752L1080P3803o9840
2233A17505n2424p0356O3338j04465k8757J78846m8565j07806P6100q2447M4702
2222a4329K0375p9986P8204N6881k12030R5413L8684j2188m8671j0970Q8482J3862
2210A3727r8031n3687J7476J14457Q4190r8103N1586J23859l255m2690p5013m8636
2198a4120M4621J04105q6981J18760O7586p2993o572M7287m4298l0471l9173n704
2186H2047P2865j24297K4781J13365L3912N530j23311N5154m4551j57011R5986
$$ plain form
2268 395724 417638 184530 267602 351392 200438 193402 188022 135672 183495 105481 181418 158591
2256 158591 265492 250494 157175 152457 190792 203668 181419 140996 174758 224963 243084 236405
2244 236405 229305 106682 90701 227859 156497 135740 168214 82462 113542 187345 117505
2233 117505 65081 -5275 58063 -46402 -75159 103687 55122 -52684 23416 -59031 -14329
2222 -14329 6046 -73940 4264 61145 -150885 -55472 -16788 -28976 -77647 -88617 -135 13727
2210 13727 -84304 -137991 -120515 -6058 78132 -19971 31615 155474 152219 109529 34516 -14120
2198 -14120 30501 134606 47625 166385 233971 160978 154406 201693 157395 126924 87751 82047
2186 82047 154912 30615 55396 168761 202673 208203 84892 140046 95495 -61516 34470
2175C4470P3922N524K1156k4661n908P4440k31353r1225n976J00067p7944R0357
2163c7131O641j14247L2966m9783j6122P2216K30p7140R3579p0895n6629J8785
2151a97530R4011j92582J16120J63024j12917k9928R298m2217l522J85855k5470
2140c5858k6438O6778m5533J0301J65395j17114P6035q1463m9755R4438Q9417
2129A46203j02143j03671K0264P0101L4253k4638n4071l5907R6677l4435j06729
2118i4096Q1006R2358j8416k5206P3679p0505j37618N3752l9328r88J13826r675
2106A8789j17255N1468L5716n9497j17947P6403M1702J9901l2375o1346O3817
$$ plain form
2175 34470 108392 113916 135072 110411 104503 178943 -52410 -143635 -149611 -49544 -127488 -37131
2163 -37131 -30490 -144737 -111771 -161554 -177676 -105460 -105230 -182370 -88791 -159686 -216315 -197530
2151 -197530 -103519 -296101 -179981 -16957 -129874 -159802 -150504 -192721 -196243 -10388 -35858
2140 -35858 -62296 4482 -41051 -30750 134645 17531 93566 12103 -37652 56786 146203
2129 146203 44060 -59611 -39347 30754 65007 40369 -13702 -49609 47068 12633 -94096
2118 -94096 -13090 79268 60852 35646 109325 38820 -98798 -45046 -84374 -85362 28464 18789
2106 18789 -98466 -46998 -11282 -70779 -188726 -112323 -70621 -50720 -83095 -144441 -80624
$$ [...]
##END NTUPLES=NMR SPECTRUM
##END=
