##TITLE=1H_EC-3314(1)
 CDCl3
 8 sc, 
 8.2.2024
##JCAMPDX= 6.0         $$ Bruker NMR JCAMP-DX V2.0
##DATA TYPE= NMR SPECTRUM
##DATA CLASS= NTUPLES
##ORIGIN= UXNMR, Bruker Analytische Messtechnik GmbH
##OWNER= root
$$ XWIN-NMR		Version 3.5
$$ Thu Feb  8 14:07:00 2024 Russian Standard Time (UT+4h)  she@DPX200
##.OBSERVE FREQUENCY= 200.1313
##.OBSERVE NUCLEUS= ^1H
##.ACQUISITION MODE= SIMULTANEOUS
##.ACQUISITION SCHEME= undefined
##.AVERAGES= 8
##.DIGITISER RES= 18
##SPECTROMETER/DATA SYSTEM= spect
##.PULSE SEQUENCE= zg30
##.SOLVENT NAME= CDCl3
##.SHIFT REFERENCE= (INTERNAL, CDCl3, 0, 15.4307)
##AUDIT TRAIL= $$ (NUMBER, WHEN, WHO, WHERE, WHAT)
$$ ##TITLE= Audit trail, XWIN-NMR		Version 3.5
$$ ##JCAMPDX= 5.01
$$ ##ORIGIN= Bruker BioSpin GmbH
$$ ##OWNER= she
$$ F:/spectra/data/she/nmr/H-F/1/pdata/1/auditp.txt
$$ ##AUDIT TRAIL=  $$ (NUMBER, WHEN, WHO, WHERE, WHAT)
(   1,<2024-02-08 14:05:52.84 +0400>,<she>,<DPX200>,
      <created by zg, POWCHK disabled, PULCHK disabled
       configuration hash MD5:
       00 E9 B6 7A A2 85 ED C7 34 08 36 98 17 FE 4E 26
       data hash MD5: 16K
       4A 6C C3 2A 09 02 D7 93 7F 55 E7 8B 8C 97 15 05>)
(   2,<2024-02-08 14:05:57.26 +0400>,<she>,<DPX200>,
      <Start of raw data processing
       efp BC_mod = 2 LB = 0.24 FT_mod = 6 PKNL = 1 PHC0 = -24594.66 PHC1 = 13.05268 SI = 16K 
       data hash MD5: 16K
       C1 93 CE 0D 1B CE A2 D3 81 A9 41 24 EA BC D7 E4>)
(   3,<2024-02-08 14:06:12.82 +0400>,<she>,<DPX200>,
      <pk PHC0 = 0.6128694 PHC1 = 0.4 
       data hash MD5: 16K
       95 D6 93 A7 4C A8 EB A1 B4 B0 85 24 F8 47 B2 CC>)
(   4,<2024-02-08 14:06:16.28 +0400>,<she>,<DPX200>,
      <abs ABSG = 5 
       data hash MD5: 16K
       24 EA F0 8D 8D BD D6 21 23 D9 17 E0 B1 9E F1 5E>)
$$ ##END=
$$ 
$$ hash MD5
$$ C7 27 22 BA 6F E2 FC 04 15 A9 A2 C0 31 8C C8 57
##$RELAX= 
##$RELAX= 
##$RELAX= 
##$RELAX= 
##$RELAX= 
##$RELAX= 
$$ Bruker specific parameters
$$ --------------------------
##$DU= <F:/spectra>
##$EXPNO= 1
##$NAME= <H-F>
##$PROCNO= 1
##$TYPE= <nmr>
##$USER= <she>
##$AMP= (0..31)
100 100 100 100 100 100 100 100 100 100 100 100 100 100 100 100 100 100 
100 100 100 100 100 100 100 100 100 100 100 100 100 100 
##$AQSEQ= 0
##$AQ_mod= 1
##$AUNM= <au_zg>
##$AUTOPOS= <>
##$BF1= 200.13
##$BF2= 200.13
##$BF3= 200.13
##$BF4= 200.13
##$BF5= 200.13
##$BF6= 200.13
##$BF7= 200.13
##$BF8= 200.13
##$BYTORDA= 1
##$CFDGTYP= 0
##$CFRGTYP= 5
##$CHEMSTR= <none>
##$CNST= (0..31)
1 1 145 1 1 1 1 1 1 1 1 1 1 1 1 1 1 1 1 1 1 1 1 1 1 1 1 1 1 1 1 1 
##$CPDPRG= <>
##$CPDPRG1= <>
##$CPDPRG2= <>
##$CPDPRG3= <>
##$CPDPRG4= <mlev>
##$CPDPRG5= <mlev>
##$CPDPRG6= <mlev>
##$CPDPRG7= <mlev>
##$CPDPRG8= <mlev>
##$CPDPRGB= <>
##$CPDPRGT= <>
##$D= (0..31)
0 1.2 0 0 0 0 0 0 0 0.06 0 0.03 0 0 0 0 0.0002 0 0 0 0 0 0 0 0 0 0 0 0 
0 0 0 
##$DATE= 1707386752
##$DBL= (0..7)
120 120 120 120 120 120 120 120 
##$DBP= (0..7)
150 150 150 150 150 150 150 150 
##$DBP07= 0
##$DBPNAM0= <>
##$DBPNAM1= <>
##$DBPNAM2= <>
##$DBPNAM3= <>
##$DBPNAM4= <>
$$ [...]
##$SUBNAM3= <"">
##$SUBNAM4= <"">
##$SUBNAM5= <"">
##$SUBNAM6= <"">
##$SUBNAM7= <"">
##$SUBNAM8= <"">
##$SUBNAM9= <"">
##$SW= 18.0517328524113
##$SWIBOX= (0..15)
0 0 2 0 0 0 0 0 0 0 0 0 0 0 0 0 
##$SW_h= 3612.71676300578
##$TD= 16384
##$TD0= 1
##$TE= 0
##$TE2= 300
##$TE3= 300
##$TEG= 300
##$TL= (0..7)
0 120 120 120 120 120 120 120 
##$TP= (0..7)
150 150 150 150 150 150 150 150 
##$TP07= 0
##$TPNAME0= <>
##$TPNAME1= <>
##$TPNAME2= <>
##$TPNAME3= <>
##$TPNAME4= <>
##$TPNAME5= <>
##$TPNAME6= <>
##$TPNAME7= <>
##$TPOAL= (0..7)
0.5 0.5 0.5 0.5 0.5 0.5 0.5 0.5 
##$TPOFFS= (0..7)
0 0 0 0 0 0 0 0 
##$TUNHIN= 0
##$TUNHOUT= 0
##$TUNXOUT= 0
##$USERA1= <user>
##$USERA2= <user>
##$USERA3= <user>
##$USERA4= <user>
##$USERA5= <user>
##$V9= 5
##$VALIST= <valist>
##$VCLIST= <CCCCCCCCCCCCCCC>
##$VD= 0
##$VDLIST= <DDDDDDDDDDDDDDD>
##$VPLIST= <PPPPPPPPPPPPPPP>
##$VTLIST= <TTTTTTTTTTTTTTT>
##$WBST= 1024
##$WBSW= 4
##$XGAIN= (0..3)
0 0 0 0 
##$XL= 0
##$YL= 0
##$YMAX_a= 746441
##$YMIN_a= -888898
##$ZGOPTNS= <>
##$ZL1= 120
##$ZL2= 120
##$ZL3= 120
##$ZL4= 120
##$ABSF1= 15.49127
##$ABSF2= -2.560579
##$ABSG= 5
##$ABSL= 3
##$ALPHA= 0
##$AQORDER= 0
##$ASSFAC= 0
##$ASSFACI= 0
##$ASSFACX= 0
##$ASSWID= 0
##$AUNMP= <proc_1d>
##$AZFE= 0.1
##$AZFW= 0.1
##$BCFW= 0
##$BC_mod= 2
##$BYTORDP= 0
##$COROFFS= 0
##$CY= -3
##$DATMOD= 1
##$DC= 0
##$DFILT= <>
##$DTYPP= 0
##$F1P= 0
##$F2P= 0
##$FCOR= 1
##$FTSIZE= 16384
##$FT_mod= 6
##$GAMMA= 0
##$GB= 0
##$INTBC= 1
##$INTSCL= 3.70164e-10
##$ISEN= 128
##$LB= 0.24
##$LEV0= 0
##$LPBIN= 0
##$MAXI= 10000
##$MC2= 0
##$MEAN= 0
##$ME_mod= 0
##$MI= 1.114404
##$NCOEF= 0
##$NC_proc= -6
##$NLEV= 6
##$NOISF1= 3.799351
##$NOISF2= 2.8
##$NSP= 0
##$NTH_PI= 0
##$NZP= 0
##$OFFSET= 15.43067
##$PC= 1
##$PHC0= -24594.05
##$PHC1= 13.45268
##$PH_mod= 1
##$PKNL= yes
##$PPARMOD= 0
##$PSCAL= 0
##$PSIGN= 0
##$REVERSE= no
##$SF= 200.130018217549
##$SI= 16384
##$SIGF1= 3
##$SIGF2= 2
##$SINO= 5.538805
##$SIOLD= 16384
##$SREGLST= <1H.CDCl3>
##$SSB= 0
##$STSI= 16384
##$STSR= 0
##$SW_p= 3612.71676300578
##$SYMM= 0
##$S_DEV= 0
##$TDeff= 16384
##$TDoff= 0
##$TI= <>
##$TILT= no
##$TM1= 0
##$TM2= 0
##$TOPLEV= 0
##$USERP1= <user>
##$USERP2= <user>
##$USERP3= <user>
##$USERP4= <user>
##$USERP5= <user>
##$WDW= 1
##$XDIM= 16384
##$YMAX_p= 481818240
##$YMIN_p= -667864
$$ End of Bruker specific parameters
$$ ---------------------------------
##NTUPLES= NMR SPECTRUM
##VAR_NAME=  FREQUENCY,     SPECTRUM/REAL,   SPECTRUM/IMAG
##SYMBOL=    X,             R,               I
##VAR_TYPE=  INDEPENDENT,   DEPENDENT,       DEPENDENT
##VAR_FORM=  AFFN,          ASDF,            ASDF
##VAR_DIM=   16384,         16384,           16384
##UNITS=     HZ,            ARBITRARY UNITS, ARBITRARY UNITS
##FACTOR=    0.220516191357247, 1,           1
##FIRST=     3088.14022509015, 0,            0
##LAST=      -524.576537915626, 0,           0
##MIN=       -524.576537915626, -667864,     0
##MAX=       3088.14022509015, 481818240,    0
$$ Real data points
##PAGE= N=1
##DATA TABLE= (X++(R..R)), XYDATA
$$ [...]
8643 14999287 15642070 16785243 18146974 19814758 21760645 24169142 26556749 28442872
8635 28442872 29625602 30210575 29788474 28774310 28370397 28129361 27878605 27374887 26503352
8626 26503352 24844029 22208914 19363704 16895641 14645092 12745169 11235816 10365816
8618 10365816 9504589 8632454 8139038 7867010 7654163 7123775 6765278 6531736 6200655
8609 6200655 5905235 5823248 5429839 5178373 5391219 5060258 4907733 4816155 4871943 4831634
8599 4831634 4561779 4464707 4412926 4242946 4453251 4329584 4099841 4047330 4154808 4207779
8589 4207779 4277118 4267987 4219505 4229046 4112763 4170035 4017793 3977320 3983142 3899262 3931155 3886446
8577 3886446 3717371 3565279 3674359 3484166 3441580 3388133 3302500 3432472 3202192 3275437
8567 3275437 3167329 3341541 3465451 3345895 3326018 3262471 3327857 3347969 3194779 3288031
8557 3288031 3383730 3324235 3197475 3182784 3178567 3257980 3256205 3252258 3282939 3240712 3116201 3275771
8545 3275771 3262827 3320180 3399297 3360946 3357548 3227381 3342014 3558727 3582626 3485977 3504243
8534 3504243 3557879 3690232 3692105 3867855 4043364 3798351 3759363 3880261 3962189 4207211
8524 4207211 4033931 4156600 3894242 4050067 4180902 4007732 4291321 4300379 4295798 4145034
8514 4145034 4234469 4522509 4603975 4772923 4908951 5079598 5223035 5537758 5517061 5974877
8504 5974877 6242529 6592434 7256081 7759526 8419460 9186729 10270344 11291833 13173927
8495 13173927 15606798 18392975 21206269 23625327 25262602 25502884 24689587 22539222
8487 22539222 19516927 16500963 13481921 11148134 9398679 8350010 7477825 7118104
8479 7118104 6813935 6521542 6135988 5941510 5977828 5795315 5697035 5670042 5588888 5590416 5815631
8468 5815631 5765356 5926276 6147987 6376439 6650869 7165620 7761830 8454063 9380450 10275545
8458 10275545 11739833 13692379 16111914 18732674 20480973 21398476 21095572 19759476
8450 19759476 17680181 14950367 12340528 10029394 8306367 7127552 5995742 5358546
8442 5358546 4982712 4669284 4450662 4310977 3917129 3540955 3195856 3235458 3024607 2819640
8432 2819640 2797516 2399235 2353725 2457131 2265213 2117586 2207813 2180280 2121805 1949888
8422 1949888 1950377 1906466 1858207 1914519 1740167 1766820 1919545 1765618 1698864 1627432 1448664
8411 1448664 1552205 1628795 1761766 1632064 1477884 1574023 1459689 1533157 1387927 1445420
8401 1445420 1338929 1256182 1410871 1165469 1211308 1168194 950713 1245220 1092647 977917
8391 977917 990883 1007616 1112495 1103530 990369 1087045 1127996 1222376 1369617 1321952 1330869
8380 1330869 1191972 1228498 1372682 1407795 1355233 1177768 1048448 968672 1128800 1052776
8370 1052776 1160268 1049228 858076 720815 861613 1142311 1120200 1227317 1097007 1072940
8360 1072940 1068911 1224048 1373283 1579418 1388202 1399611 1309950 864171 995196 1122005
8350 1122005 1133904 1088191 704900 930974 908380 825463 1161696 1137144 1083129 983817 925755
8339 925755 856515 789190 993483 1138096 1041261 916526 885354 1067244 974799 853586 1067222
8328 1067222 739629 762140 838070 900275 963478 673508 772334 937136 933942 779392 946402
8317 946402 998358 1045749 803894 909339 1043724 925583 957088 1014594 989085 966326 945748
8306 945748 1021879 1128116 1088362 936657 994504 1029791 958771 997368 874618 900065 985944
8295 985944 1052687 932299 888792 974846 879927 911852 915687 1103044 929228 914912 1215811
8284 1215811 1072402 1172507 1219151 1121727 1125290 1481523 1315012 1352341 1266881 1099813 1045877
8273 1045877 1040827 1093385 935733 968650 1122070 875390 861231 884791 930680 751100 959233
8262 959233 948024 883058 1231214 1369559 1405023 1393552 1566222 1683079 1777998 1909161 1903040
8251 1903040 1586089 1456525 1566728 1317283 1268518 1315901 1630806 1606839 1282585 1168388
8241 1168388 1079801 1276356 1094401 1147549 1180380 684750 790994 738457 963970 1198842
8231 1198842 997277 1037435 789718 949254 847724 1002627 907459 927605 947776 1050485
8221 1050485 931625 1078850 1006383 1215167 1286903 1262471 1338285 1075257 1138340 976340
8211 976340 844684 1029666 1099842 1147082 1108121 1355053 950513 822905 710392 798533
8201 798533 953466 955117 1064638 713876 474448 356799 384815 617200 188916 -667864
8191 -667864 632058 685619 576292 1044019 1262200 1282506 1132376 903870 619236 232062
8181 232062 348449 488623 517421 389315 21364 65982 -168301 125090 303682 320310
8171 320310 485744 188873 73745 154693 262676 355812 813252 771495 560734 308845
8161 308845 287125 439817 213825 290812 81960 14033 -185614 -43541 12110 148202
8151 148202 89363 216916 315878 135125 163743 206739 286580 244887 271300 351090 136177
8140 136177 59674 374934 373056 196783 26107 -16164 86275 -87655 -5443 273761 285390
8129 285390 138361 88826 179084 182358 295483 336707 271674 272601 271170 385658 90152 56358
8117 56358 470784 445758 90377 115788 132101 1005 -69190 -20760 139922 143504 -56522
8106 -56522 78066 -150286 -86292 223252 199538 185073 53425 144823 51730 274928 231003
8095 231003 228056 125594 92660 -14727 -54925 145054 70027 155559 103334 128645 -71423
8084 -71423 -62153 165981 57356 139884 48003 -56820 -301823 -112626 -61416 -220282 -127031
8073 -127031 143342 -11508 -17948 -136514 -13981 51660 27210 123175 -84229 21633 -75757
8062 -75757 54828 300322 134299 48982 5749 2240 -96377 -103397 13864 102912 -36708
8051 -36708 -130402 -65655 96569 161110 41695 90412 -155738 -57696 125140 132513 78010
8040 78010 -109964 -147729 -434540 -356963 -44627 -95352 62870 -64283 -152551 -302147 -324467
8029 -324467 -134526 -28266 106745 221202 53441 -83020 99335 45259 47658 194710
8019 194710 186873 80238 -163305 -305374 -369675 -120999 -87836 -156972 -223191 -263723 -101484
8008 -101484 -181497 -39230 -29076 61937 185792 111961 198570 180538 251662 127678 31127
7997 31127 30215 170189 -64289 -90779 63109 -219208 -344687 -182416 -80851 -35818 -80919
7986 -80919 -93695 -44976 -50772 -33261 -46910 62909 40309 96103 132156 31689 193945
7975 193945 90045 -5910 70331 53870 -100521 -263499 -246943 -109408 -251699 -159887 -220385
7964 -220385 -320690 -210402 -123398 188539 24645 -112718 -66912 3950 68373 10477 33350
7953 33350 -58092 -167423 -266334 -28968 19721 -111754 -29202 -208787 -155071 -252950 -186648
7942 -186648 -89846 -42728 143319 20612 -319374 -197785 -47310 -23523 -23839 139109 20433
7931 20433 -319781 -333131 -118751 -140669 -267871 -230208 -231949 -294513 -257108 -157905 29046
7920 29046 -8495 -278798 -351727 -190147 -155090 -167766 -76099 -186610 -386989 -297271 -153994
7909 -153994 -240686 -230986 78021 -155089 -180690 -94643 -257729 -161211 -79382 121874 -93223
7898 -93223 -119520 -136294 -174121 -166142 -248742 -152742 -299612 -242902 -332400 -407535 -308238 -174445
7886 -174445 -45771 -32657 -95358 -68845 -161811 -254242 -177551 -210055 114742 59589 -101598
7875 -101598 -193471 -87723 198416 265189 -7286 -318077 -262421 -128835 -185879 -281265 -296839
7864 -296839 -76916 -289386 -386980 -153330 -215319 -110973 -13791 35409 91345 -11863 -65481
7853 -65481 -3745 124193 7083 -103457 -348029 -134014 -140200 -295007 -196187 -434287 -261312
7842 -261312 -233880 -477236 -223598 -101491 87622 -88838 -281248 -224335 -307253 32843
7832 32843 101030 19849 95440 -15840 -90052 -101760 -17247 121508 -24427 -128851 -232318
7821 -232318 -375595 -90164 14073 -215146 -179142 -97208 -278949 -451234 -211656 -60812
7811 -60812 -108156 -129188 -207356 -234058 -48331 -88599 18595 -112348 -96224 -33649 -299519
7800 -299519 -220554 -137363 -233305 -185844 -189358 -163095 116878 -109092 -213832 -134022 -90805
7789 -90805 -46016 -74166 -7325 -64091 -25824 -64452 -34896 -99157 -81577 -11234 -21221 -296465
7777 -296465 -212475 -64434 80084 4739 -36081 -15059 44285 10235 4181 154093 186848
7766 186848 66898 -160469 -165916 -54950 -103586 -293301 -166698 -140796 -206717 -310579 -380765
7755 -380765 -210998 86923 110946 -150123 -190248 -50257 198495 208181 144076 160220 139032
7744 139032 248556 33004 -211426 218862 233070 -119884 -110503 -239143 -36424 -70167
7734 -70167 -109554 125419 -17786 -24211 -56723 -228973 82841 98175 131210 141224 -1382
7723 -1382 -71983 -86700 -9668 -125301 78666 162851 -139978 -170992 -175412 -46876 -136364
7712 -136364 -84145 13281 -58904 -96782 -51644 19365 -12906 119200 -43240 -127432 169279
7701 169279 102128 97865 97666 143984 46768 54542 18236 -275933 -219089 -20715 -55035 -56848
7689 -56848 -138274 -107561 -53014 -23941 -25884 -87980 32846 -40034 -127812 -188109 -43955 12446
7677 12446 -59227 5427 -143580 25874 -92965 -212371 51251 231059 289366 47756
7667 47756 -128398 -15739 -25018 -134033 -9200 -51772 55149 -75733 -226034 -329946
7657 -329946 -170773 21426 -97109 -247209 -208716 -217620 -224418 -249601 -162919 50440 178203
7646 178203 75872 -14971 -41112 -113287 -37805 -72519 80636 -44802 -87954 -107730 -451759
7635 -451759 -124931 11424 65478 -6130 63440 145405 79640 -84084 72674 112538 45933
7624 45933 122666 92473 -106135 -96703 -74773 -61584 79977 47437 -49927 -125726 -80546 -24315
7612 -24315 34964 54257 117916 50734 200634 -4752 -256985 -44524 83232 -28626 -85390
7601 -85390 -25205 15343 -251755 -76246 105695 49570 201157 113601 2125 107519 -16444
7590 -16444 151196 -22625 -55916 -64382 -244823 -221811 -315584 -179424 -91463 -161187 -205109
7579 -205109 -200415 -5464 -167586 -113685 -45553 114579 276944 129427 -18996 -104339 336
7568 336 8199 147135 161835 -21945 -53405 -220584 -82017 -53134 -98138 54124 -155925
7557 -155925 -127190 -76092 -65857 173405 127089 -31489 190559 254473 134389 212886 328653
7546 328653 338847 141497 -15562 47318 -3235 206595 116510 106844 -119973 -225192 -146293
7535 -146293 -38303 120311 -10163 -132488 -131686 -228878 -203007 21866 154725 -71524 -266184
7524 -266184 -215665 -234038 -115622 11734 75014 7545 -179695 -177718 -196916 -42774 105076
7513 105076 176830 121050 168058 -108989 55108 111063 167988 356758 177083 202155 -162883
7502 -162883 -110651 -128875 75844 155357 -5820 72107 -57271 -43688 -23620 -93098 -40913
7491 -40913 16649 158058 60153 -105626 -57411 -26080 -6293 158748 58352 -109159 70542
7480 70542 25068 -5852 -49335 106486 72515 -107738 243661 75041 4030 124416 275116
7469 275116 345889 162362 51228 112541 9563 -66155 69474 -5118 113078 -4006
7459 -4006 32305 208865 135849 33736 -83205 16862 -16214 123914 124701 -2085 -30609
7448 -30609 100299 396615 288299 296751 -46233 -90443 -21047 -56415 104135 142719 148586
7437 148586 -24359 47479 -34192 227845 109516 45420 144207 -12722 129146 29651 273792
7426 273792 207795 -89623 102524 126780 150819 102304 108180 -158739 -38795 16236 -79929
7415 -79929 -57495 -25979 220739 138438 74003 69805 -8509 355913 367764 300663 295645 230533
7403 230533 160044 246418 245045 217945 359422 460876 147677 -84320 93294 -5500 129614
7392 129614 -69633 20257 -54638 -45296 32479 -72050 194371 124997 128082 184145 264673
7381 264673 262248 322861 431773 281471 345989 369735 343304 303966 311630 310478 142341 -64951
7369 -64951 142114 120223 143498 84749 -57855 -117724 -261410 -151979 -46290 1769 56112
7358 56112 -94969 -189086 -14934 24926 -147941 -90404 95078 37705 -48214 23785 167113
7347 167113 -15948 89616 216876 -90649 -37266 -14497 -29905 -79329 -146630 97487 -1858
7336 -1858 32787 -113121 -182675 19455 2332 -204594 -121981 28909 -103003 -8923 104269
7325 104269 126171 -74527 122406 -51386 -220077 -20817 7469 -284722 -348647 -211727
7315 -211727 -265234 -379359 -284976 -71498 -190591 -48767 -54270 -137129 52695 31739 160529
7304 160529 21273 143198 100342 41016 36236 -37986 38562 -65554 -237003 -73162 -183234
7293 -183234 -270666 -209268 -244165 -82241 -180494 -112010 -76765 -62771 105502 23379 -17049
7282 -17049 86571 126941 203464 295268 113163 -37799 -111022 -106884 -122988 -53314 -70582
7271 -70582 -23307 30841 -169576 -117963 -142531 38278 -107651 -47871 -19267 215097 52731
7260 52731 36357 280783 196572 204339 86243 75455 178317 -87292 -9585 -86988 -175285
7249 -175285 -174911 -181374 -173025 -94690 -101102 -90607 -53679 -180881 8534 33500 58239 7844
7237 7844 -228774 -25417 68644 142542 235676 15677 17248 -292823 -257383 -278120 -234908
7226 -234908 -50208 -171949 -247071 -203444 -66048 -338253 -272323 17193 225185 102019
7216 102019 -70548 80902 -16564 41946 927 106523 5895 111739 20047 -269443
7206 -269443 -333743 -136743 -68694 3506 50873 -69975 -201572 -361872 -87316 -81963 52849
7195 52849 138525 -15912 -104459 -105694 -7718 -36411 38112 38681 44749 -251727 -347775 -112249
7183 -112249 -237621 35928 -37842 -78341 -96925 -81969 169697 189026 18744 -16688 -113304
7172 -113304 -98596 -47203 56492 191253 162716 -73019 65206 -170378 -96165 51386
7162 51386 731 186798 -126173 -98079 -116570 -88931 184531 235903 94808 -39147 -83357
7151 -83357 -140557 31856 -138996 114078 215490 170951 205444 74259 61109 153847 186800
7140 186800 144366 1133 -172134 -29454 -27486 -307243 -209316 4587 -23955 -54598 -325756
7129 -325756 -142016 -190927 -125703 -126924 -39225 32165 106537 -14203 -2071 144345 208775
7118 208775 127251 190255 85891 27862 -100931 -24059 60936 242128 249609 -2036 -267946
7107 -267946 -190062 -165826 -2714 11374 4367 -10204 -314193 -196281 -103792 -64346 89572
7096 89572 208670 74530 -79755 -116473 -223204 -33314 -48790 177377 89580 -153465
7086 -153465 -112465 -129911 15522 76258 17702 -58940 74330 -85621 53088 232843 70391
7075 70391 142394 73269 -151136 -81592 3738 130088 228081 178821 225615 -125753 -355126
7064 -355126 -71865 10863 74588 20391 -65355 -49882 42957 -87864 -12523 -52287 62657
7053 62657 65260 28040 10163 -203875 -42402 169455 -26354 52615 68311 -198295 -44302
7042 -44302 -113326 -65047 -292396 -218176 141320 50831 21724 -941 -73908 69849 201152
7031 201152 42531 147099 149511 125313 103381 -116022 -125148 -39430 97157 238120 -22178
7020 -22178 -151990 -275184 -218103 -48553 -112920 -126004 76662 36557 -10886 -248420 -47914
7009 -47914 32563 125232 272449 197392 62373 48335 82097 130068 252543 117707 95188
6998 95188 -165997 -379471 14175 -38505 215896 -72491 -135756 -85716 -136528 49809 31986
6987 31986 165796 247669 -9814 -34608 -136584 57731 214388 131304 75809 -3783 20539
6976 20539 -68119 -71644 -39076 -9981 13048 268648 20305 -97331 -11573 153056 70580
6965 70580 43561 25980 -88748 -123135 -55140 203065 76864 78878 213600 -138076 45884
6954 45884 -82786 -37935 29364 -121632 203832 132841 -105048 542 -89524 105785 184679
6943 184679 82453 145557 -41010 42627 24449 6828 73624 143991 182730 229843 97554
6932 97554 -28380 74908 -33821 99383 151456 136030 -113983 -28116 -48385 -6890 4521
6921 4521 -22521 143881 105985 -86822 -136129 21425 -45910 63415 159009 94573 100495
6910 100495 94631 103072 38616 108376 94423 139737 99656 178714 302638 144902 -111239
6899 -111239 -96354 18957 238118 163439 77532 -196633 21893 33052 111695 114439 111866
6888 111866 172934 88035 160282 -21412 -61479 32776 61415 94472 64234 117657 109413 -1769
6876 -1769 68612 180627 232202 240121 184735 315358 280496 220105 330861 375679 410915 8901
6864 8901 100235 302029 271872 123711 -26664 -57106 71539 147453 176959 200701 -157052
6853 -157052 -29668 85316 -89516 136421 61145 118280 77889 166719 142761 155853 208619
6842 208619 192143 217686 169909 134112 52564 18386 253850 149824 198987 173699 187182
6831 187182 78286 271029 130715 122352 322624 2734 131735 150085 392536 250575
6821 250575 268633 294222 90180 176190 171013 343898 47700 49603 103898 2139 326348
6810 326348 326132 280440 323868 287145 281453 327739 401860 135209 273055 330002 312605 185051
6798 185051 118161 278500 134273 132018 75056 190542 252962 391395 370077 173436 329927
6787 329927 288013 247355 295868 358238 367908 337118 261782 193642 261551 297430 345370 182935
6775 182935 144587 526832 433116 264263 413985 567809 392463 435914 459926 521551 534019
6764 534019 623670 397449 148050 303834 511770 492845 408456 225702 227451 226294 294798
6753 294798 278343 430299 411107 332872 435318 646634 619690 504499 694187 685104 581948
6742 581948 547624 647822 600499 427821 711794 712044 353345 641998 553273 606746 402658
6731 402658 393177 579418 631494 607033 706024 631009 533298 547728 515715 525635 709967 686627
6719 686627 593471 437811 610468 605539 454395 753520 888961 851179 947263 661755 779826
6708 779826 587511 882590 876821 603383 775127 738296 608182 755405 656661 753028 598675
6697 598675 771073 877955 726322 884773 923973 997283 1011864 1025273 1015222 1039213 1200338
6686 1200338 1322129 1116978 1253885 1078911 955899 1122041 968497 1000281 1247444 1230916
6676 1230916 1060562 860309 1025688 1213926 1196177 1354038 1410244 1095924 1182295 1305482
6666 1305482 1198870 1263347 1403325 1485270 1542205 1463487 1536635 1278074 1362967 1628111 1454484
6655 1454484 1466790 1425343 1582423 1680115 1646855 1876153 1762690 1727539 1903192 2006346
6645 2006346 2153972 2049615 1777910 1671040 1757164 1933648 1952246 1924365 1995124 1946874
6635 1946874 1983976 1865539 2071790 2341858 2460557 2287095 2224205 2403616 2530717 2649248
6625 2649248 2853203 3030381 2968603 3121686 3062663 2991507 2964305 2974684 3157711 3199631 3167964
6614 3167964 3204067 3309695 3414588 3469248 3321253 3541918 3572495 3590570 3950580 3874630
6604 3874630 4058714 4198719 4349409 4443693 4688096 4662221 4840313 4992347 5151981 5187221
6594 5187221 5198044 5336360 5487300 5484184 5766935 6052433 6069648 6006935 6007268 6286170 6482172
6583 6482172 6588036 6845175 6836420 7089592 7075441 7141974 7285944 7592119 8088836 8171717
6573 8171717 8047328 8025160 8079057 8324380 8390313 8537900 8706108 8393335 8224075 8369360
6563 8369360 8437691 8472724 8435249 8451699 8225555 8112072 8076047 7883877 7979253 7822673 7715753
6552 7715753 7629762 7377694 7271140 7115596 6882324 6715938 6511892 6450926 6285759 6232200
6542 6232200 6054745 5862463 5742159 5586706 5528516 5463444 5372365 5449776 5010605 4839373
6532 4839373 4936865 4754334 4617148 4408692 4357184 4162906 4060331 4031533 3910204 3697524
6522 3697524 3536766 3573900 3327717 3236576 3206727 3310178 3336037 3087151 2962812 2882748
6512 2882748 2797702 2656143 2776210 2818147 2670803 2744212 2579512 2527580 2331182 2300373
6502 2300373 2263266 2367577 2139785 2047234 2124044 2130244 1943619 1783035 1888050 1874823 2002407
6491 2002407 2070409 1977246 1845767 1799063 1976405 1824700 1896868 1906641 1669465 1599598 1558113
6480 1558113 1471925 1622289 1673575 1572488 1374858 1323936 1326997 1209460 1394689 1522268
6470 1522268 1445250 1339151 1063309 1108153 936630 1262149 1427605 1189345 1223753 1162242
6460 1162242 1075722 1044687 1203225 1280286 1317237 1155402 953634 905400 945243 1086288 1189409
6449 1189409 1013383 1212754 948343 793468 1153198 910604 1044723 946097 931657 1012155
6439 1012155 703696 999219 1087209 1090388 1129651 968656 870199 852655 942079 1112741 1069369
6428 1069369 1036631 902733 1013464 1022809 917034 796465 878025 974423 741869 795319 707068
6417 707068 759209 857161 797123 920758 792619 751993 794570 676202 914401 1040908 816759
6406 816759 785234 836980 979500 919334 776217 790565 915109 827160 809587 702679 733703
6395 733703 613379 760234 928679 733265 1051310 879875 952890 1041711 907689 1068375
6385 1068375 671709 1064524 757076 617191 949260 942143 924382 889540 1031720 759622
6375 759622 793335 927259 904130 1018294 854307 879007 842921 1004766 1119583 814433
6365 814433 953615 1258783 945488 1034342 1112494 1243651 1237338 1206055 1315854 1378292 1570328
6354 1570328 1369517 1318157 1377526 1536740 1405104 1203587 1338729 1230885 1460975 1479096
6344 1479096 1478205 1474237 1227588 1357566 1167980 1259572 1242327 1216029 1533355 1598911 1438876
6333 1438876 1246686 1611120 1669345 1663942 1898622 1958528 1986042 1756469 1932384 1919138 1826602
6322 1826602 1943896 1882628 1713956 1648951 1251277 1361844 1525667 1421816 1391173 1384336
6312 1384336 1501266 1592193 1677688 1661775 1591096 1735216 1598257 1496888 1240377 1602775
6302 1602775 1790072 1505126 1640055 1571192 1462175 1407575 1468071 1440930 1384597 1351810 1187209
6291 1187209 1223777 1284483 1529785 1397494 1140521 1228326 1350975 1558668 1449946 1546305
6281 1546305 1837591 1647961 1566916 1525028 1660235 1586458 1640082 1547727 1318064 1403024 1540438
6270 1540438 1423903 1312088 1406321 1262415 1181419 1193513 1119421 1017591 1240438 1121484
6260 1121484 1249123 1241092 1235930 1139989 1108165 1352418 1215614 1315618 1586369 1556433 1674376
6249 1674376 1739630 1653684 1441340 1480534 1402558 1361487 1535111 1455960 1425609 1186723 1380524
6238 1380524 1333758 1167222 1221350 1316412 1057200 928368 1246677 1208359 995788 1228613
6228 1228613 1501213 1451816 1213509 1309289 1417679 1441960 1713833 1853346 1729069 1551782
6218 1551782 1350186 1360654 1489653 1568664 1502218 1371291 1541280 1313910 1061859 1374423
6208 1374423 1410751 1479150 1587159 1617685 1445740 1659299 1866874 1860560 2027794 2227245
6198 2227245 2420264 2275764 2423027 2295425 2089505 2199356 2354305 2144273 1916288 2064806
6188 2064806 2205426 2120240 2126878 2156834 2351800 2283437 2317717 2456673 2635153 2684091 2748509
6177 2748509 2811018 2643616 2762139 2907488 2665886 2474193 2604400 2919549 2854589 3053308
6167 3053308 3207272 2867385 2713419 2757027 2879092 2886054 3110658 3280587 3183609 3346224
6157 3346224 3397367 3067996 2930735 2965785 2836077 2553519 2647250 2552183 2307912 2516224
6147 2516224 2450068 2529150 2840022 2922492 2685569 2658963 2980725 3063041 3049633 3308245 3115735
6136 3115735 3278012 3186827 3170282 2925518 2655749 2806859 2444778 2186387 2081906 2007497
6126 2007497 1871849 1864191 1700535 1709622 1958453 1912598 1948120 1892440 2017717 2133729 2169599
6115 2169599 2451314 2234630 2132945 2236572 2218799 2233345 2245506 2127797 2072639 1939978
6105 1939978 1706402 1761263 1617412 1607061 1480695 1159243 1514798 1375826 1363637 1487905
6095 1487905 1348354 1639262 1688170 1611495 1409032 1483261 1736819 1587984 1527125 1655992
6085 1655992 1716563 1696219 1573996 1376851 1304184 1196502 1402446 1384334 1364725 1380767 1188913
6074 1188913 1199004 1205857 1263116 1293744 1243380 1214255 1169698 1016882 1042913 1098946 1084179
6063 1084179 1416342 973381 1021529 1237682 1279586 1467404 1125967 1330673 1380483 1118488
6053 1118488 1407471 1385182 1417829 1359583 1360534 1402786 1450136 1258824 1131595 1262036 951734
6042 951734 1015436 960312 884969 1021440 825123 1133731 1073418 805997 938335 907284 1040081
6031 1040081 1183312 1226647 1368428 1118218 890752 1075721 1038059 1079828 1163853 1127731
6021 1127731 1092154 994961 873938 853868 893494 821118 996423 1067846 989267 1117183 965622
6010 965622 923448 1208695 1168261 1222101 1090817 1005615 846516 680263 953087 1096345
6000 1096345 1014889 1072923 979324 839973 775046 723379 885445 830853 945820 992760 886263
5989 886263 847155 681328 906835 1068866 1013842 996955 986700 1344847 1014532 993239 1210500
5978 1210500 1249796 1229750 1125005 1242621 1104278 1014955 1235926 1312710 1305728 1048212 968705
5967 968705 790837 851174 931195 922115 995098 780315 696823 671233 916253 846685 778731
5956 778731 1072447 910157 732779 799426 1111493 1034301 1115503 1090392 1042180 885418 888950
5945 888950 1170921 1103676 1239210 1157064 930338 776707 898348 1016292 1124568 1060309
5935 1060309 1018195 944590 789336 856167 1063346 1233177 1165778 1200427 1128505 1162814 1190127
5924 1190127 1182159 1257564 1372885 1436303 1291866 1099725 1182152 1351639 1475686 1420866 1488441
5913 1488441 1443702 1260375 1129723 1228645 1496699 1522645 1356944 1210076 1233287 1298483
5903 1298483 1375186 1330147 1191482 1170923 1282875 1254442 1281705 1353092 1378632 1499681 1325402
5892 1325402 1449561 1548458 1550251 1642476 1474471 1557767 1449744 1358049 1355535 1428398 1503373
5881 1503373 1595990 1628963 1330616 1254691 1471542 1425013 1474233 1463461 1424410 1494800 1264507
5870 1264507 1449881 1717479 1716497 1682520 1463299 1667363 1684651 1609129 1700095 1547294 1505805
5859 1505805 1643055 1546156 1610716 1716255 1527982 1540788 1645331 1732368 1853204 1668353
5849 1668353 1990048 1728334 1828871 1959997 1848391 1991871 1862938 2187474 2179087 1964569
5839 1964569 2168366 2130208 2103885 2030382 2038146 2199574 2165888 2100367 1907445 1955194 2074925
5828 2074925 2115896 2116936 2192334 2271900 2298933 2388431 2385813 2330394 2675068 2851537 2847156 2839912
5816 2839912 2807468 2722294 2624946 2941340 3067026 3065748 3049997 2786920 2853331 2993690 3193980
5805 3193980 3350345 3313619 3590516 3821669 3441904 3703702 4021470 4095628 4179161 4295737
5795 4295737 4499266 4350848 4161162 4321217 4270520 4288858 4429835 3982275 4083669 4031385
5785 4031385 4227597 4360285 4094737 4183724 4063246 4267154 4475524 4224677 4522709 4550910
5775 4550910 4343162 4442639 4744867 4889640 5301735 5341358 5414148 5747749 5713794 5545263
5765 5545263 5052846 5133286 4885598 4654700 4396629 4231116 4343520 4405971 4335457 4296041
5755 4296041 4405587 4331101 4142254 3868538 4125586 4397984 4405677 4407366 4026187 4180928
5745 4180928 4204635 4042335 4200691 4249637 4268089 4156209 4073036 4274236 4372247 4164205
5735 4164205 4088044 3928190 3831130 3735444 3793222 4216826 4171656 4213894 4237650 4260437 4205443
5724 4205443 4149438 4051897 3908048 3723455 3599010 3687423 3552449 3420631 3431337 3585458
5714 3585458 3609443 3597153 3637493 3600846 3787897 3803339 3731794 3745724 3816989 3999237 4180711
5703 4180711 4431986 4828029 4969139 4647346 4446459 4240410 4227292 4048324 3724254 3611314
5693 3611314 3455461 3498738 3314160 3145390 3432338 3388746 3557396 3450265 3389278 3346260
5683 3346260 3285805 3346692 3211223 3304269 3493960 3382617 3602689 3646146 3599643 3747726
5673 3747726 3832036 3983137 3654015 3663086 3510443 3323048 3200440 3124183 3312001 3202660
5663 3202660 3309767 3302340 3044654 3086006 3088647 3378949 3334787 3357873 3290964 3257468 3348648
5652 3348648 3281490 3607343 3424216 3283530 3187282 3185420 3126030 3087511 3186229 3001562 2906770
5641 2906770 2797161 3001621 3101772 3173957 3206281 3279285 3328656 3405755 3583112 3681221 3638778
5630 3638778 3847840 3788599 3725053 3789674 3717362 3952984 3712481 4009509 3927263 3737371
5620 3737371 3932353 3847027 3844766 3586471 3797094 3993417 3921707 3832200 3828409 3921470 3910669
5609 3910669 4005372 4196458 4369449 4242068 4146958 4047592 4039660 4124632 4206156 4556675 4344191
5598 4344191 4551646 4579460 4202644 4216144 4271808 4561509 4486681 4652729 4674957 4459080
5588 4459080 4372494 4466703 4385055 4311253 4263857 4391919 4380881 4485915 4661811 4773036 4759102
5577 4759102 4832781 4668390 4837660 4754547 4572284 4641962 4556608 4555444 4388799 4519365 4596696
5566 4596696 4578173 4259771 4331429 4264335 4277338 4483048 4295924 4233427 4312644 4366846 4348757
5555 4348757 4446183 4714200 4697263 4479321 4570497 4779841 4764496 4753633 4802669 4893298 4463728
5544 4463728 4267222 3960277 3933292 4117553 4114276 4097852 3896800 4050804 3976642 4075950 4244804
5533 4244804 4341136 4121246 3937097 4260718 4234735 4441367 4639871 4530351 4604459 4584746
5523 4584746 4456581 4334964 4097808 4213657 4233825 4217678 4312700 4093393 4145075 4163839
5513 4163839 4077556 3995449 4130590 4026766 3959588 4037447 3947381 3652209 3410954 3555492
5503 3555492 3638552 3530494 3662949 3593569 3631859 3681138 3675173 3674100 3577520 3636408 3691712
5492 3691712 3798936 3656695 3822317 3793415 3620939 3506283 3317195 3539003 3446785 3537173
5482 3537173 3773542 3722853 3721134 3699070 3873698 4144728 4303433 4353334 4587286 4756983
5472 4756983 4862658 4805181 4990457 5089330 4993090 4900281 4424137 4134892 4078391 4206396
5462 4206396 3826187 3580748 3694530 3463154 3226385 3254148 3338147 3202690 3196148 3120168
5452 3120168 3152978 2967010 2884996 3021709 2911018 3155149 3187835 2934542 3047734 3134438
5442 3134438 3088404 3147652 3185377 3293508 3492758 3508296 3607421 3598737 3708541 3692933 3555443
5431 3555443 3781235 3951805 3723726 3370681 3208555 2975332 2861872 2791159 2749640 2726588
5421 2726588 2613140 2666602 2545447 2538011 2653573 2624172 2685100 2631355 2577659 2630447 2729288
5410 2729288 2925203 2789262 2738515 2641202 2532476 2121636 2189964 2314730 2222603 2166757
5400 2166757 2154582 2252113 2182140 2192906 2195113 2435383 2510528 2355046 2352424 2091293 2297510
5389 2297510 2423537 2315531 2485366 2403670 2403034 2470018 2550843 2615039 2680269 2885995 3089242
5378 3089242 3337245 3592060 3915365 4331432 4674922 4591322 4246324 4184337 3912602 3381087
5368 3381087 3197987 3237971 3082159 2915136 2862706 2779182 2645488 2646352 2642134 2847724 2920173
5357 2920173 3069005 3045669 3068929 3349047 3529298 3558140 3847714 4031276 4474332 4823116
5347 4823116 5244220 5925189 6789771 7615711 8569284 9328423 9509748 8904566 7919453 7087377
5337 7087377 6092281 5121261 4721156 4123719 3762891 3539256 3505215 3575955 3252185 3164032
5327 3164032 3255857 3285718 3442098 3300376 3578509 3721411 3820679 4070919 4111058 4451913
5317 4451913 4573787 4823912 5409840 6159561 6727795 7539839 8435421 9250907 9530362 9014987
5307 9014987 8292183 7190293 6005961 5421853 4735340 4353001 4011052 3803046 3484552
5298 3484552 3405010 3381479 3318652 3164542 3087946 3067162 2998495 2970166 2893376 3008916 3012909
5287 3012909 3002281 2897428 3093228 3267747 3241902 3317390 3774953 4040747 4293430 4768608
5277 4768608 4970879 4889499 4732867 4536837 4344383 4049043 4046388 4249165 4004060 4336419
5267 4336419 4228645 4088092 3981577 3685658 3542195 3355421 3365071 3181447 3045025 2987189
5257 2987189 2817788 2586265 2619050 2700748 2711885 2697644 2765173 3006055 2641352 2507103
5247 2507103 2771351 2921660 3044509 3006204 3092065 3251992 3353948 3495391 3773248 4110519
5237 4110519 4264359 4345271 4399947 4644414 4570122 4469668 4536119 4416780 4029088 3885598
5227 3885598 3739674 3492191 3297826 3184566 3242556 3055520 3011529 2926359 2638954 2703510
5217 2703510 2597259 2512914 2536124 2378794 2345462 2442249 2540975 2493284 2474478 2872834 2908469
5206 2908469 2948318 3023654 3085294 3264280 3570846 3915819 3807100 4039520 4313769 4097863
5196 4097863 3613312 3321063 3101358 2834968 2559528 2378526 2368207 2505916 2410256 2326531
5186 2326531 2254954 2136092 2120976 2108742 2232837 2375053 2097556 2039585 2032449 1808657 1769651
5175 1769651 1800073 1955564 1950410 1752564 1956401 1941232 1986333 1980731 2021026 2275310 2276422
5164 2276422 2236167 2222294 2202451 2096800 2017667 1993164 2060671 2029694 1914364 1913028 1928983
5153 1928983 1915974 1965172 1866614 1863621 1996738 1934734 1873753 1660469 1838567 1859842 1793358
5142 1793358 2013019 1959594 1946292 1711173 1876200 2084299 2058477 2032323 2030853 1960692 1973634
5131 1973634 2121647 2141051 2388980 2281852 2346596 2223954 2274630 2519874 2506784 2544224
5121 2544224 2455755 2418588 2503251 2672834 2615673 2477727 2595353 2528881 2322866 2321692 2555839
5110 2555839 2781210 2780350 2732158 2652004 2521320 2792507 2647857 2530955 2757857 2942656
5100 2942656 2633267 2508197 2560455 2485761 2824566 2963423 2690217 2774389 2817935 2889321
5090 2889321 2877463 2932513 3528437 3363827 3426106 3416820 3397338 3555991 3505826 3524942 3560988
5079 3560988 3612348 3607815 3476948 3330411 3414584 3341582 3650321 3691622 3759089 4080487 4126262
5068 4126262 4428894 4815704 5412129 5722923 6054317 6089804 5812031 5445106 5060528 4885369
5058 4885369 4524534 4497805 4379390 4171899 4146567 3825651 4085888 4042503 3940634 3936049
5048 3936049 4025783 4006008 4026891 4374525 4472287 4246597 4123761 4037014 4061753 4189036 4265184
5037 4265184 4513671 4168412 4198676 4124408 4098000 4287952 4126119 4361300 4401381 4209169
5027 4209169 4362193 4669089 4702287 4862182 4970182 5263432 5197887 5348701 5610934 5640357
5017 5640357 6060943 6297006 6550942 6797401 7072406 7893432 8671353 9415452 10206632 10035627
5007 10035627 9150555 8233604 7411929 6999682 6872654 6682107 6579039 6632851 6644007 6726284
4997 6726284 6656680 6629641 6609425 6484762 6445393 6402321 6430020 6582390 6542766 6671966 6817844
4986 6817844 6728003 6881726 6951438 7069737 7088022 7265075 7163157 7090621 7440726 7463611
4976 7463611 7525364 7449529 7416463 7504162 7608045 7544581 7577351 7796508 8172077 8094046 7838862
4965 7838862 7936147 7986599 8161745 8451830 8267053 8305164 8522181 8543655 8651807 8685286
4955 8685286 9067762 9217023 9379266 9603352 9811768 9823748 10070875 10377458 10471094 10444073
4945 10444073 10616750 10934468 11175348 11749621 12229088 12377645 12527923 12939051 13238754
4936 13238754 13680876 13989624 13886921 13995022 13748783 13698260 13489365 13812720 14380822 14782918
4926 14782918 15357579 15906203 16605164 16928391 16960693 17435520 17970484 18593512 19239256 20152153
4916 20152153 21155852 22817407 24596728 26949126 30139686 33839840 37438040 37982318
4908 37982318 34890446 30091217 25962675 22680806 20373349 19067234 18287240 17612496
4900 17612496 17127904 16855926 16712284 16484435 16444053 16173964 15883951 15918355 15937198 16127219
4890 16127219 16072378 16157493 16194731 16179857 16325257 16759246 16980678 17095660 17086111 16997292 17025367
4879 17025367 17066785 17222555 17404207 17804631 18162618 18502998 18805620 19352318 20008022 20882185
4869 20882185 21487226 21691276 21909531 22111327 22435260 22790686 22987136 23512832 23992846
4860 23992846 24193053 24362003 24451305 24556106 24642617 24782942 25422037 25806496 26381582 26783993
4850 26783993 26970166 27579193 28197620 28923216 29586400 30385500 31267138 31897751 32903417
4841 32903417 34146247 35131607 36483559 37793332 38852399 40124471 41560652 43065589
4833 43065589 44634835 46608053 48828222 51195762 54187782 57294173 60590516 64339563
4825 64339563 68463193 73101287 77604213 81710702 84177546 85364497 86111502 86605696
4817 86605696 87584434 88800891 90661120 92378254 94004853 95317523 95961404 96579295 97384662
4808 97384662 98881422 100884164 103397268 106212471 109159560 112079433 114983100 117881840
4800 117881840 121353535 125360248 130345129 137252422 145969648 155911166 163071629 163528031
4792 163528031 156591352 145553370 134780270 125767659 119695392 115742032 113061424 111198269
4784 111198269 108889937 105985925 102760131 99333051 96485334 94455931 93123104 92202854
4776 92202854 91395157 90127807 88537604 86687885 84874440 83002711 81395451 80639080
4768 80639080 80343591 79916633 78438571 75768480 70765879 65098355 59564428 54476921
4760 54476921 50263166 46568349 43820716 40965774 38273314 35920534 33959499 32262564
4752 32262564 30769960 29611849 28487103 27466340 26455034 25761235 24732392 24009647
4744 24009647 23490563 23039339 22509866 21787953 21156769 20715638 20161474 19731095 19395315
4735 19395315 18765356 18277888 17954381 17605460 17217457 16755019 16887578 16880073 16451473 16196141
4725 16196141 15953842 15724883 15525106 15367883 15135023 14707012 14428854 14258197 13962471
4716 13962471 13845917 13857817 13786210 13596171 13596991 13403907 13214710 13042653 13089294 12927759
4706 12927759 12693202 12467057 12458784 12327030 12342227 12663709 12407573 12227417 12366149 12380517
4696 12380517 12387638 12118421 12087746 12329249 12210182 12018010 12134549 12244013 12327999 12371224
4686 12371224 12461505 12720071 12752744 12841432 12898228 12679162 12836863 12905628 12862813 13001909
4676 13001909 13001898 13127687 13300734 13414709 13645783 13681593 13792063 13957081 13968462 14135864
4666 14135864 14477041 14698305 14737606 14916471 15042689 15040368 15360490 15567037 15663986 15796860
4656 15796860 15750648 15610872 15640097 15897115 15856056 15984646 16089492 16205874 16153665 16358633
4646 16358633 16633485 17052899 17491263 17783179 18020580 18240444 18535593 19024662 19285426
4637 19285426 19773067 20267639 20579121 21021233 21384592 21878800 22243822 22648820 23347546
4628 23347546 23852156 24476420 25215238 25693409 26353274 26919157 27219679 27949303 28279364
4619 28279364 29016988 29597905 30083124 30931797 31261080 31855143 32637450 33483620 34231468
4610 34231468 34796358 35385639 36313050 37188036 38308115 39341803 40824690 42457831 44047679
4601 44047679 46233487 48480416 51438171 54459690 57776999 61763629 66398150 71379670
4593 71379670 77216669 84046211 92091129 101937047 113715421 128789394 148517947 174100394
4585 174100394 205305902 236760804 263028187 282122723 290275230 284774681 265881805
4578 265881805 238890647 205729980 169996148 138464377 114236014 96887131 84633187
4571 84633187 75692892 69085622 63638228 58974958 55180028 51451330 48226997 45097193
4563 45097193 42489426 40590496 38376638 37020678 35861383 34510375 33513080 32766614
4555 32766614 32310572 31609250 30806391 30276468 29543369 28906801 28386151 28024551 27677827
4546 27677827 27305105 27039546 26950043 27014963 27072734 27328705 27437255 27853453 28034088 27890673
4536 27890673 27604992 27405622 27255942 26770973 26403989 26079770 25676767 25253390 24880479
4527 24880479 24565121 24660892 24762737 24916074 25167553 25382081 26008411 27022229 28243103
4518 28243103 29528324 30851063 32444342 34016857 35164473 36458008 37087444 37229859
4510 37229859 36836330 35581317 33938487 32030268 30225616 28768768 27311799 26395620
4502 26395620 25769454 25436148 25431229 25297512 25505106 25837309 26265569 26862471 27574695 28528154
4492 28528154 29869679 31224262 33074866 35044868 36757317 37757449 38064954 38055603 37090066
4483 37090066 35531221 33987363 32510651 30690169 29389375 28528109 28020140 27632495 27535205
4474 27535205 27645449 27655083 27497379 27218688 27237178 27387634 27599085 27748666 28123107 28263357
4464 28263357 28500245 29102656 29609249 30123927 30709485 31876862 32490706 33386919 34437887
4455 34437887 35794789 37456567 39260956 41275377 43614001 46368756 49603639 53761555
4447 53761555 58931549 65819908 74894537 86701778 100853577 114917525 126993314 136042141
4439 136042141 140347725 139214935 132920803 122809393 109550598 94856504 81044767
4432 81044767 70111318 61781087 55617697 51100813 47404140 44407186 41808236 39775027
4424 39775027 38008688 36005159 34256668 32470703 31242608 29857104 28795325 27664530
4416 27664530 26713765 25980275 25097013 24212596 22946579 22267483 21345217 20720959 19907621
4407 19907621 19349731 18955867 18402548 17921366 17400274 17019206 16819066 16700234 16427231
4398 16427231 16103815 15766724 15485625 15204850 15018829 15043844 14895853 14644441 14530716 14412552
4388 14412552 14217312 14103009 13980319 14023841 13815091 13673593 13534997 13373910 13327171 13270094
4378 13270094 13380561 13307304 13180116 13225172 13189611 13156542 12982367 13184579 13163803 13100760
4368 13100760 13003499 12763137 12745771 12702438 12768654 12803947 12975347 12912196 12866953 12636926 12587063
4357 12587063 12591143 12704565 12678831 12733315 12779099 12629367 12653390 12722367 12889745 12875470 12794065
4346 12794065 12895328 12776827 12644226 12712266 12800903 12669958 12621407 12725699 12609832 12400463
4336 12400463 12716099 12658663 12654197 12641834 12825449 13024989 13144054 13170839 13185225 13233580 13493291
4325 13493291 13585986 13593249 13743373 13718445 13892688 13845286 14104330 14066317 14389611 14670568
4315 14670568 14539902 14839718 15229706 15516145 15778572 15956304 16208998 16438295 16560585
4306 16560585 16896510 17348213 17671901 17769030 17627015 17817029 18058942 18596864 18923112 19256424
4296 19256424 19439849 19635211 19563824 19600555 19950752 19885479 19793021 19756084 19718686 19486692
4286 19486692 19278740 19309122 19403829 19472333 19695012 20096223 20386754 20554520 20688770 20964916
4276 20964916 21239945 21448292 22024855 22625832 23429493 24009522 24473919 24670083 24682866 24153793
4266 24153793 24186100 23979158 23768083 23525796 23449977 23468701 23324597 23403535 23650860 23670746
4256 23670746 23779693 24052278 24265497 24350892 24713730 25230641 25432701 25994933 26427263 26995132
4246 26995132 27650060 28391597 29105146 30107223 30955488 31406747 31694339 31820701 31902842
4237 31902842 31958731 32008608 31923671 31628926 31657748 31838336 31904426 32164365 32331208 31978433
4227 31978433 31768597 31782388 31942596 31948906 32233067 32467073 32491283 32776001 33237265 33260814
4217 33260814 33606937 34100118 34489906 34597910 34944530 35360031 36036978 36543006 37167912
4208 37167912 37820609 38448906 38814181 39024984 39360571 39591930 39744666 40059164 40416489
4199 40416489 40521649 40700199 40743167 41138768 41300939 41648058 41834016 41797102 42203719 42177362
4189 42177362 42202275 42573285 42950819 42991680 42780421 42796495 42647492 42320323 42087875 42204746
4179 42204746 42009440 42102203 42275685 42296150 42553493 42464129 42633684 42763670 42537603 41953665
4169 41953665 40833419 39658553 38573868 38111800 37959542 37537604 37235671 36972776 36801090
4160 36801090 36809806 36744069 37115923 37722824 38199133 38810238 39486538 39869204 40371831 40819764
4150 40819764 41430577 42106120 43005085 44363488 45359767 46374477 47374030 48365164 49326655
4141 49326655 50283234 51303975 52064296 52600599 52566459 52039126 51725501 51718471 51969208 52109940
4131 52109940 52798588 53443632 53636820 53728127 53757094 54210652 54197494 54913251 55781714 56756537
4121 56756537 58008584 59043165 60143638 61095801 61620506 62246554 62617139 62750539 63346223
4112 63346223 64309803 65689842 67035041 68044763 69374829 70427101 71463501 72841475
4104 72841475 74226084 76126657 78048827 80034845 81698627 82888689 84515211 85982526
4096 85982526 87624550 88857958 89939663 91489138 93233419 95483573 98403230 100826030
4088 100826030 102984206 104632616 106041712 108197471 110712687 113900552 117299645 121432168
4080 121432168 125730191 128565547 129324752 128970935 128566292 128488682 129245851 130669735 132217365
4071 132217365 134062182 136268513 138347036 139404788 138841206 137289727 135984033 135711490
4063 135711490 136145817 136654116 136075443 134492054 131987678 129392054 127021031 124462716
4055 124462716 122774659 121916561 122027626 122409281 122456106 121151612 117999146 114086054 110503038
4046 110503038 107407544 104608255 102192281 99886235 98370611 97272842 95784625 94053365
4038 94053365 91972740 90055444 88017077 86004974 84064178 81957750 79989411 78018187
4030 78018187 76084993 74356657 72832718 71199278 69268921 67473553 65806105 64532802
4022 64532802 63463878 63074496 62244501 61290571 60177218 58725489 57073278 55520265 54088998
4013 54088998 53060722 51978590 51396591 51029371 50561041 50445524 50239991 49896721 49618516
4004 49618516 49443419 49414835 49101274 48384552 47639170 46967472 46755172 46264951 46314944 46099661
3994 46099661 45356160 44426113 43834888 43234253 42396932 41601399 41103401 40548077 39763347
3985 39763347 39622925 39313502 38821074 38334662 37598396 36762716 36198542 35551563 35420455
3976 35420455 35268463 35159500 35681644 35799008 36502009 36663967 36457430 36403494 35927711 35642958
3966 35642958 35257996 35509386 35622134 35645973 35729147 35365945 35154133 35103039 35182446 35332765
3956 35332765 35554352 35703394 35634027 35613309 35637745 35703764 35856344 35998299 36134919 36226653
3946 36226653 36376694 36542872 36440601 36470513 36466181 36443019 36893102 37415898 38142346 38807522
3936 38807522 39406906 40247784 40703641 41244752 41991669 42618657 43542000 44197878 44683998
3927 44683998 45111374 45370578 45291073 45228817 44960722 45040861 45154547 45271061 45648672 45884956
3917 45884956 45876834 45162707 44143181 43204401 42206757 41412655 40910333 40559920 40091432 39746214
3907 39746214 39381559 39202127 39343494 39732302 40312695 40641793 40741752 40742585 40821432 41111468
3897 41111468 41050208 41114972 41280458 41559508 42003008 42096784 42564349 42754226 42949049 43409909
3887 43409909 43519299 43894170 44049353 44412392 45029944 45790694 46770108 47248178 47126430
3878 47126430 46899606 46552345 46101071 45889292 45316662 44722200 43980284 43081383 42413568
3869 42413568 41596789 41317779 41078365 40696882 40705604 40690817 40689799 41005005 41274220 41669200
3859 41669200 42102445 42746794 43231316 43328113 43681471 43678454 43464933 43261780 42941301 42578039
3849 42578039 42274310 41974661 41889861 41951361 42215970 42511564 42490624 42753629 42693716 42431371
3839 42431371 42272550 42065645 41722410 41948520 42339411 42500715 42770744 43079379 43240463
3830 43240463 42757563 42752007 42684388 42633450 42971673 42868843 42888948 42714200 42545556 42572715
3820 42572715 42469188 42920305 42941835 43050925 42959371 42870352 43024182 43209215 43231583 43499506
3810 43499506 43643687 43420889 43414985 43384391 43655082 43796920 43928774 44175614 44119722 44442814
3800 44442814 44692169 44965135 45285433 45583447 46150960 46205092 45984592 46277870 46177981 46267156
3790 46267156 46142234 46098621 45968332 45710503 45751948 45874058 46046129 46389531 46766019 46932391
3780 46932391 47170830 47682488 48256318 48914852 49538152 50258713 51339137 52010738 52514592
3771 52514592 52854636 53342635 53430291 53256232 52922825 52667873 52394760 51968574 52035979 52058813
3761 52058813 52044240 52231263 52027460 51683504 51030073 50507916 49704054 48620070 47300048
3752 47300048 45877799 44522920 43093359 41980068 40719733 39750345 38933393 38104142 37636759
3743 37636759 37225207 36903467 36574463 36144046 36095560 35714960 35349808 35296262 35126871 35282665
3733 35282665 35196678 35097969 34922527 34927034 35126846 34946075 34791170 34803716 34929917 34772403
3723 34772403 34441985 34217535 34288945 34069677 33823211 33875109 33763381 33700523 33415237 33349242
3713 33349242 33343429 33445175 33402090 33337386 33466151 33314768 33545099 33414297 33626792 33663868
3703 33663868 33619802 34010012 33960823 33963547 34209601 34330828 34215404 34154932 34358513 34478358
3693 34478358 34484849 34794856 34754263 34766143 34827189 35102340 35134786 35329080 35536956 35842607
3683 35842607 35701481 36003426 36378043 36454390 36908970 36986778 37420549 37944975 38137248 38461245
3673 38461245 38658664 39092371 39204729 39298713 39618288 39773755 39635841 39901246 40372578 40666825
3663 40666825 40869218 40932011 41115706 41273695 41729580 42260001 42435459 42704824 43170848 43516654
3653 43516654 43850148 44281787 44718532 45053024 45230726 45539031 45636129 45918554 46802403 47261075
3643 47261075 47586154 47971549 48406217 48811718 49212025 49925096 50671333 51098396 51651893
3634 51651893 51991805 52418887 52969153 53382778 53929708 54421582 54889765 55621889 56106162
3625 56106162 56773083 57251128 58057646 58698098 59201153 59964710 60819280 61508882 62126347
3616 62126347 62948914 63858542 64680838 65326082 66424023 67482254 68322477 69210250 70073509
3607 70073509 70829272 71745156 72701286 73646361 74273042 75069210 76048153 76935126 77754260
3598 77754260 78620340 79641272 80557162 81445499 82311707 83627323 84962724 86074937 86665032
3589 86665032 87589066 88343023 89215595 90054140 90824867 91944911 93162307 94643405 96078726
3580 96078726 97588436 99270505 101070254 102859882 104801874 106592546 108686731 110868848
3572 110868848 112920906 115170737 117283465 119525334 121587231 123762947 126106826 128074656
3564 128074656 130000466 132194910 134248612 136392076 138568217 140812410 143039481 145470247
3556 145470247 147812242 150477331 153122790 155789806 158493719 161426672 164659408 167728406
3548 167728406 171130591 174706815 178297097 182194638 186408381 190762195 195614816 200830013
3540 200830013 206826906 213100901 219751798 227020371 234963957 243499470 252746233 263099202
3532 263099202 274810071 287195449 301164273 316273591 332701742 350354542 369361313
3525 369361313 389488864 409492459 429460978 448329955 464394516 476124687 481818240
3518 481818240 479710786 469633714 452497348 430866996 407415796 384691416 364107660
3511 364107660 345602764 329682861 315701148 303245213 292101188 282158793 273212388
3504 273212388 265578678 258433886 251811945 245243249 239432304 234112785 229106357 225045105
3496 225045105 221422428 218253278 215110693 212680565 210354210 207977273 205578856 202603507
3488 202603507 199111182 194802056 190418303 186016723 181554582 177246525 172829108 168603945
3480 168603945 164351500 160169326 156242962 152542485 149198263 145997673 142773897 139993316
3472 139993316 137336186 134844052 132321579 129887742 127914805 125928458 124299989 122774465
3464 122774465 121388569 120422259 119178263 118517792 118382313 118787621 118975776 118056780 116654019
3455 116654019 114249154 110818260 107111369 103769912 100703388 98070675 96135969 94384105
3447 94384105 92835159 91322552 90158368 88953836 87645177 86353833 85170146 84152598
3439 84152598 83054421 82086443 81247211 80745074 80055748 79478238 78824628 78374070 77896138
3430 77896138 77386508 77362893 77393171 77519024 77632125 77733131 77153339 76156249 74805230 72951500
3420 72951500 71143530 69585842 68547479 67469510 66749150 65915500 65174134 64413274 63557995
3411 63557995 63119246 62678177 62116016 61515881 61119688 60633057 60042973 59278982 59043471
3402 59043471 58645650 58103789 57625984 57231875 56530617 55940367 55650102 55452164 55018756
3393 55018756 54730101 54589322 54151981 53741476 53308585 53195799 53024709 52824095 52693668
3384 52693668 52299632 52165336 51656409 51268182 51162528 50790974 50625813 50285100 50071271
3375 50071271 49789565 49554520 49414151 49005456 48968481 48938131 48721685 48458876 48175161 48151724
3365 48151724 47919143 47928351 47824911 47728404 47545124 47177109 46931534 46617345 46716656 46495949
3355 46495949 46196803 45819238 45540579 45287448 44975232 44696880 44425803 44166813 43931398
3346 43931398 43871655 43317406 43375469 43072437 42727582 42513286 42196670 42127009 41812631 41539472
3336 41539472 41159520 41179064 41012179 40673221 40363562 40229690 40121468 39885409 39718752 39793530
3326 39793530 39615874 39411884 39025597 38678154 38479766 38441505 38224263 37870087 37662197 37179567
3316 37179567 36844103 36503606 36539919 36347753 36210044 35647058 35400047 35279340 34912790 35028537
3306 35028537 34926290 34999545 34750739 34705421 34511919 34146116 34331778 34321369 34383767 34272429
3296 34272429 34311370 34090729 34077399 34331505 34580943 34639689 34689452 34869880 34755324 35009980
3286 35009980 35119263 35133363 35102448 35210958 35336224 35445554 35671862 35772528 35853751 36117137
3276 36117137 36514747 36520770 36968205 37411540 37561202 37909341 38100842 38485604 38867450 39142810
3266 39142810 39764883 39906759 40246202 40840939 41270910 41927603 42594253 43226895 43865991
3257 43865991 44658500 45470521 46061558 46333912 46685078 46831546 46733347 47033425 47082136 47377499
3247 47377499 47873876 48388715 48891198 49585297 50513802 51364696 51936034 52159514 52695067
3238 52695067 52644799 53235691 53688782 53985633 54571463 55029378 56079146 56933071 57889266
3229 57889266 58948857 60136284 61426726 63110384 64778987 66764345 68364696 69180955
3221 69180955 70176630 70916639 71970010 72909726 74004177 75663041 77363584 79673732 81972849
3212 81972849 84516950 87231265 89656145 92064280 93602703 94928107 96266069 97381776
3204 97381776 98138069 98894394 99571619 100033295 100601288 101515752 102676876 103912248 105352061
3195 105352061 106860792 108412881 110282584 112589484 115522552 118479349 122057107 125440638
3187 125440638 129301177 133501166 138213268 143516643 148920396 154980519 160963338 167050666
3179 167050666 171943495 175581549 177263888 176209806 172696053 166905257 160429473 154122693
3171 154122693 148858737 144971872 142665446 141186166 140679484 141392010 142358801 144020864
3163 144020864 145998941 148738959 151696341 155003529 158706129 162407457 165921001 169506541
3155 169506541 173156694 176460257 179357689 181142640 181664242 180473376 177752999 174457760
3147 174457760 170388990 165728771 160277581 154056089 147533684 141416566 136388756 132275600
3139 132275600 128893436 126363580 124632520 123429728 122947910 123182744 123743071 124131263 124465015
3130 124465015 124833573 124947968 124447729 123357610 121629410 119301160 116286434 112753193
3122 112753193 108559979 103816257 98602077 93455297 89040688 84918372 80979720 77319260
3114 77319260 74412487 71802502 69068137 66607050 64613470 62589853 60964800 59492351
3106 59492351 57978406 56665777 55537319 54726493 53757051 53019897 52178215 50905713 49706189
3097 49706189 48534060 47166915 45864387 44491940 43031397 41640651 40520122 39375910
3089 39375910 38048897 37239009 36655185 35808579 34964399 34158635 33460225 32662282 32084421
3080 32084421 31211075 30361772 29828914 29064569 28512943 27725742 27332899 26871130 26566810
3071 26566810 26370966 25791564 25491338 25290474 24850206 24625521 24407520 24150261 23896220
3062 23896220 23581159 23298127 22858977 22269613 21837365 21493152 21288125 20830855 20328878
3053 20328878 19912724 19424128 19193894 18620479 18376492 18097724 17740369 17427298 17059071
3044 17059071 16753764 16381868 16118161 16092349 16103518 15727346 15583041 15545648 15162718 14978268
3034 14978268 14901866 14866514 14584254 14138565 14053188 13856740 13431739 13229120 13043692 12920756
3024 12920756 12808283 12494976 12173721 11935029 11782401 11698580 11429883 11101946 10846709 10794721
3014 10794721 10651895 10364331 10164767 10095208 9958684 9597582 9470745 9399802 9361065 9250613
3004 9250613 8859351 8788426 8828826 8874676 8713841 8404184 8425025 8170580 8216159 8049642
2994 8049642 8106116 8099822 7894828 7624516 7709588 7882820 7716816 7772253 7544405 7265671
2984 7265671 7340798 7418169 7272052 7219428 7249491 7420793 7132811 7045379 6970642 6852377 6950974
2973 6950974 6764598 6668358 6751297 6738784 6632669 6621483 6724680 6652314 6319331 6259986 6310547
2962 6310547 6343504 6463415 6231051 6097455 5937420 6107238 6200661 6061258 6018169 5967693
2952 5967693 5765882 5765099 5769648 5710887 5733564 5634191 5665926 5549942 5547997 5500384 5416281 5521594
2940 5521594 5377423 5374380 5384178 5440474 5450499 5382123 5289335 5284237 5157643 5175616 5291085
2929 5291085 5212046 5283612 5337358 5188449 4975783 4993386 4929972 5086067 5033271 4929522 4878971
2918 4878971 4679721 4647433 4780625 4881759 4920593 4775515 4844388 4697347 4604226 4482171
2908 4482171 4545582 4753816 4703798 4587328 4545550 4551704 4535136 4721414 4905807 4703104 4486872
2897 4486872 4483046 4662076 4666134 4617100 4605720 4578060 4599236 4426294 4381802 4319794 4412521
2886 4412521 4366725 4305180 4187718 4102901 4223418 4138070 4260417 4350275 4514199 4583579 4247695
2875 4247695 4437932 4496784 4273099 4277729 4364144 4329186 4272240 4242781 4397936 4154508 4131921
2864 4131921 4169488 4116265 4127317 3964098 4012379 3924329 3902294 4080180 4068357 4140628 3918390
2853 3918390 3860520 3943821 3783404 3741297 3803519 3832170 3773845 3832708 3552185 3486673 3609608
2842 3609608 3988968 3862022 3537034 3498117 3514657 3312617 3268334 3352059 3541396 3418094
2832 3418094 3105111 3018796 3022989 3109050 3095072 3051279 2912615 2743393 2666598 2856734 2842865
2821 2842865 2788468 2800637 2821090 2698905 2816877 2946672 2882427 2879348 2890464 2897064 2645654
2810 2645654 2733837 2646945 2774534 2729646 2560366 2554425 2442360 2403775 2166876 2390022 2660337
2799 2660337 2502636 2492258 2541263 2359846 2220567 2254697 2644833 2433206 2438555 2514526 2390701
2788 2390701 2311406 2258660 2373746 2529426 2314403 2250438 2123523 1919743 1927414 1910935 2070958
2777 2070958 2119830 1905961 2014104 2075014 1892670 2025671 1999161 1995544 1767543 1857090 1964181
2766 1964181 1825435 1741936 1848818 1809308 1627665 1849526 1870274 1980397 1794467 1864659
2756 1864659 2024414 1771340 1844595 1947260 1903576 1910408 1622433 1738148 1766821 1464365
2746 1464365 1745311 1707213 1639459 1631506 1548091 1649840 1724394 1776921 2061381 1788311 1763315
2735 1763315 1631796 1537483 1582526 1561268 1602219 1531937 1157100 1322056 1456245 1396754 1546781
2724 1546781 1488806 1496574 1193899 1194221 1429107 1543198 1512622 1432614 1389632 1383878 1148569
2713 1148569 1316230 1601175 1502403 1398659 1386451 1400241 1344602 1216807 1573266 1600680
2703 1600680 1386287 1368965 1237812 1253103 1389235 1451919 1398431 1395937 1265363 1273094 1082007
2692 1082007 1034444 1448359 1296443 1384850 1197137 1096174 1204651 888743 1052662 1148316
2682 1148316 1189121 1082777 742012 920610 948724 1028174 1260123 1219076 1165563 1062537
2672 1062537 809229 884812 950578 1045354 1095868 917263 882455 898538 846073 862520 994148
2661 994148 922821 820568 799050 833964 806504 901294 1151593 1150456 986881 1190593 1003610
2650 1003610 930981 911577 1173759 1225891 975802 859693 680769 714295 801023 637395
2640 637395 632445 712335 597710 580702 582837 670365 714704 720607 736964 758302 725408 835768
2628 835768 863925 745768 811668 928724 798725 821679 817636 865734 772929 636048 727490
2617 727490 757329 858721 774651 647680 773157 724296 619201 538627 768958 776875 553409
2606 553409 522224 458339 540100 407990 583474 713113 506466 479630 477952 668832 654527
2595 654527 708355 801259 865958 791517 744793 855523 1005922 1123082 1117692 1212819 791500
2584 791500 914696 649785 642281 585540 549730 560865 411070 509574 402051 575217 420065
2573 420065 449302 575497 582069 592511 444477 644879 811366 571295 583690 676031 725097
2562 725097 500923 643463 633606 424587 517496 566787 638269 535255 722549 688534 577786
2551 577786 545456 378579 609730 779459 763405 656588 632988 619831 524800 582611 701310
2540 701310 558566 692349 691429 469237 219758 318816 438442 427615 540457 739321 709293
2529 709293 580538 632348 739802 625011 750480 865695 861874 819772 505818 592579 601579
2518 601579 688792 506934 583555 627382 532295 397853 392232 463153 451857 541068 563443
2507 563443 580887 525922 458062 489190 627762 570480 399326 515345 641626 621082 571742
2496 571742 682161 655375 485993 490869 643751 547966 541841 771048 714908 644474 786344
2485 786344 752039 783846 936050 861058 740892 709995 664706 621565 797589 891380 791927
2474 791927 707275 727919 509320 584123 849070 710037 640637 919497 830713 547674 580722
2463 580722 1077433 1027750 932762 976764 1010958 987376 1082640 1135694 1090085 1242696 1181173
2452 1181173 1149292 1003298 973542 1197558 1002899 991827 1026739 774454 726415 891622
2442 891622 902812 851746 837860 866371 1011992 1083286 1068724 1102028 1267543 1353252 1263443
2431 1263443 1302147 1472860 1482927 1621822 1537045 1485786 1727567 1788768 1921138 1957597 1804903
2420 1804903 1914002 1742663 1825499 1822012 1870590 1909835 1945552 2069689 1851296 1904098 2268856
2409 2268856 2345026 2556982 2464456 2529996 2629977 2391000 2624374 2863227 3024664 3141832
2399 3141832 3269031 3328573 3438948 3653578 4035657 4481430 4694162 4964559 5076524 5382098
2389 5382098 5831918 6465192 7469192 8459579 9961515 11595285 13854465 16850268 21200484
2380 21200484 27307282 32398608 31567388 25128271 19469927 14741123 11118912 9215423
2372 9215423 7771393 6709171 5984098 5349670 5021309 4526951 4389862 4547893 4319691
2363 4319691 4194725 3558740 3285761 3009326 2615501 2644830 2600472 2444023 2077387 1991115
2353 1991115 2113675 2092723 2017662 1867503 1780002 1643838 1555930 1423528 1288677 1398814
2343 1398814 1498953 1583792 1335609 1066740 1133993 1166575 1053097 1018315 1101474 1178835 1220946
2332 1220946 942733 970560 940191 1074662 879677 883005 775071 697277 815845 793715 804797
2321 804797 582090 741117 897341 838117 642172 647947 654212 609401 730931 672047 749997
2310 749997 777694 715122 618854 639466 604437 593182 630146 470140 467348 515377 715252
2299 715252 534079 367103 663253 526624 416009 490193 316266 315355 290815 406828 307061
2288 307061 371259 512660 655255 567669 612402 674230 415879 434457 288596 425099 496754
2277 496754 648031 388815 304866 296670 354464 323495 342687 575057 183006 311017 136246
2266 136246 276507 334367 359219 697455 597554 629864 306812 367777 620511 597209 453208
2255 453208 499666 500022 273274 142771 339138 438523 255409 388979 260487 -27327 188889
2244 188889 302255 432697 242264 257150 400114 276355 334774 258968 93387 335176
2234 335176 353618 290930 270654 3060 268219 155206 181608 225032 115140 141431 -101949
2223 -101949 41585 55547 254525 325951 183812 349504 115326 239881 255698 288593
2213 288593 339997 123696 325894 220029 235494 280076 160105 37229 23415 111596 151580
2202 151580 236112 195783 351056 57468 165725 201457 216131 303360 400247 496470 42614
2191 42614 11209 209707 105581 170313 340772 401263 157009 96932 147640 273130 250857
2180 250857 185819 144809 33941 -17453 70057 54123 110698 123285 56566 51682 16477 97665
2168 97665 273547 259354 202016 231130 98859 348936 353237 523721 394611 20886 24106
2157 24106 -149021 -318 -3348 78630 110050 -2530 -85199 -215286 -5265 183878 279329
2146 279329 196563 46075 32299 121210 105727 212499 361655 281593 258590 -7851 33680
2135 33680 75802 481133 585321 225193 170650 150397 254748 136551 151426 325107 311316
2124 311316 246569 240750 203523 304564 401587 284249 256423 273126 189227 154898 48901
2113 48901 267506 321722 255101 302479 134832 139486 17226 71846 143406 135806 109497 -81749
2101 -81749 6105 126137 55509 41766 207454 142075 344614 136434 129214 -115107 17127
2090 17127 178815 184258 101977 259375 367858 135119 89327 134214 313819 115483 80503
2079 80503 202632 64605 -75953 -42005 84232 30848 -20049 66689 33437 -252115 -55977
2068 -55977 63926 -110960 6352 184518 140887 38246 -7635 324376 218949 192486
2058 192486 148566 108323 222658 54744 133207 280846 35818 167436 281902 193070
2048 193070 113689 -114744 -5406 -67309 -96926 227821 130841 -211765 -38496 -11960 133045
2037 133045 53026 6427 83396 42493 64926 -3595 -50837 60450 70114 133298 47562 26837
2025 26837 -88111 14781 -44989 73596 122690 99038 106309 32666 -105908 30148 102505
2014 102505 189847 15249 -47115 102083 106272 27622 17258 -15093 118743 -10220 -77046
2003 -77046 -92673 -173511 -115799 -66068 112674 178855 21328 8488 102203 204413 127202
1992 127202 117048 49344 -123124 25453 162683 63131 110776 129267 89761 266649 99758
1981 99758 256550 130780 -93151 101433 70742 122639 82608 214353 156513 301967 155983
1970 155983 91484 66472 -44681 241500 72937 205411 77449 4964 -2804 145259 118619
1959 118619 104527 131740 -116130 -269044 -120654 166767 38230 1712 177481 22963
1949 22963 -219568 -131735 -44084 122782 -1952 94396 -152565 -263440 -136830 -127639 3652
1938 3652 28255 123363 -80061 -88015 -41768 45492 50186 180031 -18404 49865 189408 159259
1926 159259 -33823 129445 62774 -236226 -65972 168015 -115183 -132587 -105480 -60818
1916 -60818 124341 187765 131071 127622 316622 325627 106635 -20006 273292 170282 -25089
1905 -25089 115964 -145679 -288655 -221970 47041 -10085 -118031 -50849 -136290 -99792 2262
1894 2262 8878 31550 132475 40725 47450 -38055 -25951 27994 21583 118814 -119582 -89757
1882 -89757 -78829 -77063 94475 -19839 115322 121817 78433 19699 214443 146122 152022 365774
1870 365774 347800 232025 3607 107778 58973 -61112 101962 -1628 -24453 -95444
1860 -95444 64925 30279 -38373 -30647 -1094 283661 208354 27641 -9443 114634 21070
1849 21070 255909 288391 206355 63007 -55333 113126 3711 -52621 148316 230441 259918
1838 259918 130207 -35553 -170704 -116302 81936 137432 -40792 -140966 -21901 47042
1828 47042 6268 -42452 136410 167689 67748 -191175 -117520 -147589 -176304 11918 5652
1817 5652 -77297 -183863 800 6531 17925 132547 8605 31880 -90152 217126 142823
1806 142823 142807 55336 9105 36156 -142778 313 -145208 -118083 -106282 36000 -17028
1795 -17028 -304192 -117637 120334 124564 -84264 -34471 -100146 -135750 6033 118174 102121
1784 102121 182341 106909 130937 5500 63884 128157 219745 93475 43845 90695 -45597
1773 -45597 201302 191158 127836 -4459 -87728 -83135 -61642 -16481 -31652 -9728 16069 12649
1761 12649 -38919 -136558 101030 167402 248564 221855 221343 176888 154517 225262 163493 168366
1749 168366 -28369 -2397 71759 -48503 -73210 -246633 -322237 -164557 88073 340575
1739 340575 263831 -3714 -44059 60280 99759 100778 166097 201416 51151 -82891 -6066
1728 -6066 -110965 -18553 55428 104098 -29926 -90627 -44610 -29755 118245 -80161 94682
1717 94682 -39256 -80999 174670 200266 235593 -4668 68902 153033 74684 109469 350612
1706 350612 205932 56733 -27782 -255106 -136508 117948 308869 109170 -90859 -122268
1696 -122268 -293905 -85792 204786 281739 200570 32155 -60948 2020 167816 73196 100036
1685 100036 204583 10501 70182 33663 -155221 -209254 40743 4556 -248222 -190326 84579
1674 84579 43976 -101784 23188 -67467 31758 92843 170083 178379 -63267 148120 73980
1663 73980 244497 104442 9321 38712 161921 -59391 -233298 -133393 -200127 61880 68949
1652 68949 -9083 -192774 -125164 -132588 -41572 -12404 -220173 -64798 -24686 32503 203904
1641 203904 -14896 103716 73453 202452 285229 114999 169825 41899 29548 -64599 -271589
1630 -271589 -35896 61018 103456 74939 8203 108724 -225445 -266966 174286 301338 86263
1619 86263 -146970 93124 90481 -67801 22920 180698 10595 -36486 -39728 -33486 -206531
1608 -206531 -12367 13907 -40148 -53371 -61399 128615 1622 38280 185934 188981 238427
1597 238427 176134 236208 204076 65267 145785 308475 362097 123344 138462 -71446 -18438
1586 -18438 214935 320189 181508 -259383 -44330 26954 -66584 -137752 32847 190915
1576 190915 138805 51944 -307369 -137283 10448 195695 62373 150274 93122 -51161
1566 -51161 119042 207024 165303 188688 292758 384542 96678 -139560 -25326 -185873 10231
1555 10231 -41322 -69968 -94782 -264389 -339642 -31791 -17747 -48340 23851 100825 -15391
1544 -15391 -137788 -189425 61268 196621 280767 322162 55639 -15239 -53142 -46025 62916
1533 62916 351137 204841 84062 -95714 -235697 53460 37953 105829 204557 92500
1523 92500 222170 -89074 7558 188141 220125 190763 -19188 -115300 -232700 -2888 -16716
1512 -16716 13153 21666 -178241 -143828 -353254 -179656 -131293 19583 202635 65663 62800
1501 62800 298253 191994 237201 247051 333025 259501 3048 -9911 -88892 -55107 98544
1490 98544 -67001 -167037 -191053 -351983 -168961 -75498 25615 103474 217043 139369 49496
1479 49496 56764 340746 188244 8722 310625 111230 80765 -3563 3011 71404 13380
1468 13380 23954 -33107 11443 -116265 -84181 -55599 88046 127706 -93891 130076 173443
1457 173443 142937 46685 -24875 59160 82694 247836 -44605 24477 210293 -59162 -136781
1446 -136781 166260 134919 41603 -38579 -170192 -157901 -106580 138731 76804 -26210 -30724
1435 -30724 -126492 -43114 44562 -20599 -198947 -4317 80431 -49848 -74308 81887 126373
1424 126373 111114 244124 197100 147079 149481 97424 81990 3450 -79924 -78891 104355 177535
1412 177535 -64506 -36021 13747 -59436 -57372 11125 23731 116265 -94386 -73208 -194665
1401 -194665 -13658 161775 78110 17294 -24391 -30962 56539 74638 191246 95277 12217
1390 12217 134653 7672 -41679 127460 143643 89913 -17605 -174585 1927 177563
1380 177563 265182 34946 -114804 -104594 -95522 -80958 161513 71778 -104266 74510 3589
1369 3589 -214917 -24282 39814 121940 102690 128250 40290 151018 213346 397284 49914
1358 49914 138882 86193 -13956 48876 -12181 45709 -37626 -114729 112035 49173 -33283
1347 -33283 -19531 -42194 103050 122436 226500 154802 55236 199717 237315 369618 233918
1336 233918 144308 353816 76071 41402 -139550 17658 -8061 44899 -24579 -178655 -102141
1325 -102141 -143163 139313 223667 140717 167810 207890 289831 -12325 -5367 126509 292665
1314 292665 112116 -36335 46650 19659 -181392 -4166 -201211 -115819 -210 2170 -49366
1303 -49366 -145047 -69804 10110 107772 275501 206401 150639 240310 -48098 60273 28169
1292 28169 46761 9868 133213 72579 -214563 -25251 -119431 -43716 118694 369418 102804
1281 102804 -210118 -48469 123357 148526 13626 -6195 -43206 -1917 74064 190555 71701
1270 71701 -53941 17127 -74468 -12033 40142 102235 255328 -58321 41166 50082 -94341
1259 -94341 34941 220914 128867 -99605 -198555 -96755 -72238 -15190 -109996 75235 84894
1248 84894 75486 -99620 -170523 13906 -53090 394281 365503 126529 -10947 13222 134333
1237 134333 -6235 148885 289100 51417 50659 65240 -226875 -46666 -16260 102401 -5583
1226 -5583 -125626 127497 23779 42451 215780 26728 180052 118983 127105 -1888 -129511
1215 -129511 144103 -38800 11091 27874 153301 197197 129951 -71083 -55553 141234 109581
1204 109581 202554 191373 149281 135547 16359 4933 -42128 36390 327575 294650 -54536
1193 -54536 -87957 -4510 -13778 -45948 5137 62955 -284073 -108288 -96239 -148836 -21120
1182 -21120 -41349 126445 21350 83027 51466 169958 301867 171685 11255 68268 201184
1171 201184 221820 259974 230801 69563 -74441 -16257 -24496 -71685 51570 13695 -10689
1160 -10689 -153358 -98489 -229038 -286551 -74135 -29461 86888 -261408 -300219 -161725 -6878
1149 -6878 174528 197675 55035 -169948 276300 59457 -62933 -47246 89667 232858
1139 232858 29306 212756 17513 92521 168038 100100 9336 -35147 181220 112633 180238
1128 180238 177780 121620 -41247 -61125 -3738 24039 110618 -22556 -51001 -209907 -317874
1117 -317874 -259912 -112011 95799 -61533 -211525 -166002 -121474 -113789 129020 289174 152158
1106 152158 68032 -3827 187156 209887 248223 239417 324716 265303 158008 203152 113581
1095 113581 56834 -29756 158008 3391 -174813 -59676 -180324 -116985 -122819 52651 -116103
1084 -116103 -233154 -162724 -3297 16303 -228750 -46438 29996 19040 -153024 -2133
1074 -2133 128531 44340 96905 221384 362536 78195 180790 209014 77317 -16991 92743
1063 92743 264540 97032 -215593 -159066 -17613 21792 16720 -1505 -199714 -188180 -105711
1052 -105711 -55683 -43823 -68298 102460 131 249313 186210 39880 20163 -104643 74520
1041 74520 169243 244673 58105 165236 41393 -162155 -49008 253112 174054 -199857
1031 -199857 154179 243759 -63475 -11016 125284 158925 258489 189073 54421 -303145 -191712
1020 -191712 24565 58045 -44007 36561 -85977 38795 -53500 -167657 88607 192368
1010 192368 -910 16120 55814 28557 50832 229816 158796 -77436 174739 49532 -111664
999 -111664 -81168 80142 -138957 -81873 47454 -13599 -162060 -353977 -291877 -141909 148842
988 148842 87494 -2001 -106508 -4350 12708 218269 70161 120750 142560 24566 -31344
977 -31344 -37173 13269 44562 93348 49052 125908 -142239 117738 74646 108369 97135 141832
965 141832 105161 99700 20999 35732 183412 32418 160478 -86760 -55606 -37286 -124940
954 -124940 -20266 -37382 -136219 -132043 43259 341435 156772 -11278 114219 -187588 -139425
943 -139425 48756 235653 91136 42934 125762 -72884 38966 119473 105975 24739 -42413
932 -42413 -91795 -51168 -24599 -117653 -67996 109963 217305 192048 154490 14960 -60484
921 -60484 -119297 -185527 -215325 82978 143500 160278 50253 14202 3778 -45171 271084
910 271084 177904 171321 -1510 -70082 -121138 -45725 -13877 -24283 98027 -208063 -84826
899 -84826 -316643 -311079 -279832 -353922 -85650 -240339 -181467 -41068 -115255 -46094 -125135
888 -125135 -50258 16972 -78151 99105 28215 95382 159397 -31649 -38344 33285 -8239 -4759
876 -4759 8822 2616 -40621 -260929 -247813 -230779 36760 136795 182464 -6219 18315 73445
864 73445 25546 164822 273282 236200 39992 108443 -20578 40851 215694 88567 48206
853 48206 -103726 -102657 -182208 -198075 -109005 -232598 -108970 -39974 -178269 -204505 -73234
842 -73234 -106144 -26251 -101915 72238 70325 -173003 12990 -48903 1881 273766 -27101
831 -27101 -130601 -82590 -52010 5455 -131264 15502 165731 -29783 -8792 -197869 -44874
820 -44874 -8275 -102556 -104437 19480 -149644 -23920 18277 -203113 -22518 -174043 48204
809 48204 -24531 -205152 51200 -109078 -56131 125937 112192 223824 27365 133617 44703
798 44703 -190676 -34866 -63030 -148310 -130532 65486 -207916 -333612 -186654 -160349 -243766
787 -243766 -4046 99983 -83294 -182707 -125405 19059 57134 260217 94405 186 33781
776 33781 -9115 5615 102206 -2868 30657 -272741 -306193 -339359 -205801 57883 -10929
765 -10929 -111737 -78636 -254613 -287836 -73535 22976 170735 -42755 -27568 -169101 -7071
754 -7071 162577 226375 134838 5866 80217 -11409 18408 50820 88667 -5473 -256224 -131627
742 -131627 -66616 -156461 76671 172887 13278 -127976 14013 -179138 36051 166725
732 166725 74662 -6010 -209524 -26187 -101836 -59667 9194 -54208 20133 -137500 -330987
721 -330987 -231685 -213172 -20776 44162 -14496 -65599 -136765 45576 -70489 -217926 -192205
710 -192205 -18132 -98109 58501 15845 -203180 -182826 -235068 -223382 -252376 -140557 106971
699 106971 -106645 -177947 -137433 -314634 83649 -27224 -57021 -89981 -166000 -124380 -15356
688 -15356 193199 265243 84012 111286 110217 -227467 -56704 66471 185174 62114 64625
677 64625 -26862 -174431 -46358 1598 118806 97578 -62969 -279045 -152540 -85456 -117388
666 -117388 52252 30552 -112297 -215390 -59818 100091 90554 96666 135894 -95611 -182224
655 -182224 18623 -88180 2072 18218 -55986 -122723 -312507 39569 -54782 99161 74190
644 74190 50895 137080 -249306 -145424 -140723 17152 150706 86333 49653 -288803 -416021
633 -416021 -134974 -138189 -125177 -34989 -90665 -23683 -244125 -112694 203206 45186 18483
622 18483 -86573 47711 -106470 -140737 7163 -67426 -63752 -3276 19229 -38974 141441
611 141441 185814 70941 -86549 -79810 -90225 -222718 -158710 -92407 -105212 -227316 -296851
600 -296851 -196999 -69093 65453 -19028 -212303 -114201 -109908 -61763 -102835 114321 122086
589 122086 -5776 -125982 -98800 27963 126661 222040 72866 -10359 -113969 -65593 114295
578 114295 -27511 130490 -161577 -124993 -107596 -378354 -79682 -1333 -86901 29074 -40707
567 -40707 -215668 -220447 -238267 -85116 -180643 -40828 -97610 -154470 -105860 -1643 126833
556 126833 121812 51388 83339 -104322 -43796 68310 -8638 -41183 -76869 -176667 -55188
545 -55188 -141180 -96092 -136591 -241340 -68335 -45936 -64799 -9168 -217384 -74232 -121153
534 -121153 83054 176302 2537 -44022 -77691 -4775 -46131 -23994 -40877 44860 -18086
523 -18086 -76284 -136114 -125610 -148741 -187502 114256 -98721 -395265 -76673 -166361 -166629 70996
511 70996 37416 -79353 -118180 -163096 -39708 -174049 178666 165182 -81541 -208890 -179951
500 -179951 -150110 -24076 -37936 34628 21388 -154837 -173262 -194879 -56032 -54531 56088
489 56088 108230 -71748 -122686 -190700 -43047 13387 3125 -32706 -217917 -135232 48268
478 48268 23937 -160290 -144302 -159001 -61052 4483 -199720 -112236 -56701 -115937 32132
467 32132 -92091 -86078 -12296 52846 -3671 -35248 -140885 19760 -8397 -119929 40434
456 40434 59335 -142982 -258953 -185353 -160917 -86518 -168325 -277811 -228401 -314825 -23971
445 -23971 -25966 -9469 43152 -15143 -13400 -73577 22231 101038 194397 65839 -14359 92219
433 92219 49906 -219173 -17026 86055 31005 -79548 -123657 -186901 -168924 7021 36864
422 36864 -44009 -135278 -162825 -236623 -237315 -200773 -74127 -175008 -153850 -211736 -164700 115610
410 115610 104568 24922 -88833 54480 22243 17496 104570 90601 -150183 -16955 45053
399 45053 -20610 20934 -127234 -129233 -2370 -2352 -128302 -122285 -151011 14426 -149608 -194097
387 -194097 194331 -67406 -118644 -49207 -320784 -33916 -46760 2346 35585 11175 104118
376 104118 -111508 -90441 -15542 142680 439505 434654 196530 -106654 -49108 120144 170924
365 170924 154226 47287 -158361 -113005 -187190 -146281 -41814 -23020 -12857 -233660 -136284
354 -136284 -233354 174152 114184 -103665 115957 18668 -169926 -125495 164659 2456 -207826
343 -207826 -109508 -115439 -312519 -169624 -9322 -218124 -77372 177997 69129 44173 125045
332 125045 69622 -58551 -163057 -107752 126762 202748 28682 -206140 -216321 46836 -191359
321 -191359 -185430 196896 230406 -104652 -184916 -89682 -117096 32515 120630 113903 -218609
310 -218609 -130055 -90798 -163030 26258 154905 48148 -26658 -150930 -1275 114215 17222
299 17222 72744 -55060 -86615 -174266 -285046 -129538 3788 -141788 -182856 -166515 52211
288 52211 188612 193913 135115 1746 74985 164753 29865 -19682 153885 177036 21974
277 21974 -95724 -120504 -166917 -247288 -278301 -126434 -294398 -244897 -53730 -65847 -85011
266 -85011 -82312 49164 51280 17066 184716 194189 -12390 54768 242191 110699 -8998
255 -8998 -44536 92136 65192 -125409 -153800 -186243 -122523 11571 101246 -79019 -33124
244 -33124 -167502 -120055 -135801 -146572 -128515 71798 78164 -219342 -124571 -33572 60258 -18542
232 -18542 47187 80461 -135593 45997 -28244 -40868 137647 47011 90783 -159683 129775
221 129775 226532 -61614 111000 109431 -308755 -150089 85061 -59031 -69170 -129437 29677
210 29677 -180810 -288445 -309103 -201122 28712 124830 -60084 -59692 -58381 -285611 -26996
199 -26996 185310 207874 125892 273486 125198 -88378 -177564 1298 105593 263702 128375
188 128375 -232195 -339409 -239861 -160165 -58845 -190848 -134363 -31250 -177348 -159877 -205974
177 -205974 142884 192371 82363 22856 87084 -18397 188468 111987 32674 96736 92892
166 92892 -68158 -147137 53932 -131598 -76033 -274744 -209531 -223553 -140375 76416 -138430
155 -138430 -170306 -188048 -76309 -140231 -49036 -70500 -3373 138710 -85133 3001 48763
144 48763 20935 146712 39444 66183 8777 -44467 -18578 -18163 -160697 -180690 -114682 -24829
132 -24829 -86100 -238466 18764 -190985 -128570 -55589 -121 -49598 -6770 126420 -156435
121 -156435 -193772 -41427 91237 18488 -118762 -195812 -184607 -130127 -66638 14988 -9123
110 -9123 74135 26954 48918 114661 -109496 61869 152278 29205 -85202 -180328 -155555
99 -155555 -301486 -145459 -28886 -14626 -116006 -179980 -207434 30261 26543 81808 -19102
88 -19102 -61952 84829 -2264 -1775 -18145 103296 142016 185320 -45221 -153634 -35573 -82289
76 -82289 -40158 6238 1926 8254 -33788 -28021 -127451 -57276 38578 76322 -39401 -101613 -174677
63 -174677 -62910 -192383 -43430 31051 -40242 -68086 -67756 91030 -103 -97133 -3461 -91187
51 -91187 -98834 19426 -110410 -22181 36129 -122298 -238895 -229643 65347 8440 -190948
40 -190948 -119297 -136852 -60687 -82421 18838 -13868 32200 21347 -154558 -46500 57885
29 57885 18455 68573 4527 23838 -58586 -2514 51473 1281 160462 136532 -146004 -185026
17 -185026 7198 -21614 -11597 -38139 -11852 -106332 -170266 -48166 -61401 50551 -37943
6 -37943 -107910 -125716 -120793 -121352 -118018 -50631
0 -50631
$$ Imaginary data points
##PAGE= N=2
##DATA TABLE= (X++(I..I)), XYDATA
16383 -3146348 -3230331 -3124189 -3051516 -3052997 -2924040 -2972272 -2873272 -2754235 -2825536 -2792986 -2732337
16372 -2732337 -2747363 -2588374 -2584531 -2607495 -2517407 -2427892 -2293057 -2424166 -2403958 -2180104 -2108523
16361 -2108523 -2143604 -2243809 -2194857 -2059730 -2013916 -1873282 -1855885 -1816688 -1763287 -1935659
16351 -1935659 -1767566 -1660687 -1538833 -1599084 -1451485 -1429315 -1560362 -1504574 -1442064 -1429434
16341 -1429434 -1249398 -1212933 -1231387 -1152905 -1112419 -1075094 -1141462 -1047886 -1119517 -989506 -858669
16330 -858669 -749332 -769174 -751591 -654296 -792685 -550674 -455207 -488175 -417415 -306103 -366747
16319 -366747 -515210 -371853 -63643 -84290 -48367 -58363 -132694 -80291 -99262 25363 -47132
16308 -47132 26314 30992 73914 73562 174707 191778 209569 374970 404710 432480 510463 672005
16296 672005 667699 704641 533476 571321 835563 793459 845950 602999 770698 824941 676987
16285 676987 835275 791687 900042 865739 991275 1014006 911345 1202985 1240850 1214581
16275 1214581 1173468 1323193 1443600 1323998 1553335 1325625 1323993 1480817 1489822 1686538
16265 1686538 1534219 1648835 1688845 1526943 1572366 1657448 1830844 1901361 1796489 1899734
16255 1899734 1776817 1701089 1807367 1925929 2182185 1917110 1898803 2057852 1902250 1968868
16245 1968868 2025410 2299843 2193988 2144461 2395688 2355668 2257072 2287463 2523136 2473035
16235 2473035 2253171 2479906 2344176 2204091 2398417 2331749 2460834 2389672 2513541 2567871
16225 2567871 2404271 2553053 2558839 2705425 2624186 2468247 2596066 2736303 2672057 2598384
16215 2598384 2706834 2638448 2563386 2738592 2869266 2777985 2800060 3010946 2908328 2839501
16205 2839501 3014107 3123579 3042023 3049204 2924432 2936732 3111993 3089931 3306325 3236692
16195 3236692 3188648 3073709 3200837 3294421 3122129 3233544 3328848 3073094 3122847 3207620
16185 3207620 3307991 3236751 3412948 3409453 3137440 3045613 3107035 3438861 3509066 3482905 3350243
16174 3350243 3415345 3445084 3459497 3758529 3648051 3538647 3332033 3390731 3414577 3388507
16164 3388507 3399919 3523381 3408206 3395194 3517024 3444863 3546314 3668104 3768279 3733061
16154 3733061 3727704 3532931 3715334 3750975 3932878 3728159 3685321 3551236 3431792 3507198
16144 3507198 3534341 3413218 3465942 3597773 3776524 3638327 3569451 3797244 3865749 3911134
16134 3911134 3806694 3972088 3961887 3822767 3863252 3691255 3789228 3847624 3999510 3980302
16124 3980302 3726750 3677188 3691320 3844179 3915669 3996536 3980174 3914023 3729810 3824100 3892776
16113 3892776 3846067 3963871 4024851 3894176 3829624 3797084 3920620 3920913 4052194 3914574 3992878
16102 3992878 3852364 3985842 3990915 3885301 3959140 3905478 4051546 3786040 3779075 3903316
16092 3903316 3996162 3964281 3929848 4126614 3968544 3826741 3899107 4003291 3999037 4057471 4058533
16081 4058533 4037555 3816041 3924934 4012022 3934004 4054596 4074733 4091193 3944577 3897827
16071 3897827 3872014 4119339 4261555 4160004 4144181 4091335 3961293 4035499 3914176 3972572
16061 3972572 3984704 4114685 3984948 3783655 3901074 3939021 4043392 3936079 4047219 4052242
16051 4052242 3939570 3921136 3865123 3964554 3968226 4103614 4231326 4291184 4174521 4072904
16041 4072904 4113996 4174551 4276749 4218612 4089810 4026756 3886172 3955966 3963628 4027998 4004228
16030 4004228 3806748 3909675 3828562 3964204 4054461 4036294 3906556 4043775 4207852 4046801
16020 4046801 4132901 4179808 4303356 4204256 4091362 4051345 4128302 4199784 4326688 4111322
16010 4111322 4002169 3837573 3919771 4030340 3945846 4087418 4142605 4051971 3853372 3825681
16000 3825681 3938814 4082897 4108109 4260737 4079690 4014299 4260037 4264120 4270243 4126468
15990 4126468 3984909 3972760 3813721 3938014 4127871 4040001 4144901 3991621 4105227 4230122
15980 4230122 4030794 4338516 4265954 4026427 3921038 3940066 4270771 4171891 4027656 4236357
15970 4236357 4117701 4128336 4008575 3849570 3959612 4081763 3967021 4014996 3934153 3849188
15960 3849188 4101887 4185698 4083287 4085904 4109003 4219920 3931552 3992322 4196470 4063435
15950 4063435 4102564 4086095 4130205 3886271 3992668 4338269 4249012 4142158 4018616 4040322
15940 4040322 4091527 4063481 4232632 4268842 4142280 4265593 4166560 4303964 4244312 4072890
15930 4072890 4126970 4123197 4023754 4021984 4124954 4015599 4007828 3972464 4129622 3882640 3787334
15919 3787334 3972434 3985202 4104052 3970304 4068416 4065819 4002603 4055155 4074746 4020427 4071413
15908 4071413 4171888 4003792 4149930 4035778 4012188 4074504 4105626 4276673 4040808 3885016
15898 3885016 3993436 4072871 4251716 4243941 4131112 4256679 4353067 4197290 4045202 4188037
15888 4188037 4224796 4229451 4031580 4021340 4129921 4028960 4148986 4080466 4014174 4046124 3920301
15877 3920301 3753240 3872794 3909242 4163546 4107486 4105363 4373375 4287200 4389501 4303701
15867 4303701 4206450 4348282 4355732 4422779 4416247 4322578 4363790 4268322 4219402 4223826 4085400
15856 4085400 4096019 4170486 3975204 3893991 3820036 3903199 4146462 4078503 4240993 4076423
15846 4076423 4038256 4212877 4108131 4073460 4081732 4146542 4134647 3976635 4108800 4097102 4016377
15835 4016377 4169434 4122950 4023047 4187099 4139129 3938444 4124648 4193284 4251872 4158026
15825 4158026 4009867 4185477 4149657 4256602 4242946 4081503 4290279 4210396 4013754 4153067
15815 4153067 4126182 4239914 4184867 4332540 4329270 4151943 4077716 3970875 4262821 4247847
15805 4247847 4093936 4147495 4201671 4109685 4084329 4026890 4351222 4365346 4108464 4095339 4077612
15794 4077612 4250236 4191787 4083863 4293130 4337065 4082990 3929413 3974117 4125045 4106817
15784 4106817 4167989 4131286 4109069 4039518 4091956 3947421 3917964 4271752 4221063 4062081 4025342
15773 4025342 3908157 3974517 4028768 4181804 4241183 4006683 4265037 3997205 4083168 4101444
15763 4101444 4047454 4343134 4247493 4352729 4261795 4218271 4318656 3989983 4157737 4372332
15753 4372332 4245129 4088220 4300319 4273072 4297795 4196176 4254270 4300373 4241336 4238620 4167522
15742 4167522 4160084 4122128 4179914 4186928 4185395 4056690 4013658 4047363 3908327 4079490 4078709 4160274
15730 4160274 4160166 4135073 4069624 4104039 4398748 4563029 4523075 4384085 4257741 4243310 4205477
15719 4205477 4075255 4183157 4239116 4176018 3904376 3856801 3760168 3862147 3841928 4058897
15709 4058897 4085298 4007470 4027348 3939404 3863935 3923061 4103317 4174270 4362997 4259820 4162005
15698 4162005 4263565 4108266 4161417 4311644 4382617 4316282 4369437 4218405 4125162 4094786
15688 4094786 4096497 4196372 4045943 4112230 4316087 4119996 4186313 4252795 4158942 4205236 4238106
15677 4238106 4250496 4339615 4363449 4212490 4025982 4013957 4199850 4266756 4209607 4260370 4267039
15666 4267039 4209950 4016884 3987802 4116660 4242741 4326142 4120315 3997229 4096191 4142923
15656 4142923 4340195 4330755 4184245 4216007 4114906 4262554 4296794 4029733 4181262 4224075
15646 4224075 4147462 4125027 4143711 4188650 4016735 3918787 3957399 4048147 4048047 4131694 4101627
15635 4101627 4308842 4225763 4049628 4167192 4163832 4106857 4081233 4329239 4278163 4213424 4201629
15624 4201629 4174833 4347411 4306517 4344652 4403170 4248117 4235313 4098065 4226967 4280279
15614 4280279 4410666 4373382 4134299 4197287 4273234 4304098 4253020 4375739 4218091 4204097
15604 4204097 4163246 4272700 4387494 4181950 4080216 4096169 4181816 4001694 3983033 4088685
15594 4088685 4192552 4184276 4042141 4234994 4104560 4282880 4414863 4204876 4264024 4278886
15584 4278886 4186439 4207547 4165105 4443660 4466113 4256248 4110855 4039135 4124500 4096708 4016434
15573 4016434 4132954 4134792 4039132 4092726 4277123 4213146 4255118 4330495 4019744 4135141 4511107
15562 4511107 4370993 4455552 4244149 4263222 4242200 4172399 4259377 4174712 4230041 4210002 4012149
15551 4012149 3867034 4167934 4148025 4175322 4288537 4233125 4194483 4019776 4112098 4436542
15541 4436542 4627181 4479703 4260009 4259983 4306760 4418051 4531184 4361096 4184795 4200281
15531 4200281 4147854 4125964 3879480 4243974 4263043 4236509 4071894 4068795 4339580 4241443 4203750
15520 4203750 4276635 4318696 4123541 4140093 4193266 4222193 4411711 4217388 4338313 4105202
15510 4105202 4129609 4309869 4139298 4327480 4484545 4227821 4301476 4137239 4188650 4335271
15500 4335271 4144971 4450612 4219879 4400974 4509065 4261188 3965239 3972893 4271162 4329201
15490 4329201 4404374 4531849 4447888 4163564 4108684 4252603 4428570 4504241 4512124 4405826
15480 4405826 4251100 4263083 4260390 4298552 4529728 4336399 4263007 4069647 3884008 4124973
15470 4124973 4042473 4197684 4178946 4312756 4288707 4169332 4118852 4378942 4459536 4308624
15460 4308624 4304548 4200842 4274874 4038030 4104354 4281038 4247827 4399005 4325637 4064107
15450 4064107 4029044 4303833 4294184 4385853 4280945 4247358 4305844 4020312 4459032 4261830
15440 4261830 4355047 4374603 4181501 4422117 4144165 4168123 4187522 4189021 4436903 4252034
15430 4252034 4302091 4242953 4360985 4527074 4525788 4357872 4500414 4509377 4392704 4408858 4452671
15419 4452671 4674375 4270442 4320920 4314667 4138340 4370230 4457621 4399132 4230356 4217616
15409 4217616 4275410 4145644 4179588 4357284 4417948 4325594 4464278 4272877 4347068 4283022
15399 4283022 4301397 4430413 4591768 4538614 4275271 4172125 4178980 4236141 4370157 4454619
15389 4454619 4192777 4327668 4218807 4156771 4232121 4067569 4279332 3977045 4116308 4372264
15379 4372264 4155130 4387554 4443383 4414566 4435593 4169181 4365588 4651922 4532307 4540529
15369 4540529 4463344 4324981 4389376 4390056 4422116 4483319 4266210 4392990 4280447 4161279 4068217
15358 4068217 4230501 4470401 4478533 4280064 4116612 4126373 4263140 4438760 4282186 4224741
15348 4224741 4161045 4030673 4153167 4280919 4338917 4380026 4305326 4313180 4267392 4288905 4385026
15337 4385026 4377351 4366503 4558595 4349305 4349470 4417042 4531202 4520628 4489668 4364074 4463094
15326 4463094 4521046 4312039 4398556 4421891 4376026 4463145 4142730 4138248 4268663 4167532 4403661
15315 4403661 4158630 4244448 4348234 4251908 4301664 4389394 4544605 4399949 4419448 4328271
15305 4328271 4366358 4438578 4426282 4528200 4380869 4432940 4488716 4463587 4275678 4382218
15295 4382218 4387082 4506595 4473768 4415170 4438232 4452329 4436424 4495411 4444387 4294034 4200959
15284 4200959 4244777 4430142 4459547 4295800 4172780 4070769 4352575 4483347 4386586 4319255
15274 4319255 4382263 4250166 4151155 4194851 4317473 4428458 4454805 4405092 4186568 4150066
15264 4150066 4272729 4228190 4440288 4487157 4354705 4274650 4241279 4374681 4430474 4517017
15254 4517017 4670285 4490687 4336503 4275416 4102934 4209290 4403642 4624763 4386848 4416420
15244 4416420 4229145 4205241 4314079 4387947 4467837 4287898 4370578 4318527 4253474 4115936
15234 4115936 4145153 4410248 4568210 4348001 4310021 4338157 4129360 4044419 4197655 4511972
15224 4511972 4314811 4542637 4541898 4625258 4627043 4468219 4437378 4334391 4400918 4434584 4260044
15213 4260044 4259258 4259739 4329290 4295151 4070121 4177874 4347656 4371031 4214394 4416137 4318583
15202 4318583 4254740 4357833 4492932 4660800 4602865 4523852 4443061 4289449 4225583 4341570
15192 4341570 4202157 4305892 4380951 4430109 4408206 4153107 4372067 4343340 4480305 4437396
15182 4437396 4312728 4613717 4435642 4590787 4495969 4658857 4604651 4431175 4505991 4450139
15172 4450139 4504641 4442716 4552805 4329755 4382028 4460528 4456130 4341518 4303263 4318361 4190169
15161 4190169 4254322 4254152 4615492 4329651 4444716 4453805 4592809 4662977 4384167 4490621 4572351
15150 4572351 4659856 4493233 4441257 4569148 4523858 4498185 4382561 4525415 4521663 4399844
15140 4399844 4253191 4186950 4196995 4226641 4404028 4287973 4337967 4404349 4570411 4545678
15130 4545678 4418324 4554032 4429044 4458528 4624142 4509535 4538245 4430328 4587031 4437349
15120 4437349 4626093 4589344 4535379 4478010 4421419 4378863 4268205 4346556 4247914 4209621 4309642
15109 4309642 4473701 4390667 4358514 4378000 4409621 4487183 4433897 4445501 4163825 4345748 4271037
15098 4271037 4277397 4579373 4494215 4415394 4424363 4408677 4461197 4324344 4309699 4415241 4480289
15087 4480289 4575947 4647700 4449344 4436158 4461497 4254552 4505849 4568152 4524511 4470256 4233360
15076 4233360 4360484 4219576 4269235 4503001 4516582 4668368 4477321 4351385 4525671 4301804
15066 4301804 4408990 4710355 4565249 4513805 4367924 4415175 4452638 4378412 4467444 4463305 4473765
15055 4473765 4363940 4344669 4383383 4522467 4379667 4336774 4559299 4726837 4689324 4534256
15045 4534256 4609998 4483419 4635447 4550316 4600463 4617663 4493093 4581457 4415817 4404663
15035 4404663 4408642 4428024 4554940 4505048 4502762 4388119 4326272 4556822 4577638 4454487 4584090
15024 4584090 4483907 4502699 4385312 4465491 4554504 4452447 4197646 4322765 4241636 4337187
15014 4337187 4420383 4331230 4299522 4211855 4372781 4567866 4773018 4818821 4775032 4669096
15004 4669096 4577912 4527851 4504447 4699271 4624725 4493104 4473946 4313219 4158661 4423085
14994 4423085 4481050 4574547 4419042 4369987 4336822 4290160 4479998 4627940 4593706 4485032
14984 4485032 4683222 4811058 4618297 4577845 4677684 4605687 4492068 4347840 4596890 4588720
14974 4588720 4560131 4493600 4489941 4708688 4492677 4526053 4659293 4587258 4613214 4444582 4442369
14963 4442369 4629937 4563721 4525044 4618290 4357209 4423421 4330582 4472862 4602884 4589344
14953 4589344 4668245 4410932 4463608 4696873 4623206 4723118 4720320 4696322 4677948 4631544 4518540
14942 4518540 4722955 4607705 4689889 4596311 4382863 4565030 4429999 4465992 4471937 4563113
14932 4563113 4529264 4356044 4463472 4577254 4711690 4726999 4534673 4516069 4576067 4560502
14922 4560502 4732137 4661441 4572410 4702002 4489770 4628459 4467758 4623142 4884499 4660583
14912 4660583 4615516 4595597 4705783 4606908 4612664 4745034 4862548 4771221 4707829 4635295 4577780
14901 4577780 4559232 4500295 4504793 4470166 4496513 4611927 4540386 4277749 4277850 4451988 4491357
14890 4491357 4418985 4268063 4440045 4341629 4438612 4559046 4464448 4600439 4555828 4534846
14880 4534846 4416034 4518469 4527917 4579137 4588681 4493112 4619001 4485929 4698033 4573768
14870 4573768 4490151 4576219 4657808 4598336 4553328 4754461 4595240 4489162 4512514 4551746 4454302
14859 4454302 4424881 4629879 4639294 4461061 4467839 4568276 4588676 4595388 4548830 4492520 4533687
14848 4533687 4617670 4738264 4628731 4553334 4591162 4664081 4641383 4428716 4655087 4852450
14838 4852450 4605563 4181338 4291595 4575947 4401778 4461902 4660067 4661088 4392451 4566750
14828 4566750 4483868 4594850 4488219 4602257 4689864 4439092 4596316 4600422 4520242 4436592
14818 4436592 4439334 4538187 4600399 4517654 4377499 4490760 4364565 4472737 4564951 4670559
14808 4670559 4830891 4727750 4696146 4589639 4641512 4714199 4732788 4714833 4629438 4703446 4573565
14797 4573565 4635683 4595394 4620346 4778717 4766468 4429961 4473912 4583623 4619253 4607525 4716160
14786 4716160 4968848 4497796 4559017 4830963 4717168 4806668 4587529 4558117 4471166 4450811
14776 4450811 4470981 4460612 4682448 4548593 4573982 4576893 4533034 4568471 4705037 4640271 4535601
14765 4535601 4683746 4769581 4714992 4611624 4532867 4654686 4721980 4748373 4618134 4533838
14755 4533838 4557633 4647194 4558668 4512884 4547495 4781438 4635911 4497266 4535581 4464661 4448646
14744 4448646 4466761 4641343 4663565 4447640 4582352 4612997 4586706 4800326 4897726 4730025
14734 4730025 4497958 4669050 4900765 4583992 4543850 4854345 4845222 4675660 4560422 4776055
14724 4776055 4839793 4578049 4771853 4873520 4750415 4717650 4655253 4587231 4552958 4634304
14714 4634304 4793999 4523088 4408167 4444561 4547243 4579051 4524152 4482049 4552126 4528540
14704 4528540 4504710 4619942 4688713 4601622 4620374 4656387 4803297 4807673 4671460 4772318 4727570
14693 4727570 4849580 4798388 4719843 4832555 4750580 4747911 4669663 4607991 4616402 4691166 4867042
14682 4867042 4767497 4403281 4556280 4584181 4401306 4461065 4620832 4754880 4327142 4510181
14672 4510181 4635943 4673415 4515217 4614917 4908484 4795599 4755766 4810154 4749148 4907946
14662 4907946 4870107 4760907 4934020 4834229 4931210 4870092 4632511 4674429 4584044 4593807 4664974
14651 4664974 4683805 4797014 4724102 4705393 4835320 4542106 4536140 4564397 4647006 4658316 4475294
14640 4475294 4682905 4768568 4531491 4681402 4721352 4563322 4434488 4772990 4903302 4726352
$$ [...]
##END NTUPLES=NMR SPECTRUM
##END=
