##TITLE=1H_EC-3313xy
 DMSO
 8 sc, 
 13.2.2024
##JCAMPDX= 6.0         $$ Bruker NMR JCAMP-DX V2.0
##DATA TYPE= NMR SPECTRUM
##DATA CLASS= NTUPLES
##ORIGIN= UXNMR, Bruker Analytische Messtechnik GmbH
##OWNER= root
$$ XWIN-NMR		Version 3.5
$$ Tue Feb 13 15:56:16 2024 Russian Standard Time (UT+4h)  she@DPX200
##.OBSERVE FREQUENCY= 200.1313
##.OBSERVE NUCLEUS= ^1H
##.ACQUISITION MODE= SIMULTANEOUS
##.ACQUISITION SCHEME= undefined
##.AVERAGES= 8
##.DIGITISER RES= 18
##SPECTROMETER/DATA SYSTEM= spect
##.PULSE SEQUENCE= zg30
##.SOLVENT NAME= DMSO
##.SHIFT REFERENCE= (INTERNAL, DMSO, 0, 15.5133)
##AUDIT TRAIL= $$ (NUMBER, WHEN, WHO, WHERE, WHAT)
$$ ##TITLE= Audit trail, XWIN-NMR		Version 3.5
$$ ##JCAMPDX= 5.01
$$ ##ORIGIN= Bruker BioSpin GmbH
$$ ##OWNER= she
$$ F:/spectra/data/she/nmr/H-F/1/pdata/1/auditp.txt
$$ ##AUDIT TRAIL=  $$ (NUMBER, WHEN, WHO, WHERE, WHAT)
(   1,<2024-02-13 15:54:47.82 +0400>,<she>,<DPX200>,
      <created by zg, POWCHK disabled, PULCHK disabled
       configuration hash MD5:
       00 E9 B6 7A A2 85 ED C7 34 08 36 98 17 FE 4E 26
       data hash MD5: 16K
       C9 1C 9F C1 C9 1D 01 66 14 D1 ED 5D DC A7 7E 71>)
(   2,<2024-02-13 15:54:50.50 +0400>,<she>,<DPX200>,
      <Start of raw data processing
       efp BC_mod = 2 LB = 0.24 FT_mod = 6 PKNL = 1 PHC0 = -24860.69 PHC1 = 14.85265 SI = 16K 
       data hash MD5: 16K
       1E F7 73 82 AD 60 43 28 5C DB 78 07 78 1A 18 B2>)
(   3,<2024-02-13 15:55:11.64 +0400>,<she>,<DPX200>,
      <pk PHC0 = -85.88239 PHC1 = -7.599999 
       data hash MD5: 16K
       EF 2D 54 55 F5 ED 8D B7 E6 69 47 A8 D3 7D 46 22>)
(   4,<2024-02-13 15:55:15.21 +0400>,<she>,<DPX200>,
      <abs ABSG = 5 
       data hash MD5: 16K
       22 DF F2 9E 27 FA CF 03 A7 76 46 35 FF F4 6E F7>)
(   5,<2024-02-13 15:55:28.17 +0400>,<she>,<DPX200>,
      <pk PHC0 = 0 PHC1 = 0 
       data hash MD5: 16K
       22 DF F2 9E 27 FA CF 03 A7 76 46 35 FF F4 6E F7>)
$$ ##END=
$$ 
$$ hash MD5
$$ F8 FA 34 9C E4 E7 5A 42 AA 5B C2 DD 79 4D 7C A5
##$RELAX= 
##$RELAX= 
##$RELAX= 
##$RELAX= 
##$RELAX= 
##$RELAX= 
$$ Bruker specific parameters
$$ --------------------------
##$DU= <F:/spectra>
##$EXPNO= 1
##$NAME= <H-F>
##$PROCNO= 1
##$TYPE= <nmr>
##$USER= <she>
##$AMP= (0..31)
100 100 100 100 100 100 100 100 100 100 100 100 100 100 100 100 100 100 
100 100 100 100 100 100 100 100 100 100 100 100 100 100 
##$AQSEQ= 0
##$AQ_mod= 1
##$AUNM= <au_zg>
##$AUTOPOS= <>
##$BF1= 200.13
##$BF2= 200.13
##$BF3= 200.13
##$BF4= 200.13
##$BF5= 200.13
##$BF6= 200.13
##$BF7= 200.13
##$BF8= 200.13
##$BYTORDA= 1
##$CFDGTYP= 0
##$CFRGTYP= 5
##$CHEMSTR= <none>
##$CNST= (0..31)
1 1 145 1 1 1 1 1 1 1 1 1 1 1 1 1 1 1 1 1 1 1 1 1 1 1 1 1 1 1 1 1 
##$CPDPRG= <>
##$CPDPRG1= <>
##$CPDPRG2= <>
##$CPDPRG3= <>
##$CPDPRG4= <mlev>
##$CPDPRG5= <mlev>
##$CPDPRG6= <mlev>
##$CPDPRG7= <mlev>
##$CPDPRG8= <mlev>
##$CPDPRGB= <>
##$CPDPRGT= <>
##$D= (0..31)
0 1.2 0 0 0 0 0 0 0 0.06 0 0.03 0 0 0 0 0.0002 0 0 0 0 0 0 0 0 0 0 0 0 
0 0 0 
##$DATE= 1707825287
##$DBL= (0..7)
$$ [...]
##$SUBNAM3= <"">
##$SUBNAM4= <"">
##$SUBNAM5= <"">
##$SUBNAM6= <"">
##$SUBNAM7= <"">
##$SUBNAM8= <"">
##$SUBNAM9= <"">
##$SW= 18.0517328524113
##$SWIBOX= (0..15)
0 0 2 0 0 0 0 0 0 0 0 0 0 0 0 0 
##$SW_h= 3612.71676300578
##$TD= 16384
##$TD0= 1
##$TE= 0
##$TE2= 300
##$TE3= 300
##$TEG= 300
##$TL= (0..7)
0 120 120 120 120 120 120 120 
##$TP= (0..7)
150 150 150 150 150 150 150 150 
##$TP07= 0
##$TPNAME0= <>
##$TPNAME1= <>
##$TPNAME2= <>
##$TPNAME3= <>
##$TPNAME4= <>
##$TPNAME5= <>
##$TPNAME6= <>
##$TPNAME7= <>
##$TPOAL= (0..7)
0.5 0.5 0.5 0.5 0.5 0.5 0.5 0.5 
##$TPOFFS= (0..7)
0 0 0 0 0 0 0 0 
##$TUNHIN= 0
##$TUNHOUT= 0
##$TUNXOUT= 0
##$USERA1= <user>
##$USERA2= <user>
##$USERA3= <user>
##$USERA4= <user>
##$USERA5= <user>
##$V9= 5
##$VALIST= <valist>
##$VCLIST= <CCCCCCCCCCCCCCC>
##$VD= 0
##$VDLIST= <DDDDDDDDDDDDDDD>
##$VPLIST= <PPPPPPPPPPPPPPP>
##$VTLIST= <TTTTTTTTTTTTTTT>
##$WBST= 1024
##$WBSW= 4
##$XGAIN= (0..3)
0 0 0 0 
##$XL= 0
##$YL= 0
##$YMAX_a= 93152
##$YMIN_a= -96530
##$ZGOPTNS= <>
##$ZL1= 120
##$ZL2= 120
##$ZL3= 120
##$ZL4= 120
##$ABSF1= 15.47805
##$ABSF2= -2.573799
##$ABSG= 5
##$ABSL= 3
##$ALPHA= 0
##$AQORDER= 0
##$ASSFAC= 0
##$ASSFACI= 0
##$ASSFACX= 0
##$ASSWID= 0
##$AUNMP= <proc_1d>
##$AZFE= 0.1
##$AZFW= 0.1
##$BCFW= 0
##$BC_mod= 2
##$BYTORDP= 0
##$COROFFS= 0
##$CY= -3
##$DATMOD= 1
##$DC= 0
##$DFILT= <>
##$DTYPP= 0
##$F1P= 0
##$F2P= 0
##$FCOR= 1
##$FTSIZE= 16384
##$FT_mod= 6
##$GAMMA= 0
##$GB= 0
##$INTBC= 1
##$INTSCL= 3.70164e-10
##$ISEN= 128
##$LB= 0.24
##$LEV0= 0
##$LPBIN= 0
##$MAXI= 10000
##$MC2= 0
##$MEAN= 0
##$ME_mod= 0
##$MI= 1.114404
##$NCOEF= 0
##$NC_proc= -9
##$NLEV= 6
##$NOISF1= 3.799351
##$NOISF2= 2.8
##$NSP= 0
##$NTH_PI= 0
##$NZP= 0
##$OFFSET= 15.51331
##$PC= 1
##$PHC0= -24946.57
##$PHC1= 7.252651
##$PH_mod= 1
##$PKNL= yes
##$PPARMOD= 0
##$PSCAL= 0
##$PSIGN= 0
##$REVERSE= no
##$SF= 200.130001679326
##$SI= 16384
##$SIGF1= 3
##$SIGF2= 2
##$SINO= 5.538805
##$SIOLD= 16384
##$SREGLST= <1H.CDCl3>
##$SSB= 0
##$STSI= 16384
##$STSR= 0
##$SW_p= 3612.71676300578
##$SYMM= 0
##$S_DEV= 0
##$TDeff= 16384
##$TDoff= 0
##$TI= <>
##$TILT= no
##$TM1= 0
##$TM2= 0
##$TOPLEV= 0
##$USERP1= <user>
##$USERP2= <user>
##$USERP3= <user>
##$USERP4= <user>
##$USERP5= <user>
##$WDW= 1
##$XDIM= 16384
##$YMAX_p= 308041842
##$YMIN_p= -2122721
$$ End of Bruker specific parameters
$$ ---------------------------------
##NTUPLES= NMR SPECTRUM
##VAR_NAME=  FREQUENCY,     SPECTRUM/REAL,   SPECTRUM/IMAG
##SYMBOL=    X,             R,               I
##VAR_TYPE=  INDEPENDENT,   DEPENDENT,       DEPENDENT
##VAR_FORM=  AFFN,          ASDF,            ASDF
##VAR_DIM=   16384,         16384,           16384
##UNITS=     HZ,            ARBITRARY UNITS, ARBITRARY UNITS
##FACTOR=    0.220516191357247, 1,           1
##FIRST=     3104.67884289494, 0,            0
##LAST=      -508.037920110842, 0,           0
##MIN=       -508.037920110842, -2122721,    0
##MAX=       3104.67884289494, 308041842,    0
$$ Real data points
##PAGE= N=1
##DATA TABLE= (X++(R..R)), XYDATA
$$ [...]
$$ plain form
6693 978317 888470 151561 766855 1595936 994644 656687 1116828 457561 -31339 698009
6683 698009 112514 -408303 -568853 -113940 827792 413109 804872 959605 1116760 468476
6673 468476 766926 1488882 1131295 906285 403901 1295557 1082192 416341 673593 683551
6663 683551 1155669 1218929 1462412 1645222 1425830 1179330 1048735 1172968 982072 1323096
6653 1323096 1047357 -19772 190411 110478 182182 893337 515283 998857 691585 558601
6643 558601 727849 454651 822346 1168842 1269326 983815 1193909 1300155 1606694 1392279
6633 1392279 1969040 1597321 1800358 1285144 1505495 1806456 739270 788384 1194327 357648
6623 357648 390103 1321107 1141774 981307 700119 62535 771504 1781895 1932069 1650569
$$ packed form
6693I78317q9847p36909O15294Q29081o01292l37957M60141o59267m88900P29348
6683F98009n85495n20817j60550M54913R41732m14683L91763J54733J57155o48284
6673D68476K98450P21956l57587k25010n02384Q91656k13365o65851K57252R958
6663F83551M72118O3260K43483J82810k19392k46500j30595J24233j90896L41024
6653A323096k75739j067129K10183p9933P1704P11155l78054M83574l07272j32984
6643E58601J69248k73198L67695L46496J00484k85511K10094J06246L06539k14415
6633A392279N76761l71719K03037n15214K20351L00961j067186M9114M05943q36679
6623C57648L2455R31004j79333j60467k81188o37584P08969J010391J50174k81500
$$ plain form
6613 1650569 949741 406709 1079096 1613762 1733190 1498146 1112397 1370668 1186556 1627221
6603 1627221 1887584 1829299 1796379 1278504 1464867 1639240 1599086 1036535 1299706 1860370
6593 1860370 1361192 2090168 1929136 2758217 3405596 3339217 2789727 2474791 2693040 2809451
6583 2809451 2705197 3232208 2804763 2423371 2678065 2702538 2365952 1320930 1491017 2178348
6573 2178348 2876872 3431789 4088972 3704243 3453498 3437720 3409248 3523020 4032118 3973217
6563 3973217 4021093 4243971 3699461 4108807 3826404 3893584 3967472 4247240 4116415 4913053
6553 4913053 5170516 4975267 5696648 6267396 4967530 5187970 6232034 6551772 5777553
6544 5777553 5735840 5956783 6265205 7053138 7674692 7778192 8046828 7515120 7877215 7972279
$$ packed form
6613A650569p00828n43032O72387N34666J19428k35044l85749K58271j84112M40665
6603A627221K60363n8285l2920n17875J86363J74373m0154n62551K63171N60664
6593A860370m99178P28976j61032Q29081O47379o6379n49490l14936K18249J16411
6583B809451j04254N27011m27445l81392K54694K4473l36586j045022J70087O87331
6573B178348O98524N54917O57183l84729k50745j5778k8472J13772N09098n8901
6563C973217M7876K22878n44510M09346k82403O7180P3888K79768j30825P96638
6553D913053K57463j95249P21381N70748j299866K20440J044064L19738p74219
6544E777553m1713K20943L08422P87933O21554J03500K68636n31708L62095R5064
$$ plain form
6534 7972279 8192915 9229511 8891398 9164462 9499975 9859781 10330467 10327724 10096045 10818776
6524 10818776 11550616 12331288 12338205 13578613 13742205 13479041 13511351 14195732 15164521 15878003
6514 15878003 16040813 18019859 18897674 18884294 18312973 19732430 21017318 22626633 23853964
6505 23853964 24796736 25999094 27567366 29348042 31056453 33112183 34819909 36765861
6497 36765861 38735584 41376719 43554509 45802592 47460656 48758457 49472344 50691750
6489 50691750 50851270 50420558 50112750 49999701 51149095 51379129 51761873 52454576 53484905
6480 53484905 55069052 56442826 58673592 60127672 61562969 63723363 66761124 70868831
6472 70868831 74215811 75770567 77080129 78666142 78975824 77937532 77201150 75167093
$$ packed form
6534G972279K20636J036596l38113K73064L35513L59806M70686k743k31679P22731
6524A0818776P31840P80672O917J240408J63592k63164L2310O84381R68789P13482
6514A5878003J62810J979046Q77815j3380n71321J419457J284888J609315J227331
6505B3853964R42772J202358J568272J780676J708411K055730J707726J945952
6497C6765861J969723K641135K177790K248083J658064J297801P13887J219406
6489E0691750J59520m30712l07808j13049J149394K30034L82744O92703J030329
6480E3484905J584147J373774K230766J454080J435297K160394L037761M107707
6472G0868831L346980J554756J309562J586013L09682j038292p36382k034057
$$ plain form
6464 75167093 72127190 68067155 65049194 61511187 59490832 56854984 54351589 52576843
6456 52576843 51264510 50766253 49185538 48466324 48798301 48900813 49384924 49305539 48370770
6447 48370770 49502537 48611051 47081758 45813831 44450251 42993364 39723956 36752186
6439 36752186 34509201 32458917 30560503 28194720 26173780 24293532 22481578 20116663
6431 20116663 19529740 18667992 17393848 15827723 15782380 15126713 13519620 13119950 11776094
6422 11776094 12077757 11975674 10349587 9523665 9928742 9643281 9938838 8757968 7806933
6413 7806933 7854425 6956636 7106937 6089291 6199232 6254183 6166098 5807544 6224790 5845309
6403 5845309 5052619 4697092 4796969 5446418 4863078 5161326 4598875 4335780 3888228 4609345
$$ packed form
6464G5167093l039903m060035l017961l538007k020355k635848k503395j774746
6456E2576843j312333m98257j580715p19214L31977J02512M84111p9385r34769
6447D8370770J131767q91486j529293j267927j363580j456887l269408k971770
6439C6752186k242985k050284j898414k365783k020940j880248j811954k364915
6431B0116663n86923q61748j274144j566125m5343o55667j607093l99670j343856
6422A1776094L01663j02083j626087q25922M05077k85461K95557j180870r51035
6413G806933M7492q97789J50301j017646J09941N4951q8085l58554M17246l79481
6403E845309p92690l55527R9877O49449n83340K98248n62451k63095m47552P21117
$$ plain form
6393 4609345 4456697 3154004 2764120 2658016 2840665 3352942 3372092 3371819 2998847 3089364
6383 3089364 2780407 1973696 1997180 2325092 2589516 2849108 2667546 2955872 2706725 1649611
6373 1649611 1562868 1485795 1644043 1865877 1431556 1697038 1555245 948020 1398135 1282606
6363 1282606 1132019 917369 1213233 1281780 1068043 1515402 1610528 1815422 1326077 1577193
6353 1577193 2126264 2144394 2615569 1486256 1273717 1647120 1855660 1129591 96861
6344 96861 362269 584346 773070 271870 362680 533000 460211 1087698 1361813 739806
6334 739806 -2905 145023 233594 1041204 888555 716478 941143 1337538 1184279 557161
6324 557161 1517825 1650183 1303309 906036 295981 75269 -224816 -145192 4259 359354
$$ packed form
6393D609345j52648j302693l89884j06104J82649N12277J9150k73l72972R0517
6383C089364l08957q06711K3484L27912K64424K59592j81562K88326k49147j057114
6373A649611q6743p7073J58248K21834m34321K65482j41793o07225M50115j15529
6363A282606j50587k14650K95864O8547k13737M47359R5126K04894m89345K51116
6353A577193N49071J8130M71175j129313k12539L73403K08540p26069j032730
6344I6861K65408K22077J88724n01200R0810J70320p2789O27487K74115o22007
6334G39806p42711J47928Q8571Q07610j52649j72077K24665L96395j53259o27118
6324E57161R60664J32358l46874l97273o10055k20712l00085P9624J49451L55095
$$ plain form
6314 359354 174720 -190239 -16517 -72194 -245628 135292 276476 105970 300121 970241
6304 970241 710157 302738 404155 990457 1127839 803148 472170 385128 122475 920615
6294 920615 646595 711627 715269 488983 400522 20063 414333 859938 829822 657543 -37571
6283 -37571 -28308 197407 -603125 -439091 378258 1356917 194443 816791 249256 491308
6273 491308 816701 577588 675547 958102 1010419 792436 -100174 -187682 -552689 -704708
6263 -704708 85288 -327010 -158086 -171724 245682 330144 -138778 -3281 554858 527018
6253 527018 375695 162832 -174478 1040766 42362 -662721 69155 642148 -113853 305375
6243 305375 330062 875875 948975 298480 383129 698751 457473 -223769 -571791 -377382
$$ packed form
6314C59354j84634l64959J73722n5677j73434L80920J41184j70506J94151O70120
6304I70241k60084m07419J01417N86302J37382l24691l30978q7042k62653P98140
6294I20615k74020O5032L642k26286q8461l80459L94270M45605l0116j72279o95114
6283c7571R263K25715q00532J64034Q17349R78659j162474O22348n67535K42052
6273D91308L25393k39113R7959K82555N2317k17983q92610q7508l65007j52019
6263g04708P89996m12298J68924j3638M17406Q4462m68922J35497N58139k7840
6253E27018j51323k12863l37310J215244r98404p05083P31876N72993p56001M19228
6243C05375K4687N45813P3100o50495Q4649L15622k41278o81242l48022J94409
$$ plain form
6233 -377382 -115230 -372600 66047 757651 1216561 344941 1441956 1239160 1172898 1580803
6223 1580803 727436 950880 1576186 784745 -96439 -673500 -236135 -15635 -88580 -74392
6213 -74392 379842 -211362 -699249 -236561 -378240 -110439 468795 128694 -78482 -452533
6203 -452533 -343308 -228766 411332 677588 826028 472826 149395 581897 310511 394711
6193 394711 1110638 710678 801177 -191041 -246698 310812 982630 1751750 852901 750192
6183 750192 948061 882077 798943 500911 -79171 -455772 -75185 120026 367017 -768807
6173 -768807 -674817 252615 -167223 148690 -681853 -101060 -99023 -10317 -920647 -378917
6163 -378917 -287985 -294971 -63165 -105476 203584 592581 1554825 332725 315608 456423
$$ packed form
6233c77382K62152k57370M38647O91604M58910q71620J097015k02796o6262M07905
6223A580803q53367K23444O25306p91441q81184n77061M37365K20500p2945J4188
6213g4392M54234n91204m87887M62688j41679K67801N79234l40101k07176l74051
6203d52533J09225J14542O40098K66256J48440l53202l23431M32502k71386Q4200
6193C94711P15927l99960R0499r92218n5657N57510O71818P69120q98849j02709
6183G50192J97869o5984q3134k98032n80082l76601L80587J95211K46991j135824
6173g68807R3990R27432m19838L15913q30543N80793K037Q8706r10330N41730
6163c78917R0932o986K31806m2311L09060L88997R62244j222100j7117J40815
$$ plain form
6153 456423 772673 171959 -1200492 -1576671 62154 492027 902649 253380 102585
6144 102585 -67641 377775 4326 -626607 -274049 47472 579315 650039 586392 435195
6134 435195 336493 419206 201772 -448161 -1145322 -704699 343221 -115125 163978 414845
6124 414845 336213 305800 705019 61285 296258 1486979 740118 376339 1023457 398462
6114 398462 614661 398247 544950 -218846 -204318 -134637 596916 186651 247947 16713
6104 16713 -462207 -120862 -156663 193508 903547 507797 818298 655037 556746 -175948
6094 -175948 307458 1729056 379255 498358 466871 345956 920854 -264024 -495930
6085 -495930 1191314 1433522 677740 424624 318599 1146393 727261 658232 454010 123273
$$ packed form
6153D56423L16250o00714j372451l76179J638825M29873M10622o49269j50795
6144A02585j70226M45416l73449o30933L52558L21521N31843P0724o3647j51197
6134D35195r8702Q2713k17434o49933o97161M40623J047920m58346K79103K50867
6124D14845p8632l0413L99219o43734K34973J190721p46861l63779O47118o24995
6114C98462K16199k16414J46703p63796J4528O9681P31553m10265O1296k31234
6104A6713m78920L41345l5801L50171P10039l95750L10501j63261r8291p32694
6094a75948M83406J421598j349801J19103l1487j20915N74898j184878k31906
6085d95930J687244K42208p55782k53116j06025Q27794m19132o9029k04222l30737
$$ plain form
6075 123273 330702 562268 335646 390409 1312895 898626 887474 1208376 302081 -213237
6065 -213237 41484 253286 -175477 100315 487342 -12865 698899 313855 80935 230692
6055 230692 19981 125699 1368269 1183024 905432 442621 292595 338569 574349 741225
6045 741225 866422 886920 121760 -104863 857267 1460190 1805365 1298475 598392 598922
6035 598922 389049 -9694 27825 743495 1468791 1015676 1264912 1425954 1214943 826122
6025 826122 199758 884659 1278034 387718 785758 638616 961235 1071001 11987 -425482
6015 -425482 -31649 1067084 1829853 1567093 1602256 1099786 739794 1428276 1522821 1131908
6005 1131908 390684 764785 -40418 -1069401 -736967 -365371 329869 186913 -377906
$$ packed form
6075A23273K07429K31566k26622N4763R22486m14269j1152L20902r06295n15318
6065b13237K54721K11802m28763K75792L87027n00207P11764l85044k32920J49757
6055B30692k10711J05718J242570j85245k77592m62811j50026M5974K35780J66876
6045G41225J25197K0498p65160k26623R62130O02923L45175n06890p00083N30
6035E98922k09873l98743L7519P15670P25296m53115K49236J61042k11011l88821
6025H26122o26364O84901L93375q90316L98040j47142L22619J09766j059014m37469
6015d25482L93833J098733P62769k62760L5163n02470l59992O88482R4545l90913
6005A131908p41224L74101q05203j028983L32434L71596O95240j42956n64819
$$ plain form
5996 -377906 -583933 10017 361466 483924 1108785 101758 577464 936727 565944 245342
5986 245342 -38630 -33071 -210038 859572 1014880 470155 52287 -1979 431272 511401
5976 511401 85065 -593526 76027 329277 -299354 392929 -24545 -287063 372432 1058287
5966 1058287 896261 617727 335754 637722 713290 479759 1133279 1382399 1247945 1025725
5956 1025725 1268066 1138092 922414 1277660 1424979 800153 281089 24446 143938 791888
5946 791888 612318 321169 1173566 1200843 1191144 1593233 1004751 383128 600216 648137
5936 648137 1552136 1722691 1285536 520317 786414 1074973 170183 1188527 1264129 829218
5926 829218 1422825 1443120 1215084 1335154 1940782 1290670 722367 604782 704052 1229417
$$ packed form
5996c77906k06027N93950L51449J22458O24861j007027M75706L59263l70783l20602
5986B45342k83972N559j76967J069610J55308n44725m17868n4266M33251Q0129
5976E11401m26336o78591O69553K53250o28631O92283m17474k62518O59495O85855
5966A058287j62026k78534k81973L01968P5568k33531O53520K49120j34454k22220
5956A025725K42341j29974k15678L55246J47319o24826n19064k56643J19492O47950
5946G91888j79570k91149Q52397K7277r699M02089n88482o21623K17088M7921
5936F48137R03999J70555m37155p65219K66097K88559r04790J018344P5602m34911
5926H29218N93607K0295k28036J20070O05628o50112n68303j17585R9270N25365
$$ plain form
5916 1229417 1417576 1897264 1507140 1171868 2168643 2336126 1381724 1400661 1199258 1206282
5906 1206282 1473898 1002855 1276508 1403464 1378686 1371885 1392477 894544 850929 1683801
5896 1683801 1577669 858334 1051695 794879 1352618 1349329 1814257 1565752 2103803 2182489
5886 2182489 2890955 2490480 2382582 2601732 3082338 2363537 2675801 2940435 2250930 2544781
5876 2544781 2695562 3771347 3583418 3437486 3268662 3631774 3615289 2324069 2419841 3214759
5866 3214759 2607014 3411952 3625836 3723574 3630548 3815924 3215198 3185085 3326895 3247158
5856 3247158 3918211 4715558 3985387 3766897 4402721 4388246 4154863 3864886 3091648 3723201
5846 3723201 4086690 4336957 4961491 5847818 6275986 6485707 5704334 4346432 4701125
$$ packed form
5916A229417J88159M79688l90124l35272R96775J67483r54402J8937k01403P024
5906A206282K67616m71043K73653J26956k4778o801K0592m97933m3615Q32872
5896A683801j06132p19335J93361k56816N57739l289M64928k48505N38051P8686
5886B182489P08466m00475j07898K19150M80606p18801L12264K64634o89505K93851
5876B544781J50781J075785j87929j45932j68824L63112j6485j291220R5772P94918
5866C214759o07745Q04938K13884R7738r3026J85376o00726l0113J41810p9737
5856C247158O71053P97347p30171k18490O35824j4475k33383k89977p73238O31553
5846C723201L63489K50267O24534Q86327M28168K09721p81373j357902L54693
$$ plain form
5837 4701125 5996921 5621678 5674365 5579591 5967294 6188477 6460609 7219330 7230613 7003918
5827 7003918 7283421 7556501 7862037 7089598 7220129 7755051 8372630 8976515 8456644 9638464
5817 9638464 10259413 11091452 11237992 11205506 11076211 11082248 11572498 11357809 11560358 12655821
5807 12655821 12693525 12896396 13504192 12474033 13202135 14147613 15015920 15879449 16027723
5798 16027723 17699672 16859007 17627746 18535373 18916798 19657588 19383618 20809106 22115453
5789 22115453 22955014 23351465 24462103 24954549 26235997 26956123 27685131 29398110 30508338
5780 30508338 31805655 33465472 36034485 39208065 41178547 42844329 45784696 48376887
5772 48376887 50563709 53162858 55741462 57257541 58546758 58994559 59159040 59479451 58991640
$$ packed form
5837D701125J295796l75243N2687r4774L87703K21183K72132P58721J1283k26695
5827G003918K79503K73080L05536p72439J30531N34922O17579O03885n19871J181820
5817I638464O20949Q32039J46540l2486j29295O037M90250k14689K02549J095463
5807A2655821L7704K02871O07796j030159P28102R45478Q68307Q63529J48274
5798A6027723J671949q40665P68739R07627L81425P40790k73970J425488J306347
5789B2115453Q39561L96451J110638M92446J281448P20126P29008J712979J110228
5780C0508338J297317J659817K569013L173580J970482J665782K940367K592191
5772D8376887K186822K599149K578604J516079J289217M47801J64481L20411m87811
$$ plain form
5763 58991640 58028040 57373528 57355979 56813722 56718860 57885703 59074318 61229901 64776114
5754 64776114 66759057 68065748 71175551 75194849 78601487 81986434 85584259 87412552
5746 87412552 87785045 87386409 85800792 83154823 80485798 75802521 71139399 65911026
5738 65911026 63107176 60453008 57066624 54244221 52729694 50740997 49916740 49503152
5730 49503152 48635450 48771983 48928173 49356058 48882044 48221950 48249170 47099530 46435355
5721 46435355 45989540 44372422 41946283 39142404 36088928 32656346 30261857 28475785
5713 28475785 26314334 24182116 22676393 21091862 19768433 18409558 17317648 16808368
5705 16808368 16689659 16315353 15877961 13960153 12503150 11745774 11685176 10979749 10903253
$$ packed form
5763E8991640r63600o54512j7549n42257r4862J166843J188615K155583L546213
5754F4776114J982943J306691L109803M019298L406638L384947L597825J828293
5746H7412552L72493l98636j585617k645969k669025m683277m663122n228373
5738F5911026k803850k654168l386384k822403j514527j988697q24257m13588
5730D9503152q67702J36533J56190M27885m74014o60094K7220j149640o64175
5721D6435355m45815j617118k426139k803879l053476l432582k394489j786072
5713B8475785k161451k132218j505723j584531j323429j358875j091910n09280
5705A6808368j18709l74306m37392j917808j457003p57376o0598p05427p6496
$$ plain form
5696 10903253 11674976 11502782 10337455 10111858 8798840 8861284 9202430 8941345 8677802
5687 8677802 7968124 7686465 7260189 7399334 7404013 7163965 6448982 6807877 6338979 6274714
5677 6274714 6244438 5369891 5340199 5245361 6262107 5992559 4799426 5514770 5287142 4580949
5667 4580949 4680478 4832036 4582365 4714096 4987205 4734618 3903706 4224439 4875887 3468140
5657 3468140 4307088 4648714 4174592 3653995 4416375 4148179 3232401 3290809 3322026 3588783
5647 3588783 3642019 3331477 3930556 4047575 3593814 3516671 2140861 2662362 4271488 4256676
5637 4256676 3207098 3263570 3547190 4400506 3709794 3829263 4308821 5040744 4973591 4659288
5627 4659288 4257563 3804860 3905658 3545367 3204982 3435105 3855517 3772144 4136352 4122106
$$ packed form
5696A0903253P71723j72194j165327k25597j313018O2444L41146k61085k63543
5687H677802p09678k81659m26276J39145M679k40048p14983L58895m68898o4265
5677F274714l0276q74547k9692r4838J016746k69548j193133P15344k27628p06193
5667D580949R9529J51558k49671J31731K73109k52587q30912L20733O51448j407747
5657C468140Q38948L41626m74122n20597P62380k68196r15778N8408L1217K66757
5647C588783N3236l10542N99079J17019m53761p7143j375810N21501J609126j4812
5637D256676j049578N6472K83620Q53316o90712J19469M79558P31923o7153l14303
5627D659288m01725m52703J00798l60291l40385K30123M20412q3373L64208j4246
$$ plain form
5617 4122106 3745883 3799729 4319505 4350110 4432560 3867032 4481026 3505851 3045599 4624908
5607 4624908 3500167 3479879 4009794 4235103 3422876 3416540 4394332 4077521 4487306 4435218
5597 4435218 3927171 4203516 4079086 4145092 4056732 3334010 4199901 4217962 4395307 4771873
5587 4771873 4856453 5396412 5313397 4732660 4499260 5162305 5620525 5598960 5278627 4541214
5577 4541214 5000667 6074170 5933284 5678566 6204159 6300557 6664089 6695867 6559636 6510223
5567 6510223 6574850 6790795 6220813 5701254 6099306 6734705 6892396 6665060 6875880 6904841
5557 6904841 7132669 7645305 8007821 8347621 7912781 7379100 6701960 7404465 8161133 8489393
5547 8489393 7135503 7429940 7936483 7609675 7480355 7415135 7576507 8464229 8561417 9388142
$$ packed form
5617D122106l76223N3846N19776L0605Q2450n65528O13994r75175m60252J579309
5607D624908j124741k0288N29915K25309q12227o336R77792l16811M09785n2088
5597D435218n08047K76345j24430O6006q8360p22722Q65891J8061J77345L76566
5587D771873Q4580N39959q3015n80737k33400O63045M58220k1565l20333p37413
5577D541214M59453J073503j40886k54718N25593R6398L63532L1778j36231m9413
5567F510223O4627K15945n69982n19559L98052O35399J57691k27336K10820K8961
5557F904841K27828N12636L62516L39800m34840n33681o77140P02505P56668L28260
5547H489393j353890K94437N06543l26808j29320o5220J61372Q87722R7188Q26725
$$ plain form
5537 9388142 8879383 8285027 9460181 10197775 10365689 9771541 10256671 10380617 10100301
5528 10100301 10109376 10738708 11025185 11874445 11850690 12077839 12527238 13040434 12812388 12952930
5518 12952930 13195172 13614580 14177712 14480730 14234880 15174495 14712846 15843564 16603293
5509 16603293 16509496 16553812 17405976 18232541 18015417 19097012 19359569 19879002 20483064 21121603
5499 21121603 21440289 22225307 22761777 23647544 24927691 25417336 26738290 28110490 28933679
5490 28933679 30328366 32009659 33805368 34637709 35824732 37791313 39978936 42365174
5482 42365174 44134294 45038746 46156265 48771365 50914625 52157299 54551974 55394658
5474 55394658 57610667 59582901 61287946 63051379 65523413 68422412 70830674 72433818
$$ packed form
5537I388142n08759n94356J175154P37594J67914n94148M85130J23946k80316
5528A0100301R075O29332K86477Q49260k3755K27149M49399N13196k28046J40542
5518A2952930K42242M19408N63132L03018k45850R39615m61649J130718P59729
5509A6603293r3797M4316Q52164Q26565k17124J081595K62557N19433O04062O38539
5499B1121603L18686P85018N36470Q85767J280147M89645J320954J372200Q23189
5490B8933679J394687J681293J795709Q32341J187023J966581K187623K386238
5482D2365174J769120R04452J117519K615100K143260J242674K394675Q42684
5474E5394658K216009J972234J705045J763433K472034K898999K408262J603144
$$ plain form
5466 72433818 74152038 76530180 79517972 81814046 83067112 84972036 87088810 88633069
5458 88633069 90271944 91786603 94269456 96647274 98463651 101036831 104221607 108140465
5450 108140465 112150679 116083766 119508060 123268002 126418411 128837122 131818845 134555568
5442 134555568 137782434 140773975 142321552 143932325 143846881 142513524 140094730 137872386
5434 137872386 135125078 133012800 131440680 129700169 129505372 130627507 133378641 137812465
5426 137812465 141358741 146013990 151575510 157171965 162297592 166664381 169874874 170657491
5418 170657491 170836576 169465468 166640994 164265914 162316703 159559125 156940060 153208372
5410 153208372 149910974 146611837 143188193 139240942 136167186 134679223 133790648 133443981
$$ packed form
5466G2433818J718220K378142K987792K296074J253066J904924K116774J544259
5458H8633069J638875J514659K482853K377818J816377K573180L184776L918858
5450A08140465M010214L933087L424294L759942L150409K418711K981723K736723
5442A34555568L226866K991541J547577J610773q5444j333357k418794k222344
5434A37872386k747308k112278j572120j740511j94797J122135K751134M433824
5426A37812465L546276M655249N561520N596455N125627M366789L210493P82617
5418A70657491J79085j371108k824474k375080j949211k757578k619065l731688
5410A53208372l297398l299137l423644l947251l073756j487963q88575l46667
$$ plain form
5402 133443981 133553605 134901098 135625339 137730047 139978563 142082302 141952994 141523058 139742867
5393 139742867 137893541 135963553 133034178 129303390 125823706 121067734 115192732 110265757
5385 110265757 105273012 101202735 96629676 93340497 89495744 86461587 83954087 82645139
5377 82645139 81496429 78600009 77016929 76190903 74507715 73130112 71750229 70145397
5369 70145397 68659121 66930487 63642188 60289628 56626498 52813303 49123017 45598136
5361 45598136 42850849 39985286 36772847 34843904 32591160 30292721 28494428 27438610
5353 27438610 25848622 24042905 22846823 21831308 20784296 19644477 19472609 19150880
5345 19150880 18358072 17107413 16033981 15682336 15765948 14411421 13692584 13139370 12803575
$$ packed form
5402A33443981J09624J347493P24241K104708K248516K103739j29308m29936j780191
5393A39742867j849326j929988k929375l730788l479684m755972n875002m926975
5385A10265757m992745m070277m573059l289179l844753l034157k507500j308948
5377H2645139j148710k896420j583080q26026j683188j377603j379883j604832
5369G0145397j486276j728634l288299l352560l663130l813195l690286l524881
5361D5598136k747287k865563l212439j928943k252744k298439j798293j055818
5353B7438610j589988j805717j196082j015515j047012j139819j71868l21729
5345A9150880p92808j250659j073432l51645Q3612j354527p18837n53214l35795
$$ plain form
5336 12803575 12451981 12058385 12111840 11900837 11086340 10746017 9725836 9522088 9387000
5327 9387000 9228970 8794021 8674779 8531663 7889859 7468714 7532568 7822748 7969281 7211414
5317 7211414 6796970 7223122 6903849 7622950 7336449 6348290 5594486 5286668 5331943 4360167
5307 4360167 4894061 4472385 4481876 5905897 5264739 4995657 4648152 5060586 4168725 4335888
5297 4335888 4193905 4073474 4234258 4854174 4922319 3856253 4132858 4068177 3522971 3887494
5287 3887494 4063210 2677525 2934277 3674311 3578703 3071237 3098627 3027870 3384265 2643022
5277 2643022 2626151 2945665 2690169 2844149 2679428 3428866 3775412 3264555 3003666 2173223
5267 2173223 2526099 2887373 2704616 2915223 2400494 3117896 3790845 3129624 2493075 2446366
$$ packed form
5336A2803575l51594l93596N3455k11003q14497l40323j020181k03748j35088
5327I387000j58030m34949j19242j43116o41804m21145O3854K90180J46533p57867
5317G211414m14444M26152l19273P19101k86501r88159p53804l07818M5275r71776
5307D360167N33894m21676R491J424021o41158k69082l47505M12434q91861J67163
5297D335888j41983j20431J60784O19916O8145j066066K76605o4681n45206L64523
5287C887494J75716j385685K56752P40034r5608n07466K7390p0757L56395p41243
5277B643022j6871L19514k55496J53980j64721P49438L46546n10857k60889q30443
5267B173223L52876L61274j82757K10607n14729P17402O72949o61221o36549m6709
$$ plain form
5257 2446366 2501368 2930390 2493186 2243296 1689038 2043843 2198892 1292383 1487720 2150509
5247 2150509 1419176 1928112 2512874 1791143 1327669 1930603 1910494 2497084 2809736 2225217
5237 2225217 1829353 1777081 2130292 2213018 1312601 1107437 1389829 1174681 2242175 1869376
5227 1869376 2266851 2126843 1890090 1694230 1358366 2060651 1723228 1245165 1833030 2009457
5217 2009457 1586472 914680 1512239 1659377 785560 1581654 2066124 1566379 1098402 988643
5207 988643 1597453 1527898 1383407 1709999 1752655 1328532 1532586 2114440 2777634 2796242
5197 2796242 2518595 1882452 1213789 2130180 1908773 2205667 2598792 1754096 1608469 1530064
5187 1530064 1773534 1539533 693001 1136393 1624386 1683672 929767 699685 437609 142127
$$ packed form
5257B446366N5002M29022m37204k49890n54258L54805J55049r06509J95337O62789
5247B150509p31333N08936N84762p21731m63474O02934k0109N86590L12652n84519
5237B225217l95864n2272L53211Q2726r00417k05164K82392k15148J067494l72799
5227A869376L97475j40008k36753j95860l35864P02285l37423m78063N87865J76427
5217B009457m22985o71792N97559J47138q73817P96094M84470m99745m67977j09759
5207I88643O08810o9555j44491L26592M2656m24123K04054N81854O63194J8608
5197B796242k77647o36143o68663R16391k21407K96894L93125q44696j45627p8405
5187A530064K43470k34001q46532M43392M87993N9286p53905k30082k62076k95482
$$ plain form
5177 142127 900931 786870 751182 609810 582042 339167 261109 265938 998015 465687 198556
5166 198556 64129 894775 1791051 1083779 1141472 1248993 1304780 1175028 1332416 1641239
5156 1641239 989072 902918 1087418 269828 1274923 1732751 1226724 1429842 1161834 1015653
5146 1015653 635311 758426 1314199 919934 1301820 1961747 2365107 2367603 2033013 1486218
5136 1486218 1501315 1258440 1513572 1690409 1796290 1768977 1723796 2070611 2165071 1728327
5126 1728327 1946852 2323987 1723432 1911660 1434310 1476746 843436 1116538 2202390 1657640
5116 1657640 1754657 2089586 1795310 1506632 2140345 2035714 1852346 1791448 1322341 1509674
5106 1509674 2222423 1966460 2557597 3093886 2704588 2668391 2434434 2069816 1601937 2213693
$$ packed form
5177A42127P58804j14061l5688j41372k7768k42875p8058M829P32077n32328k67131
5166A98556j34427Q30646Q96276p07272N7693J07521N5787j29752J57388L08823
5156A641239o52167q6154J84500q17590J005095M57828n06027K03118k68008j46181
5146A015653l80342J23115N55773l94265L81886O59927M03360K496l34590n46795
5136A486218J5097k42875K55132J76837J05881k7313m5181L46815R4460m36744
5126A728327K18525L77135o00555J88228m77350M2436o33310K73102J085852n44750
5116A657640R7017L34929k94276k88678O33713j04631j83368o0898m69107J87333
5106A509674P12749k55963N91137N36289l89298l6197k33957l64618m67879O11756
$$ plain form
5096 2213693 2554241 2166082 2299425 1994828 1714744 1832732 1955670 2478669 2707604 1928657
5086 1928657 1786962 2118290 2346001 2243843 2000340 1416622 1781784 1949334 2259230 2271240
5076 2271240 1910124 1364876 1244556 1952972 2145987 2522779 2272589 2018056 1497732 1706529
5066 1706529 1779129 2296455 1825127 2478343 2331706 1844546 2400876 2677514 1706514 1060267
5056 1060267 1655919 2814657 2873579 2294534 1773643 1807220 1423382 1067448 2071139 2439565
5046 2439565 1572184 1123277 729705 1727897 1640752 1930762 1472018 1033818 2361005 2095201
5036 2095201 1523402 1055210 811047 1281965 1304038 1266997 1137774 1179333 1256268 1523457
5026 1523457 1618953 1167452 907771 1446625 1570464 1543088 2796558 1576211 1545075 2349664
$$ packed form
5096B213693L40548l88159J33343l04597k80084J17988J22938N22999K28935p78947
5086A928657j41695L31328K27711j02158k43503n83718L65162J67550L09896J2010
5076B271240l61116n45248j20320P08416J93015L76792k50190k54533n20324K08797
5066A706529P2600N17326m71328O53216j46637m87160N56330K76638r71000o46247
5056A060267N95652J158738N8922n79045n20891L3577l83838l55934J003691L68426
5046B439565q67381m48907l93572R98192q7145K90010m58744m38200J327187k65804
5036B095201n71799m68192k44163M70918K2073l7041j29223M1559P6935K67189
5026A523457R5496m51501k59681N38854J23839k7376J253470j220347l1136Q04589
$$ plain form
5016 2349664 2918519 2736290 3006354 1743895 1592742 1199497 1948894 1978692 838580
5007 838580 979227 1292045 1675915 2303654 1829882 2237593 2186005 1482301 1281687 1571055
4997 1571055 1402580 231805 964142 1853078 1729014 2214681 1479187 1456570 1034353 1439378
4987 1439378 1581785 1736734 1579607 1120504 2025885 2224120 1805908 1488127 2049780 1538011
4977 1538011 2105970 1955322 1957268 2102354 2562826 2066330 1011982 1327877 789794 984039
4967 984039 1456384 1667524 1389777 2211507 2365192 2403469 2124257 1499637 1629521 1243633
4957 1243633 1101960 995209 1724856 1734075 1682282 1398226 1206321 1842218 1785706 1816112
4947 1816112 2300461 1216978 1022521 1036106 630080 582813 1481025 1184034 2074878 2107979
$$ packed form
5016B349664N68855j82229K70064j262459j51153l93245P49397K9798j140112
5007H38580J40647L12818L83870O27739m73772M07711n1588p03704k00614K89368
4997A571055j68475j170775P32337Q88936j24064M85667p35494k2617m22217M05025
4987A439378J42407J54949j57127m59103R05381J98235m18212l17781N61653n11769
4977A538011N67959j50648J946J45086M60472m96496j054348L15895n38083J94245
4967I84039M72345K11140k77747Q21730J53685L8277k79212o24620J29884l85888
4957A243633j41673j06751P29647R219n1793k84056j91905O35897n6512L0406
4947A816112M84349j083483j94457J3585m06026m7267Q98212k96991Q90844L3101
$$ plain form
4937 2107979 1650840 1925711 1428569 1194338 1688070 1675866 1740760 1833290 1965079 2078247
4927 2078247 1737365 1378525 2115086 2609998 2532556 2201161 2228041 2417498 3209694 3259720
4917 3259720 3981621 2934874 3095334 3351357 2713013 2662032 2611545 3347124 2865051 3131105
4907 3131105 3966909 4299759 2976377 2620905 3191503 3770515 3426396 3492073 3220468 3343091
4897 3343091 4093447 3781851 3416734 2891524 3084138 4246165 4787733 4989286 4867926
4888 4867926 3821281 4511456 4892189 4018144 4081434 4565500 4338437 4279429 4773554 4322520
4878 4322520 4666290 4127779 5093064 5313602 4363862 4792756 4580509 4623185 4943178 5514831
4868 5514831 6494116 6061855 5519474 5149777 4321783 4726174 6080974 5899793 5570037
$$ packed form
4937B107979m57139K74871m97142k34231M93732j2204O4894R2530J31789J13168
4927B078247l40882l58840P36561M94912p7442l31395K6880J89457P92196N0026
4917C259720P21901j046747J60460K56023o38344n0981n0487P35579m82073K66054
4907C131105Q35804L32850j323382l55472N70598N79012l44119O5677k71605J22623
4897C343091P50356l11596l65117n25210J92614J162027N41568K01553j21360
4888D867926j046645O90175L80733q74045O3290M84066k27063n9008M94125m51034
4878D322520L43770n38511R65285K20538r49740M28894k12247M2676L19993N71653
4868E514831R79285m32261n42381l69697q27994M04391J354800j81181l29756
$$ plain form
4859 5570037 5199472 6171763 5635464 5233512 5728142 6516515 6596678 6058479 6741278 7510480
4849 7510480 7529761 6865354 7315627 7258722 7430887 7543110 7241574 7235479 7868944 7990959
4839 7990959 8243630 8736458 8855914 9062476 8730757 9597999 9903275 10011323 10341047 11378758
4829 11378758 11591075 11766145 11625787 11430891 12235804 12657715 13583270 13798366 14028406
4820 14028406 13254560 14032988 14571805 15928452 16103796 16440452 17187088 18328963 18522277
4811 18522277 18638680 19580283 20449221 21350595 21884895 23212454 23778716 24863759 25412771
4802 25412771 25133478 24753397 25645546 27213369 27859278 28578765 29105376 29784736 30302805
4793 30302805 30256676 31435243 32368081 33509461 33857419 34760498 35874252 36553383 37576899
$$ packed form
4859E570037l70565R72291n36299m01952M94630P88373Q0163n38199O82799P69202
4849G510480J9281o64407M50273n6905J72165J12223l01536o095O33465J22015
4839G990959K52671M92828J19456K06562l31719Q67242L05276J08048L29724J037711
4829A1378758K12317J75070j40358j94896Q04913M21911R25555K15096K30040
4820A4028406p73846P78428N38817J356647J75344L36656P46636J141875J93314
4811A8522277J16403R41603Q68938R01374N34300J327559N66262J085043N49012
4802B5412771k79293l80081Q92149J567823O45909P19487N26611O79360N18069
4793C0302805m6129J178567R32838J141380L47958R03079J113754O79131J023516
$$ plain form
4784 37576899 38463140 39248998 40043297 40501365 42407278 43180781 43603125 44347765 45105539
4775 45105539 46044895 45801804 45863625 46888615 47509705 47725692 48395736 48753686 48630339
4766 48630339 48562631 49334945 50440853 50561315 51398321 52512943 51557662 51386219 51154781
4757 51154781 52163854 52711466 52124391 52376569 52053707 52946952 52949929 52710799 51972542 51633430
4747 51633430 51107332 50424801 50859567 50574529 50237129 50361504 50071486 49311149 47985740
4738 47985740 47406546 48246356 47681326 46998231 46162874 44971338 42836461 42705156 42095991
4729 42095991 41559334 41416556 41398190 40864702 39866162 38994436 38113420 37983983 37051391 36293663
4719 36293663 35292403 34584853 33794015 32314861 31607641 30511974 29539225 28729248 27155897
$$ packed form
4784C7576899Q86241P85858P94299M58068J905913P73503M22344P44640P57774
4775D5105539R39356k43091O1821J024990O21090K15987O70044L57950j23347
4766D8630339o7708P72314J105908J20462Q37006J114622r55281j71443k31438
4757E1154781J009073N47612n87075K52178l22862Q93245K977k39130p38257l39112
4747E1633430n26098o82531M34766k85038l37400J24375k90018p60337j325409
4738D7985740n79194Q39810n65030o83095q35357j191536k134877j31305o09165
4729D2095991n36657j42778j8366n33488r98540q71726q81016j29437r32592p57728
4719C6293663j001260p07550p90838j479154p07220j095667r72749q09977j573351
$$ plain form
4710 27155897 26765241 25796409 24878334 24570602 23954182 23080819 22165509 21828990 20986728
4701 20986728 20105374 19667649 19872778 19886678 18997338 18321313 16844413 16493420 16129812
4692 16129812 15607105 15033785 14214198 13826927 14889231 14673279 13251740 12391728 11864614
4683 11864614 11791322 12291313 11972048 11223835 12277026 11936090 11439096 10618337 9828559
4674 9828559 10178945 10442407 9979401 9840238 8912695 9349696 8736395 8361378 9210246 9128959
4664 9128959 9001555 9735968 10007649 9981482 10556798 10390438 10236675 10376279 10493851 10934090
4654 10934090 11243230 11995809 12055035 12189859 12440056 11902892 11697923 11319901 12142407 12799623
4644 12799623 13151012 13511811 14313342 14850789 14824523 15145746 15919215 16902660 17661435 17608034
$$ packed form
4710B7155897l90656r68832r18075l07732o16420q73363r15310l36519q42262
4701B0986728q81354m37725K05129J3900q89340o76025j476900l50993l63608
4692A6129812n22707n73320q19587l87271J062304k15952j421539q60012n27114
4683A1864614p3292M99991l19265p48213J053191l40936m96994q20759p89778
4674I828559L50386K63462m63006j39163r27543M37001o13301l75017Q48868q1287
4664I128959j27404P34413K71681k6167N75316j66360j53763J39604J17572M40239
4654A0934090L09140P52579N9226J34824K50197n37164k04969l78022Q22506O57216
4644A2799623L51389L60799Q01531N37447k6266L21223P73469R83445P58775n3401
$$ plain form
4634 17608034 17759585 18572950 18761396 19603039 20048172 20099340 20849096 21670780 23197376
4625 23197376 24055486 24542233 25826335 27630843 28578862 29520138 30191567 31373039 33378129
4616 33378129 35613166 38280863 41250562 45367310 49253719 53528334 59044670 65593181
4608 65593181 72834502 79871819 84323780 87277371 89699187 93453816 100070167 108874365
4600 108874365 119324185 128035185 134108680 135761745 134428814 133246116 134349190 139981850
4592 139981850 148312301 155524057 160784213 159495575 151020989 140403812 131544338 126025254
4584 126025254 123817518 124544312 125339873 121923373 114267005 103594363 92080490 83113335
4576 83113335 77378203 73887809 71043563 66852458 62034571 55700704 48015296 42261586
$$ packed form
4634A7608034J51551Q13365J88446Q41643M45133N1168P49756Q21684J526596
4625B3197376Q58110M86747J284102J804508R48019R41276O71429J181472K005090
4616C3378129K235037K667697K969699M116748L886409M274615N516336O548511
4608F5593181P241321P037317M451961K953591K421816L754629O616351Q804198
4600A08874365J0449820Q711000O073495J653065j332931j182698J103074N632660
4592A39981850Q330451P211756N260156j288638q474586j0617177q859474n519084
4584A26025254k207736P26794P95561l416500p656368j0672642j1513873q967155
4576H3113335n735132l490394k844246m191105m817887o333867p685408n753710
$$ plain form
4568 42261586 37361085 33020505 29365310 26291062 24530922 22879811 20734031 19056811
4560 19056811 17389618 17388832 16689544 15067183 14578010 14544376 13987313 12945256 12132397 12259707
4550 12259707 12280011 11456166 10832507 10119033 9871960 9567846 9518074 8688317 8826236 8073757
4540 8073757 7703557 6723014 7505698 7312073 7921888 7352127 6608496 6302693 6079571 5834664
4530 5834664 5320048 5373732 4815485 4916025 5175452 5452054 4858301 5785409 5944221 5544348
4520 5544348 4370511 4931740 6096665 5494474 4408242 4875544 5020633 4227491 4108436
4511 4108436 4203442 4092495 4572265 4400887 4059389 3999392 3047356 2039702 3335651 3350584
4501 3350584 3803152 4346168 4767355 4566840 4451660 4207944 4066191 3366527 2991650 3116448
$$ packed form
4568D2261586m900501m340580l655195l074248j760140j651111k145780j677220
4560A9056811j667193p86o99288j622361m89173l3634n57063j042057q12859J27310
4550A2259707K0304q23845o23659p13474k47073l04114m9772q29757J37919p52479
4540H073757l70200r80543P82684j93625O09815n69761p43631l05803k23122k44907
4530E834664n14616N3684n58247J00540K59427K76602n93753R27108J58812l99873
4520E544348j173837N61229J164925o02191j086232M67302J45089p93142j19055
4511D108436R5006j10947M79770j71378l41498n9997r52036j007654J295949J4933
4501C350584M52568N43016M21187k00515j15180k43716j41753o99664l74877J24798
$$ plain form
4491 3116448 3744539 3485195 3344274 3081804 3491596 3826446 3476742 3263761 2988020 2008273
4481 2008273 2303615 3060601 2429868 3034628 3276009 2714394 2773178 2429311 2392484 3039878
4471 3039878 2960629 2606543 2437856 2605218 2493721 2395086 2038190 2171046 1460161 1701788
4461 1701788 2145349 2241731 1495701 1879129 2420156 1849934 1805741 1617629 1398033 1803988
4451 1803988 2345856 2670263 2797240 2655613 2303352 2097341 1641055 1625206 1208901 2170794
4441 2170794 1598963 1401351 1947769 2306549 2703915 2230476 1634396 1408978 2395930 2185257
4431 2185257 2868747 2393234 2376141 2275188 2150209 3032751 3188963 3474056 3467378 3198501
4421 3198501 3174899 2166202 2437197 2660468 2546333 3120140 3343751 2695733 2213937 2298525
$$ packed form
4491C116448O28091k59344j40921k62470M09792L34850l49704k12981k75741r79747
4481B008273K95342P56986o30733O04760K41381n61615N8784l43867l6827O47394
4471C039878p9249l54086j68687J67362j11497r8635l56896J32856p10885K41627
4461A701788M43561R6382p46030L83428N41027n70222m4193j88112k19596M05955
4451A803988N41868L24407J26977j41627l52261k06011m56286j5849m16305R61893
4441B170794n71831j97612N46418L58780L97366m73439n96080k25418R86952k10673
4431B185257O83490m75513j7093j00953j24979Q82542J56212K85093o678k68877
4421C198501k3602j008697K70995K23271j14135N73807K23611o48018m81796Q4588
$$ plain form
4411 2298525 2533830 2607528 2039123 2122899 1806486 2139357 2766746 2810879 3108673 2879002
4401 2879002 2408816 2786210 3175419 2589514 1820509 1777699 2490825 2533729 1312462 1082639
4391 1082639 1837959 2384066 1565717 2525501 2742573 2493860 2215046 2129077 2659955 2776531
4381 2776531 2475530 2372218 2615334 2479493 2879753 2238819 2664839 2327559 1910352 3115918
4371 3115918 2140339 2488200 3258561 3205600 3822735 4529211 3729637 3131401 3640479 4188120
4361 4188120 3872061 3789927 3525732 3160019 2916707 3485072 3651503 3930246 3529450 3850862
4351 3850862 3481794 2372571 2632325 2928540 2481376 2022319 3412156 3863141 3770318
4342 3770318 3783917 4291695 4594436 4161462 4318496 4660659 4324922 4369997 4824266 4765497
$$ packed form
4411B298525K35305P3698n68405Q3776l16413L32871O27389M4133K97794k29671
4401B879002m70186L77394L89209n85905p69005m2810P13126M2904j221267k29823
4391A082639P55320N46107q18349R59784K17072k48713k78814q5969N30878J16576
4381B776531l01001j03312K43116j35841M00260o40934M26020l37280m17207J205566
4371C115918r75579L47861P70361n2961O17135P06476p99574n98236N09078N47641
4361D188120l16059q2134k64195l65713k43312N68365J66431K78743m00796L21412
4351C850862l69068j109223K59754K96215m47164m59057J389837M50985r2823
4342C770318J3599N07778L02741m32974J57034L42163l35737M5075M54269n8769
$$ plain form
4332 4765497 4513285 4506798 4228115 4849424 5322074 5282865 4558934 4655296 4921011 4072922
4322 4072922 4202836 4875352 4508603 5477389 5135739 4994139 5240753 5166530 5944911 5854942
4312 5854942 5964084 6208639 6169362 6545367 6224383 5900959 6356299 6445321 6441811 7211230
4302 7211230 6893079 7649444 8355945 7559928 7626271 8244007 8590659 9544022 8978007 8613799
4292 8613799 8709179 9103094 8381240 8553949 9985082 10477086 10809672 10825149 10828131 11352782
4282 11352782 11189940 10841722 11482510 11881644 13530693 13851814 13975768 13775914 14258259
4273 14258259 14825464 14680035 15031371 16142412 15576691 15769445 16941490 17583183 18344388
4264 18344388 18445746 18664556 18701941 20227387 20303931 21334133 23355999 24236703 24189086
$$ packed form
4332D765497k52212o487k78683O21309M72650l9209p23931R6362K65715q48089
4322D072922J29914O72516l66749R68786l41650j41600K46614p4223P78381q9969
4312E854942J09142K44555l9277L76005l20984l23424M55340Q9022l510P69419
4302G211230l18151P56365P06501p96017O6343O17736L46652R53363n66015l64208
4292H613799R5380L93915p21854J72709J431133M92004L32586J5477K982N24651
4282A1352782j62842l48218O40788L99134J649049L21121J23954j99854M82345
4273A4258259N67205j45429L51336J111041n65721J92754J172045O41693P61205
4264A8344388J01358K18810L7385J525446P6544J030202K021866Q80704m7617
$$ plain form
4255 24189086 25429561 26650392 27265745 28672879 30172012 31784088 32990144 33967679
4247 33967679 35211956 37530074 39081161 40507931 42459498 45353300 47528032 48930364
4239 48930364 50740526 53372009 55860931 58936022 62119574 65683259 68041291 69989417
4231 69989417 72966611 76312258 79692121 82919915 86745645 90318254 92708010 95533690
4223 95533690 97607984 101338220 104511918 107108172 109146221 111094840 113986375 116608085
4215 116608085 118694023 120941707 122901147 123982032 125757786 127745680 128591812 129607461
4207 129607461 131333708 132042358 132900391 133693510 134585402 133346665 129341435 124472956 120246374
4198 120246374 116363572 112823211 109924912 106740491 102730962 99883821 95722080 93503933
$$ packed form
4255B4189086J240475J220831O15353J407134J499133J612076J206056R77535
4247C3967679J244277K318118J551087J426770J951567K893802K174732J402332
4239D8930364J810162K631483K488922L075091L183552L563685K358032J948126
4231F9989417K977194L345647L379863L227794L825730L572609K389756K825680
4223I5533690K074294L730236L173698K596254K038049J948619K891535K621710
4215A16608085K085938K247684J959440J080885J775754J987894Q46132J015649
4207A29607461J726247P08650Q58033P93119Q91892j238737m005230m868479m226582
4198A20246374l882802l540361k898299l184421m009529k847141m161741k218147
$$ plain form
4190 93503933 90685550 87267323 83908432 79824319 76259603 72412930 68771979 66507250
4182 66507250 63264020 60760374 58461451 55149261 52006532 49148393 46784798 44166492
4174 44166492 41754995 39868982 37171155 34584422 33430181 32121207 29893262 28389786
4166 28389786 27251755 25232858 22992051 22542510 22130240 20516538 20024008 18914607 18488551
4157 18488551 17180242 16039878 15242027 15234450 14011054 13806838 13469800 11874187 11665959
4148 11665959 12215257 12149768 12354421 11969997 11071225 10712501 10274171 9862236 9602747 9204626
4138 9204626 9030502 9031334 9030566 9157279 8619433 7792361 8306306 8366447 7624714 6961052 7348180
4127 7348180 7134322 6745245 7057440 6673862 6434990 6978464 6818068 6754096 7118089 7322108
$$ packed form
4190I3503933k818383l418227l358891m084113l564716l846673l640951k264729
4182F6507250l243230k503646k298923l312190l142729k858139k363595k618306
4174D4166492k411497j886013k697827k586733j154241j308974k227945j503476
4166B8389786j138031k018897k240807m49541m12270j613702m92530j109401m26056
4157A8488551j308309j140364p97851p577j223396k04216l37038j595613k08228
4148A1665959N49298o5489K04653l84424q98772l58724m38330m11935k59489l98121
4138I204626j74124Q32p68J26713n37846q27072N13945O0141p41733o63662L87128
4127G348180k13858l89077L12195l83578k38872N43474j60396o3972L63993K04019
$$ plain form
4117 7322108 7957388 6523435 6882284 7291938 6539488 5717491 5725262 6007489 6347559 6516806
4107 6516806 7051754 6420682 6269744 6649183 7075206 7031344 6599749 7019404 7292233 6928242
4097 6928242 6781954 7336145 7283272 7591530 7732646 7158912 6755855 7108859 6463890 6379777
4087 6379777 6375737 6667711 6682913 6967930 6415284 6552212 6616668 7372461 7409596 7193869
4077 7193869 7998000 7582767 7499796 7606607 7533737 7877426 7571212 7427088 7842033 7757053
4067 7757053 8289286 7805745 7793420 8896108 8639818 7911382 8737528 8681548 8180675 7636765
4057 7636765 8399729 8253652 8400910 9128077 9183320 9891629 9664666 9985373 9972697 9536988
4047 9536988 9743836 10080878 10356870 10515839 10098430 10133953 10622639 10144889 10490804 10506391
$$ packed form
4117G322108O35280j433953L58849M09654p52450q21997P771K82227L40070J69247
4107F516806N34948o31072j50938L79439M26023m3862m31595M19655K72829l63991
4097F928242j46288N54191n2873L08258J41116n73734m03057L53004o44969q4113
4087F379777m040K91974J5202K85017n52646J36928O4456P55793L7135k15727
4077G193869Q04131m15233q2971J06811p2870L43689l06214j44124M14945q4980
4067G757053N32233m83541j2325J102688k56290p28436Q26146n5980n00873n43910
4057G636765P62964j46077J47258P27167N5243P08309k26963L20707j2676m35709
4047I536988K06848L37042K75992J58969m17409L5523M88686m77750L45915J5587
$$ plain form
4037 10506391 11089486 11019604 10702724 11091572 11236794 10729180 11153180 11594328 11173562 11804287
4027 11804287 12081628 12641973 12147351 12059800 12621497 12354719 12157190 12377500 12167284 13025391
4017 13025391 13339208 13566895 13536745 14397473 15002947 14455711 14391674 14959275 15365906 15186570
4007 15186570 15794662 15776259 15898615 16427917 17150201 17974440 18619158 18617449 18986081 19549290
3997 19549290 19592167 19330513 20362181 20782195 21397813 22063934 23144028 23395674 23488865
3988 23488865 24576680 26137657 26385875 26406527 26527708 27001406 28120805 28536239 29501888
3979 29501888 30755607 31721612 33002246 33842765 34017870 34559710 35652781 36733712 38018658
3970 38018658 38795206 40270920 41911919 43643837 44380561 45487800 47918987 48943698
$$ packed form
4037A0506391N83095o9882l16880L88848J45222n07614M24000M41148m20766O30725
4027A1804287K77341N60345m94622q7551N61697k66778j97529K20310k10216Q58107
4017A3025391L13817K27687l0150Q60728O05474n47236o4037N67601M06631j79336
4007A5186570O08092j8403J22356N29302P22284Q24239O44718j709L68632N63209
3997A9549290M2877k61654J031668M20014O15618O66121J080094K51646R3191
3988B3488865J087815J560977K48218K0652J21181M73698J119399M15434R65649
3979B9501888J253719R66005J280634Q40519J75105N41840J093071J080931J284946
3970C8018658P76548J475714J640999J731918P36724J107239K431187J024711
$$ plain form
3962 48943698 50612391 52474254 54446800 56237083 57579304 60389016 63055584 66015257
3954 66015257 68769156 70254836 73625128 75577018 78920718 82969768 86068026 90299742
3946 90299742 94711699 99182832 104251903 108693574 114783072 120782087 127581694 134418645
3938 134418645 141039403 149195777 158644155 168935419 178488844 189590177 201635173 213933657
3930 213933657 227422977 240758232 253856685 266476623 277171177 286942832 295311835
3923 295311835 300821996 305119820 307994323 308041842 307129372 306093101 303026052 301015500
3915 301015500 298781258 294921414 291122738 285355745 278882701 271725727 262553434 251106184
3907 251106184 238734423 225924638 212496563 199001255 185818284 172004404 159778062
$$ packed form
3962D8943698J668693J861863J972546J790283J342221K809712K666568K959673
3954F6015257K753899J485680L370292J951890L343700M049050L098258M231716
3946I0299742M411957M471133N069071M441671O089498N999015O799607O836951
3938A34418645O620758Q156374R448378J0291264R553425J1101333J2044996J2298484
3930B13933657J3489320J3335255J3098453J2619938J0694554R771655Q369003
3923B95311835N510161M297824K874503M7519r12470j036271l067049k010552
3915C01015500k234242l859844l798676n766993o473044p156974r172293j1447250
3907B51106184j2371761j2809785j3428075j3495308j3182971j3813880j2226342
$$ plain form
3900 159778062 148845791 138633898 129776757 120436931 112424168 105869008 99658823 93968139
3892 93968139 89182988 85105525 81311002 77328378 74286340 71717856 68760488 65790584
3884 65790584 64193969 61915650 60319738 58405383 56158669 54849799 53516325 52163560
3876 52163560 51439253 50957072 50291956 49454056 48266415 47081761 46483114 46457078 46103940
3867 46103940 45730573 45375165 45746960 45370574 44698205 45194184 45115773 45143908 46390958 46279036
3857 46279036 45733773 47310434 47797350 48965710 50742837 50942414 51142540 51784295 51780425
3848 51780425 52512779 53231396 53217598 54339558 54585550 55067726 55115654 55754610 56164889 56252308
3838 56252308 56297839 56311189 56249842 55431152 55349777 55022666 54505960 54170307 53206812 52945701
$$ packed form
3900A59778062j0932271j0211893q857141r339826q012763o555160o210185n690684
3892I3968139m785151m077463l794523l982624l042038k568484k957368k969904
3884F5790584j596615k278319j595912j914355k246714j308870j333474j352765
3876E2163560p24307m82181o65116q37900j187641j184654n98647k6036l53138
3867D6103940l73367l55408L71795l76386o72369M95979p8411K8135J247050j11922
3857D6279036n45263J576661M86916J168360J777127J99577K00126O41755l870
3848E1780425P32354P18617j3798J121960K45992M82176M7928O38956M10279Q7419
3838E6252308M5531J3350o1347q18690q1375l27111n16706l35653r63495k61111
$$ plain form
3828 52945701 53166971 54174562 53836425 54281846 52934577 53276208 52603541 52805210 53478604
3819 53478604 53017382 53421260 54887878 56120425 55823432 57481620 58102905 58361916 60412193
3810 60412193 62433779 64628388 67646725 69453591 72022904 74356341 77653397 82059917
3802 82059917 85658624 89348334 93647455 97018525 100441834 105002070 108878476 112672663
3794 112672663 117053338 121264790 124433856 127135252 130066031 132934065 136417177 138875483
3786 138875483 141010946 143464238 146028151 148011828 149673975 149829213 149666063 150180017
3778 150180017 149990045 148977253 147863082 147507532 146445918 145611827 146026365 145113064 143804640
3769 143804640 144461754 144046563 142677571 142953089 143140828 142480763 141040310 141173533 141692145
$$ packed form
3828E2945701K21270J007591l38137M45421j347269L41631o72667K01669O73394
3819E3478604m61222M03878J466618J232547k96993J658188O21285K59011K050277
3810F0412193K021586K194609L018337J806866K569313K333437L297056M406520
3802H2059917L598707L689710M299121L371070L423309M560236L876406L794187
3794A12672663M380675M211452L169066K701396K930779K868034L483112K458306
3786A38875483K135463K453292K563913J983677J662147J55238j63150N13954
3778A50180017j89972j012792j114171l55550j061614q34091M14538r13301j308424
3769A43804640O57114m15191j368992K75518J87739o60065j440453J33223N18612
$$ plain form
3760 141692145 141188935 141288445 140761908 140441615 140238809 140544027 140481167 140250929 139253316 139385707
3750 139385707 138558367 138168820 137533421 136632153 135052848 132437052 130465257 127444755 124374631
3741 124374631 120195727 117039389 113436288 110133386 105541518 101812543 98300187 95043133
3733 95043133 91039941 87255111 84053976 79579387 75509697 72622001 68457739 64945104
3725 64945104 61643939 58171204 55527450 53274590 51674962 49205068 47242330 45826323
3717 45826323 45031313 43406760 43054198 41976944 40807170 40238340 40077387 39870620 39392606
3708 39392606 38656976 39288248 39163082 38912165 39204730 39941068 39753254 39356925 39539573
3699 39539573 39326386 40116980 40394989 40531190 40325216 39962626 39750426 38953570 38184564
$$ packed form
3760A41692145n03210R9510n26537l20293k02806L05218o2860k30238r97613J32391
3750A39385707q27340l89547o35399r01268j579305k615796j971795l020502l070124
3741A24374631m178904l156338l603101l302902m591868l728975l512356l257054
3733I5043133m003192l784830l201135m474589m069690k887696m164262l512635
3725F4945104l301165l472735k643754k252860j599628k469894j962738j416007
3717D5826323p95010j624553l52562j077254j169774n68830j60953k06767m78014
3708C9392606p35630O31272j25166k50917K92565P36338j87814l96329J82648
3699C9539573k13187P90594K78009J36201k05974l62590k12200p96856p69006
$$ plain form
3690 38184564 38109215 37331685 36883523 35657726 35472965 34125676 33430687 32998903 31813197
3681 31813197 30328099 28647557 28058217 26736043 25351583 24694492 23365932 22027124
3673 22027124 21364865 21522654 19029414 17342716 16414775 16349847 15475036 14069294 14042754
3664 14042754 13023227 12513556 12514235 12566475 12207184 11142515 10245208 9872324 10270021 9357001
3654 9357001 9218483 9255269 8656054 7908347 6815188 7117264 8166801 8379720 7560473
3645 7560473 7872976 6845275 6679213 6595724 6415351 6937438 6667664 6489067 6927423 5139196
3635 5139196 5104750 5462538 5742626 5437926 5040936 4416319 4769790 5787058 5114721 4559537
3625 4559537 5510200 5620414 4950671 4718074 5190815 5751080 4685578 4155639 4424858
$$ packed form
3690C8184564p5349p77530m48162j225797j84761j347289o94989m31784j185706
3681C1813197j485098j680542n89340j322174j384460o57091j328560j338808
3673B2027124o62259J57789k493240j686698r27941o4928q74811j405742k6540
3664A4042754j019527n09671O79N2240l59291j064669q97307l72884L97697r13020
3654I357001j38518L6786n99215p47707j093159L02076J049537K12919q19247
3645G560473L12503j027701j66062q3489j80373N22087k69774j78597M38356j788227
3635E139196l4446L57788K80088l04700l96990o24617L53471J017268o72337n55184
3625D559537R50663J10214o69743k32597M72741N60265j065502n29939K69219
$$ plain form
3616 4424858 4723751 4884819 4467777 3762050 3755134 3830311 3654543 3369106 3611920 2647029
3606 2647029 2812815 2923732 3422016 3616396 3277885 3042057 3783127 3526065 2462884
3597 2462884 2748084 2523582 2160768 1094982 2002208 2410716 2678450 1705638 951416
3588 951416 1228668 1037975 1075534 1296536 1216843 1981642 1526756 1424285 2076430 2343456
3578 2343456 2053948 1615533 2156733 1859116 1185497 2223639 2233954 1389566 978772 1352207
3568 1352207 1117295 1465452 1555633 1300346 1165293 794542 823082 1338318 1666490 1623095
3558 1623095 1809663 2089199 2265579 1139454 1061753 770953 897879 1434830 1146402 1147748
3548 1147748 1597980 1796361 2270623 1452142 1694029 1484228 1176300 1486361 1198391 460562
$$ packed form
3616D424858K98893J61068m17042p05727o916P5177j75768k85437K42814r64891
3606B647029J65786J10917M98284J94380l38511k35828P41070k57062j063181
3597B462884K85200k24502l62814j065786R07226M08508K67734r72812p54222
3588I51416K77252j90693L7559K21002p9693P64799m54886j02471O52145K67026
3578B343456k89508m38415N41200k97617o73619J038142J0315q44388m10794L73435
3568A352207k34912L48157R0181k55287j35053l70751K8540N15236L28172m3395
3558A623095J86568K79536J76380j126125p7701k90800J26926N36951k88428J346
3548A147748M50232J98381M74262q18481K41887k09801l07928L10061k87970p37829
$$ plain form
3538 460562 1349810 1197840 1340401 1583036 1395572 912280 1220930 1610375 196355 -174844
3528 -174844 608665 941702 1276465 1021067 698511 1174683 1022994 2391827 1756175 1371306
3518 1371306 1424806 1319985 1227089 1478932 902270 292253 761224 504065 1400768 1061872
3508 1061872 1363654 1647589 1452515 2072599 1231978 963899 836327 1168164 1181714 1017080
3498 1017080 772304 -83882 190981 1162362 1245200 387150 1619468 1430615 895715 992683
3488 992683 622594 1014728 1518671 1647687 2699041 3004536 2366648 1767721 1607291 1409416
3478 1409416 1598523 568729 1078697 667880 837692 978962 939673 1682298 1018780 820932
3468 820932 509843 931353 1105698 338260 -128204 1014617 1050288 1482405 1714933 961110
$$ packed form
3538D60562Q89248j51970J42561K42635j87464m83292L08650L89445j414020l71199
3528a74844P83509L33037L34763k55398l22556M76172j51689J368833o35652l84869
3518A371306N3500j04821r2896K51843n76662o10017M68971k57159Q96703l38896
3508A061872L01782K83935j95074O20084q40621k68079j27572L31837J3550j64634
3498A017080k44776q56186K74863R71381Q2838q58050J232318j88853n34900R6968
3488I92683l70089L92134N03943J29016J051354L05495o37888n98927j60430j97875
3478A409416J89107j029794N09968m10817J69812J41270l9289P42625o63518j97848
3468H20932l11089M21510J74345p67438m66464J142821L5671M32117K32528p53823
$$ plain form
3458 961110 1231485 1491121 1795636 1559886 1543797 1143906 1144210 1370696 1405831 2033371 1985274
3447 1985274 1198469 843365 1652609 1373079 1718985 958612 958136 1358721 2236656 2277095
3437 2277095 1121237 1789489 2302813 1545044 1513698 1067088 385643 1152607 1940850 1976633
3427 1976633 2741629 1955450 2037771 3050114 2931480 2695168 2708355 3168748 3796222 3165577
3417 3165577 2386625 2938995 2426061 2136043 1845000 2062931 1845811 1828777 1958957 1902158
3407 1902158 1622936 1219158 536577 573549 647186 117744 903554 1270185 187808 195511
3397 195511 858211 682006 1035366 793001 1276164 1281358 106060 -288963 769038 1329529
3387 1329529 531679 -95493 522230 1112457 132278 581670 484036 -46628 483777 791983
$$ packed form
3458I61110K70375K59636L04515k35750j6089l99891L04K26486L5135O27540m8097
3447A985274p86805l55104Q09244k79530L45906p60373m76M00585Q77935M0439
3437B277095j155858O68252N13324p57769l1346m46610o81445P66964P88243L5783
3427A976633P64996p86179Q2321J012343j18634k36312J3187M60393O27474o30645
3417C165577p78952N52370n12934k90018k91043K17931k17120j7034J30180n6799
3407A902158k79222m03778o82581L6972P3637n29442P85810L66631j082377P703
3397A95511O62700j76205L53360k42365M83163N194j175298l95023J058001N60491
3387A329529p97850o27172O17723N90227r80179M49392r7634n30664N30405L08206
$$ plain form
3377 791983 871348 362790 761887 228691 123928 428900 663331 771422 514636 750353
3367 750353 1091648 1617602 1477458 1229153 648949 970147 1138455 1581234 1867489 1825876
3357 1825876 3033375 2130557 1705524 1937608 2037216 1828217 2937429 3288033 2375450
3348 2375450 1965799 1820904 2158093 1323597 869117 877067 1229260 1856549 878125 828448
3338 828448 925276 767818 163816 212076 639567 540117 1236995 126205 -226937 186332
3328 186332 116733 -599357 -650582 -469947 -227570 395332 756448 791430 316968 -124136
3318 -124136 -322171 201676 927643 366074 758434 764876 684182 221653 -188457 78051
3308 78051 -465868 -546340 -341404 -276721 -994554 -1238999 -854841 -828512 -333179 -304377 -483630
$$ packed form
3377G91983P9365n08558L99097n33196j04763L04972K34431J08091k56786K35717
3367G50353L41295N25954j40144k48305n80204L21198J68308M42779K86255m1613
3357A825876J207499r02818m25033K32084R9608k08999J109212L50604r12583
3348B375450m09651j44895L37189q34496m54480P950L52193O27289r78424m9677
3338H28448R6828j57458o04002M8260M27491r9450O96878j110790l53142M13269
3328A86332o9599p16090n1225J80635K42377O22902L61116L4982m74462m41104
3318a24136j98035N23847P25967n61569L92360O442q0694m62529m10110K66508
3308G8051n43919q0472K04936O4683p17833k44445L84158K6329M95333K8802j79253
$$ plain form
3297 -483630 -447650 265376 879651 189371 296480 932683 681811 692718 86283 -246323
3287 -246323 -270578 -862389 -847354 -408974 -312526 227318 508730 -50753 -642278 -612835
3277 -612835 -570761 179275 165163 -61777 817383 488015 207504 -236933 -353688 -319873
3267 -319873 -388151 -15559 -144673 240103 -62571 60019 -278589 -37128 290502 -330460
3257 -330460 634973 1547430 1253187 927643 935450 508509 162976 997665 1309776 330260
3247 330260 -383391 -327512 74860 -81233 40274 114320 542795 752500 -5734 504039
3237 504039 296219 375009 590373 270060 400871 605629 219799 -240931 457621 1088867
3227 1088867 1161282 915669 -191052 -222534 -139747 -906360 -972365 -131568 726477 561846
$$ packed form
3297d83630L5980P13026O14275o90280J07109O36203k50872J0907o06435l32606
3287b46323k4255n91811J5035M38380R6448N39844K81412n59483n91525K9443
3277f12835M2074P50036j4112k26940Q79160l29368k80511m44437j16755L3815
3267c19873o8278L72592j29114L84776l02674J22590l38608K41461L27630o20962
3257c30460R65433R12457k94243l25544P807m26941l45533Q34689L12111r79516
3247C30260p13651N5879M02372j56093J21507P4046M28475K09705p58234N09773
3237E04039k07820P8790K15364l20313J30811K04758l85830m60730O98552O31246
3227A088867P2415k45613j106721l1482Q2787p66613o6005Q40797Q58045j64631
$$ plain form
3217 561846 342920 83225 -414632 -392185 157532 -741796 -1088498 -954470 -217624 183556
3207 183556 282694 -560232 -277388 -191297 201255 -173900 -710986 -188754 424041 -490655
3197 -490655 -478548 -224850 -601201 -554018 152949 948356 173161 -810699 -631782 -886960
3187 -886960 -627907 -428582 -372780 20401 -406669 -536116 -392862 -29354 -564582 -675638
3177 -675638 -289404 613980 -55306 -405293 95867 531265 -288828 32875 -208850 -252342
3167 -252342 628815 26933 -340699 -1603 -281414 -367078 -207827 -216333 -170098 -101115 -1034316
3156 -1034316 -597777 269996 251364 -13019 -229011 -19611 -646100 -219526 -36664 -473158
3146 -473158 -1442121 -582591 -218740 -177132 139823 -276111 -262198 150902 207338 165592
$$ packed form
3217E61846k18926k59695m97857K2447N49717q99328l46702J34028P36846M01180
3207A83556R9138q42926K82844Q6091L92552l75155n37086N22232O12795r14696
3197d90655J2107K53698l76351M7183P06967P95407p75195r83860J78917k55178
3187h86960K59053J99325N5802L93181m27070j29447J43254L63508n35228j11056
3177f75638L86234R03384o69286l49987N01160M35398q20093L21703k41725m3492
3167b52342Q81157o01882l67632L39096k79811q5664J59251q506M6235O8983r33201
3156a034316M36539Q67773j8632k64383k15992K09400o26489M26574J82862m36494
3146d73158r68963Q59530L63851M1608L16955m15934J3913M13100N6436m1746
$$ plain form
3136 165592 326065 585026 40333 76120 -515324 -408344 608234 44242 296687 751950
3126 751950 500101 524076 643708 19323 201021 627361 515333 728273 879385 690751
3116 690751 982905 278895 -240725 -66643 317831 27519 -33220 556055 605117 66180
3106 66180 -189428 -382229 -517825 249757 -58212 77081 -69246 -82016 241859 693013
3096 693013 972742 616052 961293 438758 141906 -10120 -45092 -105603 -379484 175095
3086 175095 -207298 -467068 -219380 232818 707965 494047 950272 457951 469560 -93888
3076 -93888 553103 620697 -138456 516851 399687 494031 -264447 -86210 528914 -572742
3066 -572742 -259108 140418 447700 647982 438577 610982 374512 62674 21666 74569
$$ packed form
3136A65592J60473K58961n44693L5787n91444J06980J016578n63992K52445M55263
3126G51950k51849K3975J19632o24385J81698M26340j12028K12940J51112j88634
3116F90751K92154p04010n19620J74082L84474k90312o0739N89275M9062n38937
3106F6180k55608j92801j35596P67582l07969J35293j46327j2770L23875M51154
3096F93013K79729l56690L45241n22535k96852j52026l4972o0511k73881N54579
3086A75095l82393k59770K47688M52198M75147k13918M56225m92321J1609n63448
3076i3888O46991O7594p59153O55307j17164R4344p58478J78237O15124j101656
3066e72742L13634L99526L07282K00282k09405J72405k36470l11838m1008N2903
$$ plain form
3056 74569 335700 331501 106295 -316807 -972145 -699604 151104 109732 231947 156270 1045721
3045 1045721 818735 506616 572607 755697 999983 623137 707151 144914 162541 117437
3035 117437 318695 429073 190010 544736 572719 -398557 -405217 -458798 -474011 91954 253603
3024 253603 -15905 -79801 -145744 82328 594674 240292 -378736 -417364 -386902 680584
3014 680584 650694 150477 -155364 -592413 -692934 -83622 52910 139594 -500766 -830867
3004 -830867 -221782 3503 -639027 -324048 -1029614 -830126 175968 515781 476599 582993
2994 582993 64594 -772333 -507143 -2657 419916 307272 604239 503784 -606674 -1126891
2984 -1126891 -685102 -521020 -325917 -1015635 -1064807 -1001574 -701189 -1310526 -1041549 -585704
$$ packed form
3056G4569K61131m199k25206m23102o55338K72541Q50708m1372J22215p5677Q89451
3045A045721k26986l12119O5991J83090K44286l76846Q4014n62237J7627m5104
3035A17437K01258J10378k39063L54726K7983r71276o660n3581j5213N65965J61649
3024B53603k69508o3896o5943K28072N12346l54382o19028l8628L0462J067486
3014F80584k9890n00217l05841m37049j00521O09312J36532Q6684o40360l30101
3004h30867O09085K25285o42530L14979p05566J99488J006094L39813l9182J06394
2994E82993n18399q36927K65190N04486M22573j12644K96967j00455j110458n20217
2984a126891M41789J64082J95103o89718m9172O3233L00385o09337K68977M55845
$$ plain form
2974 -585704 -192774 -16151 64394 -199793 -765203 -1073046 -1250239 -619376 -57398 -132218
2964 -132218 666710 -427879 -578054 357146 261764 152481 65792 -34692 -384403 -83081
2954 -83081 425245 150390 -223182 447201 619054 -438175 -999939 -994271 -891988 -756593
2944 -756593 -18254 576392 277423 606980 50945 -25545 289079 453733 240632 360371
2934 360371 -966086 -500845 -3385 469230 483647 -85754 -542116 -225847 -61406 -426002
2924 -426002 -495130 81636 -190961 -268282 -208454 -960738 -543434 86275 505193 382451
2914 382451 -207380 -1440654 -699779 -908635 -761686 -565354 -1050623 -747787 -493455 -300278
2904 -300278 -768345 -722088 -469633 -525511 -1164724 -972014 -499014 -86679 161788 -199825
$$ packed form
2974e85704L92930J76623Q0545k64187n65410l07843j77193O30863N61978p4820
2964a32218P98928j094589j50175R35200r5382j09283q6689j00484l49711L01322
2954h3081N08326k74855l73572O70383J71853j057229n61764N668J02283J35395
2944g56593P38339N94646k98969L29557n56035p6490L14624J64654k13101J19739
2934C60371j326457M65241M97460M72615J4417n69401m56362L16269J64441l64596
2924d26002o9128N76766k72597p7321N9828p52284M17304O29709M18918j22742
2914C82451n89831j233274P40875k08856J46949J96332m85269L02836K54332J93177
2904c00278m68067M6257K52455n5878o39213J92710M73000M12335K48467l61613
$$ plain form
2894 -199825 -277061 -748403 -527390 -1387077 -1266629 -598707 136594 232841 -426850 -912788
2884 -912788 -196296 -310320 -775135 -1264723 -957600 -1104157 -1418695 -1398299 -802751 -196177
2874 -196177 -6529 92071 118304 -546617 -411502 162751 52117 169055 -591032 78898
2864 78898 405209 -31139 -359918 -40898 -99353 2820 -259481 -1116946 -408668 216473
2854 216473 86423 -182040 -719437 -877687 -407720 -222500 117481 -148869 -228648 294190
2844 294190 -571870 -651592 -414870 -524142 -319518 -124945 -473993 -481568 70702 452446
2834 452446 393271 65499 8051 53231 -263557 -374824 -510274 -174845 -455106 -967912
2824 -967912 -1388583 -895528 -644240 35778 -15611 -655767 342168 -209262 -151532 130338
$$ packed form
2894a99825p7236m71342K21013q59687J20448O67922P35301R6247o59691m85938
2884i12788P16492j14024m64815m89588L07123j46557l14538K0396N95548O06574
2874a96177J89648R8600K6233o64921J35115N74253j10634J16938p60087O69930
2864G8898L26311m36348l28779L19020n8455J02173k62301q57465P08278O25141
2854B16473j30050k68463n37397j58250M69967J85220L39981k66350p9779N22838
2844B94190q66060p9722K36722j09272K04624J94573l49048p575N52270L81744
2834D52446n9175l27772n7448M5180l16788j11267j35450L35429k80261n12806
2824i67912m20671M93055K51288O80018n1389o40156R97935n51430N7730K81870
$$ plain form
2814 130338 238050 327870 -1023524 -544195 -71824 -847586 -813208 -146053 52170 413729
2804 413729 342343 -656674 -1251616 -812539 -550739 -752107 -675121 -489558 -715297 -465597
2794 -465597 345498 90041 461087 -181490 -942295 -111611 -859765 -435578 127621 -216746
2784 -216746 -936082 -628217 385416 296889 319659 40824 -260808 45285 -243953 -393753
2774 -393753 -19759 583907 175900 -68627 -139441 -57937 139551 -8384 200190 -4744
2764 -4744 -470491 -644040 -925481 154433 768888 359021 249293 -16786 152908 -682442
2754 -682442 -268284 399979 700038 -428207 -650786 -608089 -390616 -286098 -405770 84418
2744 84418 46614 154261 -480675 -761372 -70011 166320 -152130 -44067 -198455 -75609
$$ packed form
2814A30338J07712Q9820j351394M79329M72371p75762L4378O67155J98223L61559
2804D13729p1386r99017n94942M39077K61800k01368P6986J85563k25739K49700
2794d65597Q11095k55457L71046o42577p60805Q30684p48154M24187N63199l44367
2784b16746p19336L07865J013633q8527K2770k78835l01632L06093k89238j49800
2774c93753L73994O03666m08007k44527p0814Q1504J97488j47935K08574k04934
2764d744m65747j73549k81441J079914O14455m09867j09728k66079J69694q35350
2754f82442M14158O68263L00059j128245k22579M2697K17473J04518j19672M90188
2744H4418l7804J07647o34936k80697O91361K36331l18450J08063j54388J22846
$$ plain form
2734 -75609 499379 -55892 32760 -752296 -13711 305391 107996 198285 506871 130029
2724 130029 42573 -179870 35199 -349892 -532469 -838666 -1291356 132594 510982 -183052
2714 -183052 -831558 -214980 59926 -663337 -1576724 -1245977 -497599 40406 -32994 53853
2704 53853 301866 -10519 -589461 -507104 -481159 -326310 483297 364820 73827 -27321
2694 -27321 452610 -41951 -866087 -167074 -320552 -414511 -405152 -198460 324381 -113975
2684 -113975 -379311 -598668 -588726 -759150 -969411 -835138 -528640 257012 492872 -51232
2674 -51232 -930402 -779038 -1765389 -1187042 -786186 -760003 -838631 -1038454 -106141 523319
2664 523319 293571 22929 -397308 -21876 -269038 -259475 -459841 -124332 760184 876750
$$ packed form
2734g5609N74988n55271Q8652p85056P38585L19102j97395R0289L08586l76842
2724A30029q7456k22443K15069l85091j82577l06197m52690J423950L78388o94034
2714a83052o48506O16578K74906p23263r13387L30747P48378N38005p3400Q6847
2704E3853K48013l12385n78942Q2357K5945J54849Q09607j18477k90993j01148
2694b7321M79931m94561q24136O99013j53478r3959R359K06692N22841m38356
2684a13975k65336k19357R942j70424k10261J34273L06498P85652K35860n44104
2674e1232q79170J51364r86351N78347M00856K6183p8628j99823R32313O29460
2664E23319k29748k70642m20237L75432k47162R563k00366L35509Q84516J16566
$$ plain form
2654 876750 274629 267842 -735797 -984192 -63822 123009 -357658 -682997 -288846 -362403
2644 -362403 242472 -180543 164021 900247 277771 -703884 -502394 26083 -840942 -1323516
2634 -1323516 -362652 443401 -46841 -685794 -729043 -312490 233370 -419682 -484000 -563384
2624 -563384 -657102 -16140 242900 732944 385796 210348 -148262 -115355 1458 -517053
2614 -517053 -26978 185990 -85992 -829696 85434 -214599 -383734 -342861 -677915 -375930
2604 -375930 -557959 -970853 -72651 251399 369175 -670468 -454042 542786 133564 160619
2594 160619 181702 830810 930033 266389 386721 -34514 -820906 -578664 -217454 -295610
2584 -295610 393379 1032716 -120442 -84941 -335337 -631926 -526161 97980 810266 1276570
$$ packed form
2654H76750o02121o787j003639k48395R20370J86831m80667l25339L94151p3557
2644c62403O04875m23015L44564P36226o22476r81655K01490N28477q67025m82574
2634a323516R60864Q06053m90242o38953m3249M16553N45860o53052o4318p9384
2624e63384r3718O40962K59040M90044l47148j75448l58610L2907J16813n18511
2614e17053M90075K12968k71982p43704R15130l00033j69135M0873l35054L01985
2604c75930j82029m12894Q98202L24050J17776j039643K16426R96828m09222K7055
2594A60619K1083O49108R9223o63644J20332m21235p86392K42242L61210p8156
2584b95610O88989O39337j153158L5501k50396k96589J05765O24141P12286M66304
$$ plain form
2574 1276570 -296171 -528632 -120894 -39051 506205 -681404 -849336 -201932 133611
2565 133611 -1006919 -1061563 170770 197952 -19279 -326397 -26760 -724689 -1750266 -1427683
2555 -1427683 -1060783 -854270 -1135996 -1165327 -836468 -1055793 -1104701 -1114000 -1155482 -46204
2545 -46204 -158657 -129582 -39692 -157226 -696235 -947546 -634140 -565394 173425 441782
2535 441782 -51676 -36578 323464 659910 398601 287496 -856079 -742353 -772756 -457795
2525 -457795 154353 -794650 -491876 -503399 -799546 -805808 -432270 -148796 -377105 -290350
2515 -290350 95059 280778 440207 699283 424055 -500179 -510028 -362079 181868 -701775
2505 -701775 -438416 396024 381743 -41367 48044 48614 -243578 420139 933403 403852 232518
$$ packed form
2574A276570j572741k32461M07738Q1843N45256j187609j67932O47404L35543
2565A33611j140530n4644J232333K7182k17231l07118K99637o97929j025577L22583
2555a427683L66900K06513k81726k9331L28859k19325m8908r299m1482J109278
2545d6204j12453K9075Q9890j17534n39009k51311L13406O8746P38819K68357
2535D41782m93458J5098L60042L36446k61309j11105j143575J13726l0403L14961
2525d57795O12148r49003L02774j1523k96147o262L73538K83474k28309Q6755
2515b90350L85409J85719J59429K59076k75228r24234r849J47949N43947q83643
2505g01775K63359Q34440j4281m23110Q9411N70k92192O63717N13264n29551j71334
$$ plain form
2494 232518 519088 85848 89871 146841 -496711 -756804 -478365 -537527 -716086 25852
2484 25852 294401 -156599 -215888 -1064830 -766001 -137352 23102 493235 -488087 -373922
2474 -373922 464558 83045 -616922 -871207 -1033467 -792193 -1017446 -1349859 -410269 -255213
2464 -255213 -230781 45718 -230878 -27192 465250 -225785 -48718 -142357 -569492 -791388
2454 -791388 -486581 -890585 -1044312 -1291331 -819231 -877744 -1061690 198505 718092 60529
2444 60529 -1352133 -865330 -417215 -10433 122179 -368843 -640716 -555182 -1696905 -1753634
2434 -1753634 -1091924 -512548 -35946 -36005 178587 -494246 144909 236770 206686 108922 769591
2423 769591 1283312 757459 659388 78210 484766 407798 361991 212154 292791 678819
$$ packed form
2494B32518K86570m33240M023N6970o43552k60093K78439n9162j78559P41938
2484B5852K68549m51000n9289q48942K98829O28649J60454M70133r81322J14165
2474c73922Q38480l81513o99967k54285j62260K41274k25253l32413R39590J55056
2464b55213K4432K76499k76596K03686M92442o91035J77067r3639m27135k21896
2454g91388L04807m04004j53727k47019M72100n8513j83946J260195N19587o57563
2444F0529j412662M86803M48115M06782J32612m91022k71873Q5534j141723n6729
2434a753634O61710N79376M76602n9K14592o72833O39155R1861l0084r7764O60669
2423G69591N13721n25853r8071n81178M06556p6968m5807j49837Q0637L86028
$$ plain form
2413 678819 412636 -324614 -673580 -347373 -388182 -715528 33381 -87651 -257602 421238
2403 421238 450755 335209 -194094 574189 -8795 -271397 306294 93226 433704 -83353
2393 -83353 -533957 -264595 328734 382820 328800 283338 632500 657759 356762 -281743 -96730
2382 -96730 842056 805807 837210 333939 5625 -78850 -148166 -467144 -313929 291727 242366
2371 242366 678208 -362561 -221789 249416 -299133 -75258 72873 622936 473425 299250
2361 299250 494241 365987 369796 -364730 -474915 -176193 -628430 -277192 88418 -211715
2351 -211715 130213 360304 42858 127546 -415960 -415267 -294414 19563 657272 817198
2341 817198 330971 216293 832479 1499229 1406934 525109 -190099 282602 487286 -335127
$$ packed form
2413F78819k66183p37250l48966L26207m0809l27346P48909j21032j69951O78840
2403D21238K9517j15546n29303P68283n82984k62602N77691k13068L40478n17057
2393h3353m50604K69362N93329N4086n4020m5462L49162K5259l00997o38505J85013
2382i6730R38786l6249L1403n03271l28314q4475o9316l18978J53215O05656m9361
2371B42366M35842j040769J40772M71205n48549K23875J48131N50063j49511j74175
2361B99250J94991j28254L809p34526j10185K98722m52237L51238L65610l00133
2351b11715L41928K30091l17446Q4688n43506O93J20853L13977O37709J59926
2341H17198m86227j14678O16186O66750r2295q81825p15208M72701K04684q22413
$$ plain form
2331 -335127 -133154 348361 669280 390916 -43624 549195 945791 825986 244871 60393
2321 60393 -21650 1224085 2123031 1579692 1874386 2006120 1659388 2065102 1982214 2101222
2311 2101222 2480193 2582437 3621981 4355213 6212416 7849942 9287845 10629854 10450804
2302 10450804 7679926 4938712 3578504 2494188 2012738 1247490 1329245 385730 1075665
2293 1075665 877204 1268885 1638617 635466 524992 906048 797120 222972 -431012
2284 -431012 327198 688451 237014 -87023 274766 733363 149398 106285 326049 137671
2274 137671 -340487 570825 -10770 -20390 -450466 251391 227861 -129662 -19632 -181302
2264 -181302 -422200 -117693 -332298 -391337 -353647 -308178 -561905 -333532 102131 236620
$$ packed form
2331c35127K01973M81515L20919k78364m34540N92819L96596j19805n81115j84478
2321F0393q2043J245735Q98946n43339K94694J31734l46732M05714q2888J19008
2311B101222L78971J02244J039544P33232J857203J637526J437903J342009j79050
2302A0450804k770878k741214j360208j084316m81450p65248Q1755r43515O89935
2293A075665j98461L91681L69732j003151j10474L81056j08928n74148o53984
2284d31012P58210L61253m51437l24037L61789M58597n83965m3113K19764j88378
2274A37671m78158R11312n81595r620m30076P01857k3530l57523J10030j61670
2264a81302k40898L04507k14605n9039L7690M5469k53727K28373M35663J34489
$$ plain form
2254 236620 -41460 35344 55098 -905255 -360043 -199668 -487341 -610255 -272197 -265580
2244 -265580 85217 -203881 616111 496685 158496 841157 478563 61804 477305 291054
2234 291054 394990 332425 935050 30934 -715896 -397468 449388 663818 -330740 -612436
2224 -612436 -1054055 200958 964375 318564 -132930 -142174 -38078 -171811 -517026 219269
2214 219269 17816 214555 408841 359758 852963 1160806 584558 428931 -782376 -896674
2204 -896674 -445126 -196630 16256 -374656 -253712 -184084 -552461 -1074068 -627449 -337820
2194 -337820 113940 -381683 -674307 -681187 -401248 113959 95812 -406403 -504710 -931326
2184 -931326 -851969 -151710 -357667 -210184 -947935 -1183172 -462837 44392 130395 -636031
$$ packed form
2254B36620k78080P6804J9754r60353N45212J60375k87673j22914L38058O617
2244b65580L50797k89098Q19992j19426l38189O82661l62594m16759M15501j86251
2234B91054J03936o2565O02625r04116p46830L18428Q46856K14430r94558k81696
2224f12436m41619J255013P63417o45811m51494r244J04096j33733l45215P36295
2214B19269k01453J96739J94286m9083M93205L07843n76248j55627j211307j14298
2204h96674M51548K48496K12886l90912J20944O9628l68377n21607M46619K89629
2194c37820M51760m95623k92624o880K79939N15207j8147n02215r8307m26616
2184i31326P9357P00259k05957J47483p37751k35237P20335N07229Q6003p66426
$$ plain form
2174 -636031 -552833 103379 -104439 -341161 215374 705852 691427 67163 -543022 -239919
2164 -239919 342307 611099 221538 -605217 -868764 -432000 -538625 -668748 -1340455 -11642
2154 -11642 533110 -70225 -723852 -77360 26125 522326 44925 -207659 -447337 -412446
2144 -412446 -60866 73540 297811 -390086 206992 49346 433171 325582 273243 -274411
2134 -274411 375991 -411972 -600495 -1010936 -583223 161852 663894 -192331 -802187 -184371
2124 -184371 -330698 -542036 -465174 -430969 498112 529467 327019 518518 140504 -1160282
2114 -1160282 -1356722 -254126 22426 501888 472143 -136493 -514670 -197073 -79881 1066313
2104 1066313 856982 -93696 -274994 439105 639761 40266 93348 7665 164355 47423
$$ packed form
2174f36031Q3198O56212k07818k36722N56535M90478j4425o24264o10185L03103
2164b39919N82226K68792l89561q26755k63547M36764j06625j30123o71707J328813
2154a1642N44752o03335o53627O46492J03485M96201m77401k52584k39678L4891
2144d12446L51580J34406K24271o87897N97078j57646L83825j07589n2339n47654
2134b74411O50402p87963j88523m10441M27713P45075N02042q56225o09856O17816
2124a84371j46327k11338P6862L4205R29081L1355k02448J91499l78014j300786
2114a160282j96440J102596K76552M79462k9745o08636l78177L17597J17192J146194
2104A066313k09331r50678j81298P14099K00656n99495N3082q5683J56690j16932
$$ plain form
2094 47423 29861 149790 212477 -300179 60272 207626 -1176710 -376322 150683 127767
2084 127767 -244919 -849030 -397387 -512329 -22102 81955 188264 141256 -189033 -561963
2074 -561963 -192578 -403036 -1354334 -968618 -369350 533612 195789 -460771 -36739 227974
2064 227974 -204545 -75617 247186 250828 144361 104105 80920 -178860 -946697 -215831
2054 -215831 -156925 -116234 788120 1227302 272002 -71272 336105 -31796 498395 27807
2044 27807 -419672 -347615 -1054692 -400506 -624828 -783263 -164276 26271 849197 871918
2034 871918 503441 -47454 -222658 132373 289832 1010471 1054665 749820 555958 2380
2024 2380 -292896 73927 -106015 175982 -76166 -343355 548039 -78225 -1030543 -508092
$$ packed form
2094D7423j7562J19929O2687n12656L60451J47354j384336Q00388N27005k2916
2084A27767l72686o04111M51643j14942M90227J04057J06309m7008l30289l72930
2074e61963L69385k10458r51298L85716N99268R02962l37823o56560M24032K64713
2064B27974m32519J28928L22803L642j06467m0256k3185k59780p67837P30866
2054b15831N8906M0691R04354M39182r55300l43274M07377l67901N30191m70588
2044B7807m47479P2057p07077O54186k24322j58435O18987J90547Q22926K2721
2034H71918l68477n50895j75204L55031J57459P20639M4194l04845j93862n53578
2024B380k95276L66823j79942K81997k52148k67189Q91394o26264r52318N22451
$$ plain form
2014 -508092 574617 504286 530622 435442 576729 451923 582252 549478 -247791 -1447891
2004 -1447891 -1219002 213003 -168690 -1188412 -1134910 -1409931 -1144749 -5566 796572
1995 796572 301374 -267373 -763731 -690655 -758114 -69812 310851 -182291 -189180 292619
1985 292619 336414 -482303 -601188 -193392 491156 -129055 615952 348198 157689 28659
1975 28659 -926854 -922558 -1198433 -945486 -109307 289074 -321689 -321898 -366635 -767333 -338637
1964 -338637 -19500 -526979 -761789 -316558 -479762 -1031689 -1148063 -942014 -1166683 -399570
1954 -399570 -176776 51043 138073 -343962 -440424 -638753 -685095 -707422 -513123 356757
1944 356757 549539 -571103 -405363 458509 -246131 -822401 -959701 -733168 150787 353549
$$ packed form
2014e08092J082709p0331K6336r5180J41287j24806J30329l2774p97269j200100
2004a447891K28889J432005l81693j019722N3502k75021K65182J139183Q02138
1995G96572m95198n68747m96358P3076o7459O88302L80663m93142o889M81799
1985B92619M3795q18717j18885M07796O84548o20211P45007k67754j90509j29030
1975B8659r55513M296k75875K52947Q36179L98381o10763k09m4737m00698M28696
1964c38637L19137n07479k34810M45231j63204n51927j16374K06049k24669P67113
1954c99570K22794K27819Q7030m82035r6462j98329m6342k2327J94299Q69880
1944C56757J92782j120642J65740Q63872p04640n76270j37300K26533Q83955K02762
$$ plain form
1934 353549 -50655 -152890 -396694 192250 67335 -227511 559783 728716 -344806 -324989
1924 -324989 413155 153104 -305116 -695107 -51499 523218 801613 620262 485461 -34207
1914 -34207 2209 -306791 606996 515065 -280264 -144567 -83971 735700 144437 -240640
1904 -240640 -397657 111279 379983 88258 -504186 -1016469 -1001710 -677906 -684430 -640826
1894 -640826 -298468 160606 363372 221738 814287 217592 -295454 -490876 -233551 -507881
1884 -507881 -468914 -382527 -1058310 -535892 -99365 -550609 -1040987 -293081 1125428 1246013
1874 1246013 656450 612596 127670 -112215 661983 -166539 -596056 -458108 139478 229767
1864 229767 134579 -843544 -1553599 -1261354 -1216080 -1062416 -917415 27435 911090 1187866
$$ packed form
1934C53549m04204j02235k43804N88944j24915k94846P87294J68933j073522J9817
1924c24989P38144k60051m58220l89991O43608N74717K78395j81351j34801n19668
1914c4207L6416l09000R13787r1931p95329J35697O0596Q19671n91263l85077
1904b40640j57017N08936K68704k91725n92444n12283J4759L23804o524M3604
1894f40826L42358M59074K02766j41634N92549n96695n13046j95422K57325k74330
1884e07881L8967Q6387o75783N22418M36527m51244m90378P47906J418509J20585
1874A246013n89563m3854m84926k39885P74198q28522m29517J37948N97586R0289
1864B29767r5188r78123p10055K92245M5274J53664J45001R44850Q83655K76776
$$ plain form
1854 1187866 258750 276890 106850 -83503 260912 -235035 -124623 -102934 44250 176491
1844 176491 -3835 -643869 471187 526993 -314175 -335022 -718496 -473450 -49567 166756
1834 166756 -606967 -1129555 -838493 -843955 -283031 53152 2858 24012 37966 -684153 -209303
1823 -209303 450722 458566 -335201 -399297 -872290 -419533 -164569 -647529 323428 -420576
1813 -420576 -150531 -642455 -863021 105282 256363 -340785 -150286 522837 745127 14393
1803 14393 319719 269138 418318 -599967 -995283 -977908 -170276 -109106 -272091 -790311
1793 -790311 -820742 -617609 -813737 -1002342 -726161 -799853 -1133224 -343804 -913579 -1141911
1783 -1141911 -270113 -604791 -73167 410434 -308032 -140474 76966 -137072 -57967 -552418
$$ packed form
1854A187866r29116J8140j70040j90353L44415m95947J10412K1689J47184J32241
1844A76491j80326o40034J115056N5806q41168k0847l83474K45046M23883K16323
1834A66756p73723n22588K91062n462N60924L36183n0294K1154J3954p22119M74850
1823b09303O60025P844p93767o4096m72993M52757K54964m82960R70957p44004
1813d20576K70045m91924k20566R68303J51081n97148J90499O73123K22290p30734
1803A4393L05326n0581J49180j018285l95316J7375Q07632O1170j62985n18220
1793g90311l0431K03133j96128j88605K76181p3692l33371P89420n69775k28332
1783a141911Q71798l34678N31624M83601p18466J67558K17440k14038P9105m94451
$$ plain form
1773 -552418 -845227 -864887 -956531 -354763 -134870 -70296 -180982 23245 83889 901498
1763 901498 235384 106653 687079 -28618 13585 1012905 774120 248686 -683951 -530729
1753 -530729 -293482 -42720 896692 725840 306738 865276 154132 -578492 243769 346989
1743 346989 380056 462146 890358 471418 386123 194342 -244231 -7652 316384 482933
1733 482933 292326 -420192 -80659 156913 503231 708513 683553 681965 -51150 323228
1723 323228 -608203 -107720 -258719 -386343 -222799 -372387 318560 177689 -393810 -519214
1713 -519214 70727 -659431 488917 915756 1398667 1339386 775435 142274 -1093574 -609574
1703 -609574 -63114 288295 -140483 495342 163065 -243786 485496 625253 418635 -30753
$$ packed form
1773e52418k92809j9660r1644O01768K19893O4574j10686K04227O0644Q17609
1763I01498o66114j28731N80426p15697M2203R99320k38785n25434r32637J53222
1753e30729K37247K50762R39412j70852m19102N58538p11144p32624Q22261J03220
1743C46989L3067Q2090M28212m18940q5295j91781m38573K36579L24036J66549
1733D82933j90607p12518L39533K37572L46318K05282k4960j588p33115L74378
1723C23228r31431N00483j50999j27624J63544j49588O90947j40871n71499j25404
1713e19214N89941p30158J148348M26839M82911n9281n63951o33161j235848M84000
1703f09574N46460L51409m28778O35825l32277m06851P29282J39757k06618m49388
$$ plain form
1693 -30753 -321819 33576 913583 861660 242722 -434564 -734481 -301103 -700215 -99971
1683 -99971 -161030 -124694 -170574 286469 972498 497461 405382 164982 -101488 22390 467587
1672 467587 -548926 -337970 263640 159997 451151 195592 5983 160968 1476341
1663 1476341 676962 -268704 974186 962980 298946 449283 700098 599118 -644880
1654 -644880 -959042 -374806 -212092 250437 81756 -195194 79271 757389 -107305 -574697
1644 -574697 1703 -121425 635494 713628 777612 346754 135994 327765 397523 65489
1634 65489 469770 152049 -734179 505169 399518 183808 -181595 -181512 43247 233783
1624 233783 258230 385348 -37104 -101393 691890 -377531 -714098 -1491295 -1091204 -276963
$$ packed form
1693c0753k91066L55395Q80007n1923o18938o77286k99917M33378l99112O00244
1683i9971o1059L6336m5880M57043O86029m75037r2079k40400k66470J23878M45197
1672D67587j016513K10956O01610j03643K91154k55559j89609J54985J315373
1663A476341p99379r45666J242890j1206o64034J50337K50815j00980j243998
1654f44880l14162N84236J62714M62529j68681k76950K74465O78118q64694m67392
1644e74697N76400j23128P56919P8134O3984m30858k10760J91771O9758l32034
1634F5489M04281l17721q86228J239348j05651k15710l65403Q3K24759J90536
1624B33783K4447J27118m22452o4289P93283j069421l36567p77197M00091Q14241
$$ plain form
1614 -276963 -218860 -380851 -47949 555457 -423242 171474 528805 628610 560758 8993
1604 8993 -116262 -372381 -618572 -664343 -787231 -17497 118280 549633 308214 -464456
1594 -464456 -545584 -83563 -113844 -83171 90414 -830963 -1102674 -308023 -611167 -207208
1584 -207208 173939 261489 614764 279050 162970 321439 -346944 -57068 525953 689160
1574 689160 -187282 -728700 -346874 456638 545926 209367 141260 147036 290090 259232 265734
1563 265734 -226850 -48956 -33237 -647657 -1023345 -1211634 -1045020 -789825 -816629 -334601
1553 -334601 -132543 227640 172145 479735 217032 131640 -325262 -65942 407380 241504
1543 241504 162920 -510536 -3527 666398 -554013 -582581 -87077 -122045 76911 39852
$$ packed form
1614b76963N8103j61991L32902O03406r78699N94716L57331R9805o7852n51765
1604H993j25255k56119k46191m5771j22888P69734J35777M31353k41419p72670
1594d64456q1128M62021l0281L0673J73585r21377k71711P94651l03144M03959
1584b07208L81147Q7550L53275l35714j16080J58469o68383K89876N83021J63207
1574F89160q76442n41418L81826Q03512Q9288l36559o8107N776J43054l0858O502
1563B65734m92584J77894J5719o14420l75688j88289J66614K55195k6804M82028
1553c34601K02058L60183n5495L07590k62703q5392m56902K59320M73322j65876
1543B41504p8584o73456N07009O69925j220411k8568M95504l4968J98956l7059
$$ plain form
1533 39852 14813 466722 356622 511473 -329276 -325614 -21810 -24846 -291297 -254678 314731
1522 314731 171119 219043 -965287 -105646 -39483 191453 -419273 -161714 542068 912286
1512 912286 597719 173850 134493 -432988 -818071 -1272407 -429435 -1348827 -243828 1035644
1502 1035644 438227 -423500 -329823 -600613 -769860 -222543 -545147 -625439 -422820 -614971
1492 -614971 36635 -309599 -128082 138347 276498 175284 -119479 -859804 -1228659 -865382
1482 -865382 -851083 -172853 -184540 -541637 -21395 83468 -463277 -415375 -205520 130746
1472 130746 -251947 145096 350562 -439915 53252 682979 61090 -216072 -710966 -424160
1462 -424160 445746 -517425 -603524 -279545 465147 745466 62039 -306544 -646314 -200689
$$ packed form
1533C9852k5039M51909j10100J54851q40749L662L03804l036k66451L6619N69409
1522C14731j43612M7924j184330Q59641O6163K30936o10726K57559P03782L70218
1512I12286l14567m23869l9357n67481l85083m54336Q42972r19392J104999J279472
1502A035644n97417q61727R3677k70790j69247N47317l22604q0292K02619j92151
1492f14971O51606l46234J81517K66429J38151j01214k94763p40325l68855L63277
1482h65382J4299O78230j1687l57097N20242J04863n46745M7902K09855L36266
1472A30746l82693L97043K05466p90477M93167O29727o21889k77162m94894K86806
1462d24160Q69906r63171q6099L23979P44692K80319o83427l68583l39770M45625
$$ plain form
1452 -200689 -1053 1388792 876866 129454 466203 807741 512459 199186 990736 844467
1442 844467 222851 -78892 -142046 125769 -385792 -302353 -879 605319 777028 650026
1432 650026 599382 806776 458834 578124 -125287 46262 -4597 -690397 -212453 -503417
1422 -503417 -312987 -519135 -735751 -1271182 -830308 -168113 39892 100871 -845540 -164000
1412 -164000 161562 -614305 120981 -346907 -1241558 80249 -89469 -493107 -289610 -274539
1402 -274539 666269 442354 670928 218024 -138177 18891 465531 515257 1114065 570428
1392 570428 79164 -174441 -304169 -209144 -971584 -3009 378912 -551006 -511926 -404341
1382 -404341 -1186618 -626861 -363817 -700278 67137 -226367 -317043 -597343 -468447 -224900
$$ packed form
1452b00689J99636J389845n11926p47412L36749L41538k95282l13273P91550j46269
1442H44467o21616l01743o3154K67815n11561Q3439L01474O06198J71709j27002
1432F50026n0644K07394l47942J19290p03411J71549n0859o85800M77944k90964
1422e03417J90430k06148k16616n35431M40874O62195K08005O0979r46411O81540
1412a64000L25562p75867P35286m67888q94651J321807j69718m03638K03497J5071
1402b74539R40808k23915K28574m52904l56201J57068M46640M9726N98808n43637
1392E70428m91264k53605j29728R5025p62440R68575L81921r29918L9080J07585
1382d04341p82277N59757K63044l36461P67415k93504r0676k80300J28896K43547
$$ plain form
1372 -224900 48000 298219 531330 675350 486841 -308735 -267046 104652 -382499 -462071
1362 -462071 -808522 -551204 -133878 -93690 -202039 -75563 5657 -92331 -466196 -545370
1352 -545370 -200276 -726517 -167223 333395 -74870 155758 -156302 -72489 -134447 -178862
1342 -178862 -550507 -834242 -511706 230656 -724980 -969609 -548251 -377910 381240 621176
1332 621176 -59192 -706752 -71423 285321 -181750 89173 -160803 -625798 601346 294744
1322 294744 59029 460260 266997 502312 653632 1308067 650925 538228 -676327 -916154
1312 -916154 6450 144756 -754204 -1415277 -212833 48686 -174373 -906553 -674223 -451949
1302 -451949 607197 501947 40902 -812878 -448312 -221810 -718293 -720614 -605225 -291467
$$ packed form
1372b24900K72900K50219K33111J44020j88509p95576M1689L71698m87151p9572
1362d62071l46451K57318M17326M0188j08349J26476Q1220r7988l73865p9174
1352e45370L45094n26241N59294N00618m08265K30628l12060Q3813o1958m4415
1342a78862l71645k83735L22536P42362r55636k44629M21358J70341P59150K39936
1332F21176o80368o47560O35329L56744m67071K70923k49976m64995J227144l06602
1322B94744k35715M01231j93263K35315J51320O54435o57142j12697j214555k39827
1312i16154R22604J38306q98960o61073J202444K61519k23059p32180K32330K22274
1302d51949J059146j05250m61045q53780L64566K26502m96483k321J15389L13758
$$ plain form
1292 -291467 -328549 -603554 403124 680536 -28057 244524 -9291 398600 96366 -334663
1282 -334663 -213264 188424 380269 190077 172500 418090 -202107 -684432 -600284 15538
1272 15538 98699 921225 667535 -17265 202080 166728 720598 924561 -89014 -176861
1262 -176861 -547061 -647240 -390821 -59255 298005 258115 504330 360461 502136 816160
1252 816160 451700 414187 657292 370178 368560 174515 207127 -62651 -133427 61035 -310126
1241 -310126 -432392 -469529 -848736 -442934 -568404 -252281 998829 148476 -935873 60125
1231 60125 -1384 -331191 -574040 -382912 175968 254791 -84841 -1057931 76534 487614
1221 487614 1208396 1179821 -170684 955609 1052129 294447 -62331 -238065 -220383 -770827
$$ packed form
1292b91467l7082k75005J006678K77412p08593K72581k53815M07891l02234m31029
1282c34663J21399M01688J91845j90192j7577K45590o20197m82325Q4148O15822
1272A5538Q3161Q22526k53690o84800K19345l5352N53870K03963j013575q7847
1262a76861l70200j00179K56419L31566L57260l9890K46215j43869J41675L14024
1252H16160l64460l7513K43105k87114j618j94045L2612k69778p0776J94462l71161
1241c10126j22266l7137l79207M05802j25470L16123J251110q50353j084349R95998
1231F0125o1509l29807k42849J91128N58880P8823l39632r73090J134465M11080
1221D87614P20782k8575j350505J126293R6520p57682l56778j75734J7682n50444
$$ plain form
1211 -770827 -74058 605294 -441557 -575115 13214 242667 -784351 -474272 -470256 160095
1201 160095 732613 885925 1175532 201369 -84079 795990 -269071 -233241 1437574 1757954
1191 1757954 894276 176818 129845 122749 25345 495647 925025 598023 458879 1172775
1181 1172775 764588 468481 69346 -271964 -87443 -480170 143390 207940 131755 546941
1171 546941 870652 159567 -460934 -668024 101810 57273 -236167 -5789 -17442 41175
1161 41175 245742 128927 -505332 -988116 79001 22549 -29067 -114883 285130 -195987
1151 -195987 39005 442119 597054 1211279 788797 138826 795262 839742 -478672 -1240697
1141 -1240697 -1163727 -685868 -620235 -150167 -60667 -346931 -358648 -307929 -192819 -176260 252116
$$ packed form
1211g70827O96769O79352j046851j33558N88329K29453j027018L10079M016O30351
1201A60095N72518J53312K89607r74163k85448Q80069j065061L5830J670815L20380
1191A757954q63678p17458m6973p096r7404M70302M29378l27002j39144P13896
1181A172775m08187k96107l99135l41310J84521l92727O23560O4550p6185M15186
1171E46941L23711p11085o20501k07090P69834m4537k93440K30378j1653N8617
1161D1175K04567j16815o34259m82784J067117n6452n1616q5816M00013m81117
1151a95987K34992M03114J54935O14225m22482o49971O56436M4480j318414p62025
1141a240697P6970M77859O5633M70068Q9500k86264j1717N0719J15110J6559M28376
$$ plain form
1130 252116 637615 167945 412115 -104025 218560 168208 -229542 771796 674669 33537
1120 33537 -40071 216 -820 490915 725915 566327 1162822 1289058 896921 311011 321643
1109 321643 888085 686046 107047 -8784 626353 93043 133757 -42039 390008 725168
1099 725168 -5765 143757 167351 657089 -33729 -129829 -521058 -185009 479901 889608
1089 889608 367459 -144227 -349973 412287 954241 297449 49147 -457715 282161 -436051
1079 -436051 -281727 528609 436511 554632 57000 -470745 -776665 -612244 382582 9600
1069 9600 50493 948063 446794 651913 1168591 856748 898565 492575 249601 711826
1059 711826 930186 1250649 654465 224825 49938 210476 338360 -564053 -1273252 -1491207
$$ packed form
1130B52116L85499m69670K44170n16140L22585n0352l97750J001338r7127o41132
1120C3537p3608M0287j036M91735K35000j59588N96495J26236l92137n85910J0632
1109C21643N66442k02039n78999j15831O35137n33310M0714j75796M32047L35160
1099G25168p30933J49522K3594M89738o90818r6100l91229L36049O64910M09707
1089H89608n22149n11686k05746P62260N41954o56792k48302n06862P39876p18212
1079d36051J54324Q10336r2098J18121m97632n27745l05920J64421R94826l72982
1069I600M0893Q97570n01269K05119N16678l11843M1817m05990k42974M62225
1059G11826K18360L20463n96184m29640j74887J60538J27884r02413p09199k17955
$$ plain form
1049 -1491207 -436965 56419 -23679 -2800 -21150 200764 529167 699548 -33929 -318881
1039 -318881 6124 -523355 -173568 -250017 -746142 -232911 205499 966573 170406 757984
1029 757984 559829 54076 -429501 -862601 -636234 173743 631902 200089 246401 -60365
1019 -60365 345362 1046049 246409 -100418 649354 553197 914423 708174 847760 471100
1009 471100 263441 -114385 -422197 -433856 -84560 553867 703464 993175 548513 494515
999 494515 -218775 371529 240409 -692228 -555282 -214193 -62700 -379247 -1060580 -218695
$$ packed form
1049a491207J054242M93384q0098K0879j8350K21914L28403J70381p33477k84952
1039c18881L25005n29479L49787p6449m96125N13231M38410P61074p96167N87578
1029G57984j98155n05753m83577m33100K26367Q09977M58159m31813M6312l06766
1019f0365M05727P00687p99640l46827P49772r6157L61226k06249J39586l76660
1009D71100k07659l77826l07812j1659L49296O38427J49597K89711m44662n3998
999D94515p13290N90304j31120r32637J36946L41089J51493l16547o81333Q41885
$$ [...]
##END NTUPLES=NMR SPECTRUM
##END=
