##TITLE=1H_EC-3313x
 DMSO
 8 sc, 
 13.2.2024
##JCAMPDX= 6.0         $$ Bruker NMR JCAMP-DX V2.0
##DATA TYPE= NMR SPECTRUM
##DATA CLASS= NTUPLES
##ORIGIN= UXNMR, Bruker Analytische Messtechnik GmbH
##OWNER= root
$$ XWIN-NMR		Version 3.5
$$ Tue Feb 13 14:29:27 2024 Russian Standard Time (UT+4h)  she@DPX200
##.OBSERVE FREQUENCY= 200.1313
##.OBSERVE NUCLEUS= ^1H
##.ACQUISITION MODE= SIMULTANEOUS
##.ACQUISITION SCHEME= undefined
##.AVERAGES= 8
##.DIGITISER RES= 18
##SPECTROMETER/DATA SYSTEM= spect
##.PULSE SEQUENCE= zg30
##.SOLVENT NAME= DMSO
##.SHIFT REFERENCE= (INTERNAL, DMSO, 0, 15.5034)
##AUDIT TRAIL= $$ (NUMBER, WHEN, WHO, WHERE, WHAT)
$$ ##TITLE= Audit trail, XWIN-NMR		Version 3.5
$$ ##JCAMPDX= 5.01
$$ ##ORIGIN= Bruker BioSpin GmbH
$$ ##OWNER= she
$$ F:/spectra/data/she/nmr/H-F/1/pdata/1/auditp.txt
$$ ##AUDIT TRAIL=  $$ (NUMBER, WHEN, WHO, WHERE, WHAT)
(   1,<2024-02-13 14:28:14.75 +0400>,<she>,<DPX200>,
      <created by zg, POWCHK disabled, PULCHK disabled
       configuration hash MD5:
       00 E9 B6 7A A2 85 ED C7 34 08 36 98 17 FE 4E 26
       data hash MD5: 16K
       D3 57 ED A3 E9 17 AF D3 D7 69 70 9F B0 F7 88 7A>)
(   2,<2024-02-13 14:28:17.28 +0400>,<she>,<DPX200>,
      <Start of raw data processing
       efp BC_mod = 2 LB = 0.24 FT_mod = 6 PKNL = 1 PHC0 = -24950.79 PHC1 = 14.8527 SI = 16K 
       data hash MD5: 16K
       89 1E E1 2A F4 01 98 D3 94 DE 4F 93 8E 4E D7 D6>)
(   3,<2024-02-13 14:28:34.15 +0400>,<she>,<DPX200>,
      <pk PHC0 = 1.005257 PHC1 = -2.4 
       data hash MD5: 16K
       84 7C 02 F0 5A 1E 49 AA B1 4E 48 73 DB 60 97 59>)
(   4,<2024-02-13 14:28:37.76 +0400>,<she>,<DPX200>,
      <abs ABSG = 5 
       data hash MD5: 16K
       84 49 8A 18 1C 54 09 B9 5F EE 67 74 F3 E4 C9 63>)
$$ ##END=
$$ 
$$ hash MD5
$$ 6E B9 1D BD 59 33 D7 A9 C1 63 7B 22 93 80 CB 0C
##$RELAX= 
##$RELAX= 
##$RELAX= 
##$RELAX= 
##$RELAX= 
##$RELAX= 
$$ Bruker specific parameters
$$ --------------------------
##$DU= <F:/spectra>
##$EXPNO= 1
##$NAME= <H-F>
##$PROCNO= 1
##$TYPE= <nmr>
##$USER= <she>
##$AMP= (0..31)
100 100 100 100 100 100 100 100 100 100 100 100 100 100 100 100 100 100 
100 100 100 100 100 100 100 100 100 100 100 100 100 100 
##$AQSEQ= 0
##$AQ_mod= 1
##$AUNM= <au_zg>
##$AUTOPOS= <>
##$BF1= 200.13
##$BF2= 200.13
##$BF3= 200.13
##$BF4= 200.13
##$BF5= 200.13
##$BF6= 200.13
##$BF7= 200.13
##$BF8= 200.13
##$BYTORDA= 1
##$CFDGTYP= 0
##$CFRGTYP= 5
##$CHEMSTR= <none>
##$CNST= (0..31)
1 1 145 1 1 1 1 1 1 1 1 1 1 1 1 1 1 1 1 1 1 1 1 1 1 1 1 1 1 1 1 1 
##$CPDPRG= <>
##$CPDPRG1= <>
##$CPDPRG2= <>
##$CPDPRG3= <>
##$CPDPRG4= <mlev>
##$CPDPRG5= <mlev>
##$CPDPRG6= <mlev>
##$CPDPRG7= <mlev>
##$CPDPRG8= <mlev>
##$CPDPRGB= <>
##$CPDPRGT= <>
##$D= (0..31)
0 1.2 0 0 0 0 0 0 0 0.06 0 0.03 0 0 0 0 0.0002 0 0 0 0 0 0 0 0 0 0 0 0 
0 0 0 
##$DATE= 1707820094
##$DBL= (0..7)
120 120 120 120 120 120 120 120 
##$DBP= (0..7)
150 150 150 150 150 150 150 150 
##$DBP07= 0
##$DBPNAM0= <>
##$DBPNAM1= <>
##$DBPNAM2= <>
##$DBPNAM3= <>
##$DBPNAM4= <>
##$DBPNAM5= <>
$$ [...]
##$SUBNAM3= <"">
##$SUBNAM4= <"">
##$SUBNAM5= <"">
##$SUBNAM6= <"">
##$SUBNAM7= <"">
##$SUBNAM8= <"">
##$SUBNAM9= <"">
##$SW= 18.0517328524113
##$SWIBOX= (0..15)
0 0 2 0 0 0 0 0 0 0 0 0 0 0 0 0 
##$SW_h= 3612.71676300578
##$TD= 16384
##$TD0= 1
##$TE= 0
##$TE2= 300
##$TE3= 300
##$TEG= 300
##$TL= (0..7)
0 120 120 120 120 120 120 120 
##$TP= (0..7)
150 150 150 150 150 150 150 150 
##$TP07= 0
##$TPNAME0= <>
##$TPNAME1= <>
##$TPNAME2= <>
##$TPNAME3= <>
##$TPNAME4= <>
##$TPNAME5= <>
##$TPNAME6= <>
##$TPNAME7= <>
##$TPOAL= (0..7)
0.5 0.5 0.5 0.5 0.5 0.5 0.5 0.5 
##$TPOFFS= (0..7)
0 0 0 0 0 0 0 0 
##$TUNHIN= 0
##$TUNHOUT= 0
##$TUNXOUT= 0
##$USERA1= <user>
##$USERA2= <user>
##$USERA3= <user>
##$USERA4= <user>
##$USERA5= <user>
##$V9= 5
##$VALIST= <valist>
##$VCLIST= <CCCCCCCCCCCCCCC>
##$VD= 0
##$VDLIST= <DDDDDDDDDDDDDDD>
##$VPLIST= <PPPPPPPPPPPPPPP>
##$VTLIST= <TTTTTTTTTTTTTTT>
##$WBST= 1024
##$WBSW= 4
##$XGAIN= (0..3)
0 0 0 0 
##$XL= 0
##$YL= 0
##$YMAX_a= 88608
##$YMIN_a= -111889
##$ZGOPTNS= <>
##$ZL1= 120
##$ZL2= 120
##$ZL3= 120
##$ZL4= 120
##$ABSF1= 15.54086
##$ABSF2= -2.510991
##$ABSG= 5
##$ABSL= 3
##$ALPHA= 0
##$AQORDER= 0
##$ASSFAC= 0
##$ASSFACI= 0
##$ASSFACX= 0
##$ASSWID= 0
##$AUNMP= <proc_1d>
##$AZFE= 0.1
##$AZFW= 0.1
##$BCFW= 0
##$BC_mod= 2
##$BYTORDP= 0
##$COROFFS= 0
##$CY= -3
##$DATMOD= 1
##$DC= 0
##$DFILT= <>
##$DTYPP= 0
##$F1P= 0
##$F2P= 0
##$FCOR= 1
##$FTSIZE= 16384
##$FT_mod= 6
##$GAMMA= 0
##$GB= 0
##$INTBC= 1
##$INTSCL= 3.70164e-10
##$ISEN= 128
##$LB= 0.24
##$LEV0= 0
##$LPBIN= 0
##$MAXI= 10000
##$MC2= 0
##$MEAN= 0
##$ME_mod= 0
##$MI= 1.114404
##$NCOEF= 0
##$NC_proc= -7
##$NLEV= 6
##$NOISF1= 3.799351
##$NOISF2= 2.8
##$NSP= 0
##$NTH_PI= 0
##$NZP= 0
##$OFFSET= 15.50339
##$PC= 1
##$PHC0= -24949.78
##$PHC1= 12.4527
##$PH_mod= 1
##$PKNL= yes
##$PPARMOD= 0
##$PSCAL= 0
##$PSIGN= 0
##$REVERSE= no
##$SF= 200.130003665206
##$SI= 16384
##$SIGF1= 3
##$SIGF2= 2
##$SINO= 5.538805
##$SIOLD= 16384
##$SREGLST= <1H.CDCl3>
##$SSB= 0
##$STSI= 16384
##$STSR= 0
##$SW_p= 3612.71676300578
##$SYMM= 0
##$S_DEV= 0
##$TDeff= 16384
##$TDoff= 0
##$TI= <>
##$TILT= no
##$TM1= 0
##$TM2= 0
##$TOPLEV= 0
##$USERP1= <user>
##$USERP2= <user>
##$USERP3= <user>
##$USERP4= <user>
##$USERP5= <user>
##$WDW= 1
##$XDIM= 16384
##$YMAX_p= 534036900
##$YMIN_p= -1058442
$$ End of Bruker specific parameters
$$ ---------------------------------
##NTUPLES= NMR SPECTRUM
##VAR_NAME=  FREQUENCY,     SPECTRUM/REAL,   SPECTRUM/IMAG
##SYMBOL=    X,             R,               I
##VAR_TYPE=  INDEPENDENT,   DEPENDENT,       DEPENDENT
##VAR_FORM=  AFFN,          ASDF,            ASDF
##VAR_DIM=   16384,         16384,           16384
##UNITS=     HZ,            ARBITRARY UNITS, ARBITRARY UNITS
##FACTOR=    0.220516191357247, 1,           1
##FIRST=     3102.69356000267, 0,            0
##LAST=      -510.023203003111, 0,           0
##MIN=       -510.023203003111, -1058442,    0
##MAX=       3102.69356000267, 534036900,    0
$$ Real data points
##PAGE= N=1
##DATA TABLE= (X++(R..R)), XYDATA
$$ [...]
$$ plain form
8485 -24041 106725 27318 -108733 -173132 -62529 -13908 -105912 -189592 -143229 -250241 -238108
8474 -238108 -87540 -189298 -32531 74840 -40288 -182404 -195313 -91485 -96929 -367137
8464 -367137 -212826 76675 48391 -346197 -447186 55852 94872 57978 -163969 -204190
8454 -204190 -189001 -185619 -289180 -240586 3908 140392 -94880 -172994 -102623 -231741 -289436
8443 -289436 -330366 -413205 -424314 -132375 34507 -363456 -228567 -147404 -237863 -114476 -85412
8432 -85412 -29159 29172 -231992 -300710 -310705 -234983 -73939 -112013 -201016 -229038 -309938 -238521
8420 -238521 -80689 -16097 -183156 -133230 -285281 -253143 39662 12414 95717 -231278 -256170
8409 -256170 -256464 -180744 -150801 -143877 -55006 -105458 -228241 -60195 72213 -83901 63944
$$ packed form
8485b4041J30766p9407j36051o4399J10603M8621r2004q3680M6363j07012J2133
8474b38108J50568j01758J56767J07371j15128j42116j2909J03828n444k70208
8464c67137J54311K89501k8284l94588j00989N03038L9020l6894k21947m0221
8454b04190J5189L382j03561M8594K44494J36484k35272p8114P0371j29118n7695
8443b89436m0930q2839j1109K91939J66882l97963J34889Q1163r0459J23387K9064
8432h5412N6253N8331k61164o8718r995P5722J61044l8074q9003k8022q0900P1417
8420b38521J57832O4592j67059M9926j52051L2138K92805k7248Q3303l26995k4892
8409b56170k94P5720K9943O924Q8871n0452j22783J68046J32408j56114J47845
$$ plain form
8398 63944 -21525 -110598 86642 -73724 -48317 -78091 -154212 -148940 -102281 -22847 -47917 -88126
8386 -88126 -161063 -183468 -186239 -196643 -161721 -140030 -44871 13178 4905 -109602 275886 240340
8374 240340 217860 -77420 -280290 72446 25243 -175442 -93406 224023 155308 214801 -62731
8363 -62731 -207321 -232253 -267737 -346023 -562296 -205307 -56290 -117464 -146145 -121329 59789
8352 59789 211514 15393 -42449 15199 -104389 -91574 48063 -11553 -251043 -222879 74228
8341 74228 156400 -28179 -198738 94030 306600 98562 -66184 -89747 -173337 18248
8331 18248 -186559 -19814 -14141 -68422 112582 -227625 -375902 -496005 -121106 -45169 -47180
8320 -47180 -380418 -232319 66861 7541 -112151 -392208 -158695 41053 33959 -180731
$$ packed form
8398F3944q5469q9073J97240j60366K5407k9774p6121N272M6659P9434k5070m0209
8386h8126p2937k2405k771j0404L4922K1691R5159N8049q273j14507L85488l5546
8374B40340k2480k95280k02870L52736m7203k00685Q2036L17429o8715N9493k77532
8363f2731j44590k4932l5484p8286k16273L56989J49017o1174k8681K4816J81118
8352E9789J51725j96121n7842N7648j19588J2815J39637n9616k39490K8164K97107
8341G4228Q2172j84579j70559K92768K12570k08038j64746k3563q3590J91585
8331A8248k04807J66745N673n4281J81004l40207j48277j20103L74899P5937k011
8320d7180l33238J48099K99180n9320j19692k80057K33513J99748p094k14690
$$ plain form
8310 -180731 -121956 -11909 -175359 -157490 -35907 -59754 -235551 -147661 2137 -238723
8300 -238723 -317590 -76218 -209740 -13527 93295 -62686 -91023 15993 17976 -66827 -122643
8289 -122643 18428 91034 48063 -12220 15415 -48006 124078 66599 -235135 -23243 31014
8278 31014 3910 -95635 -187942 -213788 -101723 75548 -80469 -260000 -383474 -163344 -112613
8267 -112613 -426582 -403193 -282420 -397624 -138546 -56895 -162142 -134214 95455 159307
8257 159307 -113627 -44577 -158597 -12296 -123800 -272219 -162890 -82560 965 15697
8247 15697 -133656 107165 171775 135342 2507 -3538 62923 -125604 -41610 -161787 -338579
8236 -338579 -169364 -201562 -27405 89846 14535 -37999 54616 122616 101012 -25651 66027
$$ packed form
8310a80731N8775J10047j63450J7869J21583k3847j75797Q7890J49798k40860
8300b38723p8867K41372j33522J96213J06822j55981k8337J07016J983q4803n5816
8289a22643J41071P2606m2971o0283K7635o3421J72084n7479l01734K11892N4257
8278C1014k7104r9545r2307k5846J12065J77271j56017j79531j23474K20130N0731
8267a12613l13969K3389J20773j15204K59078Q1651j05247K7928K29669O3852
8257A59307k72934O9050j14020J46301j11504j48419J09329Q0330Q3525J4732
8247A5697j49353K40821O4610l6433j32835o045O6461j88527Q3994j20177j76792
8236c38579J69215l2198J74157J17251p5311n2534R2615O8000k1604j26663R1678
$$ plain form
8225 66027 88195 37153 46833 -71761 -6964 -13036 72997 -215928 -305275 -129436 71883
8214 71883 186395 103571 51918 11434 56352 210829 349 -51909 22774 89142 -162601
8203 -162601 -94376 -125270 119712 248474 200186 62747 218951 156148 473903 453762 908912
8192 908912 268650 -1058442 -661873 -531622 -469597 -450561 -114150 -326902 -155487 -406107
8182 -406107 -260793 -109643 -121095 -155410 -30344 202191 137604 144855 78205 -388011 -323419
8171 -323419 -2263 -52808 3598 -200060 61006 188465 -58857 -345102 -489053 -423089
8161 -423089 -173759 -26035 22622 -16171 -82035 177453 112351 -151345 -353628 -430759 -350954
8150 -350954 -316135 -262562 -203044 -212949 -133227 -55528 -16732 -193531 -263886 -77018 -158433
$$ packed form
8225F6027K2168n1042R680j18594O4797o072Q6033k88925q9347J75839K01319
8214G1883J14512q2824n1653m0484M4918J54477k10480n2258P4683O6368k51743
8203a62601O8225l0894K44982J28762m8288j37439J56204o2803L17755k0141M55150
8192I08912o40262j327092L96569J30251O2025J9036L36411k12752J71415k50620
8182d06107J45314J51150j1452l4315J25066K32535o4587P251o6650m66216O4592
8171c23419L21156n0545N6406k03658K61066J27459k47322k86245j43951O5964
8161d23089K49330J47724M8657l8793o5864K59488o5102k63696k02283p7131P9805
8150c50954L4819N3573N9518r905P9722P7699L8796j76799p0355J86868q1415
$$ plain form
8139 -158433 -319156 -223608 -148907 -44610 53760 -37463 -81603 -88094 -181471 -341071 -365103
8128 -365103 -137270 -62150 -128157 -210040 -268856 -319695 -251985 -158774 -141068 -177033 -148977
8117 -148977 -123371 -130059 -104084 -89671 -228054 -307842 -177686 -246132 -220028 -51094 81970
8106 81970 133217 -96628 -359698 -306267 -56280 228360 15581 44134 -45344 14730 -160082
8095 -160082 -211393 4789 -112193 -2108 -12360 -125445 -73940 91193 -81 -111146
8085 -111146 -291370 -241825 -214014 -167762 -157782 -123532 -162985 -231379 -46100 -20563 52983
8074 52983 179642 -39177 -246388 -153728 -285423 -21617 116807 -229766 -111339 -381755
8064 -381755 -471751 -342051 -231173 -358651 -407550 -382548 -172080 -2220 -254802 -269972
$$ packed form
8139a58433j60723R5548P4701J04297R8370r1223m4140o491r3377j59600k4032
8128c65103K27833P5120o6007q1883n8816n0839O7710R3211J7706l5965K8056
8117a48977K5606o688K5975J4413j38383p9788J30156o8446K6104J68934J33064
8106H1970N1247k29845k63070N3431K49987K84640k12779K8553q9478O0074j74812
8095a60082n1311K16182j16982J10085j0252j13085N1505J65133r1274j11065
8085a11146j80224M9545K7811M6252R980L4250l9453o8394J85279K5537P3546
8074E2983J26659k18819k07211R2660j31695K63806J38424l46573J18427k70416
8064c81755q9996J29700J10878j27478m8899K5002K10468J69860k52582j5170
$$ plain form
8054 -269972 -85005 -2907 -71723 -10683 -140699 -216729 47046 105847 -50741 -226603 -468193
8043 -468193 -320026 34972 12323 -153243 -184262 -221727 -190875 -295528 -162124 40715
8033 40715 138613 -151507 -338665 -79702 70086 26208 -63504 -211691 -116424 263 70018
8022 70018 106670 -29561 -94455 -89119 -72213 69465 -75963 175 149373 176258 46517
8011 46517 -162542 -112236 -127683 -141291 -182758 -344672 -89295 179751 323717 395344 80488
8000 80488 4111 88810 58474 -3495 177286 177145 -63666 44619 113861 -12495 -38194
7989 -38194 232478 246435 36829 136939 5497 88913 30752 -228411 -233882 179416 176620
7978 176620 -4825 -96748 63981 93542 209967 147800 -57944 82646 232627 111023
$$ packed form
8054b69972J84967Q2098o8816O1040j30016p6030K63775N8801j56588j75862k41590
8043d68193J48167L54998k2649j65566l1019l7465L0852j04653J33404K02839
8033D0715R7898k90120j87158K58963J49788m3878q9712j48187R5267J16687O9755
8022G0018L6652j36231o4894N336J6906J41678j45428P6138J49198K6885j29741
8011D6517k09059N0306j5447j3608m1467j61914K55377K69046J43966P1627l14856
8000H0488p6377Q4699l0336o1969J80781j41k40811J08285O9242j26356k5699
7989c8194K70672J3957k09606J00110j31442Q3416n8161k59163n471M13298k796
7978A76620j81445r1923J60729K9561J16425o2167k05744J40590J49981j21604
$$ plain form
7968 111023 -42137 -39925 -132072 166271 -20972 -39301 124917 188231 133793 -1852 -119413
7957 -119413 -176912 -258471 -49828 -138090 -42948 -22398 -246563 -196676 -20104 -93137 -188453
7946 -188453 -224340 -116196 -201490 -365609 -435122 -494936 -426391 -270936 -48316 -224103 -215602
7935 -215602 -337367 -28858 -14158 71005 -7265 -107828 -108022 -238790 -324159 -307224 -75368
7924 -75368 -167072 -316949 -187717 -191986 -371011 -464511 -558728 -611857 -337333 -289887 -167981
7913 -167981 -60997 -14202 4895 129189 155843 -19697 -49559 84054 -12837 -159385 -23367
7902 -23367 -187265 -185984 -38330 183435 150974 -138746 -161855 -199646 -134041 -125719 -425296
7891 -425296 -347601 -164192 -229 -64829 -48882 -209614 -230524 -90191 -25736 -19655 -173035
$$ packed form
7968A11023j53160K212r2147K98343j87243j8329J64218O3314n4438j35645j17561
7957a19413n7499q1559K08643q8262R5142K0550k24165M9887J76572p3033r5316
7946a88453l5887J08144q5294j64119o9513n9814O8545J55455K22620j75787Q501
7935b15602j21765L08509J4700Q5163p8270j00563j94j30768q5369J6935K31856
7924g5368r1704j49877J29232m269j79025r3500r4217n3129K74524M7446J21906
7913a67981J06984M6795J9097J24294K6654j75540k9862J33613r6891j46548J36018
7902b3367j63898J281J47654K21765l2461k89720k3109l7791O5605Q322k99577
7891d25296P7695J83409J63963o4600J5947j60732k0910J40333O4455O081j53380
$$ plain form
7880 -173035 -126968 -48239 135814 63166 -111083 -95024 -123466 8899 -121135 -51259 -42801
7869 -42801 -78371 -199750 -71471 18012 -31215 33857 80494 124827 -2215 -50889 -323016
7858 -323016 -248685 65245 270000 39545 107650 -60422 -289222 -157408 154417 128819
7848 128819 -139352 -117124 -168290 -71847 -170378 -364323 -319039 -205295 -127328 -2984 -35981
7837 -35981 18598 158277 91045 -244562 -380364 -372876 -73814 66669 -30501 -164444 -163483
7826 -163483 115157 24096 -156455 -215835 -129616 85195 176876 -2059 -159805 -317324
7816 -317324 -346563 95814 19087 -90796 -70767 120508 329266 148237 -53057 83946
7806 83946 -225978 -721642 -291008 -180865 -142109 -23815 18463 -4809 -38941 -110820 -6866
$$ packed form
7880a73035M6067P8729J84053p2648j74249J6059k8442J32365j30034O9876Q458
7869d2801l5570j21379J28279Q9483m9227O5072M6637M4333j27042m8674k72127
7858c23016P4331L13930K04755k30455O8105j68072k28800J31814L11825k5598
7848A28819k68171K2228n1166R6443r8531j93945M5284J13744P7967J24344l2997
7837c5981N4579J39679o7232l35607j35802P488K99062J40483r7170j33943R61
7826a63483K78640r1061j80551n9380Q6219K14811R1681j78935j57746j57519
7816c17324k9239M42377p6727j09883K0029J91275K08758j81029k01294J37003
7806H3946l09924m95664M30634J10143L8756J18294M2278k3272l4132p1879J03954
$$ plain form
7795 -6866 59797 152760 -145213 -258128 14903 147185 284333 175211 -86560 94619
7785 94619 -52285 -244891 -96051 66669 47650 15623 -103104 -194492 65723 167499
7775 167499 -45507 -184279 -22236 63204 67744 75104 -12934 -103347 74785 102016 -79870
7764 -79870 -290520 -23969 98015 203156 310119 223707 45814 -168883 -66278 -93089
7754 -93089 -96354 -310990 -239446 -106768 -96578 -216470 -335987 21272 -41397 -87313 -214918
7743 -214918 -208097 26373 43268 2692 23353 39052 9108 -166865 -211654 -201443 -203316 -270065
7731 -270065 -265417 -258156 -17059 23720 153671 20432 -118491 -13332 -106634 -122343 -342539
7720 -342539 -474596 -245258 -6770 -219976 -198449 -69191 -72993 74381 69742 -187917 -302992
$$ packed form
7795f866O6663R2963k97973j12915K73031J32282J37148j09122k61771J81179
7785I4619j46904j92606J48840J62720j9019l2027j18727r1388K60215J01776
7775A67499k13006j38772J62043Q5440M540P360q8038r0413J78132K7231j81886
7764g9870k10650K66551J21984J05141J06963q6412j77893k14697J02605k6811
7754i3089l265k14636P1544J32678J0190j19892j19517L57259o2669m5916j27605
7743b14918O821K34470J6895m0576K0661J5699k9944j75973m4789J0211j873o6749
7731b70065M648P261K41097M0779J29951j33239j38923J05159r3302j5709k20196
7720c42539j32057K29338K38488k13206K1527J29258l802J47374m639k57659j15075
$$ plain form
7709 -302992 -185104 -27890 -81230 -68308 -294946 -291851 124393 -51517 -148988 46811 364462
7698 364462 5660 -344243 -290450 -41788 146400 -82892 -77946 -42241 56893 116918 176372
7687 176372 172155 -167752 -153733 -134043 -71079 -31309 -57220 81634 72416 230738 -173433
7676 -173433 -396191 -263762 90871 116129 -219092 -146464 -251961 -111526 60489 -306732
7666 -306732 -324042 -171355 -61648 90850 -64658 -88304 -132192 -103672 -67881 -253390 -219169
7655 -219169 -9052 -225810 -402621 -298154 -108323 -21532 21152 -64775 -326199 -235153
7645 -235153 -257691 -132908 -149030 -127412 -213774 -209502 -127949 -104521 10249 -78229 -201470
7634 -201470 131107 23596 -99865 -101508 -227672 -226016 -172872 -187881 51324 27705 90498
$$ packed form
7709c02992J17888J57214n3340J2922k26638L095M16244j75910r7471J95799L17651
7698C64462l58802l49903N3793K48662J88188k29292M946L5705R9134O0025N9454
7687A76372m217l39907J4019J9690O2964L9770k5911J38854r218J58322m04171
7676a73433k22758J32429L54633K5258l35221P2628j05497J40435J72015l67221
7666c06732j7310J52687J09707J52498j55508k3646m3888K8520L5791j85509L4221
7655b19169K10117k16758j76811J04467J89831Q6791M2684q5927k61424R1046
7645b35153k2538J24783j6122K1618q6362M272Q1553K3428J14770q8478j23241
7634b01470L32577j07511j23461j643j26164J656N3144j5009K39205k3619O2793
$$ plain form
7623 90498 -247861 -408400 -13653 68651 261423 222710 113051 146017 123195 126952 -1389
7612 -1389 -117805 236444 195276 21533 95437 153709 150948 41423 89618 -26492 115050
7601 115050 31398 -234523 -204144 -65454 35908 43255 25948 -177904 22940 -12918 -103639
7590 -103639 -157216 63929 -103881 199567 135107 -74601 -17383 22698 -200256 -152504 -112431
7579 -112431 -220952 -10544 46149 -18241 10350 -54784 18061 127041 45270 47362 24633
7568 24633 -292576 -266690 -91204 -75753 -53197 -4808 151159 223352 288997 71129 -140578
7557 -140578 -256684 -149963 -66892 -193326 -443150 -158036 -105657 -274941 -260261 -142357
7547 -142357 1443 -43769 -192865 -195741 -34299 54120 4329 35951 105811 44308 92936
$$ packed form
7623I0498l38359j60539L94747Q2304J92772l8713j09659L2966k2822L757j28341
7612a389j16416L54249m1168j73743P3904N8272k761j09525M8195j16110J41542
7601A15050q3652k65921L0379J38690J01362P347j7307k03852K00844l5858r0721
7590a03639n3577K21145j67810L03448o4460k09708N7218M0081k22954M7752M0073
7579a12431j08521K10408N6693o4390K8591o5134P2845J08980q1771K092k2729
7568B4633l17209K5886J75486J5451K2556M8389J55967P2193O5645k17868k11707
7557a40578j16106J06721Q3071j26434k49824K85114N2379j69284J4680J17904
7547a42357J43800m5212j49096k876J61442Q8419m9791L1622O9860o1503M8628
$$ plain form
7536 92936 26750 -77946 -37936 68131 28780 -225710 -225443 -73149 21 -22276 -54126
7525 -54126 -162183 -29686 19938 -165353 -120106 64098 -92285 -47281 2830 69827 -23695
7514 -23695 -141219 -110382 109536 257146 190375 -16084 -3780 147712 131265 -21131 -125031
7503 -125031 109065 122016 124963 3604 -75150 -131842 -75240 -82396 -101649 -36439 124138
7492 124138 -22555 -373803 -91846 7430 -97278 -264769 -224939 44144 -35866 -218342
7482 -218342 -213543 -100495 -52651 70261 29795 31627 -197585 -78659 94172 84668 71436
7471 71436 35474 -76345 -179043 -128755 -357413 -201662 -65423 257009 100941 -214128
7461 -214128 -190281 -52756 -168572 4400 113520 78556 74305 -141764 -327621 -351919 -190462
$$ packed form
7536I2936o6186j04696M0010J06067l9351k54490K67J52294P3170k2297l1850
7525e4126j08057J32497M9624j85291M5247J84204j56383M5004N0111O6997r3522
7514b3695j17524L0837K19918J47610o6771k06459J2304J51492j6447j52396j03900
7503a25031K34096J2951K947j21359p8754n6692N6602p156j9253O5210J60577
7492A24138j46693l51248K81957R9276j04708j67491L9830K69083q0010j82476
7482b18342M799J13048M7844J22912m0466J832k29212J18926J72831r504j3232
7471G1436l5962j11819j02698N0288k28658J55751J36239L22432j56068l15069
7461b14128K3847J37525j15816J72972J09120l4964m251k16069j85857k4298J61457
$$ plain form
7450 -190462 -186658 -122725 -114998 -46000 107801 125952 -74642 -73997 -251961 -203310 -126769 -113529
7438 -113529 -157517 137139 -61510 -82044 -63916 -42278 -106397 -154774 17851 6404 12324
7427 12324 -337101 -302676 -299889 -314814 -331603 -407123 -250411 -92434 -123917 -310706 -338493
7416 -338493 -236016 93789 104306 -275069 -179102 -131138 115753 264344 238241 183066 182508
7405 182508 109886 -72026 181642 406484 155356 151015 118998 -47919 -181006 -294946
7395 -294946 -30997 109716 132694 -251132 -275211 -45285 -157604 -128277 146978 -88933
7385 -88933 -77118 -172178 -326115 -431523 -98702 -25785 -551074 -534253 -237302 -98395 -166959
7374 -166959 -161549 -133482 -67960 15503 -180120 -9155 12061 -129416 -17017 -130770 -125871
$$ packed form
7450a90462L804O3933P727O8998J53801J8151k00594O45j77964M8651P6541J3240
7438a13529m3988K94656j98649k0534J8128K1638o4119m8377J72625j1447N920
7427A2324l49425L4425K787j4925j6789p5520J56712J57977l1483j86789k7787
7416c38493J02477L29805J0517l79375R5967M7964K46891J48591k6103n5175n58
7405A82508p2622j81912K53668K24842k51128m341l2017j66917j33087j13940
7395b94946K63949J40713K2978l83826k4079K29926j12319K9327K75255k35911
7385h8933J1815r5060j53937j05408L32821P2917n25289J6821K96951J38907o8564
7374a66959N410K8067O5522Q3463j95623J70965K1216j41477J12399j13753M899
$$ plain form
7363 -125871 -11132 -265544 -296197 25454 -103421 -20310 -224085 -56547 -31025 116657
7353 116657 -56510 -87120 63876 80832 10918 20945 -138812 -209865 -163516 50595 75133
7342 75133 -149 -93677 23361 -45793 -82491 155688 -28515 -105202 -277284 -214263 -133375
7331 -133375 -132810 -333492 -266554 -281646 -184136 -189759 -194580 -69537 -173466 -329572 -340400 -276962
7319 -276962 -286507 -161156 -75456 31441 -28789 105159 29512 -1479 -61111 -148721 -113879
7308 -113879 149205 110158 49357 103702 67776 41099 -226084 -143793 117860 337211 208425
7297 208425 86487 -182203 -273117 -94709 43311 -43838 -112045 -107728 -98965 91589 19721
7286 19721 -81993 77906 256051 89143 -72997 -23436 74640 -105761 -252253 71838
$$ packed form
7363a25871J14739k54412l0653L21651j28875Q3111k03775J67538K5522J47682
7353A16657j73167l0610J50996J6956o9914J0027j59757p1053M6349K14111K4538
7342G5133p5282r3528J17038o9154l6698K38179j84203p6687j72082O3021Q0888
7331a33375N65k00682O6938j5092R7510n623m821J25043j03929j56106j0828O3438
7319b76962r545J25351Q5700J06897o0230J33948p5647l0991n9632q7610L4842
7308a13879K63084l9047o0801N4345l5926k6677k67183Q2291K61653K19351j28786
7297B08425j21938k68690r0914J78408J38020q7149o8207M317Q763J90554p1868
7286A9721j01714J59899J78145j66908j62140M9561R8076j80401j46492L24091
$$ plain form
7276 71838 116579 51689 -117366 39147 47802 -188986 -231385 -286896 -91211 11669 -325853
7265 -325853 -448661 -189753 -56195 -13751 -1323 -70104 -69708 -32999 98057 -64653 -109516
7254 -109516 -20827 -138104 -76585 53256 -69946 -194645 -284480 -151722 107169 -70433
7244 -70433 -7584 80104 -31758 147063 120682 5699 8981 -7489 -120751 -36739 109778
7233 109778 41499 -138574 114231 1204 -25288 20988 154054 89227 -54068 85991
7223 85991 -93687 -282457 -212293 -6731 239506 47800 -55811 -74742 77036 184216
7213 184216 -267969 -160843 -27822 -80488 85455 30277 203215 358866 287672 227311
7203 227311 112991 -24611 -37622 51371 -184811 -215550 -193346 -109340 -440647 -286181 176892
$$ packed form
7276G1838M4741o4890j69055J56513Q655k36788m2399n5511J95685J02880l37522
7265c25853j22808K58908J33558M2444J2428o8781L96L6709J31056j62710m4863
7254a09516Q8689j17277O1519J29841j23202j24699q9835J32758K58891j77602
7244g0433O2849Q7688j11862J78821k6381j14983L282j6470j13262Q4012J46517
7233A09778o8279j80073K52805j13027k6492M6276J33066o4827j43295J40059
7223H5991j79678j88770P0164K05562K46237j91706j03611j8931J51778J07180
7213A84216m52185J07126J33021n2666J65943n5178J72938J55651p1194o0361
7203B27311j14320j37602j3011Q8993k36182l0739K2204Q4006l31307J54466M63073
$$ plain form
7192 176892 1037 -138263 -75153 -154149 -280624 -304889 -47755 9444 -169992 -116329 50355
7181 50355 -108024 -50345 -132297 -247649 -217778 -162621 -172395 -218482 29664 90561 25369
7170 25369 -174501 -45217 162135 205767 -1298 -118169 -25139 30501 1087 -152730 -288506
7159 -288506 -209262 -139722 -65350 -280462 -333210 -103124 -136145 -268305 -367315 35215 -13100
7148 -13100 39362 -222009 -156577 -82975 84143 1988 -127957 27312 -53669 51203 146418
7137 146418 119186 38899 -87843 -409059 -227911 -45441 17329 -90713 27911 -20066
7127 -20066 -119442 -257726 -262411 -343444 -261925 136845 -188457 -21229 160189 137285 73988
7116 73988 -7570 -50752 -13781 -134806 -273166 -130673 -24203 7920 -67639 -166325 -97080
$$ packed form
7192A76892j75855j39300O3110p8996j26475k4265K57134N7199j79436N3663J66684
7181E0355j58379N7679q1952j15352K9871N5157r774m6087K48146O0897o5192
7170B5369j99870J29284K07352M3632k07065j16871R3030N5640k9414j53817j35776
7159b88506P9244O9540P4372k15112n2748K30086l3021j32160r9010M02530m8315
7148a3100N2462k61371O5432P3602J67118q2155j29945J55269q0981J04872R5215
7137A46418k7232q0287j26742l21216J81148J82470O2770j08042J18624m7977
7127b0066r9376j38284m685q1033Q1519L98770l25302J67228J81418k2904o3297
7116G3988q1558m3182L6971j21025j38360J42493J06470L2123p5559r8686O9245
$$ plain form
7105 -97080 146045 89064 76557 189924 52612 23529 -19137 -173599 -92231 60795 -95089
7094 -95089 -132881 -200293 -2652 -67067 -110025 -81187 116194 68545 -35752 33307 61485
7083 61485 -194442 -99436 133884 -18859 -14014 -103362 -129938 23062 150039 -14235 -120504
7072 -120504 -146548 -10047 -81838 -120947 -137862 41746 -118668 -106275 -82807 -24734 -93438
7061 -93438 45453 -21971 -44495 -208142 -295031 -291665 -147240 -255796 -257093 -303374 -164629
7050 -164629 -98258 -107019 -178680 -402764 -114967 178626 -64355 -102232 6176 225595 308325
7039 308325 78964 -55346 -291346 -118641 -83645 37577 128889 43169 4901 -49676 -81576
7028 -81576 -178495 -128996 -160752 -144129 71449 71512 -67105 64857 50380 13564 -135839 -329856
$$ packed form
7105i7080K43125n6981j2507J13367j37312k9083m2666j54462Q1368J53026j55884
7094i5089l7792o7412J97641o4415m2958K8838J97381m7649j04297O9059K8178
7083F1485k55927R5006K33320j52743M845q9348k6576J53000J26977j64274j06269
7072a20504k6044J36501p1791l9109j6915J79608j60414J2393K3468N8073o8704
7061i3438J38891o7424k2524j63647q6889L366J44425j08556j297m6281J38745
7050a64629O6371q761p1661k24084K87797K93593k42981l7877J08408K19419Q2730
7039C08325k29361j34310k36000J72705L4996J21222R1312q5720l8268n4577l1900
7028h1576r6919M9499l1756J6623K15578O3j38617J31962j4477l6816j49403j94017
$$ plain form
7016 -329856 -247330 -193770 -141243 -268947 -239028 -129515 6612 146541 -133870 -354600
7006 -354600 -55649 -135535 -45548 3593 -159309 -246926 -179668 -104435 -118741 -31795 62899
6995 62899 -44820 -144493 4695 227569 -77821 -268204 -169015 -253034 -355853 -321786 -148601
6984 -148601 -60333 -11806 158206 -146699 -189837 -285662 -214940 24968 -235344 -183703 -156924
6973 -156924 -71129 -14570 90037 100252 -66644 28855 51565 -39841 -151877 -136899 100293
6962 100293 244762 152999 151508 -7393 -223636 -94584 -191395 -241930 -50785 113345 85169
6951 85169 54648 -8430 -22137 33762 2082 -246618 -281977 -94213 108005 249653 287632
6940 287632 253808 17642 140601 124517 36798 154195 71675 230548 55406 -147236
$$ packed form
7016c29856Q2526N3560N2527j27704K9919J09513J36127J39929k80411k20730
7006c54600K98951p9886Q9987M9141j62902q7617O7258P5233j4306Q6946R4694
6995F2899j07719r9673J49188K22874l05390j90383R9189q4019j02819L4067J73185
6984a48601Q8268M8527J70012l04905m3138r5825P0722K39908k60312N1641K6779
6973a56924Q5795N6559J04607J0215j66896R5499K2710r1406j12036J4978K37192
6962A00293J44469r1763j491j58901k16243J29052r6811n0535J91145J64130k8176
6951H5169l0521o3078j3707N5899l1680k48700l5359J87764K02218J41648L7979
6940B87632l3824k36166J22959j6084q7719J17397q2520J58873j75142k02642
$$ plain form
6930 -147236 -110931 -53736 278419 177323 115140 98379 90049 132578 253811 110046 -52712
6919 -52712 9957 171208 40608 -79233 219179 326573 116053 59388 148927 -107770
6909 -107770 -136269 -144356 -220798 13969 86089 22116 -36822 98075 -8959 99447 160531
6898 160531 29446 185327 87761 -66956 151460 313781 326341 119587 70218 161088
6888 161088 125612 -97174 -223993 -70427 -26931 -176220 -127407 -111369 -16410 77918 232636
6877 232636 3146 49681 254339 -11041 64457 114427 342106 143828 -73956 27529
6867 27529 169546 -52163 -80439 -65979 96281 -920 19582 243956 201712 74526 260519
6856 260519 228404 131776 93063 141168 302354 27256 65068 158815 -113078 -118939 106366
$$ packed form
6930a47236L6305N7195L32155j01096o2183j6761q330M2529J21233j43765j62758
6919e2712O2669J61251j30600j19841K98412J07394k10520n6665Q9539k56697
6909a07770k8499q087p6442K34767P2120o3973n8938J34897j07034J08406O1084
6898A60531j31085J55881r7566j54717K18416J62321J2560k06754m9369R0870
6888A61088l5476k22786j26819J53566M3496j49289M8813J6038R4959R4328J54718
6877B32636k29490M6535K04658k65380P5498M9970K27679j98278k17784J01485
6867B7529J42017k21709k8276J4460J62260r7201K0502K24374m2244j27186J85993
6856B60519l2115r6628l8713M8105J61186k75098L7812R3747k71893n861K25305
$$ plain form
6845 106366 93860 196508 46609 -4931 323400 393156 219182 160073 232893 449149 311978
6834 311978 29058 47736 131638 187518 110506 59496 107584 116867 218872 448095 429254
6823 429254 567406 558683 152698 61472 280771 467733 492902 423761 559307 471382 473892
6812 473892 699035 604555 760263 478257 428634 657439 684373 577480 366791 450822
6802 450822 702542 871041 866886 929487 809205 817490 763162 832460 947608 1028716 1039828
6791 1039828 1100213 1201235 1217544 830083 823821 1056736 1025578 972795 930000 943444 863401
6780 863401 740108 940850 816670 622141 649820 713436 604412 561254 527154 567121 543506
6769 543506 523769 786318 824525 701233 406036 342839 374909 610818 729449 745250 677180
$$ packed form
6845A06366j2506J02648j49899n1540L28331O9756j73974n9109P2820K16256j37171
6834C11978k82920J8678Q3902N5880p7012n1010M8088R283J02005K29223j8841
6823D29254J38152q723m05985r1226K19299J86962K5169o9141J35546q7925K510
6812D73892K25143r4480J55708k82006m9623K28805K6934j06893k10689Q4031
6802D50822K51720J68499m155O2601j20282Q285n4328O9298J15148Q1108J1112
6791A039828O0385J01022J6309l87461o262K32915l1158n2783m2795J3444q0043
6780H63401j23293K00742j24180j94529K7679O3616j09024m3158l4100L9967k3615
6769E43506j9737K62549L8207j23292k95197o3197L2070K35909J18631J5801o8070
$$ plain form
6758 677180 443172 501775 443772 290489 527336 700067 434235 446958 246477 152439
6748 152439 253600 296026 -48469 -5275 177355 48113 -87897 -22381 6557 67245 392486
6737 392486 409723 375586 276746 275191 133569 325836 360518 184659 -118161 -7419 7505
6726 7505 181259 174553 167849 267934 270749 363956 202966 -5266 160429 217848 204375 253714
6714 253714 168922 64183 99855 153303 212955 212127 107045 -98301 51428 294296 224185
6703 224185 318608 360748 221304 123246 221844 196088 53680 111288 173177 253173 183733
6692 183733 343007 237356 -11732 -152908 71476 8710 -133694 76955 110298 56964
6682 56964 68510 -26656 160826 102638 142268 355449 311604 286139 212285 167226 76201
$$ packed form
6758F77180k34008N8603n8003j53283K36847J72731k65832J2723k00481r4038
6748A52439J01161M2426l44495M3194J82630j29242j36010O5516K8938O0688L25241
6737C92486J7237l4137r8840j555j41622J92267L4682j75859l02820J10742J4924
6726G505J73754o706o704J00085K815R3207j60990k08232J65695N7419j3473M9339
6714B53714q4792j04739L5672N3448N9652q28j05082k05346J49729K42868p0111
6703B24185R4423M2140j39444r8058R8598k5756j42408N7608O1889P9996o9440
6692A83733J59274j05651k49088j41176K24384o2766j42404K10649L3343n3334
6682E6964J1546r5166J87482n8188L9630K13181m3845k5465p3854m5059r1025
$$ plain form
6671 76201 101797 262771 80338 -33695 74671 11617 47964 68140 139787 207191 310050
6660 310050 222729 -109318 -89413 68237 216882 243055 114380 327599 403607 404146 165615
6649 165615 83640 194815 367673 213158 64678 268491 534114 375103 209395 118700
6639 118700 126897 -2434 225365 212777 197814 243944 264150 304322 419211 575534 379617
6628 379617 352351 195972 295484 437223 197136 231492 415066 413848 268593 141772 437365
6617 437365 346979 339766 449778 718164 587117 492123 442902 321612 373272 436759 527694
6606 527694 396196 279299 427241 529985 548109 604646 519057 644562 400965 333580
6596 333580 389211 390262 577089 947609 782693 816248 765288 578065 465979 498728 351655
$$ packed form
6671G6201K5596J60974j82433j14033J08366o3054L6347K0176P1647O7404J02859
6660C10050q7321l32047J9905J57650J48645K6173j28675K13219P6008N39k38531
6649A65615q1975J11175J72858j54515j48480K03813K65623j59011j65708r0695
6639A18700Q197j29331K27799j2588j4963M6130K0206M0172J14889J56323j95917
6628C79617k7266j56379R9512J41739k40087L4356J83574j218j45255j26821K95593
6617D37365r0386p213J10012K68386j31047r4994m9221j21290N1660O3487R0935
6606E27694j31498j16897J47942J02744J8124N6537q5589J25505k43597o7385
6596C33580N5631J051J86827L70520j64916L3555n0960j87223j12086L2749j47073
$$ plain form
6585 351655 429256 641808 687344 477077 646478 624217 377773 817774 907420 849889 893998
6574 893998 661246 681377 1052582 1366593 1149309 889397 1100779 1094697 1025235 919240
6564 919240 868787 1010087 1120629 1297206 1301482 1099495 1228884 1050932 1008402 1116722
6554 1116722 998989 1152001 1331490 1494098 1292627 1330359 1510961 1563930 1537286 1736870
6544 1736870 1927158 1965200 1802499 1957703 2067706 2177532 2369447 2448099 2462149 2257781
6534 2257781 2485046 2304117 2466273 2296759 2346646 2750119 2753230 2976661 3165309 3194952
6524 3194952 3278637 3523838 3623348 3712722 3654910 3943822 4356620 4621169 4553686 4893727
6514 4893727 5313667 5453574 5668661 5817564 6273264 6662094 6974241 7146619 7675268 8101906
$$ packed form
6585C51655P7601K12552M5536k10267J69401k2261k46444M40001Q9646n7531M4109
6574H93998k32752K0131L71205L14011k17284k59912K11382o082o9462j05995
6564I19240n0453J41300J10542J76577M276k01987J29389j77952m2530J08320
6554A116722j17733J53012J79489J62608k01471L7732J80602N2969k6644J99584
6544A736870J90288L8042j62701J55204J10003J09826J91915P8652J4050k04368
6534B257781K27265j80929J62156j69514M9887M03473L111K23431J88648K9643
6524C194952Q3685K45201R9510Q9374n7812K88912M12798K64549o7483L40041
6514D893727M19940J39907K15087J48903M55700L88830L12147J72378N28649M26638
$$ plain form
6504 8101906 8548362 8986772 9532499 10019323 10573953 11252196 11913767 12435207 12645350 12686790
6494 12686790 13023372 13195529 13301970 13062341 13128953 13264862 13293733 13444062 13953633 14274181
6484 14274181 14536354 14938989 15360277 15927630 16727519 17351020 17905645 18452789 19080431
6475 19080431 19766525 20140446 20204962 20117383 19919390 19686083 19001206 18436960 17632814 16905713
6465 16905713 16250925 15603406 15108221 14957849 14646128 14147599 13539796 13120598 13106693 13297716
6455 13297716 13222800 13356278 13330034 13123454 13156295 12924721 12529876 12111975 11806028 11317363
6445 11317363 10559227 10075284 9647126 9022884 8496969 7612217 7143041 6614042 6198923
6436 6198923 5836836 5802720 5414422 5184976 4915843 4620416 4437095 4148377 3828343 3847685
$$ packed form
6504H101906M46456M38410N45727M86824N54630O78243O61571N21440K10143M1440
6494A2686790L36582J72157J06441k39629O6612J35909K8871J50329N09571L20548
6484A4274181K62173M02635M21288N67353P99889O23501N54625N47144O27642
6475A9080431O86094L73921O4516q7579j97993k33307o84877n64246q04146p27101
6465A6905713o54788o47519m95185j50372l11721m98529o07803m19198j3905J91023
6455A3297716p4916J33478k6244k06580L2841k31574l94845m17901l05947m88665
6445A1317363p58136m83943m28158o24242n25915q84752m69176n28999m15119
6436F198923l62087l4116l88298k29446k69133k95427j83321k88718l20034J9342
$$ plain form
6426 3847685 3631843 3634673 3331019 2908498 2865596 2679801 2647116 2341738 2390853 2572058
6416 2572058 2198713 1956167 1831514 1835173 1805632 1904797 1728000 1822430 1857130 1975175 1765711
6405 1765711 1377124 1320262 1444811 1166750 1242014 1235087 1313024 1349803 1101476 922801 870857
6394 870857 937718 1027352 869573 850945 742971 900527 873536 867693 879966 734341 878858
6383 878858 1081481 788928 595000 758362 841439 649575 533938 366604 140059 436749
6373 436749 565947 603302 378100 495098 542195 690691 725811 664119 401487 433627 448091
6362 448091 360724 275827 367487 327867 384317 539390 352879 212327 255215 376513 479385
6351 479385 351073 240529 399108 380132 329167 274816 279922 273219 200114 486894 566732
$$ packed form
6426C847685k15842K830l03654m22521m2902j85795l2685l05378M9115J81205
6416B572058l73345k42546j24653L659k9541R9165j76797R4430L4700J18045k09464
6405A765711l88587n6862J24549k78061P5264o927P7937L6779k48327j78675n1944
6394H70857O6861Q9634j57779j8628j07974J57556k6991n843J2273j45625J44517
6383H78858K02623k92553j93928J63362Q3077j91864j15637j67334k26545K96690
6373D36749J29198L7355k25202J16998M7097J48496L5120o1692k62632L2140J4464
6362D48091q7367q4897R1660l9620N6450J55073j86511j40552M2888J21298J02872
6351D79385j28312j10544J58579j8976n0965n4351N106o703p3105K86780P9838
$$ plain form
6340 566732 414796 242275 196631 143995 138767 219578 388610 349675 358217 167403 301129
6329 301129 360555 162624 292702 375242 301618 310017 479833 493338 539197 692422 639787
6318 639787 637895 586684 413704 224649 75152 251656 123653 -159461 -27004 6700
6308 6700 335409 309560 330370 304431 353183 275579 82210 44119 419321 517573 219515
6297 219515 141256 272179 167040 203775 288257 236452 246590 221383 43041 -73956 59564
6286 59564 374535 516678 325319 154949 54135 218344 121871 30183 -66322 -176083
6276 -176083 -164880 129412 236465 185031 346941 196384 98161 131865 208886 132018 103431
6265 103431 92755 109856 105281 100787 201406 233991 124547 36045 225280 64652 206226
$$ packed form
6340E66732j51936j72521m5644n2636n228Q0811J69032l8935Q542j90814J33726
6329C01129N9426j97931J30078Q2540p3624Q399J69816J3505M5859J53225n2635
6318F39787j892n1211j72980j89055j49497J76504j28003k83114J32457L3704
6308F700L28709k5849K0810k5939M8752p7604j93369l8091L75202R8252k98058
6297B19515p8259J30923j05139L6735Q4482n1805J0138k5207j78342j16997J33520
6286E9564L14971J42143j91359j70370j00814J64209r6473r1688r6505j09761
6276a76083J1203K94292J07053n1434J61910j50557r8223L3704P7021p6868k8587
6265A03431j0676J7101m575m494J00619L2585j09444q8502J89235j60628J41574
$$ plain form
6254 206226 -6488 -54387 -141970 211827 414223 312454 190596 -8988 286874 308087
6244 308087 127776 236324 326306 400810 362125 230303 -21007 110481 222900 227755 24969
6233 24969 -80208 -44021 42067 -46204 3917 -86067 69272 151984 -83716 109747 117642
6222 117642 28469 -35787 179335 244278 182851 225193 -8447 -88202 -81835 16397 16083 -92321
6210 -92321 91307 119697 149858 229951 260313 302030 245620 242993 132398 81460 305836
6199 305836 -3705 -140401 -127404 107501 79025 -105716 99455 255953 200779 -71921
6189 -71921 -50204 -98820 -130203 -56079 -71712 86916 140454 160304 137767 -43372 -72159
6178 -72159 85356 144321 236146 224831 147438 84669 110510 366414 234962 72343 137154
$$ packed form
6254B06226k12714m7899q7583L53797K02396j01769j21858j99584K95862K1213
6244C08087j80311J08548Q9982P4504l8685j31822k51310J31488J12419M855k02786
6233B4969j05177L6187Q6088q8271N0121q9984J55339Q2712k35700J93463P895
6222A17642q9173o4256K15122O4943o1427M2342k33640p9755O367R8232l14j08404
6210i2321J83628K8390L0161Q0093L0362M1717n6410k627j10595n0938K24376
6199C05836l09541j36696J2997K34905k8476j84741K05171J56498n5174k72700
6189g1921K1717m8616l1383P4124j5633J58628N3538J9850k2537j81139k8787
6178g2159J57515N8965R1825j1315p7393o2769K5841K55904j31452j62619O4811
$$ plain form
6167 137154 199486 84066 7933 242544 364118 291627 274846 214973 109332 279739 259279
6156 259279 341782 347582 176510 71788 156172 152902 46355 63450 286170 237018 62360
6145 62360 170777 319095 458329 315319 164668 199803 8225 111189 146886 -25033
6135 -25033 -138454 48451 48135 -1390 338990 380260 262542 124469 22613 112127 127578
6124 127578 9139 -70898 223293 112635 47612 204188 139156 56883 -7170 135510 205517
6113 205517 260242 150525 49246 -146521 93020 87880 -87149 36182 166797 237124
6103 237124 375405 364799 268872 331105 288264 167569 266787 594935 390443 104194 185489
6092 185489 376930 241469 224868 229019 201631 377002 277721 176875 277860 272822 329947
$$ packed form
6167A37154O2332j15420p6133K34611J21574p2491j6781n9873j05641J70407k0460
6156B59279Q2503N800j71072j04722Q4384l270j06547J7095K22720m9152j74658
6145F2360J08417J48318J39234j43010j50651L5135j91578J02964L5697j71919
6135b5033j13421J86905l16m9525L40380M1270j17718j38073j01856Q9514J5451
6124A27578j18439q0037K94191j10658o5023J56576o5032q2273o4053J42680P0007
6113B05517N4725j09717j01279j95767K39541n140j75029J23331J30615P0327
6103B37124J38281j0606r5927O2233m2841j20695R9218L28148k04492k86249Q1295
6092A85489J91441j35461j6601M151k7388J75371r9281j00846J00985n038N7125
$$ plain form
6081 329947 271752 405564 390086 314467 290115 100853 101413 6414 -35408 59586 222339
6070 222339 394499 567516 334248 229314 361879 672004 642176 403112 150143 348056
6060 348056 242954 -9587 59830 102945 195585 394618 246557 336899 348075 392746 435572
6049 435572 217065 106691 80418 23604 86732 53688 343952 372175 101079 19141 130103
6038 130103 313440 130650 161869 272656 273424 304777 191224 16463 87325 258019 371497
6027 371497 26008 -93381 4752 393081 405053 265897 251441 221737 181507 231056 186852
6016 186852 81508 -37700 -28656 104188 108576 25937 172631 257807 379192 544603 474799
6005 474799 246278 222060 42575 70948 329303 220140 -29064 43735 95001 197203
$$ packed form
6081C29947n8195J33812j5478p5619k4352j89262N60r4999m1822R4994J62753
6070B22339J72160J73017k33268j04934J32565L10125k9828k39064k52969J97913
6060C48056j05102k52541O9417M3115R2640J99033j48061R0342J1176M4671M2826
6049D35572k18507j10374k6273n6814O3128l3044K90264K8223k71096q1938J10962
6038A30103J83337j82790L1219J10787P68L1353j13553j74761P0862J70694J13478
6027C71497l45489j19389R8133L88329J1972j39156j4456k9704m0230M9549m4204
6016A86852j05344j19208R044J32844M388q2639J46694Q5176J21385J65411o9804
6005D74799k28521k4218j79485K8373K58355j09163k49204P2799N1266J02202
$$ plain form
5995 197203 477667 171225 88105 267978 326538 206651 336341 20610 -150944 183519
5985 183519 300633 238450 310113 213547 183835 430247 557484 466306 540804 411521 113984
5974 113984 267981 -92012 -41657 44869 175645 -84432 -225658 -175891 -114460 216766
5964 216766 245761 79706 259441 148454 80439 206083 379902 302180 184389 248366
5954 248366 144798 250624 207520 132012 247482 216826 219432 -135410 -53217 -147065 -31718
5943 -31718 272917 90212 117868 107684 195364 307496 232178 314164 342859 409045 599141
5932 599141 628610 564176 527879 466341 388067 541936 509296 598228 455896 495560 698011
5921 698011 456273 470121 579473 233298 304297 457939 588257 371040 367605 359133 417182
$$ packed form
5995A97203K80464l06442q3120J79873N8560j19887J29690l15731j71554L34463
5985A83519J17114o2183P1663r6566k9712K46412J27237r1178P4498j29283k97537
5974A13984J53997l59993N0355Q6526J30776k60077j41226M9767O1431L31226
5964B16766K8995j66055J79735j10987o8015J25644J73819p7722j17791O3977
5954B48366j03568J05826m3104p5508J15470l0656K606l54842Q2193r3848J15347
5943c1718L04635j82705K7656j0184Q7680J12132p5318Q1986K8695O6186J90096
5932E99141K9469o4434l6297o1538p8274J53869l2640Q8932j42332L9664K02451
5921F98011k41738J3848J09352l46175P0999J53642J30318k17217l435q472N8049
$$ plain form
5910 417182 295982 222474 263535 338197 264727 291980 489796 627015 531130 482232 489781
5899 489781 623195 460494 576216 597285 455855 336220 450731 569924 465759 258854
5889 258854 244448 347434 623250 685873 573135 500195 631596 939954 849737 515065
5879 515065 411432 706779 528363 639660 570705 423976 465496 630923 775362 865148
5869 865148 763521 677774 892477 891648 624060 702878 782954 842933 916707 738224 868500
5858 868500 943096 856621 761685 835432 981038 867097 947135 932220 927036 1093715 1159152
5847 1159152 1222536 1194605 854978 1061235 1353527 1253694 1279565 1241197 1306025 1237927 1284680
5836 1284680 1455514 1578805 1487208 1462815 1445560 1665769 1717236 1719745 1900957 2047296 2018662
$$ packed form
5910D17182j21200p3508M1061P4662p3470K7253J97816J37219r5885m8898P549
5899D89781J33414j62701J15722K1069j41430j19635J14511J19193j04165k06905
5889B58854j4406J02986K75816O2623j12738p2940J31401L08358r0217l34672
5879E15065j03633K95347j78416J11297o8955j46729M1520J65427J44439Q9786
5869H65148j01627q5747K14703q29k67588P8818Q0076N9979P3774j78483J30276
5858H68500P4596q6475r4936P3747J45606j13941Q0038j4915n184J66679O5437
5847A159152O3384k7931l39627K06257K92292r9833K5871l8368O4828o8098M6753
5836A284680J70834J23291r1597k4393j7255K20209N1467K509J81212J46339k8634
$$ plain form
5825 2018662 2039807 2158726 2264679 2522817 2339526 2420036 2418771 2493914 2406891 2457362 2587548
5814 2587548 2636370 2948539 2919504 2914245 3084449 3335912 3410700 3358195 3504361 3482645 3711161
5803 3711161 3828667 4099583 4115013 4034842 4215409 4485195 4462751 4722579 4910803 5113565
5793 5113565 5360737 5530008 5845039 5944080 5940504 5992040 6545457 6769285 6974613 7597893
5783 7597893 7658937 7999173 8484883 9119722 9590016 10119994 10619971 11148202 11877098 12597919
5773 12597919 13331217 13584514 14080874 14554356 14994529 15256076 15073071 15232784 15168362 14965145
5763 14965145 15019274 15192171 15092524 15112626 15499387 15900908 16155811 16570619 17233603 18096590
5753 18096590 19067124 19793835 20712727 21345464 21855384 22259493 22449159 22423316 22061139 21573284
$$ packed form
5825B018662K1145J18919J05953K58138j83291Q0510j265P5143q7023N0471J30186
5814B587548M8822L12169k9035n259J70204K51463P4788n2505J46166k1716K28516
5803C711161J17506K70916J5430q0171J80567K69786k2444K59828J88224K02762
5793E113565K47172J69271L15031R9041l576N1536N53417K23828K05328O23280
5783G597893O1044L40236M85710O34839M70294N29978M99977N28231P28896P20821
5773A2597919P33298K53297M96360M73482M40173K61547j83005J59713o4422k03217
5763A4965145N4129J72897r9647K0102L86761M01521K54903M14808O62984Q62987
5753A8096590R70534P26711R18892O32737N09920M04109J89666k5843l62177m87855
$$ plain form
5743 21573284 20675749 19673017 18775068 17999446 17312385 16517006 15753693 15137816 14725187
5734 14725187 14164915 13942318 13819445 13525549 13233653 13323047 13549835 13582756 13307394 13146952
5724 13146952 12994783 12806954 12360406 11819252 11103477 10618519 10078977 9391534 8696459
5715 8696459 8158874 7716043 7107828 6529326 6281182 5924091 5591998 5362668 4889370 4587155
5705 4587155 4588103 4298080 4231679 4125920 3961108 4100334 3710893 3326177 3533537 3592406
5695 3592406 3544696 3463990 3381983 2907058 2983556 2933198 2512966 2670894 2503760 2164875
5685 2164875 2061266 2352335 2304909 2255712 2143042 2138820 2005337 1899125 1885974 1854537 1979782
5674 1979782 1885918 1644551 1599794 1774248 1761753 1955153 1769260 1732223 1899359 1987983
$$ packed form
5743B1573284q97535j002732q97949p75622o87061p95379p63313o15877m12629
5734A4725187n60272k22597j22873k93896k91896Q9394K26788L2921k75362j60442
5724A3146952j52169j87829m46548n41154p15775m84958n39542o87443o95075
5715H696459n37585m42831o08215n78502k48144l57091l32093k29330m73298l02215
5705D587155R48k90023o6401j05759j64812J39226l89441l84716K07360N8869
5695C592406m7710q0706q2007m74925P6498n0358m20232J57928j67134l38885
5685B164875j03609K91069m7426m9197j12670m222j33483j06212j3151l1437J25245
5674A979782r3864k41367m4757J74454j2495J93400j85893l7037J67136Q8624
$$ plain form
5664 1987983 1878838 1766426 1859753 1737369 1723692 1630812 1577040 1534934 1437237 1574080 1540507
5653 1540507 1543162 1581857 1576443 1663576 1483582 1599990 1718415 1481495 1425104 1599710 1590071
5642 1590071 1576400 1446913 1437100 1661016 1765555 1749702 1734500 1660536 1595860 1492313 1532423
5631 1532423 1553245 1721465 1731595 1764979 1685483 1382555 1507139 1550521 1564619 1685635 1805780
5620 1805780 1843187 1637119 1559052 1553854 1628018 1707234 1840672 1831067 1893120 1861034 1691981
5609 1691981 1710321 2023718 1935035 1644978 1644283 1735181 1907020 1982299 2119455 2104160 1990342
5598 1990342 2123847 2171348 2079517 2138041 2180325 2229639 2243901 2256997 2387180 2349700 2360820
5587 2360820 2316508 2523741 2764751 2543917 2332335 2576041 2719290 2902064 2984861 3085085
$$ packed form
5664A987983j09145j12412R3327j22384j3677r2880n3772m2106r7697J36843l3573
5653A540507K655L8695n414Q7133j79994J16408J18425k36920n6391J74606r639
5642A590071j3671j29487r813K23916J04539j5853j5202p3964o4676j03547M0110
5631A532423K0822J68220J0130L3384p9496l02928J24584M3382J4098J21016J20145
5620A805780L7407k06068p8067n198P4164P9216J33438r605O2053l2086j69053
5609A691981J8340L13397q8683k90057o95R0898J71839P5279J37156j5295j13818
5598A990342J33505M7501r1831N8524M2284M9314J4262J3096J30183l7480J1120
5587B360820m4312K07233K41010k20834k11582K43706J43249J82774Q2797J00224
$$ plain form
5577 3085085 2965010 2831886 2687243 2659868 2881177 2877533 2786248 2855419 2887840 2948359 3165978
5566 3165978 3241818 3491533 3425826 3352817 3581604 3495331 3510921 3469887 3435439 3502084 3582317
5555 3582317 3627217 3740112 3746648 3805216 3957904 3877100 4045502 4045511 4288919 4202906 4430529
5544 4430529 4459523 4405270 4398775 4705391 4787620 4887954 4840823 4728833 4752176 4787869 5092875
5533 5092875 5182638 5223831 5283978 5474938 5254174 5115603 5596985 5863509 5733099 5758337
5523 5758337 5885917 5940630 6214677 6125915 6254076 6578210 6565615 6844415 7020435 7096521
5513 7096521 7405365 7541660 7847831 7918903 7980029 8271563 8607325 8913549 8856800 9164781
5503 9164781 9319005 9556080 9956677 10465642 10651719 11101025 11619510 12007428 12287617 12489866
$$ packed form
5577C085085j20075j33124j44643k7375K21309l644r1285O9171L2421O0519K17619
5566C165978P5840K49715o5707p3009K28787q6273J5590m1034l4448O6645Q0233
5555C582317M4900J12895O536N8568J52688q0804J68402RK43408q6013K27623
5544D430529K8994n4253o495L06616Q2229J00334m7131j11990K3343L5693L05006
5533E092875Q9763M1193O0147J90960k20764j38571M81382K66524j30410K5238
5523E758337J27580N4713K74047q8762J28161L24134j2595K78800J76020P6086
5513G096521L08844J36295L06171P1072O1126K91534L35762L06224n6749L07981
5503I164781J54224K37075M00597N08965J86077M49306N18485L87918K80189K02249
$$ plain form
5493 12489866 13030687 13654291 14236164 14782779 15351904 15953081 16619623 17348130 18075134
5484 18075134 18636759 19145206 19779263 20348054 21288755 21901536 22772750 23536739 24470255
5475 24470255 25423094 26143022 26883606 27897401 28801711 29762504 30905860 31857733 33224976
5466 33224976 34127653 34961576 35853544 37096540 38240985 39243503 40531454 42002689 43396720
5457 43396720 44911095 46620956 48228266 49958895 51929449 53546966 54701452 56009384
5449 56009384 57328657 57970551 59232677 60305110 61456857 62583344 63284331 63936404 64312005
5440 64312005 64519876 64576647 64708358 65141320 65780215 66758492 67920523 69288575 70730644
5431 70730644 72564003 74359413 76374908 78081842 79909935 81420703 82427381 83417019
$$ packed form
5493A2489866N40821O23604N81873N46615N69125O01177O66542P28507P27004
5484A8075134N61625N08447O34057N68791R40701O12781Q71214P63989R33516
5475B4470255R52839P19928P40584J013795R04310R60793J143356R51873J367243
5466C3224976R02677Q33923Q91968J242996J144445J002518J287951J471235J394031
5457D3396720J514375J709861J607310J730629J970554J617517J154486J307932
5449E6009384J319273O41894J262126J072433J151747J126487P00987O52073L75601
5440F4312005K07871N6771J31711M32962O38895R78277J162031J368052J442069
5431G0730644J833359J795410K015495J706934J828093J510768J006678R89638
$$ plain form
5423 83417019 83984242 84620461 84789323 85289661 85679364 85864300 86348412 87408486 88729499
5414 88729499 89979341 91213476 92481153 94083156 96135365 98391745 101312957 104545485
5406 104545485 108044336 111941876 116451536 121902812 128448540 135700637 144666841 155276932
5398 155276932 168205052 183597214 201789226 224445143 253581333 291598585 340139405
5391 340139405 399626584 464726350 518230553 534036900 501076535 439511314 374317111
5384 374317111 315603715 267179201 229354490 199608146 175666247 156158124 139700999
5377 139700999 125718434 113529428 103318525 94341610 86774644 80008125 74025978 68638826
5369 68638826 63919601 59834504 55828045 52667111 49514475 46576957 44182639 42040972
$$ packed form
5423H3417019N67223O36219J68862N00338L89703J84936M84112J060074J321013
5414H8729499J249842J234135J267677J602003K052209K256380K921212L232528
5406A04545485L498851L897540M509660N451276O545728P252097Q966204J0610091
5398A55276932J2928120J5392162J8192012K2655917K9136190L8017252M8540820
5391C40139405N9487179O5099766N3504203J5806347l2960365o1565221o5194203
5384C74317111n8713396m8424514l7824711k9746344k3941899j9508123j6457125
5377A39700999j3982565j2189006j0210903q976915p566966o766519n982147n387152
5369F8638826m719225m085097m006459l160934l152636k937518k394318k141667
$$ plain form
5361 42040972 39707588 37815968 35819752 34249286 32507722 30942874 29648226 28129808
5353 28129808 27027371 25722460 24893890 23970592 23072791 22395048 21643416 20790249 20351679
5344 20351679 19820967 19177139 18763819 18388267 17783263 17283067 16939374 16228295 15639008
5335 15639008 15145192 14539379 13869824 13364366 12983638 12585808 12078532 11783595 11278560
5326 11278560 10904811 10601596 10047124 9992059 9973990 9512994 9296906 9068645 8978441 8551580
5316 8551580 8101762 7899531 7768873 7742441 7413262 7235553 6967154 6712274 6586804 6549965
5306 6549965 6370413 6313934 6407692 6050591 5861169 5891414 5445367 5411845 5409558 5285072 4893524
5295 4893524 4783235 4765190 4753109 4695430 4619714 4786571 4603733 4562222 4289166 4219052 4311339
$$ packed form
5361D2040972k333384j891620j996216j570466j741564j564848j294648j518418
5353B8129808j102437j304911q28570r23298q97801o77743p51632q53167m38570
5344B0351679n30712o43828m13320l75552o05004n00196l43693p11079n89287
5335A5639008m93816o05813o69555n05458l80728l97830n07276k94937n05035
5326A1278560l73749l03215n54472n5065j8069m60996k16088k28261r0204m26861
5316H551580m49818k02231j30658k6432l29179j77709k68399k54880j25470l6839
5306F549965j79552n6479R3758l57101j89422L0245m46047l3522k287j24486l91548
5295D893524j10289j8045j2081n7679p5716J66857j82838m1511k73056p0114R2287
$$ plain form
5284 4311339 4454852 4465640 4147350 3969558 4125240 3952340 3648732 3524803 3318273 3278066
5274 3278066 3234896 3265167 3072235 3322330 3180377 3008505 3197144 3169722 3089876 2752768
5264 2752768 2718213 2785845 2800630 2943946 2889975 2796399 2942972 2940497 2759948 2595282 2675473
5253 2675473 2622464 2445704 2386124 2403259 2219748 2049742 1959618 1951860 1747263 1838410 2030726
5242 2030726 1910063 1904004 1971729 1942696 1727010 1580835 1635477 1774144 1943765 1741865
5232 1741865 1549222 1577883 1676731 1753614 1434163 1505777 1441875 1616321 1758557 1846029 1863415
5221 1863415 1863756 1670867 1349802 1182617 1052168 1307946 1554936 1702823 1602881 1589992
5211 1589992 1294489 1282528 1262081 1340903 1464480 1338279 1260554 1352860 1418206 1390924 1347234
$$ packed form
5284D311339J43513J0788l18290j77792J55682j72900l03608j23929k06530m0207
5274C278066m3170L0271j92932K50095j41953j71872J88639k7422p9846l37108
5264B752768l4555O7632J4785J43316n3971r3576J46573k475j80549j64666Q0191
5253B675473n3009j76760n9580J7135j83511j70006r0124p758k04597R1147J92316
5242B030726j20663o059O7725k9033k15686j46175N4642J38667J69621k01900
5232A741865j92643K8661R8848P6883l19451P1614o3902J74446J42236Q7472J7386
5221A863415L41j92889l21065j67185j30449K55778K46990J47887r9942j2889
5211A589992k95503j1961k0447P8822J23577j26201p7725R2306O5346k7282m3690
$$ plain form
5200 1347234 1155996 1107497 1037099 1043266 1264559 1264627 1301097 1103821 963795 1151165 1218641
5189 1218641 1474136 1180562 1174640 1269613 1297670 1322526 1151909 1224864 1278518 1228828 942088
5178 942088 905046 972578 892601 1093019 756591 617430 910330 1150947 1219574 910730
5168 910730 773561 1005769 1033821 952379 709954 884157 1007362 1030181 942059 1046366
5158 1046366 989047 1045467 785093 614791 1012643 884211 758599 918273 994919 968900
5148 968900 855764 828582 913563 813670 1036416 786814 826874 736458 531166 623401 701767
5137 701767 1033544 1163127 924401 833605 749768 755762 909470 813962 738794 980170 1261882
5126 1261882 1247984 1038441 1073232 726082 979255 988067 909046 927729 1023349 971747 955400
$$ packed form
5200A347234j91238m8499p0398O167K21293O8L6470j97276j40026J87370O7476
5189A218641K55495k93574n922R4973K8057K4856j70617P2955N3654m9690k86740
5178I42088l7042O7532p9977K00418l36428j39161K92900K40617O8627l08844
5168I10730j37169K32208K8052q1442k42425J74203J23205K2819q8122J04307
5158A046366n7319N6420k60374j70302L97852j28432j25612J59674P6646k6019
5148I68900j13136k7182Q4981r9893K22746k49602M0060r0416k05292R2235P8366
5137G01767L31777J29583k38726r0796q3837N994J53708r5508p5168K41376K81712
5126A261882j3898k09543L4791l47150K53173Q812p9021J8683R5620n1602j6347
$$ plain form
5115 955400 696485 922523 1036607 1039456 1009189 773482 1128026 1114851 985468 925264 860903
5104 860903 814715 873305 830447 689396 785477 905127 873148 1004658 923255 895299 806856
5093 806856 788465 790126 933600 1031963 797585 646431 675970 782136 688270 594181 1015701
5082 1015701 711478 162983 213489 340655 684725 844709 598677 537685 565167 670838
5072 670838 815557 731613 732631 650458 618774 671986 633813 643321 423491 478505 479938 588446
5060 588446 436254 491629 525697 544231 433462 503956 532490 367357 400603 446390 493734
5049 493734 464511 392083 390512 205365 408722 471194 376902 558380 420239 521572 398379
5038 398379 348671 433764 395602 350369 478087 513190 471808 238584 361105 624821 546859
$$ packed form
5115I55400k58915K26038J14084K849l0267k35707L54544j3175j29383o0204o4361
5104H60903m6188N8590m2858j41051R6081J19650l1979J31510q1403k7956q8443
5093H06856j8391J661J43474R8363k34378j51154K9539J06166r3866r4089M21520
5082A015701l04223n48495N0506J27166L44070J59984k46032o0992K7482J05671
5072F70838J44719q3944J018q2173l1684N3212l8173R508k19830N5014J433J08508
5060E88446j52192N5375L4068J8534j10769P0494K8534j65133L3246M5787M7344
5049D93734k9223p2428j571j85147K03357O2472r4292J81478j38141J01333j23193
5038C98379m9708Q5093l8162m5233J27718L5103m1382k33224J22521K63716p7962
$$ plain form
5027 546859 497479 549539 406098 230706 333834 489340 557540 673143 634535 608400 471530
5016 471530 490750 595817 737217 693965 459378 288653 638951 817838 517909 385113
5006 385113 453248 408294 517088 394599 257337 360880 558596 568745 494900 485820 467684
4995 467684 517119 493162 551278 617913 640019 528957 551301 515887 552418 500700 515892
4984 515892 384484 610730 578272 418566 565923 634017 542177 424769 408174 334868 231508
4973 231508 194357 365252 530967 517839 415411 441086 298941 498194 582778 547423 302759
4962 302759 55315 427527 449969 480255 520326 653507 613596 636050 584553 242257 390764
4951 390764 749445 637749 811587 780665 643480 625781 682287 649713 664222 661527 573761
$$ packed form
5027E46859m9380N2060j43441j75392J03128J55506O8200J15603l8608k6135j36870
5016D71530J9220J05067J41400m3252k34587j70725L50298J78887k99929j32796
5006C85113O8135m4954J08794j22489j37262J03543J97716J0149p3845r080j8136
4995D67684M9435k3957N8116O6635K2106j11062K2344l5414L6531n1718J5192
4984E15892j31408K26246l2458j59706J47357O8094r1840j17408j6595p3306j03360
4973B31508l7151J70895J65715j3128j02428K5675j42145J99253Q4584l5355k44664
4962C02759k47444L72212K2442L0286M0071J33181l9911K2454n1497l42296J48507
4951C90764L58681j11696J73838l0922j37185j7699N6506l2574J4509k695q7766
$$ plain form
4940 573761 611375 624594 763006 770026 950331 813978 704314 782435 844817 850315 770468
4929 770468 689206 700263 541501 576094 764333 732234 923849 839708 792364 830589 1065503
4918 1065503 1000497 926013 846685 785249 608609 764422 987333 922185 764664 799186 782976
4907 782976 682099 830198 782461 630158 660223 1007583 916684 983090 788641 849904 848706
4896 848706 923885 816631 921414 1034976 1091820 1113283 1252264 1245697 1060684 864242 823753
4885 823753 1005399 1169632 1392279 1204914 974504 999651 1011427 1048302 1140357 1146255 1208358
4874 1208358 1367181 1186779 1317968 1357929 1430058 1381622 1183244 1298184 1562403 1493155
4864 1493155 1369397 1314800 1326049 1591551 1651257 1754766 1919050 1637158 1449299 1647028
$$ packed form
4940E73761L7614J3219J38412P020J80305j36353j09664P8121O2382N498p9847
4929G70468q1262J1057j58762L4593J88239l2099J91615q4141m7344L8225K34914
4918A065503o5006p4484p9328o1436j76640J55813K22911o5148j57521L4522j6210
4907G82976j00877J48099m7737j52303L0065L47360r0899O6406j94449O1263j198
4896H48706P5179j07254J04783J13562N6844K1463J38981o567j85013j96442m0489
4885H23753J81646J64233K22647j87365k30410K5147J1776L6875R2055N898O2103
4874A208358J58823j80402J31189L9961P2129m8436j98378J14940K64219o9248
4864A493155j23758n4597J1249K65502N9706J03509J64284k81892j87859J97729
$$ plain form
4854 1647028 1816405 1750041 1643786 1722413 1616512 1721426 1847130 1986944 2194745 2223729
4844 2223729 2290568 2422594 2025931 1980572 2206085 2624503 2850099 2684108 2758075 3090952
4834 3090952 3208129 3021451 3060498 3301396 3317359 3378830 3319999 3433785 3536265 3854360
4824 3854360 4031741 4204373 4570032 4862437 4777352 4802988 4986813 5098514 5183779 5227841
4814 5227841 5251735 5566453 6054640 6176045 6270888 6475688 6670042 6717333 6940536 7158471
4804 7158471 7518673 7648151 7608708 7852274 8226774 8439502 8537808 8710652 9128632 9500658
4794 9500658 9594839 9997113 10204935 10512563 10837564 10837214 10923660 11199041 11482234 11672927
4784 11672927 11777678 11882563 12190062 12368024 12671147 12768450 12910361 12991239 13099814 13215279
$$ packed form
4854A647028J69377o6364j06255P8627j05901J04914J25704J39814K07801K8984
4844B223729O6839J32026l96663m5359K25513M18418K25596j65991P3967L32877
4834C090952J17177j86678L9047K40898J5963O1471n8831J13786J02480L18095
4824C854360J77381J72632L65659K92405q5085K5636J83825J11701Q5265M4062
4814E227841K3894L14718M88187J21405R4843K04800J94354M7291K23203K17935
4804G158471L60202J29478l9443K43566L74500K12728R8306J72844M17980L72026
4794I500658R4181M02274K07822L07628L25001l50Q6446K75381K83193J90693
4784A1672927J04751J04885L07499J77962L03123R7303J41911Q0878J08575J15465
$$ plain form
4774 13215279 13145165 13682292 13923717 14005386 14042769 13996819 14037005 14119160 14126079 14084295 14073606
4763 14073606 14262625 14445134 14290092 14152120 14118173 14133017 13984654 14005180 13605165 13547944
4753 13547944 13665585 13596280 13439292 13244026 13337978 13160076 12960518 12960316 12775107 12551268
4743 12551268 12385199 12115161 11970656 11712506 11486953 11425740 11178211 10812260 10695047 10520586
4733 10520586 10234346 9814197 9523140 9540099 9271340 8888741 8742021 8502180 8429391 8081803
4723 8081803 7710258 7466066 7070449 7033656 6948036 6724930 6454506 6291988 5938472 5790625
4713 5790625 5554770 5405450 4990968 5173654 5094421 5255939 5001116 4402837 4358399 4362835
4703 4362835 4312411 4073734 3875913 3799544 3782749 3516120 3549368 3365423 3361041 3137028 2976616
$$ packed form
4774A3215279p0114N37127K41425Q1669L7383m5950M0186Q2155O919m1784j0689
4763A4073606J89019J82509j55042j37972l3947J4844j48363K0526m00015n7221
4753A3547944J17641o9305j56988j95266R3952j77902j99558k02j85209k23839
4743A2551268j66069k70038j44505k58150k25553o1213k47529l65951j17213j74461
4733A0520586k86240m20149k91057J6959k68759l82599j46720k39841p2789l47588
4723H081803l71545k44192l95617l6793q5620k23106k70424j62518l53516j47847
4713E790625k35855j49320m14482J82686p9233J61518k54823n98279m4438M436
4703D362835n0424k38677j97821p6369j6795k66629L3248j83945m382k24013j60412
$$ plain form
4692 2976616 2927390 2932494 2877292 2884732 2663436 2756716 2913635 2578839 2510674 2427589 2569741
4681 2569741 2550216 2298857 2371999 2279274 2320146 2281809 2333389 2394093 2442005 2339225 2407199
4670 2407199 2510090 2456605 2470941 2616829 2363433 2564353 2588561 2379663 2458498 2262456
4660 2262456 2269714 2382602 2479055 2464566 2549940 2528972 2722964 2789296 2695891 2996723 3265161
4649 3265161 2982970 2870813 3076206 3272888 3489072 3470105 3525711 3597303 3672199 3779459
4639 3779459 3901329 4077442 4340970 4444470 4527833 4633659 4648494 4697528 4841348 5060997
4629 5060997 5193340 5410141 5537308 5711061 5936624 6374413 6628037 6959902 7463738 8005746
4619 8005746 8176596 8589272 8893196 9759174 10478653 11016617 12088353 13415711 14670561
$$ packed form
4692B976616m9226N104n5202P440k21296R3280J56919l34796o8165q3085J42152
4681B569741j9525k51359P3142r2725M0872l8337N1580O0704M7912j02780O7974
4670B407199J02891n3485J4336J45888k53396K00920K4208k08898P8835j96042
4660B262456P258J12888R6453j4489Q5374k0968J93992O6332r3405L00832K68438
4649C265161k82191j12157K05393J96682K16184j8967N5606P1592P4896J07260
4639C779459J21870J76113K63528J03500Q3363J05826J4835M9034J43820K19649
4629E060997J32343K16801J27167J73753K25563M37789K53624L31865N03836N42008
4619H005746J70850M12676L03924Q65978P19479N37964J071736J327358J254850
$$ plain form
4610 14670561 16126890 17909778 19814389 21481016 22614816 23650974 24566032 25834451
4602 25834451 27692476 30086104 32782322 34690266 35654289 36173830 36056417 36112223 36927346
4593 36927346 38844995 40916910 42624289 43306970 42096228 39923714 37828311 36376975
4585 36376975 35302209 35028358 35274346 34703047 33432345 31042128 28318636 25812179 24104173
4576 24104173 22629776 21597659 20732609 19714090 18100143 16359545 14687377 12938462
4568 12938462 11408209 10453234 9625378 8744044 7959375 7067372 6756652 6211147 5749894
4559 5749894 5558440 5216232 4995071 4981027 4573301 4394549 4244663 4015697 3718560 3575205
4549 3575205 3539121 3269311 3306782 3196537 3046958 3075133 3023108 3054086 2978552 2588403 2424595
$$ packed form
4610A4670561J456329J782888J904611J666627J133800J036158R15058J268419
4602B5834451J858025K393628K696218J907944R64023N19541j17413N5806Q15123
4593C6927346J917649K071915J707379O82681j210742k172514k095403j451336
4585C6376975j074766k73851K45988n71299j270702k390217k723492k506457j708006
4576B4104173j474397j032117q65050j018519j613947j740598j672168j748915
4568A2938462j530253r54975q27856q81334p84669q92003l10720n45505m61253
4559E749894j91454l42208k21161j4044m07726j78752j49886k28966k97137j43355
4549C575205l6084k69810L7471j10245j49579K8175n2025L0978p5534l90149j63808
$$ plain form
4538 2424595 2547336 2548174 2229910 1997315 2024620 2210336 2319203 2110531 1949718 1866643
4528 1866643 1790621 1885610 1828183 1853239 1660843 1747798 1600311 1587279 1834119 1579909 1634699
4517 1634699 1653211 1574916 1438432 1342077 1408334 1455674 1391025 1313638 1289531 1330780 1335978
4506 1335978 1241541 1116771 1255697 1254437 1192330 1218737 1141221 1173523 1118292 1058254 1202074
4495 1202074 959077 849848 896011 865339 797634 871858 923899 858254 659863 614514 903030
4484 903030 971908 789312 768465 782992 685133 792754 848239 783690 729279 504029 509614
4473 509614 523027 590363 592009 465360 443225 605362 402732 532728 463654 500626 578718
4462 578718 711911 631547 669788 594882 555271 553686 331775 486442 701033 827606 563012
$$ packed form
4538B424595J22741Q38l18264k32595K7305J85716J08867k08672j60813q3075
4528A866643p6022R4989n7427K5056j92396Q6955j47487j3032K46840k54210N4790
4517A634699J8512p8295j36484r6355O6257M7340o4649p7387k4107M1249N198
4506A335978r4437j24770J38926j260o2107K6407p7516L2302n5231o0038J43820
4495A202074k42997j09229M6163l0672o7705P4224N2041o5645j98391m5349K88516
4484I03030O8878j82596k0847J4527r7859J07621N5485o4549n4411k25250N585
4473E09614J3413O7336J646j26649k2135J62137k02630J29996o9074L6972P8092
4462E78718J33193q0364L8241p4906l9611j585k21911J54667K14591J26573k64594
$$ plain form
4451 563012 412453 355162 313467 441615 661216 627709 440501 352581 535236 372804
4441 372804 442535 572339 715382 624934 681445 494548 800079 810027 701375 484257 380719
4430 380719 636300 730340 594278 591429 673347 865313 891483 747028 819535 699390 621274
4419 621274 637112 497015 738727 896946 821449 753205 572268 606778 701844 699349 707920
4408 707920 748338 786219 792889 533955 444258 567965 585061 670041 447331 458017 579267
4397 579267 418167 376832 416453 552742 540432 616598 745451 747114 696001 779878 593347
4386 593347 499744 722675 744017 606623 490196 476702 545886 629822 591371 611790 613253
4375 613253 731446 624352 549462 879305 771418 442177 437571 580387 473416 428250
$$ packed form
4451E63012j50559n7291m1695J28148K19601l3507j87208q7920J82655j62432
4441C72804O9731J29804J43043r0448N6511j86897L05531R948j08652k17118j03538
4430C80719K55581R4040j36062k849Q1918J91966K6170j44455P2507j20145p8116
4419F21274J5838j40097K41712J58219p5497o8244j80937L4510R5066k495Q571
4408G07920M0418L7881O670k58934q9697J23707J7096Q4980k22710J0686J21250
4397E79267j61100m1335L9621J36289j2310P6166J28853J663n1113Q3877j86531
4386E93347r3603K22931K1342j37394j16427j3494O9184Q3936l8451K0419J463
4375F13253J18193j07094p4890L29843j07887l29241m606J42816j06971m5166
$$ plain form
4365 428250 437216 469098 526575 428666 541179 508351 265797 449387 600770 823309 567773
4354 567773 771856 676858 844189 825666 799905 784152 549066 701740 627601 627772 798497
4343 798497 614986 630458 788296 902460 822694 739520 703958 744029 928281 912881 983552
4332 983552 1050470 965038 1003149 1023572 946560 1165083 1080307 994175 1013185 1102272 1039492
4321 1039492 1081728 1152467 1220516 1078529 913123 849576 996556 1112473 1181678 1202094 1241917
4310 1241917 1288298 1328537 1389214 1405609 1487736 1567948 1521632 1633816 1702989 1727214 1857236
4299 1857236 1791672 1663174 1557705 1691716 2102788 2294308 1985384 2001186 2105750 2393819
4289 2393819 2293518 2389540 2578734 2526043 2492941 2460242 2508027 2559214 2498371 2778036 2903416
$$ packed form
4365D28250Q966L1882N7477r7909J12513l2828k42554J83590J51383K22539k55536
4354E67773K04083r4998J67331j8523k5761j5753k35086J52674p4139J71J70725
4343G98497j83511J5472J57838J14164p9766q3174l5562M0071J84252j5400P0671
4332I83552O6918q5432L8111K0423p7012K18523q4776q6132J9010Q9087o2780
4321A039492M2236P0739O8049j41987j65406o3547J46980J15917O9205K0416L9823
4310A241917M6381M0239O0677J6395Q2127Q0212m6316J12184O9173K4225J30022
4299A857236o5564j28498j05469J34011M11072J91520l08924J5802J04564K88069
4289B393819j00301R6022J89194n2691l3102l2699M7785N1187o0843K79665J25380
$$ plain form
4278 2903416 2911020 3115974 3281744 3347841 3450058 3661759 3687028 3776946 3857054 4163551 4156379
4267 4156379 4190848 4313764 4616502 4792506 4990778 5221650 5386387 5656170 5849616 5943770
4257 5943770 6166328 6325885 6853526 6925714 7108215 7481101 7887642 8348173 8559848 8869547
4247 8869547 9404202 10022260 10477513 10913724 11488594 12237922 12761428 13365493 14006116 14639983
4237 14639983 15471041 16433489 17249024 17941107 18573000 19266757 19905747 20762356 21851507
4228 21851507 22600020 23591888 24117374 24998514 25877616 26550034 27116674 27963875 28930767
4219 28930767 29597335 30263691 30715040 31190025 31701267 32286026 32711360 33518281 34301203
4210 34301203 34782806 34559257 34042943 33702241 32914223 32532483 32221728 31579354 31465264
$$ packed form
4278B903416P604K04954J65770O6097J02217K11701K5269Q9918Q0108L06497p172
4267D156379L4469J22916L02738J76004J98272K30872J64737K69783J93446R4154
4257E943770K22558J59557N27641P2188J82501L72886M06541M60531K11675L09699
4247H869547N34655O18058M55253M36211N74870P49328N23506O04065O40623O33867
4237A4639983Q31058R62448Q15535O92083O31893O93757O38990Q56609J089151
4228B1851507P48513R91868N25486Q81140Q79102O72418N66640Q47201R66892
4219B8930767O66568O66356M51349M74985N11242N84759M25334Q06921P82922
4210C4301203M81603k23549n16314l40702p88018l81740l10755o42374j14090
$$ plain form
4201 31465264 31088022 30331432 29657860 28753251 28096159 27379917 26503221 25585605 24924757
4192 24924757 24393549 23389852 22351482 21654528 20929398 20217819 19481552 18699032 17654477
4183 17654477 16919967 16256667 15399206 14634900 14134698 13553252 12644090 12271224 11469735
4174 11469735 10726135 10289870 10034172 9316948 8972249 8333776 8021409 7561740 7197691
4165 7197691 6863902 6519345 6380177 5882888 5619453 5418446 5107673 4876244 4865159 4512278
4155 4512278 4394065 4308880 3954171 3790468 3958846 3818157 3596974 3437924 3365768 3189152
4145 3189152 2948059 3014887 2989115 2848302 2837370 2783444 2725955 2791306 2544418 2306051 2415622
4134 2415622 2608307 2632004 2263470 2140997 2231221 2460132 2326473 2176571 2177938 1977430
$$ packed form
4201C1465264l77242p56590o73572r04609o57092p16242q76696r17616o60848
4192B4924757n31208j003697j038370o96954p25130p11579p36267p82520j044555
4183A7654477p34510o63300q57461p64306n00202n81446r09162l72866q01489
4174A1469735p43600m36265k55698p17224l44699o38473l12367m59669l64049
4165G197691l33789l44557j39168m97289k63435k01007l10773k31429j1085l52881
4155D512278j18213q5185l54709j63703J68378j40689k21183j59050p2156j76616
4145C189152k41093O6828k5772j40813j0932n3926n7489O5351k46888k38367J09571
4134B415622J92685K3697l68534j22473R0224K28911j33659j49902J367k00508
$$ plain form
4124 1977430 2202128 2269187 2215462 2079866 2109828 1905023 1946215 2109656 1940893 2041145
4114 2041145 1948982 1868520 1844591 1786488 1798738 1640638 1694002 1899402 1873526 1909243 1730902
4103 1730902 1436311 1656348 1488293 1648663 1831000 2078359 2105754 1869764 1703953 1732062
4093 1732062 1827804 1736501 1570643 1784165 2015587 1917087 1819071 1916374 1964216 1947811 1905425
4082 1905425 2040087 2264607 2190861 2023794 1933430 1732500 1746976 2176946 2125775 2018793
4072 2018793 1794380 2146812 1972820 2023204 1949975 1902301 2138513 2321600 2230285 2063245
4062 2063245 2062037 2074766 2066019 2022947 2092821 2138565 2201974 2156541 2091865 2159306 2166518 2425807
4050 2425807 2649203 2501559 2556818 2511626 2618244 2672812 2648857 2795294 2659972 2727982
$$ packed form
4124A977430K24698O7059n3725j35596K9962k04805M1192J63441j68763J00252
4114B041145r2163q0462k3929n8103J2250j58100N3364K05400k5876L5717j78341
4103A730902k94591K20037j68055J60370J82337K47359K7395k35990j65811K8109
4093A732062R5742r1303j65858K13522K31422r8500r8016R7303M7842j6405m2386
4082A905425J34662K24520p3746j67067r0364k00930J4476M29970n1171j06982
4072B018793k24413L52432j73992N0384p3229m7674K36212J83087r1315j67040
4062B063245j208J2729q747m3072O9874M5744O3409m5433o4676O7441P212K59289
4050B425807K23396j47644N5259m5192J06618N4568k3955J46437j35322O8010
$$ plain form
4040 2727982 2842683 2872152 2852056 2933204 3027881 3036512 3246992 3410407 3364136 3278481 3437001
4029 3437001 3560071 3331621 3406125 3709726 3795258 3860002 3902606 3999847 4131199 4115850 4229630
4018 4229630 4382361 4375174 4337539 4582307 4592897 4862081 5050333 4896843 5102731 5181520
4008 5181520 5305491 5627465 5843441 6215644 6116791 6198922 6360432 6447301 6709664 7064056
3998 7064056 7210401 7201686 7279483 7490103 7899340 8215224 8449848 8688765 9109059 9432897
3988 9432897 9531298 10024123 10426260 10681546 10832318 11242359 11880511 12120359 12557639 13020368
3978 13020368 13557884 14156588 14662748 15159368 15929157 16702429 17478475 18147133 18731281
3969 18731281 19614668 20737988 21628287 22660373 23587916 24846893 26227842 27715723 29483070
$$ packed form
4040B727982J14701K9469k0096Q1148R4677Q631K10480J63415m6271q5655J58520
4029C437001J23070k28450P4504L03601Q5532O4744M2604R7241J31352j5349J13780
4018D229630J52731p187l7635K44768J0590K69184J88252j53490K05888P8789
4008E181520J23971L21974K15976L72203r8853Q2131J61510Q6869K62363L54392
3998G064056J46345q715P7797K10620M09237L15884K34624K38917M20294L23838
3988I432897R8401M92825M02137K55286J50772M10041O38152K39848M37280M62729
3978A3020368N37516N98704N06160M96620P69789P73272P76046O68658N84148
3969A8731281Q83387J123320Q90299J032086R27543J258977J380949J487881J767347
$$ plain form
3960 29483070 31102836 32490351 34365813 36266711 38465129 40905408 43515539 46195644
3952 46195644 49012495 52095212 55470550 58799647 62024262 65300919 68362738 71089379
3944 71089379 73423440 75483607 76933140 77916413 78625412 78985306 79295803 79071169 78552614
3935 78552614 78116346 77289760 76470845 75510755 74106999 72577281 70564860 68288513 65424798
3926 65424798 62598350 59631267 56386015 52820219 49330849 46361753 43082878 40340064
3918 40340064 37780873 35490432 33340810 31074784 29244726 27620512 26110007 24662545
3910 24662545 23396927 22136170 21069409 20044236 19052739 18487746 17906128 17098954 16307687
3901 16307687 15578773 14997893 14843612 14392306 13737041 13275162 12881973 12923863 12750756 12122401
$$ packed form
3960B9483070J619766J387515J875462J900898K198418K440279K610131K680105
3952D6195644K816851L082717L375338L329097L224615L276657L061819K726641
3944G1089379K334061K060167J449533R83273P08999L59894L10497k24634n18555
3935G8552614m36268q26586q18915r60090j403756j529718k012421k276347k863715
3926F5424798k826448k967083l245252l565796l489370k969096l278875k742814
3918D0340064k559191k290441k149622k266026j830058j624214j510505j447462
3910B4662545j265618j260757j066761j025173r91497n64993n81618q07174p91267
3901A6307687p28914n80880j54281m51306o55265m61879l93189M1890j73107o28355
$$ plain form
3891 12122401 11925494 11757307 11332864 11005084 10601731 10563109 10727166 10460378 10047488 10137357
3881 10137357 10138366 9828627 9576225 9602121 9648365 9420811 9187846 9275463 9337255 9342675 9139717
3870 9139717 9054513 9368157 9384794 9458190 9305713 9568271 9883476 9886681 9980849 10110137 10205855
3859 10205855 10355265 10498460 11008599 11417101 11633949 11659848 11685079 11868080 12285355 12671047
3849 12671047 12817300 13076264 13203869 13532916 13637054 13423930 13597492 13706660 14016533
3840 14016533 14230832 14254705 14042558 13813040 13771906 13790383 13752015 13776131 13589781 13537724
3830 13537724 13561388 13728481 13610380 13433243 13499071 13587385 13679644 13579339 13520945 13681444
3820 13681444 13826509 13967638 14212990 14442943 14750490 14967099 15201114 15726330 16396542
$$ packed form
3891A2122401j96907j68187m24443l27780m03353l8622J64057k66788m12890Q9869
3881A0137357J009l09739k52402K5896M6244k27554k32965Q7617O1792N420k02958
3870I139717q5204L13644J6637P3396j52477K62558L15205L205R4168J29288R5718
3859A0205855J49410J43195N10139M08502K16848K5899K5231J83001M17275L85692
3849A2671047J46253K58964J27605L29047J04138k13124J73562J09168L09873
3840A4016533K14299K3873k12147k29518m1134J8477l8368K4116j86350n2057
3830A3537724K3664J67093j18101j77137O5828Q8314R2259j00305n8394J60499
3820A3681444J45065J41129K45352K29953L07547K16609K34015N25216O70212
$$ plain form
3811 16396542 16974761 17712184 17962938 18655067 19537537 20255984 21144130 21933485 23141563
3802 23141563 24169702 25143220 26079127 27148988 28257503 29118957 30323429 31223193 32149364
3793 32149364 32797694 33814390 34841065 35562979 36120831 36736797 37307888 37700428 38094545
3784 38094545 38466191 38874384 39074086 39125734 38946418 38724031 38581928 38563962 38440296 38345881
3774 38345881 38422874 38486085 38260372 38046402 37973593 37934023 37594729 37786033 37740334 37476420
3764 37476420 37563056 37767221 37610839 37657241 37910431 37838803 37653337 37546825 37709591 37824996
3754 37824996 37681950 37672179 37653436 37324939 36840510 36276090 35844504 35496602 34818584 33971091
3744 33971091 33358356 32544587 31764229 30805341 29770516 28880418 28009170 26942378 25990799
$$ packed form
3811A6396542N78219P37423K50754O92129Q82470P18447Q88146P89355J208078
3802B3141563J028139R73518R35907J069861J108515Q61454J204472Q99764R26171
3793C2149364O48330J016696J026675P21914N57852O15966N71091L92540L94117
3784C8094545L71646M08193J99702N1648j79316k22387j42103j7966j23666r4415
3774C8345881P6993O3211k25713k13970p2809l9570l39294J91304m5699k63914
3764C7476420Q6636K04165j56382M6402K53190p1628j85466j06512J62766J15405
3754C7824996j43046r771j8743l28497m84429n64420m31586l47902o78018q47493
3744C3971091o12735q13769p80358r58888j034825q90098q71248j066792r51579
$$ plain form
3735 25990799 25078584 24285129 23298479 22010200 21113528 20126637 19326672 18470600 17426511
3726 17426511 16686395 15898103 15372370 14848920 14082654 13523789 13385017 12927242 12572813
3717 12572813 12440638 12278503 11847190 11680613 11704524 11604057 11489709 11388963 11494247 11782752
3707 11782752 11853916 11524714 11406263 11555592 11583012 11627089 11462691 11375035 11492714 11644556
3697 11644556 11421613 11372516 11582136 11392335 11159234 10817009 10674569 10621399 10506141 10454077
3687 10454077 10138585 9722117 9470916 9151541 8831148 8288138 8150324 7929201 7736183
3678 7736183 7452308 7011097 6842790 6455990 6199160 6003198 5752321 5451741 5164516 4856326
3668 4856326 4662844 4390145 4184317 4105531 4133945 4004138 3969835 3757845 3667986 3538956
$$ packed form
3735B5990799r12215p93455r86650j288279q96672r86891p99965q56072j044089
3726A7426511p40116p88292n25733n23450p66266n58865j38772m57775l54429
3717A2572813j32175j62135m31313j66577K3911j00467j14348j00746J05284K88505
3707A1782752P1164l29202j18451J49329K7420M4077j64398q7656J17679J51842
3697A1644556k22943m9097K09620j89801k33101l42225j42440n3170j15258n2064
3687A0454077l15492m16468k51201l19375l20393n43010j37814k21123j93018
3678G736183k83875m41211j68307l86800k56830j95962k50877l00580k87225l08190
3668D856326j93482k72699k05828p8786K8414j29807l4303k11990q9859j29030
$$ plain form
3658 3538956 3430540 3199458 3465981 3415984 3161700 2925827 2745341 2621957 2722992 2733331
3648 2733331 2514955 2480957 2626710 2651243 2542445 2345946 2221159 2298166 2195057 2221991
3638 2221991 1963752 2080532 2022892 2250106 2143031 1934388 1649213 1725608 1890178 1744738
3628 1744738 1520484 1536493 1739018 1808085 1655690 1522090 1543408 1666572 1485021 1610953
3618 1610953 1428264 1144004 1147940 1297390 1381467 1195946 1179567 1210647 1250587 1292474 1117219
3607 1117219 1233692 1208724 1096934 1214942 1052159 1242493 1050578 1129595 1111477 1200414
3597 1200414 1364034 1061031 1093571 1081586 959189 682549 887994 943332 904112 1046621
3587 1046621 933461 885046 947849 777895 707627 666391 797715 1056161 999267 859165
$$ packed form
3658C538956j08416k31082K66523m9997k54284k35873j80486j23384J01035J0339
3648B733331k18376l3998J45753K4533j08798j96499j24787P7007j03109K6934
3638B221991k58239J16780n7640K27214j07075k08643k85175P6395J64570j45440
3628A744738k24254J6009K02525O9067j52395j33600K1318J23164j81551J25932
3618A610953j82689k84260L936J49450Q4077j85521j6379L1080L9940M1887j75255
3607A117219J16473k4968j11790J18008j62783J90334j91915P9017j8118Q8937
3597A200414J63620l03003L2540j1985j22397k76640K05445N5338l9220J42509
3587A046621j13160m8415O2803j69954p0268m1236J31324K58446n6894j40102
$$ plain form
3577 859165 945985 1029281 853115 652853 912425 1150240 875687 964554 1107441 855939
3567 855939 918979 891269 590642 754187 667044 665623 785570 686386 562260 403902 544682
3556 544682 526457 617100 716764 603551 737009 815918 709356 560076 640810 755978 834481
3545 834481 1045721 907396 551707 535480 481136 433305 595334 775583 823121 792782 839028
3534 839028 753111 584849 572437 570586 532777 501606 560081 528375 593129 548416 554354 404197
3522 404197 640877 811397 762460 685231 612084 863951 702454 525981 562453 519444 573965
3511 573965 604916 679293 762760 949580 993873 580319 357431 557038 843938 525972
3501 525972 544465 643785 768865 789488 740782 553942 458405 738865 758444 780779 743092
$$ packed form
3577H59165Q6820Q3296j76166k00262K59572K37815k74553Q8867J42887k51502
3567H55939O3040k7710l00627J63545q7143j421J19947r9184j24126j58358J40780
3556E44682j8225R0643R9664j13213J33458P8909j06562j49280Q0734J15168P8503
3545H34481K11240j38325l55689j6227n4344m7831J62029J80249M7538l0339M6246
3534H39028q5917j68262j2412j851l7809l1171N8475l1706O4754m4713N938j50157
3522D04197K36680J70520m8937p7229p3147K51867j61497j76473L6472m3009N4521
3511E73965L0951P4377Q3467J86820M4293m13554k22888J99607K86900l17966
3501E25972J8493R9320J25080K0623m8706j86840r5537K80460J9579K2335l7687
$$ plain form
3490 743092 710100 788433 617252 671417 595919 514892 622378 737322 678209 636581 581655
3479 581655 621727 681357 542374 776237 749526 681724 565925 653354 587927 599173 485956
3468 485956 592566 580132 643243 643279 616482 604550 747319 594601 625393 650518 749610 640557
3456 640557 701089 654264 528838 378808 539250 686659 605445 679614 797433 734040 549682
3445 549682 605734 430651 429346 402733 577540 484216 605438 530706 646148 630534 835032
3434 835032 728794 625702 702921 532192 519761 717127 718433 588361 823537 922042 943222
3423 943222 879953 928623 839526 719710 732151 809594 869582 688982 465586 500541 483124
3412 483124 641172 422023 357183 476873 514473 536703 507349 494429 532725 521102 363529
$$ packed form
3490G43092l2992P8333j71181N4165p5498q1027J07486J14944n9113m1628n4926
3479E81655M0072N9630j38983K33863k6711o7802j15799Q7429o5427J1246j13217
3468D85956J06610j2434O3111L6k6797j1932J42769j52718L0792K5125R9092j09053
3456F40557O0532m6825j25426j50030J60442J47409q1214P4169J17819o3393j84358
3445E49682N6052j75083j305k6613J74807r3324J21222p4732J15442j5614K04498
3434H35032j06238j03092P7219j70729j2431J97366J306j30072K35176R8505K1180
3423I43222o3269M8670q9097j19816J2441P7443N9988j80600k23396L4955j7417
3412D83124J58048k19149o4840J19690L7600K2230k9354j2920L8296j1623j57573
$$ plain form
3401 363529 406016 361799 357134 426292 434265 455460 265078 268793 525420 218766 332092
3390 332092 347229 402041 574973 542405 358435 335501 396110 523521 601255 476010 459391
3379 459391 631146 458083 522588 355881 261925 368351 276428 362451 463073 259974
3369 259974 462559 716684 566670 410361 481829 635868 817000 1020647 933396 780464
3359 780464 688784 690954 712198 646519 655193 607641 679705 575208 523661 695339 725759 573632
3347 573632 530602 277581 185909 469820 649494 459744 304413 386017 603605 488405
3337 488405 253410 225233 205707 277972 213484 306210 334397 356992 391821 484880 485554 386823
3325 386823 289506 351259 516885 469635 25820 -112815 72602 125674 127831 -61502 118038
$$ packed form
3401C63529M2487m4217m665O9158P973K1195j90382L715K56627l06654J13326
3390C32092J5137N4812J72932l2568j83970k2934O0609J27411P7734j25245j6619
3379D59391J71755j73063O4505j66707r3956J06426r1923Q6023J00622k03099
3369B59974K02585K54125j50014j56309P1468J54039J81132K03647q7251j52932
3359G80464r1680K170K1244o5679Q674m7552P2064j04497n1547J71678L0420j52127
3347E73632m3030k53021r1672K83911J79674j89750j55331Q1604K17588j15200
3337D88405k34995k8177j9526P2265o4488R2726K8187K2595L4829R3059O74r8731
3325C86823r7317O1753J65626m7250m43815j38635J85417N3072K157j89333J79540
$$ plain form
3314 118038 361397 340595 290879 173225 203065 317780 243763 41172 207517 327165
3304 327165 444073 427105 379057 78656 62335 204347 351876 100728 74460 88009 84050
3293 84050 195874 228444 274246 234137 345841 253676 153282 283448 454383 482080 153060
3282 153060 77667 170910 242452 72269 255845 337870 353239 463473 457779 491625 275730
3271 275730 224475 427698 272217 175594 107819 220550 308897 31911 127345 217862 207476
3260 207476 119075 144903 258333 308365 310385 449114 363429 178391 388287 406083 142217
3249 142217 214773 170323 96258 215394 127525 -38373 138884 407752 454807 144964 137363
3238 137363 398943 280487 86682 45374 48102 144907 119445 118246 210802 153241 79687
$$ packed form
3314A18038K43359k0802m9716j17654K9840J14715p4017k02591J66345J19648
3304C27165J16908j6968m8048l00401j6321J42012J47529k51148k6268J3549l959
3293H4050J11824L2570M5802m0109J11704r2165j00394J30166J70935K7697l29020
3282A53060p5393R3243P1542j70183J83576Q2025J5369J10234n694L3846k15895
3271B75730n1255K03223j55481r6623o7775J12731Q8347k76986R5434R0517j0386
3260B07476q8401K5828J13430N0032K020J38729q5685j85038K09896J7796k63866
3249A42217P2556m4450p4065J19136q7869j65898J77257K68868M7055l09843p601
3238A37363K61580j18456j93805m1308K728R6805k5462j199R2556n7561p3554
$$ plain form
3227 79687 37069 -28247 -75104 226040 216494 259061 229833 230868 230774 -55148 -146933 13308
3215 13308 23557 -22885 27737 -11656 194712 426369 372375 293476 379388 314001 37719
3204 37719 -5873 -175714 -269325 -117530 28946 65708 48319 83351 56887 40745 16225
3193 16225 75408 -88883 44213 -77018 -96519 -15342 237118 203607 13697 -200511 63163
3182 63163 102035 1709 145536 106243 114021 98949 182390 324336 226908 162240 -41089
3171 -41089 -192214 -57496 -11923 110105 -134319 -177004 65410 302472 161034 148679
3161 148679 143375 -166158 -104273 63260 -88497 -40108 267976 396805 134895 -65526
3151 -65526 -3810 212941 317387 393283 204910 130983 103884 -30131 81403 51411 39888
$$ packed form
3227G9687m2618o5316m6857L01144r546M2567k9228J035r4k85922r1785J60241
3215A3308J0249m6442N0622l9393K06368K31657n3994p8899Q5912o5387k76282
3204C7719m3592j69841r3611J51795J46476L6762j7389L5032k6464j6142k4520
3193A6225N9183j64291J33096j21231j9501Q1177K52460l3511j89910k14208K63674
3182F3163L8872j00326J43827l9293P778j5072Q3441J41946r7428o4668k03329
3171d1089j51125J34718M5573J22028k44424m2685K42414K37062j41438j2355
3161A48679n304l09533O1885J67533j51757M8389L08084J28829k61910k00421
3151f5526O1716K16751J04446P5896j88373p3927k7099j34015J11534k9992j1523
$$ plain form
3140 39888 40825 322640 196520 144607 310768 277399 214818 229447 313419 300775 407671
3129 407671 417232 132522 -5761 165403 250337 81264 16978 -197583 -125984 149571 292766
3118 292766 204215 211181 192207 81681 261252 77553 -307170 -448547 -15362 66231 -41750
3107 -41750 75337 126832 -87011 -268782 -21708 59844 7934 99885 164546 159940 248926
3096 248926 -65993 108904 47498 123361 223197 28491 154714 -44115 27563 145777
3086 145777 181471 347807 388084 330618 464849 214973 173626 66284 -163133 -122406 241745
3075 241745 405501 228089 206290 242980 311841 259384 34084 -89172 15882 229398
3065 229398 350069 337041 262439 214771 164909 -7529 21211 -86097 -43647 -44358 -12891
$$ packed form
3140C9888R37K81815j26120n1913J66161l3369o2581J4629Q3972j2644J06896
3129D07671R561k84710j38283J71164Q4934j69073o4286k14561P1599K75555J43195
3118B92766q8551O966j8974j10526J79571j83699l84723j41377M33185Q1593j07981
3107d1750J17087N1495k13843j81771K47074Q1552n1910R1951O4661m606Q8986
3096B48926l14919J74897o1406P5863R9836j94706J26223j98829P1678J18214
3086A45777L5694J66336M0277n7466J34231k49876m1347j07342k29417M0727L64151
3075B41745J63756j77412k1799L6690O8861n2457k25300j23256J05054K13516
3065B29398J20671j3028p4602m7668m9862j72438K8740j07308M2450p11L1467
$$ plain form
3054 -12891 32069 139442 336683 129812 138969 -47716 11155 139722 261822 154179 168487
3043 168487 207666 179151 -17899 107889 93257 390009 386453 76928 111050 234629 325162
3032 325162 33594 -372 101489 96647 239485 181716 -147204 -44619 -54254 114731 78377
3021 78377 127304 68427 113712 203973 249501 223525 9873 -57093 79608 284955 203988
3010 203988 10419 -48679 -98834 -309636 -77012 -42722 36296 74124 -40356 -204700 -14884
2999 -14884 -96332 7685 261690 123911 1544 3484 -50550 -165708 107647 -13127 -13893
2988 -13893 52178 148665 -11040 -129519 -155955 9838 36061 -56233 22684 87370 126951
2977 126951 71087 -53893 -70372 200528 -8915 -63387 -115879 -227617 24434 143683
$$ packed form
3054a2891M4960J07373J97241k06871R157j86685N8871J28567J22100j07643J4308
3043A68487L9179k8515j97050J25788j4632K96752l556l09525L4122J23579R0533
3032C25162k91568l3966J01861m842J42838n7769l28920J02585r635J68985l6354
3021G8377M8927n8877M5285R0261M5528k5976k13652o6966J36701K05347q0967
3010B03988j93569n9098n0155k10802K32624L4290P9018L7828j14480j64344J89816
2999a4884q1448J04017K54005j37779j22367J940n4034j15158K73355j20774p66
2988a3893O6071R6487j59705j18479k6436J65793K6223r2294P8917O4686L9581
2977A26951n5864j24980j6479K70900k09443n4472n2492j11738K52051J19249
$$ plain form
2967 143683 143564 97944 317196 110016 -82749 -181648 -131026 -194230 -6386 683 46552
2956 46552 7076 24453 140250 19437 -181833 3313 131166 173319 35691 -148522
2946 -148522 -201632 139495 229101 117328 22387 8878 47183 24278 133989 -67353 11075
2935 11075 -233551 45085 -34938 53629 -23018 78771 139411 194121 188061 33673 -33849
2924 -33849 -197574 155718 304660 212004 111144 52860 104820 60107 -3544 -178315 -144771
2913 -144771 -29736 95436 160364 57746 97691 160793 61419 -67973 136348 34979
2903 34979 -60212 -137637 -175537 17379 -155365 -141382 -124733 -118380 45001 47984 -39380 -23118
2891 -23118 -66816 -71523 -132713 -74566 81984 125658 -164813 -343082 -327184 -267657 -26757
$$ packed form
2967A43683j19m5620K19252k07180j92765r8899N0622o3204J87844P069M5869
2956D6552l9476J7377J15797j20813k01270J85146J27853M2153j37628j84213
2946a48522n3110L41127Q9606j11773r4941j3509L8305k2905J09711k01342P8428
2935A1075k44626K78636q0023Q8567p6647J01789O0640N4710o060j54388o7522
2924c3849j63725L53292J48942r2656j00860n8284N1960m4713o3651j74771L3544
2913a44771J15035J25172O4928j02618L9945O3102r9374j29392K04321j01369
2903C4979r5191p7425l7900J92916j72744J3983J6649O353J63381K983q7364J6262
2891b3118m3698m707o1190N8147J56550M3674k90471j78269J5898N9527K40900
$$ plain form
2880 -26757 -97575 -168724 -120911 -907 35713 87797 60157 -62830 -210336 -114038 -57699
2869 -57699 -59446 49116 90167 268217 299160 83407 163339 220394 82820 -1366 199386
2858 199386 346594 310603 104272 284459 205638 -22012 -55526 -80495 -70162 -14538 -55622
2847 -55622 39771 28323 -58297 -181967 99091 372873 60265 -102283 -99469 -45356 -123326
2836 -123326 -62049 -48249 -191851 -177130 -263356 -334373 -11822 -67254 -220104 -46127 108413
2825 108413 180551 13536 119640 355187 197548 171900 258636 33695 125826 99806 53032
2814 53032 -110250 -178758 -29333 74597 -40398 -378718 -102239 76176 -141238 -191767
2804 -191767 -137606 -97362 -83466 -70553 175621 66982 160592 -35014 72619 29868 152504
$$ packed form
2880b6757p0818p1149M7813J20004L6620N2084k7640j22987j47506R6298N6339
2869e7699j747J08562M1051J78050L0943k15753P9932N7055j37574q4186K00752
2858A99386J47208l5991k06331J80187p8821k27650l3514k4969J0333N5624m1084
2847e5622R5393j1448q6620j23670K81058K73782l12608j62548K814N4113p7970
2836a23326O1277J3800j43602J4721q6226p1017L22551n5432j52850J73977J54540
2825A08413P2138j67015J06104K35547j57639k5648Q6736k24941R2131k6020m6774
2814E3032j63282o8508J49425J03930j14995l38320K76479J78415k17414n0529
2804a91767N4161M0244J3896J2913K46174j08639R3610j95606J07633m2751J22636
$$ plain form
2793 152504 103726 31004 -21504 -186143 -9147 143388 115174 -56027 90207 165129 196295
2782 196295 285336 145348 -25502 178400 50533 -17317 79215 201847 193542 97962 -57617
2771 -57617 -50933 72964 -56933 27404 133372 -814 -185288 -110363 -217695 -274609 -176475
2760 -176475 -40189 150464 -4650 -192661 -92117 47356 130894 151676 127098 -57892
2750 -57892 -11503 69350 300929 240278 126756 182131 80711 249126 365873 274579 304584
2739 304584 132962 -60761 -110491 -172070 -187082 101308 19811 -69250 -107095 -134018 21413
2728 21413 -96773 -85707 56412 98680 -103847 33624 -95087 -73147 -131569 -123152 -146116
2717 -146116 -134876 38584 197525 301199 48077 -48314 38280 24004 -104773 -63230 -31927
$$ packed form
2793A52504m8778p2722n2508j64639J76996J52535k8214j71201J46234P4922L1166
2782A96295Q9041j39988j70850K03902j27867o7850R6532J22632q305r5580j55579
2771e7617O684J23897j29897Q4337J05968j34186j84474P4925j07332n6914R8134
2760a76475J36286J90653j55114j88011J00544J39473Q3538K0782k4578j84990
2750e7892M6389Q0853K31579o0651j13522N5375j01420J68415J16747r1294L0005
2739C04584j71622j93723m9730o1579j5012K88390q1497q9061l7845k6923J55431
2728B1413j18186J1066J42119M2268k02527J37471j28711K1940n8422Q417k2964
2717a46116J1240J73460J58941J03674k53122r6391Q6594j4276j28777M1543L1303
$$ plain form
2706 -31927 -5854 -170811 -97784 26813 -212566 -442546 -153507 169895 21787 -170545
2696 -170545 -3700 26772 -115092 -71080 -32389 -272535 -119053 111450 -33352 24325
2686 24325 -149123 -53005 -41962 -80463 -31104 33605 -109288 -166060 -169425 -57764 -94308
2675 -94308 19593 -53322 -309192 -156182 86277 123235 74786 -128572 -85738 163356 240139
2664 240139 113095 -56896 -15334 -5468 -73647 -121541 -75085 23654 -42535 13593 -136281
2653 -136281 143730 273322 311589 173850 50011 13917 -100367 -27242 41716 -147477
2643 -147477 2720 37885 -131183 -20981 22239 -20599 109262 59797 -63236 163182
2633 163182 15917 30375 -21738 109486 40810 -215163 -47010 -113318 -166203 99523 143099
$$ packed form
2706c1927K6073j64957P3027J24597k39379k29980K89039L23402j48108j92332
2696a70545J66845L0472j41864M4012L8691k40146J53482K30503j44802N7677
2686B4325j73448R6118J1043l8501M9359O4709j42893n6772l365J11661l6544
2675i4308J13901p2915k55870J53010K42459L6958m8449k03358M2834K49094P6783
2664B40139j27044j69991M1562R866o8179m7894M6456R8739o6189N6128j49874
2653a36281K80011J29592L8267j37739j23839l6094j14284P3125O8958j89193
2643a47477J50197L5165j69068J10202M3220m2838J29861m9465j23033K26418
2633A63182j47265J4458n2113J31224o8676k55973J68153o6308n2885K65726M3576
$$ plain form
2622 143099 -66023 -171984 93808 83048 3917 247053 115938 246995 208333 -64293
2612 -64293 -30406 13104 66989 195647 163172 33036 -61677 -94848 130954 58774 237101
2601 237101 102158 -86948 -133148 677 -114917 -725 248780 332924 55738 160950
2591 160950 171183 44105 -138331 -239383 45253 240945 67358 -74744 10979 66775
2581 66775 13479 -79073 -200169 60306 31053 60614 306068 148901 35589 8488 69278
2570 69278 -93968 -174570 -57858 -231178 -48463 -39245 -60635 10534 -107988 -155917 -80066
2559 -80066 202063 215753 -12324 153292 72490 -63500 -177904 -104281 32481 9162 186650
2548 186650 94500 63997 103256 -28402 -131694 -27040 -28318 -135074 22495 241484 46273
$$ packed form
2622A43099k09122j05961K65792j0760p9131K43136j31115J31057l8662k72626
2612f4293L3887M3510N3885J28658l2475j30136r4713l3171K25802p2180J78327
2601B37101j34943j89106m6200J33825j15594J14192K49505Q4144k77186J05212
2591A60950J0233j27078j82436j01052K84636J95692j73587j42102Q5723N5796
2581F6775n3296r2552j21096K60475k9253K9561K45454j57167j13312k7101O0790
2570F9278j63246q0602J16712j73320J82715R218k1390P1169j18522m7929P5851
2559h0066K82129J3690k28077J65616q0802j35990j14404P3623J36762k3319J77488
2548A86650r2150l0503L9259j31658j03292J04654j278j06756J57569K18989j95211
$$ plain form
2537 46273 258163 241026 71859 127217 214768 -22412 -16173 -31649 -15879 -38675 -83101
2526 -83101 -90429 -109277 -277237 -221403 -158911 -110095 -29891 -224151 -66086 -17833 -208326
2515 -208326 -147345 -271750 -169397 -203333 13710 32225 59501 -873 60153 166006 38284
2504 38284 39910 -6888 178393 -62037 -32829 -46240 44211 60755 -58059 -34921 12973
2493 12973 -248215 -261922 -318730 -247706 -133058 -358582 -398361 -308115 -111079 142862 72047
2482 72047 -127252 -146808 -131840 36011 208848 107863 -82426 68826 -211468 -261113
2472 -261113 -206633 -179755 -126151 -118220 -136824 -210624 -109616 -70318 -22092 -159882 -278148
2461 -278148 -323725 -212338 -89592 -166543 -93679 -169703 -171124 -215983 -150263 -286779 -229420
$$ packed form
2537D6273K11890j7137j69167N5358Q7551k37180O239j5476J5770k2796m4426
2526h3101p328j8848j67960N5834O2492M8816Q0204j94260J58065M8253j90493
2515b08326O0981j24405J02353l3936K17043J8515K7276o0374O1026J05853j27722
2504C8284J626m6798J85281k40430K9208j3411R0451J6544j18814K3138M7894
2493A2973k61188j3707n6808P1024J14648k25524l9779R0246J97036K53941p0815
2482G2047j99299j9556J4968J67851J72837j00985j90289J51252k80294m9645
2472b61113N4480K6878N3604P931j8604p3800J01008L9298M8226j37790j18266
2461b78148m5577J11387J22746p6951P2864p6024j421m4859O5720j36516N7359
$$ plain form
2450 -229420 -91725 -13357 -38962 -67729 114409 139535 124640 74803 212306 197179 270212
2439 270212 288753 124280 22985 -130072 219934 409983 154011 -110656 -254698 63709
2429 63709 -48381 -4962 121713 31981 63430 14046 -137768 -120819 -226422 -255245 -73546
2418 -73546 -30616 -22341 35348 275012 73409 -294345 -199576 -140677 -161090 93362 249440
2407 249440 -140034 -357743 -161572 269985 362021 163960 -41469 -44736 -28931 -6804 140339
2396 140339 90324 56870 159384 67913 38144 12565 -17525 -2800 -184801 -299501 -77789
2385 -77789 -33754 -214991 -353104 37480 189342 -63749 84290 74607 92392 83316 65539
2374 65539 -40182 -202796 36889 221236 207149 44774 942 105387 -66632 248714
$$ packed form
2450b29420J37695P8368k5605k8767J82138K5126j4895m9837J37503j5127P3033
2439B70212J8541j64473j01295j53057L50006J90049k55972k64667j44042L18407
2429F3709j12090M3419J26675q9732L1449m9384j51814J6949j05603k8823J81699
2418g3546M2930Q275N7689K39664k01603l67754R4769N8899k0413K54452J56078
2407B49440l89474k17709J96171M31557R2036j98061k05429l267J5805K2127J47143
2396A40339n0015l3454J02514r1471k9769k5579l0090J4725j82001j14700K21712
2385g7789M4035j81237j38113L90584J51862k53091J48039r683J7785r076j7777
2374F5539j05721j62614K39685J84347j4087j62375m3832J04445j72019L15346
$$ plain form
2364 248714 112163 -130786 -91378 -151399 -60347 152035 266786 206337 55116 50163 14306
2353 14306 -29690 104259 300137 250077 202896 41583 -30379 12017 -80104 -35627 37153
2342 37153 143450 93572 -83878 37607 114754 236474 502884 482920 167258 94662 207103
$$ packed form
2364B48714j36551k42949L9408o0021R1052K12382J14751o0449j51221m953l5857
2353A4306m3996J33949J95878n0060m7181j61313p1962M2396r2121M4477P2780
2342C7153J06297m9878j77450J21485P7147J21720K66410j9964l15662p2596J12441
$$ [...]
##END NTUPLES=NMR SPECTRUM
##END=
