##TITLE=1H_EC-3313
 CDCl3
 8 sc, 
 8.2.2024
##JCAMPDX= 6.0         $$ Bruker NMR JCAMP-DX V2.0
##DATA TYPE= NMR SPECTRUM
##DATA CLASS= NTUPLES
##ORIGIN= UXNMR, Bruker Analytische Messtechnik GmbH
##OWNER= root
$$ XWIN-NMR		Version 3.5
$$ Thu Feb  8 14:01:41 2024 Russian Standard Time (UT+4h)  she@DPX200
##.OBSERVE FREQUENCY= 200.1313
##.OBSERVE NUCLEUS= ^1H
##.ACQUISITION MODE= SIMULTANEOUS
##.ACQUISITION SCHEME= undefined
##.AVERAGES= 8
##.DIGITISER RES= 18
##SPECTROMETER/DATA SYSTEM= spect
##.PULSE SEQUENCE= zg30
##.SOLVENT NAME= CDCl3
##.SHIFT REFERENCE= (INTERNAL, CDCl3, 0, 15.4913)
##AUDIT TRAIL= $$ (NUMBER, WHEN, WHO, WHERE, WHAT)
$$ ##TITLE= Audit trail, XWIN-NMR		Version 3.5
$$ ##JCAMPDX= 5.01
$$ ##ORIGIN= Bruker BioSpin GmbH
$$ ##OWNER= she
$$ F:/spectra/data/she/nmr/H-F/1/pdata/1/auditp.txt
$$ ##AUDIT TRAIL=  $$ (NUMBER, WHEN, WHO, WHERE, WHAT)
(   1,<2024-02-08 14:00:27.95 +0400>,<she>,<DPX200>,
      <created by zg, POWCHK disabled, PULCHK disabled
       configuration hash MD5:
       00 E9 B6 7A A2 85 ED C7 34 08 36 98 17 FE 4E 26
       data hash MD5: 16K
       F2 5E B7 C3 07 99 63 A7 C2 FC 12 4E E6 2C 1A 25>)
(   2,<2024-02-08 14:00:30.01 +0400>,<she>,<DPX200>,
      <Start of raw data processing
       efp BC_mod = 2 LB = 0.24 FT_mod = 6 PKNL = 1 PHC0 = -24593.38 PHC1 = 11.05268 SI = 16K 
       data hash MD5: 16K
       4E 5D 5D 80 0C 0A 02 9C 16 9D 6B B0 29 12 CC B6>)
(   3,<2024-02-08 14:00:45.98 +0400>,<she>,<DPX200>,
      <pk PHC0 = -1.28219 PHC1 = 2 
       data hash MD5: 16K
       D3 15 05 AC DE 76 89 EB 93 88 58 76 0D DA 38 0E>)
(   4,<2024-02-08 14:00:49.26 +0400>,<she>,<DPX200>,
      <abs ABSG = 5 
       data hash MD5: 16K
       E4 A5 82 14 40 7A BD F1 55 1B 25 1B 71 62 AE 1C>)
$$ ##END=
$$ 
$$ hash MD5
$$ 3B D0 E1 E9 82 68 64 6C 3B CB 81 9C D2 6A D6 24
##$RELAX= 
##$RELAX= 
##$RELAX= 
##$RELAX= 
##$RELAX= 
##$RELAX= 
$$ Bruker specific parameters
$$ --------------------------
##$DU= <F:/spectra>
##$EXPNO= 1
##$NAME= <H-F>
##$PROCNO= 1
##$TYPE= <nmr>
##$USER= <she>
##$AMP= (0..31)
100 100 100 100 100 100 100 100 100 100 100 100 100 100 100 100 100 100 
100 100 100 100 100 100 100 100 100 100 100 100 100 100 
##$AQSEQ= 0
##$AQ_mod= 1
##$AUNM= <au_zg>
##$AUTOPOS= <>
##$BF1= 200.13
##$BF2= 200.13
##$BF3= 200.13
##$BF4= 200.13
##$BF5= 200.13
##$BF6= 200.13
##$BF7= 200.13
##$BF8= 200.13
##$BYTORDA= 1
##$CFDGTYP= 0
##$CFRGTYP= 5
##$CHEMSTR= <none>
##$CNST= (0..31)
1 1 145 1 1 1 1 1 1 1 1 1 1 1 1 1 1 1 1 1 1 1 1 1 1 1 1 1 1 1 1 1 
##$CPDPRG= <>
##$CPDPRG1= <>
##$CPDPRG2= <>
##$CPDPRG3= <>
##$CPDPRG4= <mlev>
##$CPDPRG5= <mlev>
##$CPDPRG6= <mlev>
##$CPDPRG7= <mlev>
##$CPDPRG8= <mlev>
##$CPDPRGB= <>
##$CPDPRGT= <>
##$D= (0..31)
0 1.2 0 0 0 0 0 0 0 0.06 0 0.03 0 0 0 0 0.0002 0 0 0 0 0 0 0 0 0 0 0 0 
0 0 0 
##$DATE= 1707386427
##$DBL= (0..7)
120 120 120 120 120 120 120 120 
##$DBP= (0..7)
150 150 150 150 150 150 150 150 
##$DBP07= 0
##$DBPNAM0= <>
##$DBPNAM1= <>
##$DBPNAM2= <>
##$DBPNAM3= <>
##$DBPNAM4= <>
##$DBPNAM5= <>
$$ [...]
##$SUBNAM3= <"">
##$SUBNAM4= <"">
##$SUBNAM5= <"">
##$SUBNAM6= <"">
##$SUBNAM7= <"">
##$SUBNAM8= <"">
##$SUBNAM9= <"">
##$SW= 18.0517328524113
##$SWIBOX= (0..15)
0 0 2 0 0 0 0 0 0 0 0 0 0 0 0 0 
##$SW_h= 3612.71676300578
##$TD= 16384
##$TD0= 1
##$TE= 0
##$TE2= 300
##$TE3= 300
##$TEG= 300
##$TL= (0..7)
0 120 120 120 120 120 120 120 
##$TP= (0..7)
150 150 150 150 150 150 150 150 
##$TP07= 0
##$TPNAME0= <>
##$TPNAME1= <>
##$TPNAME2= <>
##$TPNAME3= <>
##$TPNAME4= <>
##$TPNAME5= <>
##$TPNAME6= <>
##$TPNAME7= <>
##$TPOAL= (0..7)
0.5 0.5 0.5 0.5 0.5 0.5 0.5 0.5 
##$TPOFFS= (0..7)
0 0 0 0 0 0 0 0 
##$TUNHIN= 0
##$TUNHOUT= 0
##$TUNXOUT= 0
##$USERA1= <user>
##$USERA2= <user>
##$USERA3= <user>
##$USERA4= <user>
##$USERA5= <user>
##$V9= 5
##$VALIST= <valist>
##$VCLIST= <CCCCCCCCCCCCCCC>
##$VD= 0
##$VDLIST= <DDDDDDDDDDDDDDD>
##$VPLIST= <PPPPPPPPPPPPPPP>
##$VTLIST= <TTTTTTTTTTTTTTT>
##$WBST= 1024
##$WBSW= 4
##$XGAIN= (0..3)
0 0 0 0 
##$XL= 0
##$YL= 0
##$YMAX_a= 278991
##$YMIN_a= -344570
##$ZGOPTNS= <>
##$ZL1= 120
##$ZL2= 120
##$ZL3= 120
##$ZL4= 120
##$ABSF1= 15.57721
##$ABSF2= -2.474641
##$ABSG= 5
##$ABSL= 3
##$ALPHA= 0
##$AQORDER= 0
##$ASSFAC= 0
##$ASSFACI= 0
##$ASSFACX= 0
##$ASSWID= 0
##$AUNMP= <proc_1d>
##$AZFE= 0.1
##$AZFW= 0.1
##$BCFW= 0
##$BC_mod= 2
##$BYTORDP= 0
##$COROFFS= 0
##$CY= -3
##$DATMOD= 1
##$DC= 0
##$DFILT= <>
##$DTYPP= 0
##$F1P= 0
##$F2P= 0
##$FCOR= 1
##$FTSIZE= 16384
##$FT_mod= 6
##$GAMMA= 0
##$GB= 0
##$INTBC= 1
##$INTSCL= 3.70164e-10
##$ISEN= 128
##$LB= 0.24
##$LEV0= 0
##$LPBIN= 0
##$MAXI= 10000
##$MC2= 0
##$MEAN= 0
##$ME_mod= 0
##$MI= 1.114404
##$NCOEF= 0
##$NC_proc= -7
##$NLEV= 6
##$NOISF1= 3.799351
##$NOISF2= 2.8
##$NSP= 0
##$NTH_PI= 0
##$NZP= 0
##$OFFSET= 15.49127
##$PC= 1
##$PHC0= -24594.66
##$PHC1= 13.05268
##$PH_mod= 1
##$PKNL= yes
##$PPARMOD= 0
##$PSCAL= 0
##$PSIGN= 0
##$REVERSE= no
##$SF= 200.13000609034
##$SI= 16384
##$SIGF1= 3
##$SIGF2= 2
##$SINO= 5.538805
##$SIOLD= 16384
##$SREGLST= <1H.CDCl3>
##$SSB= 0
##$STSI= 16384
##$STSR= 0
##$SW_p= 3612.71676300578
##$SYMM= 0
##$S_DEV= 0
##$TDeff= 16384
##$TDoff= 0
##$TI= <>
##$TILT= no
##$TM1= 0
##$TM2= 0
##$TOPLEV= 0
##$USERP1= <user>
##$USERP2= <user>
##$USERP3= <user>
##$USERP4= <user>
##$USERP5= <user>
##$WDW= 1
##$XDIM= 16384
##$YMAX_p= 506185334
##$YMIN_p= -1688604
$$ End of Bruker specific parameters
$$ ---------------------------------
##NTUPLES= NMR SPECTRUM
##VAR_NAME=  FREQUENCY,     SPECTRUM/REAL,   SPECTRUM/IMAG
##SYMBOL=    X,             R,               I
##VAR_TYPE=  INDEPENDENT,   DEPENDENT,       DEPENDENT
##VAR_FORM=  AFFN,          ASDF,            ASDF
##VAR_DIM=   16384,         16384,           16384
##UNITS=     HZ,            ARBITRARY UNITS, ARBITRARY UNITS
##FACTOR=    0.220516191357247, 1,           1
##FIRST=     3100.26797251712, 0,            0
##LAST=      -512.448790488665, 0,           0
##MIN=       -512.448790488665, -1688604,    0
##MAX=       3100.26797251712, 506185334,    0
$$ Real data points
##PAGE= N=1
##DATA TABLE= (X++(R..R)), XYDATA
$$ [...]
6541A166371p3626o14259O9279M47746M3757K27886K36423k90702j69772O0276
6531A103379l79397l7458K44537M21286o7654k51409r2491J30122k29844l83974
6521D57097Q4948j3229N5186P96750k76679m67183j355j95965L74853L9043j70273
6510F83193q7245l5951O05625L02347K11560l42954k43392l97693m01230J18246
6500D12506L12420L64249J63574j55680k66786n74648R9359L38007J76126j83488
6490F85639K15239L08085k90013R2401K85227J04504n71266L48671K18111l63513
6480A033085j7885L49990o3417l57774K30751j88764k36586L35830L19363j06311
6470A298282j38766J55001k64584K28181L18639J99072j91440P8230j683l44650
$$ y = [1166371, 1092745, 478486, 547765, 995511, 1039268, 1267154, 1503577, 1212875, 1043103, 1103379, 723982, 686524, 931061, 1352347, 1284693, 1033284, 940793, 1070915, 841071, 457097, 542045, 528816, 584002, 1380752, 1104073, 636890, 635535, 439570, 814423, 853466, 683193, 595948, 559997, 1165622, 1467969, 1679529, 1336575, 1093183, 695490, 294260, 412506, 724926, 1089175, 1252749, 1097069, 830283, 255635, 354994, 693001, 869127, 685639, 900878, 1208963, 918950, 1011351, 1296578, 1401082, 829816, 1178487, 1396598, 1033085, 1015200, 1365190, 1301773, 943999, 1174750, 985986, 749400, 1085230, 1404593, 1298282, 1159516, 1314517, 1049933, 1278114, 1596753, 1795825, 1604385, 1682615, 1680932, 1336282]
6460A336282P0566K28411J05265J36155o6024k03067j72855L49263K36269k92519
6450A727746k57845J26978j87085K86287N57151M2937l40727R5964J27037k91234
6440A887209l33416O99235M01273j58389l6379L11514o3621n6195J09686l34445
6430B426472L1899M94001p9308J79695j25491j01898M67960k5702K9935k70529
6420C027034J53385l6276K43887O1864L89325L9862m32635m77384M58775L38859
6410C766696L47245K95926j0180L509p8939j46829K74647K70433O03738k70423
6400E055823J62649q7901M08076K59927j03408J51128n70616M72447L26366m6120
6390F028371N86945N71040K67860p3930K9417O04019M4543J05271j60807K65693
$$ y = [1336282, 1406848, 1635259, 1740524, 1876679, 1810655, 1607588, 1434733, 1783996, 2020265, 1727746, 1469901, 1596879, 1409794, 1696081, 2253232, 2296169, 1955442, 2051406, 2178443, 1887209, 1553793, 2253028, 2654301, 2495912, 2459533, 2771047, 2707426, 2651231, 2760917, 2426472, 2458371, 2952372, 2873064, 3052759, 2927268, 2825370, 3293330, 3267628, 3297563, 3027034, 3180419, 3144143, 3388030, 3449894, 3839219, 3879081, 3446446, 2969062, 3427837, 3766696, 4113941, 4409867, 4399687, 4403196, 4324257, 4177428, 4452075, 4722508, 5326246, 5055823, 5218472, 5130571, 5538647, 5798574, 5695166, 5846294, 5275678, 5748125, 6074491, 6028371, 6615316, 7186356, 7454216, 7380286, 7409703, 8013722, 8058265, 8163536, 8002729, 8268422]
6380H268422J12828K29937L41364O0596L53703Q04945K15874M65194J009314O31696
6370A2493873P71712O27302L88035O07851J435529J802666R77446J208103J495604
6361B1808121J251192J323531K102124L069114L032622L079960J599638L76112
6353C7642414p47987j626500j937041j968475j768533j664744j104198r75674
6345B5849262k97805K31858P11413J077582J020752R44099J130066K082396K493890
6336C5243513L024631L577692M134179M956209N183072N554603M938721L117384
6328F9730004k46824l558874n061163o391040o238908n053447m203170l571076
6320C5405502k911253j748412k219618j488949r31481p53717n15147P68057N52014
$$ y = [8268422, 8381250, 8611187, 8952551, 9013147, 9366850, 10171795, 10387669, 10852863, 11862177, 12493873, 13265585, 13892887, 14280922, 14888773, 16324302, 18126968, 19104414, 20312517, 21808121, 23059313, 24382844, 26484968, 29554082, 32586704, 35666664, 37266302, 37642414, 36894427, 35267927, 33330886, 31362411, 29593878, 27929134, 26824936, 25849262, 25551457, 25783315, 26494728, 27572310, 28593062, 29537161, 30667227, 32749623, 35243513, 38268144, 41845836, 45980015, 50936224, 56119296, 61673899, 66612620, 69730004, 69483180, 65924306, 60863143, 54472103, 48233195, 43179748, 38976578, 35405502, 32494249, 30745837, 28526219, 27037270, 26105789, 25352072, 24836925, 25604982, 26156996]
6311B6156996J087767J778244J484722J660087K107489K263792K287269J698270
6303D0524636K60403r99399k455569l342445l658664l344131l270642k335249
6295B1378940k169786j525300j438738j235392j150138j315026o09585j133752
6287A0801223J2257m13683o99313j02335o30372o50432n23320K10886j071444
6278F933467n0932m6167n23532j05047M1484j72353m87992O86225n27343p45699
6268E002111l02126j95384n8898l98306L40263q1305L4214j75447j54277m46822
6258C564023o69563K05186L10341q801m4740r336n53584n14991N84516j97284
6248B665767j22605K43279k14855j62973m21741K00763j73667N23492J70326K2585
$$ y = [26156996, 27244763, 29023007, 30507729, 32167816, 34275305, 36539097, 38826366, 40524636, 40785039, 39785640, 37330071, 33987626, 30328962, 26984831, 23714189, 21378940, 19209154, 17683854, 16245116, 15009724, 13859586, 12544560, 11934975, 10801223, 10813480, 10399797, 9700484, 9598149, 8967777, 8317345, 7794025, 8004911, 6933467, 6882535, 6836368, 6312836, 6207789, 6249273, 6076920, 5588928, 6275153, 5747810, 5002111, 4699985, 4504601, 4445703, 4047397, 4387660, 4306355, 4340569, 4165122, 4010845, 3564023, 2894460, 3099646, 3409987, 3401186, 3356446, 3347110, 2793526, 2278535, 2863051, 2665767, 2543162, 2786441, 2571586, 2408613, 1986872, 2187635, 2013968, 2537460, 2707786, 2730371]
6238B730371n78890n73426L39148K18050L46824k28413j23894p43824K2705L42089
6228A750740o0061K68481R6095M75443j40945j3678m58258o76826K41997k35656
6218A247332k272m45838L15997M42375k15607m35186M28065N85653n87639l37889
6208I94991O50345K64291n61875p27452J25474p2185Q251J88644L78245j96033
6198A052696k5387p6279m06757K68398J19981K47996k26775J71749o04704k86924
6188B33994L10265j6160N33170J04782l85185J22547j45046k704N97111L13711
6178A666485k40029K76641q4459r51946k39527L55073J41851L67491K66954l1089
6168A527445l96146K5958l70911J67609L93913l52525j26228Q9557K06087K41447
$$ y = [2730371, 2151481, 1578055, 1917203, 2135253, 2482077, 2253664, 2129770, 1385946, 1408651, 1750740, 1690679, 1959160, 2055255, 2530698, 2389753, 2376075, 1917817, 1240991, 1482988, 1247332, 1245060, 799222, 1115219, 1557594, 1341987, 906801, 1334866, 1920519, 1332880, 994991, 1645336, 1909627, 1347752, 620300, 745774, 673589, 681840, 870484, 1248729, 1052696, 1027309, 951030, 544273, 812671, 932652, 1180648, 953873, 1125622, 520918, 233994, 544259, 528099, 1061269, 1166051, 780866, 903413, 758367, 755663, 1352774, 1666485, 1426456, 1703097, 1618638, 666692, 427165, 782238, 924089, 1291580, 1558534, 1527445, 1131299, 1157257, 786346, 953955, 1347868, 995343, 869115, 958672, 1164759, 1406206]
6158A406206J58098k02459m35873J10162Q1708k5317M35013N91825j78778O9115
6148B009700J09307k27289k45764K47406j01133l83668N1260M51578K79725M49839
6138B640961J43909m65785J4408L46159l53248n59756L50849J16594K75217K92189
6128B801497q4209j65137K60851j2144q4805M96938M03979j46681n23544L4553
6118B981298J01366m96294j28277j59439j51937R5819R9950n06064k84952P52866
6108B304336L26975m52181J07391K80070p4803j81733k70626J28229J45947o63030
6098A650575j2154P73017j86159k30820J72098J73096j57139j78747k64691k51070
6088A488006J0816j0992k20388k3117R3282m76934M3081M78433M21166n66631
$$ y = [1406206, 1564304, 1361845, 925972, 1036134, 1117842, 1092525, 1527538, 2119363, 1940585, 2009700, 2119007, 1891718, 1645954, 1893360, 1792227, 1408559, 1459819, 1911397, 2191122, 2640961, 2784870, 2319085, 2333493, 2679652, 2326404, 1766648, 2117497, 2234091, 2509308, 2801497, 2717288, 2552151, 2813002, 2800858, 2716053, 3212991, 3616970, 3470289, 2946745, 2981298, 3082664, 2586370, 2458093, 2298654, 2146717, 2242536, 2342486, 1836422, 1551470, 2304336, 2631311, 2179130, 2286521, 2566591, 2491788, 2310055, 2039429, 2167658, 2313605, 1650575, 1638421, 2411438, 2225279, 1994459, 2166557, 2339653, 2182514, 2003767, 1739076, 1488006, 1498822, 1487830, 1267442, 1244325, 1337607, 860673, 903754, 1382187, 1803353, 1236722]
6078A236722n91511M48808M74176j45456l11097K92459l6772m82171P5566L1862
6068I92586j3625J81875N23171m24625k17170M31050j83148j53291M58468K87443
6058A882734k20774j00217J79518j73632k310o0241J40685L2939L55087L91023
6048B424812n22227J88114K72096k06776m43058k27004N4499L24228M94340O9794
6038B428818Q7546j28346n5246n57835J11781M26886L59698N03362R5997N65080
6028C837741J55005j69205r9263N39958P07912K33436j47996m61719m08412q19704
6018C367753k43102M30430k30112K9697o3897j38007l40386L35104O45598m05840
6008C387238m25155J45591K41334Q4977O29875N38637L11003M59768L18739N52165
$$ y = [1236722, 645211, 1094019, 1568195, 1422739, 1111642, 1404101, 1367329, 885158, 960724, 992586, 978961, 1160836, 1684007, 1259382, 1042212, 1473262, 1290114, 1136823, 1595291, 1882734, 1661960, 1561743, 1741261, 1567629, 1565319, 1505078, 1645763, 1678702, 2033789, 2424812, 1902585, 2090699, 2362795, 2156019, 1712961, 1485957, 1540456, 1864684, 2359024, 2428818, 2516364, 2388018, 2332772, 1774937, 1886718, 2313604, 2673302, 3176664, 3272661, 3837741, 3992746, 3823541, 3724278, 4264236, 4972148, 5205584, 5057588, 4595869, 4187457, 3367753, 3124651, 3555081, 3324969, 3354666, 3290769, 3152762, 2812376, 3147480, 3793078, 3387238, 2962083, 3107674, 3349008, 3433985, 4063860, 4602497, 4913500, 5373268, 5692007, 6244172]
5998F244172Q42959R92750O10287K37593p32286j094821q11305o40368k37062
5989E411919m55280m74522j64371J4133p23107p78686L35615N56975Q02261M88904
5979E013841M49212J21225r71162M6433N13312M24591M30866R68917J227730R25659
5969I150624J790246P26144l87038j415920j378727j511154j420108m79928k71671
5960D802468k79592j24747j95803k68368j32847M36556k44547j10268K85200M63747
5950D631799J01320l73924N6075M55427L67567L22409M88056P41037O59737Q11240
5940H260743R82614k78114r24064j056659j157205p32269p4446K4662m95529k51404
5930D298329K66246k65029j70176m76753o5715K12473L50300j76082j91077N90214
$$ y = [6244172, 7087131, 8079881, 8690168, 8927761, 8195475, 7100654, 6289349, 5648981, 5411919, 4956639, 4482117, 4317746, 4331879, 3608772, 2830086, 3165701, 3722676, 4524937, 5013841, 5463053, 5584278, 4613116, 4659549, 5172861, 5597452, 6028318, 6997235, 8224965, 9150624, 10940870, 11667014, 11279976, 9864056, 8485329, 6974175, 5554067, 5074139, 4802468, 4522876, 4398129, 4202326, 3933958, 3801111, 4237667, 3993120, 3882852, 4168052, 4631799, 4733119, 4359195, 4415270, 4870697, 5238264, 5560673, 6048729, 6789766, 7449503, 8260743, 9243357, 8965243, 8041179, 6984520, 5827315, 5095046, 5020600, 5045262, 4549733, 4298329, 4564575, 4299546, 4129370, 3652617, 3586902, 3799375, 4149675, 3973593, 3782516, 4372730]
5920D372730L73912J36852N13351l0822K6321K55165Q33207N78153N14930k5737
5910G548062p40410q90032n13693j38129L92557L78276Q6150J16542m7547Q45589
5900G037365K20501J80241o2278J04184L3912o96402r81435J18441O11457K59345
5890F825331l61165P83068L25915p02909m59601n0414N11410K03757M84366L06570
5880G866328L6216o8994j29335L49287J089585M45691K38976P94233M54785l9594
5870A1037178J52563n40328p23306l48491l7946k12265K7027k19220o7466L75279
5860I443025m04274n87673K49591J03491J81359K71267M18416p408M32707Q17354
5850A0917855L89297M20879N4495L24642N63040K63601k9701M78347L55362o4544
$$ y = [4372730, 4746642, 4883494, 5396845, 5366023, 5392344, 5647509, 6480716, 7058869, 7573799, 7548062, 6807652, 5917620, 5403927, 5265798, 5658355, 6036631, 6122781, 6239323, 6191776, 7037365, 7257866, 7438107, 7375829, 7480013, 7513925, 6817523, 5836088, 5954529, 6565986, 6825331, 6464166, 7247234, 7573149, 6870240, 6410639, 6360225, 6871635, 7075392, 7559758, 7866328, 7902544, 7833550, 7704215, 8053502, 9143087, 9588778, 9827754, 10621987, 11076772, 11037178, 11189741, 10649413, 9926107, 9577616, 9539670, 9327405, 9354432, 9135212, 9067746, 9443025, 9038751, 8451078, 8700669, 8804160, 8985519, 9256786, 9675202, 9667794, 10100501, 10917855, 11307152, 11728031, 11782526, 12107168, 12670208, 12933809, 12904108, 13382455, 13737817, 13673273]
5840A3673273m81703J08651L17881O41827J177456J033461R17536Q20858Q94588
5831A9103828J136444R80536J886266K321964K592700K927663K541205L481555
5823C6972161L686255K942622J360413l38942j661738k788287l195583l077402
5815C3899499k582639j574664r38283p04991m21756J71941K36387M76182Q64879
5806B9426555J031152J544428K711305L254184L434310M784684M579373N338297
5798E6104288P183327O673636M770774O16475l930651p483806p389431o735861
5790D9808751o064486m247139l549631k822872k181049k308936j949379n39876
5782B6145383l71359k60982l8444l54865O53327J151387J532630J576984K132805
$$ y = [13673273, 13191570, 13300221, 13618102, 14259929, 15437385, 16470846, 17388382, 18209240, 19103828, 20240272, 21220808, 23107074, 25429038, 28021738, 30949401, 33490606, 36972161, 40658416, 43601038, 44961451, 44622509, 42960771, 40172484, 36976901, 33899499, 31316860, 29742196, 28803913, 28098922, 27677166, 27849107, 28085494, 28561676, 29426555, 30457707, 32002135, 34713440, 37967624, 41401934, 46186618, 50765991, 56104288, 63287615, 69961251, 74732025, 75348500, 71417849, 63934043, 56544612, 49808751, 43744265, 39497126, 35947495, 33124623, 30943574, 28634638, 26685259, 26145383, 25774024, 25513042, 25474598, 25119733, 25773060, 26924447, 28457077, 30034061, 32166866]
5773C2166866K292367J640395J957608M84747q12763j912255k488925l163466
5765C0164574l041378k414789k101649j827783j685393j462869j309632j484573
5757A4836508j036418j09010l73305p07677r4593l06096q3337k85582j59411J81398
5747A1862477L48926m71525r42480k68271j064503m46123J8012m74986M9912L8440
5737H649879n23494m7174M14843j63040j59379k64238l35605k49077L24949q8835
5727G558829j3461J94751M7722L34007l1572J34866j67171m43117l02755m29585
5717F882514m22703k20961k7948r8148j11305L06484k42742p66073o6679r7883
5707E134556J4600r5329j95706K90767O41119J55315k87465k10019j72873K33156
$$ y = [32166866, 34459233, 36099628, 38057236, 38541983, 37729220, 35816965, 33328040, 30164574, 27123196, 24708407, 22606758, 20778975, 19093582, 17630713, 16321081, 14836508, 13800090, 13691080, 13317775, 12610098, 12515505, 12209409, 12126072, 11840490, 11681079, 11862477, 12211403, 11739878, 10797398, 10529127, 9464624, 9018501, 9036513, 8561527, 8611439, 8649879, 8126385, 8079211, 8494054, 8331014, 8171635, 7907397, 7571792, 7322715, 7647664, 7558829, 7545368, 7740119, 7787841, 8121848, 8090276, 8225142, 8057971, 7614854, 7312099, 6882514, 6459811, 6238850, 6210902, 6112754, 6001449, 6307933, 6065191, 5299118, 5232439, 5134556, 5149156, 5053827, 4858121, 5148888, 5790007, 5945322, 5657857, 5447838, 5274965, 5508121]
5697E508121O57115l5699k39657L25532P87684R54101L98065j05551k86601n40678
5687G422432o23899j018720o02253k01223l07117M39270k83847j85627J63478
5678D802494j09055R0454j41231R5793o6348J32711L84244k1830j13897j47312
5668D906023Q0964J30601p4492L25602Q28804L06383K74929O75337P30298N4440
5658H238889n3271p48990l35322m68397j41486l33249j91598j82592p26929J18217
5648E175272L58763k98443k32969L3986l88524N0152N55777K60468L62367K21289
5638F098138J1729n69049r7502L1144L19545M90264p2845O17135J18301K78283
5628G225143q6833Q7981L2460k41453p7280J78829K08920k59437j19013L71508
$$ y = [5508121, 6165236, 6129537, 5889880, 6215412, 7003096, 7957197, 8355262, 8249711, 7963110, 7422432, 6798533, 5779813, 5177560, 4976337, 4669220, 5108490, 4824643, 4639016, 4802494, 4693439, 4783893, 4642662, 4738455, 4672107, 4804818, 5189062, 5167232, 5053335, 4906023, 4986987, 5117588, 5043096, 5368698, 6197502, 6503885, 6778814, 7454151, 8184449, 8238889, 8185618, 7436628, 7101306, 6632909, 6491423, 6158174, 5966576, 5783984, 5057055, 5175272, 5534035, 5235592, 5002623, 5036609, 4648085, 4698237, 5254014, 5514482, 5876849, 6098138, 6109867, 5540818, 5443316, 5474460, 5794005, 6284269, 6211424, 6828559, 6946860, 7225143, 7138310, 7226291, 7258751, 7017298, 6940018, 7118847, 7327767, 7068330, 6949317, 7320825]
5618G320825l18531R6008J66440l51897L61169k36765L62192N5855k44302K80511
5608G491505N34862M21865P92050K75780k06607k75540M71766K74700J60706P26847
5598A0667934N06176P96239K66770m28499n39497l03625m06419j480561n26816
5589H551702M18980K94288M39416n8970K12495J57407j96954J54270J07927k38076
5579I842485j81670O40153M63146n14527J64749j96125J06596L54264j44791k18182
5569A0316098N90888O47247m46733n3804M24602K62115j12135M10131K68515k8373
5559A2278551M15151L8187P13016k17050J05864o335m4561O8745J20406Q85247
5549A4357221K08530J05572P74909j0747q7440N33559N51471M05032Q68193M43815
$$ y = [7320825, 7002294, 7098302, 7264742, 6912845, 7274014, 7037249, 7399441, 7455296, 7210994, 7491505, 8026367, 8448232, 9240282, 9516062, 9309455, 9033915, 9505681, 9780381, 9941087, 10667934, 11174110, 11970349, 12237119, 11808620, 11269123, 10965498, 10559079, 9078518, 8551702, 8970682, 9264970, 9704386, 9645416, 9857911, 10015318, 9818364, 9972634, 10080561, 9842485, 9660815, 10300968, 10764114, 10249587, 10414336, 10218211, 10324807, 10679071, 10534280, 10316098, 10906986, 11554233, 11107500, 11053696, 11478298, 11740413, 11628278, 12038409, 12306924, 12278551, 12693702, 12731889, 13444905, 13227855, 13333719, 13327384, 13282823, 13351568, 13471974, 14357221, 14565751, 14671323, 15446232, 15435485, 15348045, 15881604, 16433075, 16838107, 17706300, 18150115]
5539A8150115p5266J48815M24967k65744l47345K32389N05878M2411r3171N37128
5529A9260177O36470K68285Q92982N14863J91899O37960J155277O01113k4306
5520B4134720N46317O05037P50598K83106J100532J763605J642001R03023P75019
5511C2503958O82739P76203P48197K21305O40803R63086J146848J513398J755545
5502D0952082J660224J105295P55101J081192J110278O61129K33372J196948J317745
5493E0073366J049363J986830K763525L404983L825311L625677K213861M67236
5485F9410152K61038P26068P24283J867419K421492L401164M495068M628440N072666
5476I3007790M724047N870569P416724P012274O024267N524303O920203P359328
$$ y = [18150115, 18074849, 18223664, 18648631, 18382887, 18035542, 18267931, 18773809, 18816220, 18723049, 19260177, 19896647, 20164932, 21057914, 21572777, 21764676, 22402636, 23557913, 24159026, 24134720, 24681037, 25286074, 26036672, 26319778, 27420310, 29183915, 30825916, 31728939, 32503958, 33186697, 33962900, 34711097, 34932402, 35573205, 36536291, 37683139, 39196537, 40952082, 42612306, 43717601, 44472702, 45553894, 46664172, 47325301, 47558673, 48755621, 50073366, 51122729, 53109559, 55873084, 59278067, 63103378, 66729055, 68942916, 69410152, 69671190, 70397258, 71121541, 72988960, 75410452, 78811616, 83306684, 87935124, 93007790, 97731837, 103602406, 111019130, 118031404, 124055671, 129579974, 136500177, 143859505]
5468A43859505P466676N922127L046726K49115j82152m981j472450l766129n884377
5459A49234060p794139q242146o645853n326565n314606n412663m852834l908232
5451A01737022l393273j723961j028928J7710K514751N636266P096181O950970
5443A17806738O620967r03444p106828q490610q766986q121515q338163n825657
5435G6874502m701740l814654k423594j107639j218298p91290l27249j221675
5427F1268363n99503n99619m86481M22343Q70346J135113J551237L357305M225146
5418G1144250N048815M847270L222635R29514k659254m197776n076307o746808
5410F6512339p310320n657475m299790l330808k818818j479903r70019j289391
$$ y = [143859505, 151326181, 157248308, 160295034, 160544149, 160361997, 160357016, 158884566, 155118437, 149234060, 141439921, 133197775, 126551922, 121225357, 115910751, 110498088, 105645254, 101737022, 98343749, 96619788, 95590860, 95608570, 98123321, 103759587, 110855768, 117806738, 124427705, 123524261, 116417433, 107926823, 99159837, 91038322, 82700159, 76874502, 72172762, 68358108, 65934514, 64826875, 63608577, 62817287, 62490038, 61268363, 60668860, 60069241, 59582760, 60005103, 60875449, 62010562, 63561799, 66919104, 71144250, 76193065, 81040335, 84262970, 85192484, 82533230, 78335454, 73259147, 66512339, 59202019, 53544544, 49244754, 45913946, 43095128, 41615225, 40645206, 39355815]
5402C9355815j828663j013082J82611r3494r16644j05188J767913J595848J778649
5393D0723765K428298K337332J852049O84991j562356l542421m307189m858144
5385C3756325m291885l149564k327440k029025j459949k016213j275432j155232
5377A6051585j143404o08636j16808q00872r00897k6503p56178l82605K57260
5368A1572942o36753n56117m46384q440n0319m54207l37861l90122j59707m57793
5358H075239O3373o6493l51446p4982k52671J84106L97802l84802L11416k05066
5348G696476j13341L8694P3762n15816m92335J53765j66657l90103j69991n2739
5338F061715j53314p2863j05120k00237J21383L91684l10372p6063N91093L87789
$$ y = [39355815, 37527152, 36514070, 36696681, 36603187, 35686543, 35581355, 37349268, 38945116, 40723765, 43152063, 45489395, 47341444, 48026435, 46464079, 42921658, 38614469, 33756325, 29464440, 26314876, 23987436, 21958411, 20498462, 18482249, 17206817, 16051585, 14908181, 14299545, 14182737, 13381865, 12480968, 12454465, 11698287, 11315682, 11572942, 10936189, 10380072, 9933688, 9925248, 9874929, 9420722, 9082861, 8692739, 8533032, 8075239, 8138612, 8072119, 7720673, 7645691, 7393020, 7577126, 7974928, 7590126, 7901542, 7696476, 7583135, 7621829, 7695591, 7179775, 6687440, 6841205, 6674548, 6284445, 6114454, 6061715, 5908401, 5835538, 5730418, 5530181, 5651564, 6043248, 5732876, 5656813, 6247906, 6635695]
5328F635695n77408J81855J50045J42439K83903N04871j73599k37944L98931N28684
5318G837472Q71228R79041J254026L62370k28549m59243j408174j224816l08071
5309G675284k75339j027476q5667J60461k06584k20622n57187L5132o94954q89695
5299C913353J29412J27870R38470M21163j14970k93224k89029k52262j28544J067643
5289E519882R14381P19498N43209N17872Q88554O18563O42415J78029m47262k68354
5279I826787k63807k63157o56985l60450l34356m10438J83696j49692j046171
5270F525427n71181k59548l55236k20661j01951m96515k75821J01584k70520j23696
5260C951882K49372j18941K41468M83846j11496p44220J18308K40630j85748L66792
$$ y = [6635695, 6058287, 6240142, 6390187, 6532626, 6816529, 7321400, 7147801, 6909857, 7308788, 7837472, 8708700, 9687741, 10941767, 11304137, 11075588, 10616345, 9208171, 7983355, 7675284, 7399945, 6372469, 6286802, 6447263, 6240679, 6020057, 5462870, 5498002, 4803048, 3913353, 4042765, 4170635, 5109105, 5530268, 5415298, 5122074, 4833045, 4580783, 4452239, 5519882, 6434263, 7153761, 7696970, 8214842, 9103396, 9721959, 10364374, 10542403, 10095141, 9826787, 9562980, 9299823, 8642838, 8282388, 7948032, 7537594, 7721290, 7571598, 6525427, 5954246, 5694698, 5339462, 5118801, 5016850, 4520335, 4244514, 4346098, 4075578, 3951882, 4201254, 4082313, 4323781, 4807627, 4696131, 3951911, 4070219, 4310849, 4125101, 4491893]
5250D491893L73989l14193J90917O9323l57461l84707O2534m88310n96260J8591
5240C066316m35416J39378L28576N14805k74892l95508l2830o17164m44219P702
5230A856748O01454l74308k71162K97448j00333M865J95383K35666o8816Q6795
5220B463740l50166k71568j46358k67373L79952M61278j88856M34727J56907j00398
5210B571885k64499J07133r2065k64193N85606J21447k60591l7241P8710n63538
5200A982654K41501j51675j08615K92634j13041j71574j91056N9168l69353L29062
5190A799705L37441m17702J22668k44444l32081j59249L32755o5091k43890K93005
5180A423117O9412J58812k1708J19787O8785M39694K27584r64475k5890k89812
$$ y = [4491893, 4865882, 4551689, 4742606, 4811929, 4454468, 4069761, 4132295, 3643985, 3047725, 3066316, 2630900, 2770278, 3098854, 3613659, 3338767, 2943259, 2910429, 2293265, 1849046, 1856748, 2458202, 2083894, 1812732, 2110180, 2009847, 2014712, 2210095, 2445761, 2376945, 2463740, 2113574, 1842006, 1695648, 1428275, 1808227, 2269505, 2080649, 2515376, 2672283, 2571885, 2307386, 2414519, 2322454, 2058261, 2643867, 2765314, 2504723, 2467482, 2546192, 1982654, 2224155, 2072480, 1963865, 2256499, 2143458, 1971884, 1780828, 1839996, 1470643, 1799705, 2137146, 1719444, 1842112, 1597668, 1265587, 1106338, 1439093, 1374002, 1130112, 1423117, 1492529, 1651341, 1629633, 1749420, 1818205, 2257899, 2485483, 1521008, 1495118, 1205306]
5170A205306O0803n8505K92813R29636m17871o2304J0845N42980m1076l03229
5160B159398l22229m96316k15617n5214M94061k6400q10O0101o4295j93253l91488
5149I47938M69568q5850k8082n7145l2760j42356K62996L29008k34332J32443
5139A561428k07971j77505J10044J43938n5959j95136L45058m20089n8342K11272
5129A256738Q348k4423N9146L45236l19398n5163K40338p8830k89800J543N5724
5118A199459j43915J4341M7029k57680J5072j05308J44272J66595K001j51577
5108I30289O30670k51250m30567O305m76384K03972J20718M08135K11418K1069
5098A374375J08018k42494L19856L0160j65975m25013j83223J72708l03615N34800
$$ y = [1205306, 1266109, 1207604, 1500417, 2430053, 2012182, 1949878, 1960723, 2503703, 2462627, 2159398, 1837169, 1340853, 1125236, 1070022, 1564083, 1537683, 1536873, 1596974, 1532679, 1339426, 947938, 1417506, 1331656, 1303574, 1246429, 1213669, 1071313, 1334309, 1663317, 1428985, 1561428, 1353457, 1175952, 1285996, 1429934, 1373975, 1178839, 1523897, 1103808, 1045466, 1256738, 1265086, 1240663, 1299809, 1645045, 1325647, 1270484, 1510822, 1431992, 1142192, 1143735, 1199459, 1055544, 1069885, 1116914, 859234, 874306, 768998, 913270, 1079865, 1081866, 930289, 1560959, 1309709, 879142, 885447, 409063, 613035, 733753, 1141888, 1353306, 1374375, 1482393, 1239899, 1559755, 1589915, 1423940, 998927, 815704, 988412, 684797, 1219597]
5088A219597m11155j77032K952L59174k65759j38194L35996k45351J81976L21262
5078A183466O7425n05977m28253P4153J97100M04314k6735j71304q1874L89307
5068A101622m32821m52547J13703M78565M78196l1404m73594j93844K08432p3310
5058G22998j39443q6804o1240M2552L63953l02658K45719n3819l94748j66850
5048A69660N84567J80027k44445k21635O3282K76492k05499M51984l3383n41978
5038D79072K81856n6923l00115l95426N94245j62520j1916N33346J4833k60769
5028G15683k68294K73736k20018k696o8761j31742J70406j18753J30744q1405
5018C98900k57948L34897P4613M54L35768K87619l55135m73674j4953j46410k97465
$$ y = [1219597, 808442, 631410, 634362, 993536, 727777, 589583, 925579, 680228, 862204, 1183466, 1250891, 744914, 316661, 390814, 587914, 992228, 965493, 794189, 712315, 1101622, 668801, 216254, 329957, 808522, 1286718, 1255314, 781720, 587876, 796308, 722998, 583555, 496751, 435511, 478063, 842016, 539358, 785077, 731258, 336510, 169660, 754227, 934254, 689809, 468174, 531456, 807948, 602449, 1054433, 1021050, 479072, 760928, 704005, 403890, 8464, 602709, 440189, 428273, 961619, 976452, 715683, 447389, 721125, 501107, 498411, 429650, 297908, 468314, 349561, 480305, 398900, 140952, 475849, 550462, 550916, 886684, 1174303, 819168, 345494, 330541, 184131, -113334]
5007a13334J7502j94450J24641M88833K67922P0444P3800O9363k80507k52040
4997B72174K68523M72937N0153l03844l04667k06186o73974K74102J74677J75948
4987A99843O43425j7574n29528J39557J70725J2360M07759N08030m57143m07039
4977F70415l50622l4536Q7619L67746J75558j806j64654K18378J27956m72035
4967F24019J76605J39008L1938K98706M78205l99179o20853L44656L56124j89199
4957A240030L01039j59857k14075J16054O23766l19433k04656J67258K7712j09060
4947A468778j0984k66492K15338L13337j87286K34711n43318j08703L42131R9778
4937A557290o2396L4476J59921K17929O47856j83734n90356p8773l55971Q04480
$$ y = [-113334, -95832, -290282, -165641, 323192, 591114, 661558, 735358, 804721, 524214, 272174, 540697, 1013634, 1063787, 759943, 455276, 249090, -424884, -150782, 23895, 199843, 843268, 825694, 296166, 435723, 606448, 618808, 1026567, 1534597, 1077454, 670415, 319793, 285257, 372876, 740622, 916180, 914374, 749720, 968098, 1096054, 624019, 800624, 939632, 971570, 1270276, 1748481, 1349302, 728449, 1073105, 1429229, 1240030, 1541069, 1381212, 1167137, 1283191, 1906957, 1587524, 1382868, 1550126, 1577838, 1468778, 1457794, 1191302, 1406640, 1719977, 1532691, 1767402, 1224084, 1115381, 1457512, 1557290, 1494894, 1529370, 1689291, 1907220, 2555076, 2371342, 1780986, 1702213, 1346242, 2150722]
4927B150722J05496n60924P3777k30032j18037M27445O07412l13699Q5805M02860
4917B630825j32695J73741M69102k90501K889N54984K79078j07252l66198J6416
4907C230389l07837r3921R46258j36986L40434L6612L49687O66877Q78340P16968
4897F626821j0719J67689R1264J258304J294515Q94249L186199L271899K506133
4888A9286354k78084j827694k377337k319248j570818k317151j397993q44444
4880F353585j99453n58006p20073m56808j89727j82786l1130N15398m48057M4795
4870D127738L22576m68983L6306M05116j28170q1456M81789n07523q91643l9202
4860C256548M57523J24565k79832m97353j53270J84569L77067M48416O14961l04196
$$ y = [2150722, 2256218, 1695294, 1769071, 1539039, 1421002, 1848447, 2455859, 2142160, 2227965, 2630825, 2498130, 2671871, 3140973, 2850472, 2853361, 3408345, 3687423, 3580171, 3213973, 3230389, 2922552, 2828631, 3774889, 3637903, 3978337, 4014949, 4364636, 5031513, 5909853, 6626821, 6616102, 6783791, 6875055, 8133359, 9427874, 10322123, 13508322, 16780221, 19286354, 19008270, 17180576, 14803239, 12483991, 10913173, 8596022, 7198029, 6353585, 6154132, 5596126, 4876053, 4419245, 4229518, 4046732, 4015602, 4531000, 4082943, 4127738, 4450314, 3981331, 4017637, 4422753, 4294583, 4213127, 4694916, 4187393, 3295750, 3256548, 3714071, 3838636, 3558804, 3061451, 2908181, 3092750, 3469817, 3918233, 4533194, 4228998]
4850D228998n33108j29072M40530L47620K65961N66379K98921m7980k71107k14631
4840D952511l21039j67116k53024m55803O0726J07815J22921k15895j00568M58274
4830D188802L27397l27825p43838L34089K81789L14243j87145O3353N6740k68041
4820D039564L43317L5277M83122M3162J92390l97289n82174O8467j35074J53036
4810D243798P3350j79253L13943j07478j18714j68897l48086J56724P78729M34270
4800E078386m94075J4568K32974k26833J0215r8268M44173L69617k61376l64326
4790D705055J88151M25559K65965K10703L65928j84114l17439K30199O1568L06247
4780F257822J02743L04056N59773J81388j4519o3776J047282K76452l35285M92546
$$ y = [4228998, 3695890, 3566818, 4007348, 4354968, 4620929, 5187308, 5486229, 5438249, 5167142, 4952511, 4631472, 4464356, 4211332, 3755529, 3816255, 3924070, 4046991, 3831096, 3730528, 4188802, 4516199, 4188374, 3444536, 3778625, 4060414, 4374657, 4187512, 4250865, 4307605, 4039564, 4382881, 4418158, 4901280, 4944442, 5136832, 4739543, 4157369, 4225836, 4090762, 4243798, 4317148, 4137895, 4451838, 4344360, 4225646, 4056749, 3708663, 3865387, 4644116, 5078386, 4584311, 4598879, 4831853, 4605020, 4615235, 4516967, 4961140, 5330757, 5069381, 4705055, 4893206, 5318765, 5584730, 5795433, 6161361, 5977247, 5659808, 5890007, 5951575, 6257822, 6360565, 6664621, 7224394, 7405782, 7391263, 7327487, 8374769, 8651221, 8315936, 8808482]
4770H808482j82420r1042P29273J43524N00508O91287J43056q0375M54544M02912
4760A1519749k69106Q18112O36918Q75611O72292M62016L80846J016132J184564
4751A7297134J146048R98042M20392N13179P84308J719004J081335K427149K798588
4742B9185179K769602L267065L436090L388010K328822R53361j461738k582507
4734D1283884k840316k742012j767974j132561o61023o51058L04542l47919K37551
4725C1683114O87404M37129Q75944P70721J326643J908869L112895L398910N010930
4716D9212559N727351M689441L922869K213407m85509k901375n110585o128618
4708E1139540o140287m261187l725860l047698j830947j309030j951109j198311
$$ y = [8808482, 8626062, 8535020, 9264293, 9407817, 9908325, 10599612, 10742668, 10662293, 11116837, 11519749, 11250643, 12068755, 12705673, 13581284, 14253576, 14715592, 15096438, 16112570, 17297134, 18443182, 19441224, 19861616, 20374795, 21159103, 22878107, 23959442, 26386591, 29185179, 31954781, 35221846, 38657936, 42045946, 44374768, 45328129, 43866391, 41283884, 38443568, 35701556, 33933582, 32801021, 32139998, 31488940, 31793482, 31445563, 31683114, 32370518, 32807647, 33683591, 34454312, 35780955, 37689824, 40802719, 44201629, 49212559, 54939910, 59629351, 63552220, 65765627, 65280118, 62378743, 57268158, 51139540, 44999253, 40738066, 37012206, 33964508, 32133561, 30824531, 28873422, 27675111]
4700B7675111n56047j092150n00184o6663j46794K58823P04670J478596J846974
4691B9602336K010883J509188K019812R15019j177333k590442l373235l429658
4683B5486570l288114k710599k056994j559291j639712q70656m84729q46414j164323
4674A0865738q47920r83251n85322N6341q39667k00782j42902n36296j55874j30639
4664F499426L15561l6429j85090l44968k73122m12544m42883K2025Q1644l29329
4654D894291k24302M97797m4366m64415m41076K18901o46461j87142N89012k77263
4644C914976j6642M3295O5428m34695j3755J99496l25246N8080K89642K87777
4634D068356j48406M9453J15094j18873L00752O794J5815l28167J62611l95660
$$ y = [27675111, 27119064, 26026914, 25526730, 25460067, 25313273, 25572096, 26276766, 27755362, 29602336, 31613219, 33122407, 35142219, 36057238, 34879905, 32289463, 28916228, 25486570, 22198456, 19487857, 17430863, 15871572, 14231860, 13361204, 12876475, 12030061, 10865738, 10017818, 9034567, 8449245, 8505586, 7665919, 7465137, 7322235, 6785939, 6630065, 6499426, 6814987, 6778558, 6593468, 6248500, 5975378, 5562834, 5119951, 5141976, 5223620, 4894291, 4669989, 5167786, 5123420, 4659005, 4217929, 4436830, 3790369, 3603227, 4192239, 3914976, 3898334, 3941629, 4007057, 3572362, 3558607, 3758103, 3432857, 3490937, 3780579, 4068356, 3919950, 3969403, 4084497, 3965624, 4266376, 4273170, 4288985, 3960818, 4123429, 3727769]
4624C727769L27835K48722k84639K13327k50646o7628q526j11459l41884j22329
4614C330542M76102q8045k57955j21877l7577K92601O6029j28165J82903l8216
4604C676342k23521J61320M11971P00590m50647n45811K14587j08145m02291j09169
4594C325226M10179l74312l54478l94438n42785L37890K68928p778o21953j05158
4584A941321M82052m9360P30785L9109k31516m2152M42140k80010p64582K73913
4574B541700k00930l06723m7301m26306j67528r264K71972l2847p2134l35543
4564A215096K52973m571M2801L468j74109M1558q7891l40235l52612N10927K35279
4553A342684K97972K07074J56006J07806n55099o41713p504L96921n31053L46156
$$ y = [3727769, 4055604, 4304326, 4019687, 4233014, 3982368, 3914740, 3906214, 3794755, 3452871, 3330542, 3806644, 3718599, 3460644, 3338767, 3301190, 3593791, 3659820, 3531655, 3714558, 3676342, 3452821, 3614141, 4026112, 4726702, 4276055, 3730244, 3944831, 3836686, 3434395, 3325226, 3735405, 3361093, 3006615, 2612177, 2069392, 2407282, 2676210, 2668432, 2046479, 1941321, 2423373, 2374013, 3104798, 3143907, 2912391, 2870239, 3312379, 3032369, 2267787, 2541700, 2340770, 2034047, 1986746, 1560440, 1392912, 1383648, 1655620, 1622773, 1550639, 1215096, 1468069, 1463498, 1506299, 1509767, 1335658, 1377216, 1289325, 949090, 596478, 1107405, 1342684, 1640656, 1847730, 2003736, 2111542, 1556443, 914730, 907226, 1304147, 773094, 1119250]
4543A119250N90760Q7391m62887n64282N35064j12145K49627K03677L75267j1465
4533B010257j89299J38432m06021j11788J96564J31808J30309k56849l93052L08768
4523A559129J71N06986m7917m29636N96152k55167k20116k22110N80617n53253
4513A514856k42363O50942J8042k57651J48827N44886k63584p71595M75437O6804
4503A884601m86453J18695r58n9170P07324N89356p50717l84619J98581j56262
4493A660378K11121k12026q0501N36880M64563N6086l53463l28186N9924J42883
4483B157659J6648K07725J9592l69032J93785N2224p21726p4731L46443K92145
4473B120732J63588l10430m55215L84830K05464o83332j73656O07228K61642K55293
$$ y = [1119250, 1710010, 1797401, 1334514, 770232, 1305296, 1193151, 1442778, 1646455, 2021722, 2010257, 1820958, 1959390, 1553369, 1441581, 1638145, 1769953, 1900262, 1643413, 1250361, 1559129, 1559300, 2066286, 2018369, 1588733, 2184885, 1929718, 1709602, 1487492, 2068109, 1514856, 1272493, 1923435, 1941477, 1683826, 1832653, 2377539, 2113955, 1342360, 1817797, 1884601, 1398148, 1516843, 1515885, 1456715, 2164039, 2753395, 2002678, 1618059, 1816640, 1660378, 1871499, 1659473, 1578972, 2115852, 2580415, 2636501, 2283038, 1954852, 2014776, 2157659, 2174307, 2382032, 2401624, 2032592, 2226377, 2278601, 1556875, 1482144, 1828587, 2120732, 2284320, 1973890, 1518675, 1903505, 2108969, 1425637, 1251981, 1859209, 2120851, 2376144]
4463B376144J68824j41746m75407m7958j97956o90860L37415L47592p1066j35026
4453A469956O39232K76200n69655k20684j92208J53360N75850J96514J37056j61540
4443B304081n86739o12672P8653O02367O29503L57246M1683k34451n80011J40465
4433B140125K84701l29330p93969M20805L49788L47568K18332l83716k6408K6026
4423B253922k01040k34788K38569O03637N34707k29035p75527r7822O70000K22332
4413B984955k13106p5317O4683N76430R3756p31750m238J46549K32004j09832
4403B964134k65240l98475K5535K51425r0091K57736L16002J22645k92408J58830
4393C050093K20231j44151R9074k83274n32357K20202n9876j03860K92359M47633
$$ y = [2376144, 2544968, 2403222, 1927815, 1879857, 1681901, 991041, 1328456, 1676048, 1604982, 1469956, 2109188, 2385388, 1815733, 1595049, 1402841, 1556201, 2132051, 2328565, 2465621, 2304081, 1717342, 1104670, 1183323, 1785690, 2415193, 2772439, 2814122, 2579671, 1999660, 2140125, 2424826, 2095496, 1301527, 1722332, 2072120, 2419688, 2638020, 2254304, 2227896, 2253922, 2052882, 1818094, 2056663, 2660300, 3195007, 2965972, 2190445, 2092623, 2762623, 2984955, 2771849, 2696532, 2761215, 3337645, 3431401, 2699651, 2695413, 2841962, 3073966, 2964134, 2698894, 2300419, 2325954, 2577379, 2487288, 2745024, 3061026, 3183671, 2891263, 3050093, 3270324, 3126173, 3225247, 2941973, 2409616, 2629818, 2569942, 2466082, 2758441, 3206074]
4383C206074K09672j82893k79157N08440l4709j84877J35480l56672J64690N4966
4373C241014L9368p4912M22528P13476m41870Q2449n12461n64718l6449L54856
4363C223281M05910n6077J38496r0296K95275l1649m73789J82452O96563m17106
4353C873060o89352J23353M35392M50515l15156J2779N9804K07927K46770m8061
4343D357031l71542l41344M55665J64355q5643K53763J56094j63111J02937k96934
4333D231271k78777K28641L75288M529l15197L32581O0748M1661J45920K42705
4323E069370j38980J54023M3683l2213k34981j16157N32367J12590J59439J95033
4313E744174K51146J52899K96501J43970p9575Q3904p66827K38084K51311N19596
$$ y = [3206074, 3415746, 3232853, 2953696, 3462136, 3427427, 3242550, 3378030, 3021358, 3186048, 3241014, 3280382, 3205470, 3627998, 4341474, 3899604, 3982053, 3469592, 2904874, 2868425, 3223281, 3629191, 3573114, 3711610, 3621314, 3916589, 3884940, 3411151, 3593603, 4290166, 3873060, 3183708, 3307061, 3742453, 4192968, 3877812, 3890591, 3950395, 4158322, 4405092, 4357031, 3985489, 3644145, 4099810, 4264165, 4178522, 4432285, 4588379, 4425268, 4528205, 4231271, 3952494, 4181135, 4556423, 4560952, 4245755, 4578336, 4639084, 4680745, 4826665, 5069370, 4930390, 5084413, 5128096, 5095883, 4860902, 4744745, 5277112, 5389702, 5549141, 5744174, 5995320, 6148219, 6444720, 6588690, 6509115, 6593019, 5826192, 6064276, 6315587, 6835183]
4303F835183M73001Q3682M39729k26285O30020n90672J39154O37133J40735K28766
4293H790446m13494L60970P47907M28840l2531m13549L89313j10078N37135K63449
4283A0548408r3111J78702L83180O74637j66021J39421M48818N55770K49633j8265
4273A2901172J04347K76556M40887L57462M53930Q8051L65198J37153K30903K84359
4263A5640018N34185K39750N6063O27737o6659M50859R31666M4977o8848q3682
4253A8306066O03134L83786Q83831O61708L7328P06096L76838L78212K58471K62113
4243B2857583K01308R66360J696645M48562Q69924Q61475N50203Q62853R90515
4234C0305428J227977P48352J573818J231170J383652J740967J729972J353760
$$ y = [6835183, 7308184, 7391866, 7831595, 7605310, 8235330, 7644658, 7783812, 8420945, 8561680, 8790446, 8376952, 8737922, 9485829, 9914669, 9882138, 9468589, 9857902, 9747824, 10284959, 10548408, 10455297, 10633999, 11017179, 11691816, 11525795, 11665216, 12114034, 12669804, 12919437, 12901172, 13005519, 13282075, 13722962, 14080424, 14534354, 14622405, 14987603, 15124756, 15355659, 15640018, 16174203, 16413953, 16470016, 17097753, 17031094, 17481953, 18413619, 18458596, 18389748, 18306066, 18909200, 19292986, 20176817, 20838525, 20875853, 21581949, 21958787, 22336999, 22595470, 22857583, 23058891, 24025251, 25721896, 26170458, 27040382, 27901857, 28452060, 29314913, 30305428, 31533405, 32281757, 33855575, 35086745, 36470397, 38211364, 39941336, 41295096]
4226D1295096J871443K071022J724690K282297J992722J985358K622801K976145
4218E8821574K556251K998423L256733K740428K721575K471976L021360L810126
4210H2398446L735196L344098L383348L607506L382734L751308L196712L012638
4202A09811986L603338L352948L464917K709765K777793K941196K457247K358390
4194A33477580K092235K389123J793740J360888J673300P76246L09371L38279
4186A44210762O95259o4954l44834j56935p78635j234800j941537k262870k282141
4177A35839315k534182k483800k533473k167470l148861l231444k665521l205845
4169A13868719k988850l290740l499852l541991l429327m435908m304644l856400
$$ y = [41295096, 43166539, 45237561, 46962251, 49244548, 51237270, 53222628, 55845429, 58821574, 61377825, 64376248, 67632981, 70373409, 73094984, 75566960, 78588320, 82398446, 86133642, 89477740, 92861088, 96468594, 99851328, 103602636, 106799348, 109811986, 113415324, 116768272, 120233189, 122942954, 125720747, 128661943, 131119190, 133477580, 135569815, 137958938, 139752678, 141113566, 142786866, 143563112, 143872483, 144210762, 144906021, 144841067, 144496233, 144339298, 143560663, 142325863, 140384326, 138121456, 135839315, 133305133, 130821333, 128287860, 126120390, 122971529, 119740085, 117074564, 113868719, 110879869, 107589129, 104089277, 100547286, 97117959, 92682051, 88377407, 84521007]
4161H4521007l686750l161675l101810l179404l263740l220518l186317l226601
4153E8494192l086129k366728j868371k932839k703525k017358k048726k167526
4145C9302990j910356j815104j932500j808710j783479j011492j393538r93531
4137B6654280n98458q00571j324736j242034q83900p59995l83967k19536l28788
4128B0112295j94657r34103q73162l83652l64233m55306L1987q3377m84522o20745
4118A5750525p22111k5854k28866p13989k50920k63460m5033n8533n57716l16055
4108A2567988l15106k41431k76768l46033K75797L48119j97905j0587k64476r20914
4098A0618684m77144K5979k71025J06528J0962q82225m99389K30298R7227J01836
$$ y = [84521007, 80834257, 77672582, 74570772, 71391368, 68127628, 64907110, 61720793, 58494192, 55408063, 53041335, 51172964, 48240125, 45536600, 43519242, 41470516, 39302990, 37392634, 35577530, 33645030, 31836320, 30052841, 29041349, 27647811, 26654280, 26055822, 25255251, 23930515, 22688481, 21804581, 21044586, 20660619, 20441083, 20112295, 19917638, 18983535, 18110373, 17726721, 17362488, 16907182, 16939169, 16855792, 16371270, 15750525, 15028414, 15002560, 14773694, 14059705, 13808785, 13545325, 13500292, 13441759, 12884043, 12567988, 12252882, 12011451, 11734683, 11388650, 11664447, 12012566, 11814661, 11804074, 11539598, 10618684, 10141540, 10167519, 9896494, 10003022, 10013984, 9131759, 8632370, 8862668, 8959895, 9061731]
4088I061731M54092j82645l73054n1727k42115j45306r6457j29049J36114j53307
4078H278277k77832M55356k45359k86790L97484m5869j53893k4319k92727m82043
4068G322285k97642k17230M1255N63734K39146j9148j57825n64145m77372L74237
4058F807295J024922O70893N0377k88878j06994r5924l74378K7833p9849m5311
4048G589986N28027M98488r6809L89466J64312K16503J99531k7707j53848o03142
4038H704807o2554j0229L2636M12669J15023m05049j86338J19534p2316M71605
4028I119788K66198l93908P239O6814o50552k34366J68399K76260n0893r7111
4018H477868J37835L06485L70496K23074k47823J09876J88491J93875M42191K29354
$$ y = [9061731, 9515823, 9333178, 8960124, 8908397, 8666282, 8520976, 8424519, 8295470, 8431584, 8278277, 8000445, 8455801, 8210442, 7923652, 8321136, 8275267, 8121374, 8097055, 7804328, 7322285, 7024643, 6807413, 6848668, 7412402, 7651548, 7632400, 7474575, 6910430, 6433058, 6807295, 7832217, 8503110, 8553487, 8264609, 8157615, 8061691, 7687313, 7715146, 7635297, 7589986, 8118013, 8616501, 8519692, 8909158, 9073470, 9289973, 9489504, 9461797, 9307949, 8704807, 8642253, 8632024, 8664660, 9077329, 9192352, 8787303, 8600965, 8720499, 8648183, 9119788, 9385986, 8992078, 8999317, 9066131, 8415579, 8181213, 8349612, 8625872, 8574979, 8477868, 8615703, 8922188, 9292684, 9515758, 9267935, 9377811, 9566302, 9760177, 10202368, 10431722]
4008A0431722j47900n98857O33258L55261j00825L7759M29021J15766m77601M15740
3998A1093344j51758J00026M36824J08122K24417N4925J06611j52339m5026k85919
3988A1489227n3775q5720M90123M0928j00588M0487o0782j59004j35200R1457
3978A1557153k71961O67621L15827Q2798m73691l47223m42596K36263P12059K10570
3968A2246820j7087M7888L2969j47445j44381K92075L08066K05711L43025M8516
3958A3216157J90577l7282O3070j68646P4985J38551Q5972P1198K38470K51465
3948A4124517K98841j8380M96293r2523m12791M41458j07146j6645O91129P61394
3938A6166147k17985l47281N10945K47856K56235l5382K68460K87265K08647M31535
$$ y = [10431722, 10283822, 9684965, 10318223, 10673484, 10572659, 10610418, 11039439, 11155205, 10677604, 11093344, 10941586, 11041612, 11478436, 11586558, 11810975, 11865900, 11972511, 11820172, 11775146, 11489227, 11435452, 11349732, 11839855, 11880783, 11780195, 11820682, 11759900, 11600896, 11465696, 11557153, 11285192, 11952813, 12268640, 12351438, 11877747, 11530524, 11087928, 11324191, 12036250, 12246820, 12229733, 12277621, 12310590, 12163145, 12018764, 12310839, 12618905, 12824616, 13167641, 13216157, 13406734, 13369452, 13432522, 13263876, 13338861, 13477412, 13563384, 13634582, 13873052, 14124517, 14423358, 14404978, 14901271, 14808748, 14395957, 14837415, 14730269, 14713624, 15404753, 16166147, 15948162, 15600881, 16111826, 16359682, 16615917, 16580535, 16848995, 17136260, 17344907, 17776442]
3928A7776442N3154r2669J18359L20498L11782O55080R16309J45062M25608O4012
3918B0693637k38335N36485P38454K06265L00103P33880K19831L14824M43261
3909B3948405L37441K43751L94204O40320N69509K31576O26330O86083R31998
3900B8609617O53724K04033N39788J084797J444138J322154J082355R32812R46094
3891C6819512J441831J234499J458193J761593J504332J706588J286501R86923
3883D8199972J325903J561929J205736J533692J730072J626383J360372J892417
3875F0436476J368557J744724J811985J732102J892339J138226J078192Q81188
3867G2083789O58333Q50956N89737Q73489N40084L78253Q53455J444053J115001
$$ y = [17776442, 17829596, 17736927, 17855286, 18175784, 18487566, 19142646, 20058955, 20204017, 20629625, 20693637, 20455302, 20991787, 21730241, 21936506, 22236609, 22970489, 23190320, 23505144, 23948405, 24285846, 24529597, 24923801, 25564121, 26133630, 26365206, 26991536, 27677619, 28609617, 29263341, 29467374, 30007162, 31091959, 32536097, 33858251, 34940606, 35873418, 36819512, 38261343, 39495842, 40954035, 42715628, 44219960, 45926548, 47213049, 48199972, 49525875, 51087804, 52293540, 53827232, 55557304, 57183687, 58544059, 60436476, 61805033, 63549757, 65361742, 67093844, 68986183, 70124409, 71202601, 72083789, 72742122, 73593078, 74182815, 75056304, 75596388, 75974641, 76828096, 78272149, 79387150]
3858G9387150O03858R67958N30877O87765N46497Q65082M65853O98062N06479
3849H5259581L34141J65464J036606J528518Q79869J212526K283644J749650J547046
3840I5997045K323303K649161K298505K383092L297637L131826L720341M013092
3832A19814002M318443M334179M059661M949061M664579M920457N371038N197532
3824A57628952N354021N375245O037058O470780O648401P262347P043682O644006
3816B08464492O942651O615861N538314M412114N242375M858665M231717M794952
3808B51101141M825263N363971N604780N439413N512368N401964N520020M830503
3800B93599423M297235L753425K915627K866483J311841J557947J958427J583771
$$ y = [79387150, 79991008, 80958966, 81489843, 82177608, 82724105, 83589187, 84055040, 84753102, 85259581, 85593722, 85759186, 86795792, 88324310, 89204179, 90416705, 92700349, 94449999, 95997045, 98320348, 100969509, 103268014, 105651106, 108948743, 112080569, 115800910, 119814002, 124132445, 128466624, 132526285, 137475346, 142139925, 147060382, 152431420, 157628952, 162982973, 168358218, 174395276, 180866056, 187514457, 194776804, 201820486, 208464492, 215407143, 222023004, 227561318, 231973432, 237215807, 242074472, 246306189, 251101141, 255926404, 261290375, 266895155, 272334568, 277846936, 283248900, 288768920, 293599423, 297896658, 301650083, 304565710, 307432193, 308744034, 310301981, 312260408, 313844179]
3792C13844179J495208J065208J768490J022052J180539J109138J279393J500355
3784C24264562r1003M45525P88984R05915Q22790J035342J031755J950864K612202
3775C33766936L630900N234810O857562Q356254R896454J1556744J2643713J3647889
3767D05591262J4449823J4809665J4581120J3631306J2811068J0407928Q130515
3760D94412687O223414L893638J655595j136437m004333o328100p314501q093099
3752D79308864q549426q773180r807684j0581146j1706040j2120379j3212565
3745D04558444j6008992j8036334k0287233k2456349k3885086k3309528k2990272
3738B57584650k2223932k0073892j7446782j5213829j2778492j0674459r527136
$$ y = [313844179, 315339387, 316404595, 318173085, 319195137, 320375676, 321484814, 322764207, 324264562, 324173559, 324619084, 325408068, 326313983, 327136773, 328172115, 329203870, 331154734, 333766936, 337397836, 342632646, 349490208, 357846462, 367742916, 379299660, 391943373, 405591262, 420041085, 434850750, 449431870, 463063176, 475874244, 486282172, 494412687, 500636101, 504529739, 506185334, 505048897, 501044564, 494716464, 487401963, 479308864, 470759438, 461986258, 452178574, 441597428, 429891388, 417771009, 404558444, 388549452, 370513118, 350225885, 327769536, 303884450, 280574922, 257584650, 235360718, 215286826, 197840044, 182626215, 169847723, 159173264, 149646128]
3731A49646128q034982o797852n973491n082737m879756m253354m054674m176107
3723A06393175l816166l152342l133756k969595l176061l073609k745816k958064
3715H1367766l132850l087760k632616k528339j729495j837526k159166j708938
3707F2551076k580102k744480j971688j678820k398717j816850j315096j979719
3699D6065604j303356j433807j511726r02637j493206j147618j235489j060211
3691C5977554m58837k99220p43886j065885n35114p27330p61031o2695n06623
3682C0816933o99884j032148p75525r0686l96981q81653k30330l70394l23312
3673B6016020m40416P2338m39422o10354j05449q79649l1897p1770j93528l70160
$$ y = [149646128, 141611146, 134813294, 128839803, 123757066, 118877310, 114623956, 110569282, 106393175, 102577009, 99424667, 96290911, 93321316, 90145255, 87071646, 84325830, 81367766, 78234916, 75147156, 72514540, 69986201, 68256706, 66419180, 64260014, 62551076, 59970974, 57226494, 55254806, 53575986, 51177269, 49360419, 48045323, 46065604, 44762248, 43328441, 41816715, 40914078, 39420872, 38273254, 37037765, 35977554, 35518717, 35219497, 34475611, 33409726, 32874612, 32147282, 31386251, 31323556, 30816933, 30117049, 29084901, 28309376, 28218690, 27821709, 26940056, 26709726, 26339332, 26016020, 25575604, 25647942, 25208520, 24598166, 24492717, 23613068, 23581171, 23509401, 23315873, 22945713]
3663B2945713m54048J99218m12567n20802j89671l008k59127m04110K07646j84645
3653B0924599K21297o0095m93883o49877k8765j3573L8879j90308L83039K11360
3643B0342673n6560J99503n44316r3195L63451k84728p3189J26087K16363j15440
3633B0080649o543N03462L8537R2772j29749m33307L31709O77200K08279j78249
3623B1184760N14247P00172l35400k82525k62485J03971j29440N18091O47519
3614B2658910J00238K69007O08671l05429n6135N27061J55524K66009K3927J93104
3604B4440887l89314M26683M56406j17476K75424R57054O48283l4582K76712J09999
3594B7050076J22839J42392L2754M19518K5319L99566M81661r722n6773R71333
$$ y = [22945713, 22491665, 22690883, 22278316, 21757514, 21567843, 21564835, 21305708, 20901598, 21109244, 20924599, 21145896, 21085801, 20591918, 19942041, 19913276, 19899703, 19938582, 19748274, 20131313, 20342673, 20286113, 20485616, 19941300, 19848105, 20211556, 19926828, 19853639, 19979726, 20196089, 20080649, 20074106, 20577568, 20616105, 20708877, 20579128, 20145821, 20477530, 21154730, 21363009, 21184760, 21699007, 22399179, 22063779, 21781254, 21518769, 21622740, 21493300, 22011391, 22658910, 22759148, 23028155, 23636826, 23331397, 23275262, 23802323, 23957847, 24223856, 24247783, 24440887, 24051573, 24478256, 24934662, 24817186, 25092610, 26049664, 26697947, 26663365, 26940077, 27050076, 27172915, 27315307, 27348061, 27767579, 27792898, 28192464, 28674125, 28664403, 28607630, 29578963]
3584B9578963N93555o65833j9249J018339N43983K33022N48523m1861n18617j6699
3574C1254126M09843O53726N10717K17632l4080K02177Q24203P94203J28391J68491
3564C5129429O17344L55228K318J34184K32563O1439K61555O82368J09039M20330
3554C8005797J96680j24071J32955j2816P2952K46042Q73886N85617L65038K68970
3544D0611050j97153Q5924P10142l18612k11095N07040N70292L65522N11788K81035
3534D2915933J86742O19759j06448l47010o6803p5678P38521Q87159J71739N84858
3524D5508772K91100j12336O30085M49602K7213K93895R52578K10075L20078J146537
3514D9717599M05600Q23458Q04853L43848R15056M46056k04908m98250l19674
$$ y = [29578963, 30172518, 29506685, 29487436, 30505775, 31049758, 31282780, 31831303, 31789442, 31270825, 31254126, 31663969, 32317695, 32828412, 33046044, 33011964, 33214141, 34038344, 34832547, 34960938, 35129429, 35746773, 36102001, 36104319, 36238503, 36471066, 36532505, 36794060, 37476428, 37585467, 38005797, 38202477, 38078406, 38211361, 38198545, 38271497, 38517539, 39391425, 39977042, 40342080, 40611050, 40413897, 40499821, 41209963, 40891351, 40680256, 41187296, 41757588, 42123110, 42634898, 42915933, 43102675, 43722434, 43615986, 43268976, 43202173, 43126495, 43865016, 44752175, 44923914, 45508772, 45799872, 45687536, 46317621, 46767223, 46794436, 47088331, 48040909, 48250984, 48571062, 49717599, 50123199, 50946657, 51751510, 52095358, 53010414, 53456470, 53251562, 52753312, 52433638]
3505E2433638K64648O7700L27180J3800K36638P458O742M56389n3649j88237j84998
3494E3387309J01643n92864J87392j49313m89578o73222o00686m09806n20931
3485E0239944j50619k10444L88413O49251L47643N41543O66186J169117R47796
3476E4588830J075056J208651K092145J915784J513525J786953J877249J257002
3468F7315195R16233J560996J253344J858421J475042J245025Q80615N42633m83112
3459G6564392j024032j271097j889106j677926j490236k385006k112999j966886
3451F2747104k140243j567897n51536r88592j417011k40799L08589K11193P53194
3442E7114002O95251J262665J982725J811114K330229J521980L50645J853847
$$ y = [52433638, 52698286, 52765986, 53093166, 53106966, 53343604, 53351062, 53357804, 53814193, 53760544, 53572307, 53387309, 53488952, 52896088, 53083480, 52934167, 52444589, 51771367, 51170681, 50760875, 50239944, 50089325, 49878881, 50267294, 50916545, 51264188, 51805731, 52471917, 53641034, 54588830, 55663886, 56872537, 58964682, 60880466, 62393991, 64180944, 66058193, 67315195, 68231428, 69792424, 71045768, 72904189, 74379231, 75624256, 76504871, 77047504, 76564392, 75540360, 74269263, 72380157, 70702231, 69211995, 66826989, 64713990, 62747104, 60606861, 59038964, 58487428, 57498836, 56081825, 55841026, 56149615, 56360808, 57114002, 57809253, 59071918, 61054643, 62865757, 65195986, 66717966, 67068611, 68922458]
3434F8922458L327225M892527O936571J0247449J4270828J6057892J1857012p034617
3426A29477345j6552267j5330351j1406237p000300o716521n627882m631808l249098
3418E8962881k820052k152425k279466j502231p62460m85094k85664P79899R42836
3409E0398224J548852K778196L449021L353015M705424O295170R762226J3430330
3401I5720458J5703726P414487j1694612j7687635j6563930j2319710p241802
3394E3330982m269548l794942k722443j412499j601834k433826k670926j844071
3386C2580893j738730j166123q00523j284385j473159l29231l16151j085406k52708
3377B4134477q0295o41340l50587m89037K1155J9602O75618K60378L97697M40666
$$ y = [68922458, 72249683, 77142210, 84078781, 94326230, 108597058, 124654950, 136511962, 129477345, 112925078, 97594727, 86188490, 79188190, 72471669, 66843787, 62211979, 58962881, 56142829, 53990404, 51710938, 50208707, 49446247, 48961153, 48675489, 49455388, 50398224, 51947076, 54725272, 58174293, 61527308, 66232732, 72527902, 82290128, 95720458, 111424184, 118838671, 107144059, 89456424, 72892494, 60572784, 53330982, 49061434, 45266492, 42544049, 41131550, 39529716, 37095890, 34424964, 32580893, 30842163, 29676040, 28875517, 27591132, 26117973, 25788742, 25472591, 24387185, 24134477, 24054182, 23412842, 23062255, 22573218, 22594373, 22613975, 23289593, 23549971, 23947668, 24388334]
3367B4388334J003464N08172j580926j681235j269520j882960r71516m50936o81591
3358A7381286q50950k86651k69233k56932j98115l30233n33890L3115N07437P52657
3348A5948491p31972m13389K11407j52495K39188O57664J53046K36907J078005
3339A7226852J225400M79136o39822j370580j399304j297502j177767q94544l48887
3330A1802982j74500J65250j72602n99953m91642J20299M3528m94823J3305l1900
3320A0179944l24661l32905N03665l08820p88749K86852K28291n06897n85366
3311H351354k62846M3026l29349R65875K90195o30385j40771K55737m16203o37645
3301G488988O79392q4592l18640L43751m6722k37596k15279k69154k35367o2589
$$ y = [24388334, 25391798, 25899970, 24319044, 22637809, 21368289, 19485329, 18513813, 18062877, 17381286, 16530336, 16243685, 15974452, 15717520, 15519405, 15189172, 14655282, 14688397, 15195834, 15948491, 15216519, 14803130, 15014537, 14862042, 15101230, 15758894, 15911940, 16148847, 17226852, 18452252, 18931388, 18291566, 16920986, 15521682, 14224180, 13046413, 12151869, 11802982, 11628482, 11793732, 11621130, 11021177, 10529535, 10649834, 10693362, 10198539, 10211844, 10179944, 9855283, 9522378, 10026043, 9717223, 8928474, 9215326, 9443617, 8936720, 8351354, 8088508, 8131534, 7802185, 8768060, 9058255, 8427870, 8287099, 8542836, 8126633, 7488988, 8168380, 8083788, 7765148, 8108899, 8062177, 7824581, 7609302, 7340148, 7104781, 7042192]
3291G042192p9203K97343k58268k4853N51370P4175n55820m6928K02498o81142
3281F521364j86615P1617M258L52011K38021l57350l92421N19235k35438k77414
3271F257268K58755R0225n38856j9898M34915K64626j95885l09719m34492J91166
3261E998105Q9986k72310M39504J18692j81950l91006p8103M01631J51033m333
3251F271249l79934J6749m61037K5979J82440J83772n1008p4657l23205k90115
3241E100233j8577N3435J57904j19021J30782M43681n1232j99073M9551J55399
3231E703082p8240l81054j24106R4547J96981k29657l1191M44889J43337j51781
3221E586807J21632N6705j38999o9085M74186j1249k71632J03843N55229j30866
$$ y = [7042192, 6962989, 7260332, 7002064, 6977211, 7528581, 7602756, 7046936, 7000008, 7202506, 6521364, 6334749, 6406366, 6410624, 6762635, 7000656, 6643306, 6250885, 6770120, 6534682, 6257268, 6516023, 6606248, 6067392, 6047494, 6482409, 6747035, 6551150, 6241431, 5806939, 5998105, 6088091, 5815781, 6255285, 6373977, 6192027, 5801021, 5722918, 6124549, 6275582, 6271249, 5891315, 5908064, 5447027, 5473006, 5655446, 5839218, 5788210, 5713553, 5390348, 5100233, 5081656, 5135091, 5292995, 5173974, 5304756, 5748437, 5697205, 5498132, 5547683, 5703082, 5624842, 5243788, 5119682, 5214229, 5411210, 5181553, 5150362, 5595251, 5738588, 5586807, 5708439, 5765144, 5626145, 5557060, 6031246, 6019997, 5748365, 5852208, 6407437, 6276571]
3211F276571M10413j96928K26666j18568q367k30301k36670M54896j61085P9009
3201F495636n13978K78399P70099k37479K56532j5747k47188Q8993J05563J53892
3191G134722j89401j00870j13637K70970K67019L4708n13191k39655k9823L22558
3181F843400N4162M39550O25210L35258M85199M39240k13523l16856J68721m0461
3171H819900k45299Q0484J80244K15762N8474j38461O28282K9189K35465r4103
3161I769937j88381P5033J92579l7052O8613N70177Q6094J10680O15385k62839
3151A1000226o8325N08455M41229m32667L37275N60822l49451l39925L8865n0847
3141A1645657L27171L01838k15181K3756K88190P8991J48117L61237j28749N40221
$$ y = [6276571, 6686984, 6490056, 6716722, 6598154, 6589787, 6359486, 6122816, 6577712, 6416627, 6495636, 5981658, 6260057, 7030156, 6792677, 7049209, 7033462, 6786274, 6875267, 6980830, 7134722, 6945321, 6844451, 6730814, 7001784, 7268803, 7303511, 6790320, 6550665, 6520842, 6843400, 6897562, 7337112, 7962322, 8297580, 8782779, 9222019, 9008496, 8691640, 8860361, 8819900, 8574601, 8655085, 8835329, 9051091, 9109565, 8971104, 9599386, 9628575, 9864040, 9769937, 9581556, 9656589, 9849168, 9812116, 9880729, 10450906, 10537000, 10647680, 11263065, 11000226, 10931901, 11440356, 11881585, 11448918, 11786193, 12347015, 11997564, 11657639, 11696504, 11645657, 11972828, 12274666, 12059485, 12083241, 12371431, 12450422, 12598539, 12959776, 12831027, 13371248]
3131A3371248P82967K05340J36510M20581M54503M18192O32571J28811J64547
3122A6715270N06350J73549k81153k42176q96148m45297p30920o75479M2433n46397
3112A3620032k61809r8648K90384m3482K15940K64037O7546L02303M50410L63241
3102A5169954K32622j68728L31356K58942M58991N21651L65953P1541j89299o11655
3092A6441328p74223k41036N3930n96407q85234m54240n61399n91604k5246m28653
3082A1937216n09959J65410m9421m46991o311L52918j72092K10370l55295l48225
3072A0777620P6916O57416j66659j70009l11262o35455l10343p33550k55311n51493
3062H377870K98919k85724k59578o82827q01247n1766l89580j37521K3836J67460
$$ y = [13371248, 14154215, 14359555, 14496065, 14916646, 15371149, 15789341, 16421912, 16550723, 16715270, 17221620, 17395169, 17114016, 16871840, 15975692, 15530395, 14799475, 14123996, 14166429, 13620032, 13358223, 13259575, 13549959, 13506477, 13722417, 13986454, 14054000, 14356303, 14806713, 15169954, 15402576, 15233848, 15565204, 15824146, 16283137, 16804788, 17170741, 17242282, 17052983, 16441328, 15667105, 15426069, 15479999, 14883592, 13998358, 13544118, 12982719, 12391115, 12365869, 11937216, 11427257, 11592667, 11543246, 11096255, 11089944, 11442862, 11270770, 11481140, 11125845, 10777620, 10854536, 11511952, 11345293, 11175284, 10864022, 10228567, 9918224, 9184674, 8929363, 8377870, 8676789, 8391065, 8131487, 7448660, 6647413, 6595647, 6206067, 6068546, 6092382, 6259842]
3052F259842M08237k52835m16747j29274k2135l48338R2404K00673j51090m33516
3042E207221J79156O5959k23j53312l85862j58636k23266l21541j65748N9414
3032D103162l47711J61818j59768n59161k49339J73881J35812J02087k17345o229
3022C137207K080J15396n69551j53216L79821L14768j53411n86004k94913p25192
3012A466985K52706M69806p8557L11382r3662n30478K30800Q1628o7056j19148
3002A924406K91812k7721k75212l50016P2603K46034J65592k72789k42490L3597
2992A565816J90477j76010l01890L25276j93921m49853n15480J39475L11728l83170
2982E12448N36957L84050N4704K26706l14275j9506K2857P91918n53040o48573
$$ y = [6259842, 6668079, 6415244, 5998497, 5869223, 5847088, 5498750, 5591154, 5791827, 5640737, 5207221, 5386377, 5452336, 5452113, 5298801, 4912939, 4754303, 4531037, 4209496, 4043748, 4103162, 3755451, 3917269, 3757501, 3198340, 2949001, 3122882, 3258694, 3360781, 3143436, 3137207, 3139287, 3254683, 2685132, 2531916, 2911737, 3226505, 3073094, 2487090, 2192177, 1466985, 1719691, 2189497, 2110940, 2422322, 2328660, 1798182, 2028982, 2110610, 2043554, 1924406, 2216218, 2188497, 1913285, 1563269, 1635872, 1881906, 2047498, 1774709, 1532219, 1565816, 1756293, 1580283, 1278393, 1603669, 1409748, 959895, 444415, 583890, 895618, 512448, 1049405, 1433455, 1488159, 1714865, 1400590, 1381084, 1403941, 2195859, 1642819, 994246]
2972I94246P3864J38557K08855j18636J2768k6627n50505M248j21169M60602M9939
2961A126142o866J0313n40379J36781j87852J55186J90957j37791M25661k8649
2951A143503L02397J451l881q2355n81274J91199K56963j21221L3208K9975k89132
2940H80833j88511J02767J81196k04417L91658M24221O7284k52748m61106k38790
2930G02387N8217M33514L57774k49347Q4775M8678P6367k14288q2992l08399k10429
2919F96257J55370k45981l1659O75615J88543j63995k65017L702j38114l76712
2909D98009J42922K21373O91051l69858k64364N77889j08500m91534j21188J88121
2899I63921M13622K6792j48092m62907m8276j0105J5285k44344j57814K69076
$$ y = [994246, 1068110, 1206667, 1415522, 1296886, 1309654, 1283027, 732522, 736770, 615601, 1076203, 1126142, 1119276, 1129589, 589210, 725991, 538139, 693325, 884282, 746491, 1172152, 1143503, 1445900, 1447351, 1443470, 1361115, 779841, 971040, 1228003, 1106782, 1139990, 1169965, 880833, 692322, 795089, 976285, 771868, 1163526, 1587747, 1655031, 1402283, 941177, 702387, 760604, 1194118, 1551892, 1302545, 1387320, 1435998, 1512365, 1298077, 1215085, 906686, 696257, 851627, 605646, 573987, 1249602, 1438145, 1274150, 1009133, 1012835, 874721, 498009, 640931, 862304, 1553355, 1183497, 919133, 1497022, 1388522, 896988, 775800, 963921, 1377543, 1404335, 1256243, 793336, 745060, 734955, 750240, 505896, 348082, 617158]
2889F17158J60140j13137Q4041L68202j6644n08028j68050J87320J22990J89243
2879I23235l3953j45351J55421m92478k39135K47638m1195j72888N2575N33162
2869G87031J72025J04245k80422P6718m22741m40763j08777J02546K90689K15678
2859D96229p7225j16793M55437q7822j83147r4578L24331j78800p62101M4409
2849a80060K8231J95405K10997j96173l20009J09660L55644k06646p7131P66180
2839F86098O1220l34014j62179L00134J66669j74030m710m71218L5158j43781
2829d0653K41784L46256k29631M0672m92670o11898M8681J041729L99860j6907
2819G27223L34564l35715p34695l00653m2543j98614N16026M59164K32301n2968
$$ y = [617158, 777298, 664161, 748202, 1116404, 1099760, 591732, 423682, 611002, 733992, 923235, 889282, 743931, 899352, 406874, 167739, 415377, 374182, 201294, 253869, 787031, 959056, 1063301, 782879, 859597, 436856, -3907, -112684, -10138, 280551, 496229, 419004, 302211, 757648, 669826, 486679, 392101, 716432, 537632, -224469, -180060, -151829, 43576, 254573, 58400, -261609, -151949, 203695, -2951, -80082, 686098, 747318, 413304, 251125, 551259, 717928, 543898, 539188, 67970, 103128, -40653, 201131, 547387, 317756, 358428, -134242, -746140, -697459, 344270, 744130, 727223, 1061787, 726072, -8623, -309276, -351819, -550433, -34407, 424757, 657058, 604090]
2809F04090r8623j21358p25731P9728m46787l9185L36340Q28319k8792n08862
2799a20861L25562K67689l41041o49631M54226L45481j90789J46956l16999k17467
2789b96874J6101O76929R1819j75194K34363m05637r4064j66675K70164j39595
2779A1337K96104M28328j08072J16179p28557p8129k30583j73040K61890P57956
2769E53413R95240j82037n04473n35138r0506j18009j11448J72106O15648k26939
2759E67857n26631K19897J06467J75520N9562K50481r9395Q566K46537q90432
2749A18429k25459J31625J18988K97922K19311j21301m04706k07367l25639N07713
2739A09516M86589l60535q6085q8963J3606Q4607L26663j95885m38680p57N26571
$$ y = [604090, 505467, 384109, -341622, -261894, -708681, -747866, -411526, 416793, 388001, -120861, 204701, 472390, 131349, -518282, -64056, 281425, 90636, 237592, -79407, -296874, -280773, 396156, 487975, 312781, 547144, 141507, 47443, -119232, 150932, 11337, 307441, 735769, 627697, 743876, 15319, -62810, -293393, -466433, -204543, 553413, 1548653, 1366616, 862143, 327005, 236499, 118490, 7042, 179148, 794796, 567857, 41226, 261123, 367590, 543110, 602672, 853153, 753758, 762324, 1008861, 118429, -107030, 24595, 143583, 441505, 660816, 539515, 134809, -72558, -398197, 109516, 596105, 235570, 149485, 60522, 74128, 158735, 485398, 289513, -149167, -149924, 376647]
2728C76647L52392m84423l82531j52954L15373L88409J41532k43928k66491L45243
2718C89269j93726o6266o7743J03221k11040l93199L49961M9343J86206K07188
2708C53214j54099j13889j12229J0241o64472K39621K19282L96988k83963k84493
2698c93799L11333j74031l66186k61027k4708L78190N12599l5588k21120K15722
2688e8615l1363j56626j42769J21613P5625k63026R2j25089K80024j34031k97287
2677g31452m20257K19413M55623L96307K9478J42330J28652K36426k68077l42709
2667a54266l54113l1376J13804j4846J50440K13471K88555L56215q127r67824
2657d08067J3578K08749L76j15981R4685J35906P69032J83760o35772j7781K66071
$$ y = [376647, 729039, 244616, -137915, -290869, 24504, 412913, 554445, 310517, 44026, 389269, 195543, 129277, 61534, 164755, -46285, -439484, -89523, -40180, 146026, 353214, 199115, 85226, -27003, -16762, -681234, -441613, -222331, 174657, -109306, -393799, -82466, -256497, -622683, -883710, -908418, -530228, -17629, -53217, -274337, -58615, -89978, -246604, -389373, -267760, -192135, -455161, -455069, -580158, -300134, -434165, -731452, -1151709, -932296, -476673, -80366, -50888, 91442, 220094, 456520, 188443, -154266, -508379, -539755, -425951, -440797, -290357, -76886, 211669, 567884, 559757, -408067, -394489, -185740, -185364, -301345, -206660, -70754, 698278, 882038, 246266, 228485, 494556]
2646D94556k73861k61285m04344J63598J59765j84839j01093K92728P06272n35952
2636E5545j62051L9559N4964j62109l62129K50780L12690k17843m64738j53095
2626h08427Q61222M22349J3208m07371n7761l7331r6762m87125K13593L40712
2616d3693L06735J67187m46138k3152O21714j44806j140200p7090N16147R6153
2606a67143M47462J93263j12141P6328Q7461j80273m97104Q2661J07864K04133
2596B42511N4949K1154m710k30206K98984n7725j6794j42587j43788j07121J17366
2585C2033L41857j90138r618l36800j99910N40817J53724j65441r3155j23023
2575d9654l92183J63970j55681M32394M35145r1713m26654n25781j40343J11758
$$ y = [494556, 220695, -40590, -444934, -281336, -121571, -306410, -407503, -114775, 591497, 55545, -106506, -66947, -11983, -174092, -536221, -285441, 27249, -190594, -655332, -808427, 52795, 475144, 488352, 80981, 23220, -14111, -110873, -597998, -384405, -43693, 263042, 430229, -15909, -39061, 582653, 437847, -702353, -779443, -263296, -167143, 280319, 473582, 361441, 437769, 525230, 344957, -152147, -69486, 38378, 242511, 297460, 318614, 313904, 83698, 382682, 324957, 308163, 165576, 21788, -85333, 32033, 373890, 183752, 174134, -162666, -362576, 178241, 331965, 166524, 73369, -49654, -441837, -277867, -433548, -1154, 433991, 342278, -84376, -610157, -750500, -638742]
2565f38742R18991k14004j46704J33802J56208k43581R7631N66497l26473O508
2555C10133k21425n73215M7219M76507L0400l42165M80552J80040J18873l934
2545E02985J96423k17110j011434n02349K36346M72510k6648J27059L82541J17221
2535B77544r9598N4993N1726p2169l4006m28938N83932k99559l16122m7459n1511
2524c81167J92000L42495K25549l32503m3236l42045k26707M95352O049N0008
2514a4205L00977K04220j65121j91628Q149J8142m27283j93818P33989K55722
2504E29144k81354K53561J03775j62355q1096J05396l41757l38657j23689k9148
2494c66180K78274M35143N67252o17737j92258L75838j55404j77589K47448L08216
$$ y = [-638742, 280249, 66245, -80459, 53343, 209551, -34030, 63601, 630098, 303625, 310133, 88708, -484507, -437288, 39219, 69619, -272546, 208006, 388046, 506919, 502985, 699408, 482298, -529136, -1031485, -795139, -322629, -349277, -222218, 160323, 277544, 177946, 232939, 284665, 212496, 178490, -250448, 333484, 33925, -282197, -329656, -381167, -189167, 153328, 378877, 46374, 3138, -338907, -565614, -70262, -64213, -14205, 286772, 490992, 325871, 134243, 142392, 160534, -266749, -460567, 273422, 529144, 247790, 501351, 605126, 442771, 361675, 467071, 125314, -213343, -337032, -366180, -87906, 347237, 914489, 296752, 104494, 480332, 324928, 147339, 394787, 703003]
2484G03003m64079m5274J05018K35301J05901m09662k48598J10084K96641K2481
2474D10816j50359l49807k44497J9589J03940K26256K39580K39648l26845q9821
2464G8500J90487J33480J41443l74898j4482m80626j22233J39187K32728M51897
2454C75483M9048l09834k06134k62059J77028K4706r0693N43240R20714K1833
2444A243332n48446j68690J7740n84925O536J87646N02607N75584l67202O612
2434H70794p0377j00874j41109J78899N09739J15057P9700l52434j96302L28074
2424A221167q5463j4448J59646J80022k7999l35585N47641K14993J84251r1456
2414A952769j39485p25195m7630N34147j26542K0524O19579n6010l80457j34320
$$ y = [703003, 238924, 193650, 298668, 533969, 639870, 230208, -18390, 91694, 388335, 410816, 260457, -89350, -333847, -314258, -210318, 15938, 255518, 495166, 168321, 78500, 268987, 402467, 543910, 169012, 154530, -326096, -448329, -309142, -76414, 375483, 424531, 114697, -91437, -353496, -176468, -151762, -242455, 300785, 1221499, 1243332, 694886, 526196, 543936, -40989, -34453, 153193, 655800, 1231384, 864182, 870794, 800417, 699543, 558434, 737333, 1247072, 1362129, 1441829, 1089395, 893093, 1221167, 1135704, 1121256, 1280902, 1460924, 1432925, 1097340, 1644981, 1859974, 2044225, 1952769, 1813284, 1088089, 1040459, 1574606, 1448064, 1468588, 2088167, 2032157, 1651700, 1517380]
2404A517380K37439l16067P4701N87044n3392p3857j24591K94108K68028K55245
2394B666038n04522p16496Q3993L48391j94151J54691N513M05858J34217Q0852
2384B464384l9794M25203k75632m92450P30003K82625q2837l22200r1034K9464
2374B627732K02764Q2851k61899O36586L77073n4549j79296L6732M01370K80069
2364D149433L801j32947k1292K40850K05829N9392M78778j8737L69105m67939
2354D866273n07117L22257J37386M46871K03753J167834k64098K22980O646J26253
2344F729038O75599P09277N55039J154845J359358M93510j6284Q10525R60180
2335A3431087J053756J139343J513444K844446M336653M183619N948234P095472
$$ y = [1517380, 1754819, 1438752, 1513453, 2100497, 2047105, 1973248, 1848657, 2142765, 2410793, 2666038, 2161516, 1445020, 1529013, 1877404, 1683253, 1837944, 1843457, 2249315, 2383532, 2464384, 2424590, 2849793, 2574161, 2081711, 2811714, 3094339, 3011502, 2689302, 2598268, 2627732, 2830496, 2913347, 2651448, 3288034, 3665107, 3610558, 3431262, 3467994, 3869364, 4149433, 4153234, 4020287, 3998995, 4239845, 4445674, 4505066, 4983844, 4965107, 5334212, 4866273, 4359156, 4681413, 4818799, 5265670, 5469423, 6637257, 6373159, 6596139, 6602785, 6729038, 7404637, 8113914, 8668953, 9823798, 11183156, 11676666, 11660382, 12470907, 13431087, 14484843, 15624186, 17137630, 19982076, 24318729, 28502348, 34450582, 41546054]
2327D1546054J0435306J4608020J6263783M350776j4236769j6045192j5203743
2320D1718235r703070o073954m734798l192179k162718k005335j503449j244502
2312A1098230J51890n96670p95413p49249p19009p95372p22402k06674n76546
2303F088785j62495k90822n18591n39904J92256m13597O4377l01682l64878l238
2293C750211j16225m30283m48730N019m72203k86037P7893J83096N39504m5352
2283B756893m43390n68730J30753j03829n14870J93742P07731J52799n69929m05033
2273A336137l18748r498n018K65884J06620L5720j7596m97254j98892N63399M3032
2262A303786j95036k1263m39033M1190J7663K83155m98180l758K15234j84969
$$ y = [41546054, 51981360, 66589380, 82853163, 87203939, 72967170, 56921978, 41718235, 32015165, 25941211, 21206413, 18014234, 15851516, 13846181, 12342732, 11098230, 11250120, 10653450, 9858037, 9108788, 8389779, 7594407, 6872005, 6665331, 6088785, 5926290, 5635468, 5116877, 4576973, 4769229, 4355632, 4420009, 4118327, 3753449, 3750211, 3633986, 3203703, 2754973, 2759992, 2287789, 2001752, 2079645, 2262741, 2802245, 2756893, 2313503, 1744773, 1875526, 1771697, 1256827, 1450569, 2158300, 2311099, 1741170, 1336137, 1017389, 1007891, 1002873, 1268757, 1375377, 1411097, 1393501, 896247, 697355, 1260754, 1303786, 1108750, 1087487, 648454, 689644, 707307, 990462, 492282, 488524, 703758, 518789]
2252E18789k11919j99216L94703N55558K00562n56472l22761M08664o87364m13037
2242c12493K47008J24949M76452J19024o62147J70476N57165L8397m80060l87115
2232a08344J22771L23680M43608K00685n44293l14783J18260K67918l62043j60304
2222a2845P33512m76293j26862J35431K37372j63637K99187J17569m68988K14810
2212D89256l90304j20859l83099O6177L28585N7507K62880j97156q6886k41499
2202b15398J91706K14108j81887J23716l53061j57588K13513K75219K20361J36976
2192D67665k7429k82262K8432m28346j15330J40343K99944J4151j87000O2174
2182b7658j86467J14544k49253l08171J43504J02768L99323k29237N28432r3092
$$ y = [518789, 306870, 107654, 502357, 1057915, 1258477, 702005, 379244, 787908, 100544, -312493, -65485, 59464, 535916, 654940, -7207, 163269, 720434, 758831, 278771, -108344, 14427, 338107, 781715, 982400, 438107, 123324, 241584, 509502, 147459, -12845, 720667, 244374, 117512, 252943, 490315, 326678, 625865, 743434, 274446, 489256, 98952, -21907, -405006, -338829, -10244, 47263, 310143, 112987, 26101, -215398, -23692, 190416, 8529, 132245, -220816, -378404, -164891, 110328, 330689, 467665, 440236, 157974, 186406, -241940, -357270, -216927, 83017, 97168, -89832, -27658, -214125, -99581, -348834, -657005, -513501, -410733, -11410, -240647, 287785, 194693]
2172A94693J56268n71051m86894J50819k35527M11870K40501N45117m53102r3593
2162a40899k92067l39098N30651L35032l56385J82432L63582l99148k17847K94960
2152c8787q1762p0683J2842L83767P8863k48387K15586r7955L0357l35891j54379
2141c06429M08M8938K62231k58075j03784Q3282M9290J84611L30164N6401m87298
2130a40261L85631m0382J4470n5404l626k36333k12518L37189m10397p7385r9817
2119e38833M56250M41931J39649K12937j94638j34292k61650K80147j03253k26555
2109G1693L78980j21287J33015m78562m13856l2963J46472M41131k84562J4589
2099a45350L5818J07221K69791l14710J45627n6323L31297o6188m62210j40125
$$ y = [194693, 350961, -220090, -706984, -556165, -791692, -379822, -139321, 405796, -47306, -140899, -432966, -772064, -241413, 93619, -262766, -80334, 283248, -115900, -333747, -38787, -120549, -191232, -178390, 205377, 284240, 35853, 251439, 153484, 183841, -152050, -306429, -306021, -257083, 5148, -252927, -356711, -273429, -224139, -39528, 290636, 347037, -140261, 245370, 204988, 219458, 164054, 160428, -75905, -288423, 48766, -361631, -439016, -538833, -82583, 359348, 498997, 711934, 517296, 383004, 121354, 401501, 298248, 71693, 450673, 329386, 462401, -16161, -430017, -462980, -316508, 124623, -159939, -145350, -109532, -2311, 267480, -47230, 98397, 42074, 373371, 307183, -155027, -295152]
2089b95152j99027J52645R3053L40789j16575q5385J43979r2072j89203P6949
2079a69999j61938p7414M32510K86506J1415k8656r1440M9740N065j19356l64190
2068b27757L24779K07989l4121Q8825O2584L87160p5452o05049n78566M36327
2058a3281p0503j29560M73152K70817J23770P1600m41438l42893N4043L88313
2048C84020M7761L26041k81242j42424K91879L38176k88224j78529l954k53480
2038B40024r8145p3717R2205j85126K09303l68366O7434J81699l14768J30784
2028a18673K46283J40908k45117k07315K55086l7423m54473j58600M35385J76873
2018C2934L58372J06214m95647m20984K92627k11044k0434L90227j76301k02621
$$ y = [-295152, -494179, -341534, -248481, 92308, -24267, -109652, 34327, -57745, -246948, -169999, -331937, -409351, 23159, 309665, 321080, 292424, 200984, 250724, 255789, 136433, -227757, 97022, 305011, 270890, 359715, 422299, 809459, 734007, 128958, -449608, -13281, -83784, -213344, 259808, 530625, 654395, 725995, 284557, -58336, -4293, 384020, 431781, 757822, 476580, 334156, 626035, 964211, 675987, 497458, 493504, 240024, 141879, 68162, 160367, -24759, 184544, -183822, -116388, 65311, -249457, -118673, 127610, 268518, 23401, -183914, 71172, 33749, -420724, -579324, -143939, 32934, 391306, 497520, 1873, -419111, -126484, -337528, -357962, 32265, -144036, -346657]
2008c46657Q1195M40699p5140P38976n7907q05422l09098L40966L33986k86436
1998E5162J01415K34693l510j96508J16233k88972j60401K53162j30606n1777
1988g1109j11937O0776K07394K05020J4195m06089l60178J98505j85542n38179
1978i87144O85878O35993r4134j1216K71843o15857k62689p1010J45529M67113
1968A64306p7952l74150J79102L52374j84337R6038M00146j5181n00748j40872
1958a01274k76989M42238p0605j83236O2919K41429J26595m75263L81381K92077
1948D39272r1030n88476K32745J61839m6841K09456o5652o8572k75395K00438
1938A07784j30042k98915O56868N7566l51795l32931J25535n95457J64310N14484
$$ y = [-346657, -265462, 175237, 100097, 839073, 781166, -24256, -333354, 7612, 341598, 55162, 156577, 391270, 387760, 191252, 307485, 18513, -141888, 111274, -19332, -71109, -183046, -122270, 85124, 290144, 304339, -101750, -461928, -263423, -448965, -987144, -301266, 334727, 240593, 229377, 501220, -114637, -377326, -448336, -302807, 164306, 86354, -287796, -108694, 243680, 59343, 155381, 555527, 540346, 39598, -101274, -378263, 63975, -6630, -189866, -126947, 114482, 241077, -234186, 147195, 439272, 348242, -240234, -7489, 154350, 107509, 316965, 251313, 182741, -92654, 107784, -22258, -321173, 335695, 393261, 41466, -291465, -165930, -761387, -597077, -82593]
1928h2593J27171J94153K953l66200m32849K63744l21089K72016M71639O1430
1918A90375j08511m91837r9786l0870L24645o5284K00886M21887n12374O9418
1908a01451L8027J10421j94168k60475M39345K96369j94125K5809p3700J41820
1898B27872k97831o6523j68860J31122J10531L92491O6154J15355j57895k07041
1888A45375k52791n4959L35908k91304J67989o66419q6654O1198N23596M16511
1878B98450j82840m5745j80376k13362j73867n6530K38748k8116k60177K28030
1868c75785J56789J29159j4407l92278L56895J52632J59631l99860j52895K52774
1858a27345P2274M54238k63846L63793m3163o2244j296Q1602q0911j43812k30730
$$ y = [-82593, 44578, 238731, 241684, -124516, -557365, -293621, -614710, -342694, 128945, 190375, 81864, -409973, -509759, -540629, -215984, -281268, -80382, 341505, -170869, -101451, -63424, 46997, -147171, -407646, 31699, 328068, 133943, 159752, 86052, 227872, -69959, -136482, -305342, -174220, -63689, 328802, 394956, 510311, 352416, 145375, -107416, -162375, 173533, -117771, 50218, -616201, -702855, -641657, -118061, 298450, 115610, 69865, -110511, -323873, -497740, -554270, -315522, -343638, -603815, -375785, -218996, -89837, -104244, -496522, -139627, 13005, 172636, -227224, -380119, -127345, -55071, 399167, 135321, 499114, 455951, 393707, 392411, 474013, 393102, 249290, 18560]
1847A8560M44109m0199o7719m6046k04781K4880k97023P9412o1050R64838M9765
1836H64746n38287Q2124J71229k68428l01171L48207j23123k18083K53469k73696
1826c013L10728N68841o69056q42575O71305L78780j80043k42527P7997k37803
1816a67366j62771K03980k1989K39901j32380k94575j09473Q05467n2181j4145
1806B94468K23611M7041n35510R1849l99152k81782N18257M11314l21550l41306
1796b92760L14241m58516N6194l5656K297J29455K51602L23937K65264p7229o54228
1785a75399k31722L54929J19306p4858m61450O1302L35824j14537n4270p2900
1775c13775k57655L0582l38604K0116L36391M36508J99202l14366j66100k61619
$$ y = [18560, 462669, 422470, 354751, 308705, 103924, 128804, -168219, -88807, -149857, 814981, 864746, 326459, 408583, 579812, 311384, 10213, 358420, 235297, 17214, 270683, -3013, 307715, 876556, 207500, -635075, 36230, 415010, 234967, -7560, 70437, -167366, -330137, -126157, -148146, 91755, -40625, -335200, -444673, 360794, 308613, 294468, 518079, 565120, 29610, 121459, -277693, -559475, -41218, 370096, 48546, -292760, 21481, -437035, -380841, -416497, -414200, -284745, -33143, 290794, 556058, 478829, -175399, -407121, -52192, 67114, -7744, -469194, -407892, -72068, -186605, -240875, -313775, -571430, -540848, -879452, -859336, -522945, -86437, 112765, -201601, -367701, -629320]
1765f29320K2167N5329j81451N16004N79760m70976p4791J59019j47330l39796
1755e11385K25692l48897o9278N23742l58542j90010K16251N64107l19329R2473
1745a75176P66086j40813m25642N5537j92467k03574l86283R4365P87682J50494
1735C30209j088l31593l76978J8108j1756Q2108p2496M22675J33183l2953K9978
1724A89397j00631k61626O6241O2665J49524M07872P4094l074k87141j30218j17593
1713D9510j56169l11749K63676M22668o0593K96585j41636l19119N2961J65755
1703B61889J77477l16049N8315L61123M15250n95204l26327N3390m3116J88475
1693B35223L6223M17663R0768J48602J15829j94212j22626l0651l19499k64330
$$ y = [-629320, -607153, -551824, -733275, -217271, 362489, -108487, -183278, -24259, -171589, -511385, -285693, -634590, -703868, -180126, -538668, -728678, -512427, 51680, -267649, -175176, 590910, 450097, 24455, 79992, -112475, -316049, -702332, -607967, 179715, 330209, 329121, -2472, -379450, -361342, -373098, -290990, -363486, 59189, 192372, 159419, 189397, 88766, -172860, -106619, -43954, 105570, 513442, 587536, 584462, 297321, 167103, 49510, -106659, -418408, -154732, 267936, 207343, 503928, 362292, 43173, 96134, 261889, 439366, 123317, 181632, 542755, 958005, 362801, 36474, 89864, 46748, 235223, 271446, 689109, 779877, 928479, 1044308, 850096, 727470, 696819, 377320, 112990]
1683A12990L54183K88930m13409m63445O91166K85410q7553O0450k56192j90199
1673C82331J28366K73794p10841k69205K46101J40746L09038k74040k30430J20197
1663A16057N69661m47900o86444M62431L03172j87420L20680j89796J90871K49609
1653G00921j014765l78203N28847M1697k89232K49616O71577j3085J69757k38987
1643D28143n01537l30059m91569N35986L01952J82721q4274p4824l04996j12433
1633d50890M20574J83954j80572m09389l14682M1214K55503K86012L19898m82656
1623c31034o14176M83058r121J39506j54340P6655K33609M40623R6794n67584
1613b06010J28324k61754R3338J11680k69928k27316L98364K21003K86702r0166
$$ y = [112990, 467173, 756103, 342694, -120751, 570415, 855825, 768272, 828722, 572530, 382331, 510697, 784491, 73650, -195555, 50546, 191292, 500330, 226290, -4140, 116057, 685718, 237818, -448626, 13805, 316977, 129557, 450237, 260441, 451312, 700921, -313844, -692047, -163200, -121503, -410735, -161119, 510458, 497373, 667130, 428143, -73394, -403453, -895022, -359036, -57084, 125637, 41363, -33461, -338457, -450890, -30316, 153638, -26934, -436323, -751005, -709791, -454288, -168276, 151622, -331034, -945210, -462152, -471273, -331767, -486107, -409452, -175843, 264780, 361574, -206010, -77686, -339440, -246102, -134422, -404350, -631666, -233302, -12299, 274403, 184237]
1603A84237m15827l08359L47115L54282k62202j81354K98847J55517k00419p954
1593c6117K9892j16890N9911J26774K5049P2121L3778j2368L7268n7916n32972
1582c71470l43078K91909K31935N3986L71837J44354j92574l24246K11886k01097
1572a26558J880J37241j00650K6577J15503m84891j93213M27781l6893K5472L40674
1561A32923k68592m21766K09181l9096L28387J22764k77906K67674r4281m48636
1551d89348l32122M00887k84767R0508J72811m68042N52493L15261O1334q0436
1541f1421K0019l40955j42685R6357j83306l5239k32957K50867L86234J64289
1531g8797k83814k37732m0802m01127J85652K65075K74379M22197j70827m01048
$$ y = [184237, -231590, -539949, -192834, 161448, -100754, -282108, 16739, 172256, -28163, -36117, -6225, -123115, -63204, 63570, 88619, 160740, 194518, 182150, 219418, 161502, -371470, -714548, -422639, -190704, -136718, 235119, 379473, 186899, -137347, 74539, -126558, -124678, 12563, -88087, -61510, 53993, -430898, -624111, -196330, -233223, -207751, 132923, -135669, -557435, -348254, -387350, -58963, 63801, -214105, 53569, -40712, -489348, -821470, -420583, -705350, -614842, -442031, -910073, -357580, -42319, 19015, -61421, -41402, -382357, -525042, -428685, -611991, -647230, -880187, -629320, -243086, -78797, -362611, -600343, -641145, -1042272, -856620, -591545, -317166, 105031, -65796, -466844]
1521d66844o1103N52477l14737L58489J22563n13547j25931j71866L89423R6125
1511a34951L09269N7022k20799k92156K19764K48966j22043J04491k22351m15134
1501d67922j33370N24412J97415l48216J77092L92667O95183n37084o06724j99320
1491c05867O6561K5004j01145K65901M2732M1728L64686m67497k14834l16595
1481e99326m65697L4482Q08141L51153l9320j7897m33281j47908M65975M05476
1471C61798j59022j5544k57242k4462j53064j96431K76944J95617K7514l8536
1461A7572O9855J78642j82528k3382l76334P3582M6795L21089M8926K99648N3554
1450E27419k18968M8341J30947l48279k84548M47866P4844k80590p0550K64924
$$ y = [-466844, -527947, 24530, -290207, 68282, 190845, -322702, -448633, -620499, -231076, -134951, 174318, 231340, 10541, -281615, -61851, 187115, 65072, 169563, -52788, -467922, -601292, -76880, 120535, -227681, -50589, 342078, 1037261, 500177, -106547, -305867, -239306, -214302, -315447, -49546, -6814, 34914, 399600, -67897, -282731, -599326, -1065023, -1030541, -222400, 128753, 89433, 71536, -361745, -509653, -43678, 361798, 202776, 187232, -70010, -94472, -247536, -443967, -167023, 28594, 56108, 17572, 87427, 266069, 83541, 60159, -316175, -242593, -195798, 125291, 174217, 473865, 527419, 308451, 356792, 487739, 139460, -145088, 302778, 377622, 97032, 26482, 291406]
1440B91406P5550J1837J94366p7742k41329R3757k22729J15100k9254k98247n03414
1429e90699K71821N65004L67776N46478j14828k63866l77908j88643r8655j7888
1419I8592K0652J82196N9436k31274l60930j97017j36312o43852N86652R85468
1409C63611o3630M28713J18305p1076p60331k007j70253j5654M39354m15092k55577
1398d03637J21118q1742r0415N89198L52940j77147l89472J73321R0263M4432
1388B28859l71158k19696P3809k12355N5143o20073j78019P65420N07112K33700
1378B62742l19839j48527k13664J51125k06698j94003k78793J61234J12637j1570
1368f85356j11273O08612J95658k91077j62920O6167K72196j64406K81932J14615
$$ y = [291406, 366956, 378793, 573159, 495417, 254088, 347845, 125116, 240216, 210962, -87285, -590699, -318878, 246126, 613902, 1160380, 1045552, 781686, 403778, 215135, 116480, 98592, 119244, 301440, 360876, 129602, -231328, -428345, -564657, -1208509, -621857, 363611, 299981, 728694, 846999, 775923, 15592, 13585, -156668, -172322, 267032, -148060, -403637, -282519, -364261, -454676, 134522, 487462, 310315, -79157, 94164, 184427, 228859, -142299, -361995, -288186, -500541, -445398, -1065471, -1243490, -478070, 29042, 262742, -57097, -205624, -419288, -268163, -474861, -668864, -947657, -786423, -673786, -685356, -796629, -188017, 7641, -283436, -446356, -380189, -107993, -272399, 9533, 124148]
1358A24148k39875k61860m8522n42425o53940L97943P22263L65209J89980m33918
1348c80997o23571N49860K66377l67883l44889P35950K14560l82731R8938M54
1338b33932k09485m61475J37761j37315J31304J59266M86226J51977k63212j32968
1328c71853Q2989J57550N9355J81631L40837j58802m63140q5753J83137j5390
1318h9439K66633J53816n2642k87065Q6069k45689k1065L12038L21189l14479
1308A29366l33591k40013K36606N72182k6982j11404n6228J81333q5649q5787
1298A79833j63803L20186j87362l03639N5769L93042L78236j01052j59221l04893
1288A07096j71536n3436M68322J38156j86013O00735Q9447o99453k28937J11611
$$ y = [124148, -115727, -377587, -426109, -968534, -1622474, -1224531, -502268, -137059, 52921, -380997, -1004568, -454708, -188331, -556214, -901103, -165153, 49407, -333324, -234386, -233932, -443417, -904892, -767131, -904446, -773142, -613876, -127650, 24327, -238885, -371853, -288864, -131314, -71959, 109672, 450509, 291707, -171433, -257186, -74049, -89439, 177194, 331010, 278368, -8697, 77372, -168317, -189382, 122656, 443845, 129366, -204225, -444238, -207632, 364550, 337568, 226164, 169936, 351269, 265620, 179833, 16030, 336216, 148854, -154785, -99016, 294026, 672262, 571210, 411989, 107096, -64440, -117876, 350446, 488602, 302589, 903324, 992771, 293318, 64381, 175992]
1278A75992l11936l26949M68108K79417K84250P65792j48669r12560m91863K65730
1268D7312K6412k97791M26077J15044j00701p9553l77525k35993O28253L65764
1258E17299l32427P9668o5809k01989J90769L66255r5389p891l68769m13418J239
1247c30462O30125K79584M896l85239k45873O0338k07048M9324L43489M8717l1398
1236B16453L11732k77060l56913j45736J16223J28891j29904m03816P1378O49435
1226A80683M27642J18709k86014p60602l25338J6236K45804P7457L07549j04761
1216a02635P3110L35500j23505j70557J24383Q1778m84653l70579m7782J06127
1206e78813K93954Q45114k17779k33726o98765M4134M41698j88432j36320j0046
$$ y = [175992, -135944, -462893, 5215, 284632, 568882, 1334674, 1186005, 273445, -218418, 47312, 73724, -224067, 202010, 317054, 216353, 136800, -240725, -476718, 151535, 517299, 184872, 264540, 198731, -3258, 187511, 553766, 458377, 450486, 81717, -331701, -330462, 299663, 579247, 584143, 198904, -46969, 13369, -193679, -144355, 199134, 247851, 216453, 528185, 251125, -105788, -251524, -135301, -6410, -136314, -540130, -468752, 180683, 608325, 727034, 441020, -319582, -644920, -628684, -382880, -305423, 2126, -102635, -29525, 305975, 182470, 11913, 136296, 218074, -266579, -637158, -684940, -578813, -284859, 560255, 342476, 108750, -590015, -545881, -104183, -292615, -428935, -438981]
1196d38981j8986k26139L24511K7798R0960J55557l13258j8041K90757k73657
1186c99479k37968M81882k43735M3582j51154Q5590J30264q461L70917L2887j51048
1175d6723n84068J42788M00402j14399N66132j84016n18209q0380K13616o7052
1165b71909j96890k8502J36009K84126o3559l59638Q8884M17913J50124p13905
1155e57347m84458M46900L51759N42061K47345q20071r08442N9415K46838O28847
1145b47153K98491J31939n36575K33802J73088j62951L75820L87233j34198l42942
1135A76554l93752j47631j88899O0268K51775L10560J7448l31851j34125M39252
1125E9599M70630K35857o85527k17771o0376p5096K87977k62397O98167J95362
$$ y = [-438981, -457967, -684106, -359595, -331797, -240837, -85280, -398538, -416579, -125822, -399479, -637447, -155565, -399300, -355718, -506872, -421282, -291018, -299479, 71438, 104325, -46723, -630791, -488003, -87601, -202000, 364132, 180116, -338093, -418473, -204857, -271909, -468799, -497301, -361292, -77166, -140725, -500363, -411479, 6434, 156558, -557347, -1041805, -594905, -243146, 298915, 546260, -273811, -1182253, -1122838, -876000, -247153, 51338, 183277, -353298, -119496, 53592, -109359, 266461, 653694, 519496, 176554, -217198, -364829, -553728, -493460, -241685, 68875, 86323, -245528, -379653, 59599, 530229, 766086, 80559, -137212, -197588, -272684, 15293, -247104, 451063, 646425]
1115F46425j13406o12799j28909J53344k9669l15406l74895R2962K78947O52235
1105B48829J10373j59684j37921Q6090m12342k30200L49573L80361r6199l18192
1095a79312q7257M28025M32412K31388m18900P6002m85064J08564l37058m66118
1085f97318N06906K85698l6017m40892l31324L93862M89327k64563r8196M63766
1075B71249L00476k35594L3423l12791M03621K23916n27027m25562K81745J4084
1065B7540k05313r0791L96285k34424j18154k38434k43112M23911N68106O1913
1055C47527n66282J23355O33635M55294m41907o34370j07642p0701n2754J65172
1045a48673j1131j6820K0033K77182k41910j67831M88029k21445J59759N02635
$$ y = [646425, 533019, -79780, -208689, -55345, -85014, -400420, -775315, -682353, -403406, 248829, 359202, 199518, 61597, 147687, -264655, -494855, -145282, 235079, 138880, -179312, -266569, 161456, 593868, 825256, 406356, 482358, -2706, 105858, -231200, -697318, -190412, 95286, 59269, -381623, -712947, -319085, 170242, -94321, -192517, 271249, 571725, 336131, 369554, 56763, 460384, 684300, 157273, -268289, 13456, 27540, -177773, -268564, 127721, -106703, -224857, -463291, -706403, -282492, 285614, 347527, -218755, -95400, 538235, 993529, 551622, -82748, -190390, -261091, -313845, -148673, -159804, -176624, -156591, 120591, -121319, -289150, 198879, -22566, 137193, 639828]
1035F39828l00899k56327k56484o71555L33475O46542M01461m18580P4864p4196
1025A18129n9849K99793n552j35814K52368J27733l37990n00372J61365l49772
1015d29961o76160l0933J51829O40391J28035M25260m02310r8726M68674m02934
1005b26835j45770O3322J47649m32911j25619L73621N7595p4330m202j51039k92626
994h11145N84499l42243J46904P60609j60459m28563p5081L62946q57148k5450
984h45131O49826K96339o133j62320l83802j87904Q51543J65568m0935J07115
974D44166l69357l02683k53324o7863L78228J43949L72861J26217m90473m06664
964d24943K89744k44530r5527M46719K07262q3307j52959j00235m78251L31105
$$ y = [639828, 338929, 82602, -173882, -845437, -511962, 134580, 536041, 117461, 192325, 118129, 58280, 358073, 352521, 216707, 469075, 596808, 258818, -241554, -80189, -429961, -1106121, -1137054, -985225, -344834, -216799, 208461, -193849, -292575, 176099, -226835, -372605, -309283, -161634, -594545, -720164, -346543, -288948, -363278, -367480, -518519, -811145, -226646, -568889, -421985, 338624, 178165, -250398, -325479, 37467, -819681, -845131, -195305, 101034, 94901, -67419, -451221, -639125, 212418, 377986, 337051, 444166, 74809, -227874, -481198, -549061, -170833, -26884, 345977, 472194, -18279, -424943, -135199, -379729, -475256, -28537, 178725, 95418, -57541, -157776, -636027, -304922]
954c04922K95755M5382M49982j97780j95814Q2553K95650p08608m15003P29161
944G6356J96227M281j59579J30683o26196o80294L50697M32572L62330j66226
934g9149J83819q0864k09794L31659k11108n21750K16781M79315r4601q5869J80961
923A09400J75684J57672Q2789l43564q0243J15651l66585J20843J3085j82789
913a98057K27859p4005j26364j16787O75008J14767k02408K01148q362J63009
903F55808j97708j28578q3624j42371Q8076Q6860j63764J41792K10898p7165p50273
892c60049o18910j44059N02939P09955Q9485r9211M90879K21292o51899p01153
882e60731L12522J3628L23851j71869M6389L55348J09146m21203r9237N5341j51720
$$ y = [-304922, -9167, 36215, 486197, 288417, 92603, 175156, 470806, -237802, -652805, 76356, 272583, 276864, 117285, 247968, -378228, -1058522, -707825, -275253, 87077, -79149, 104670, 23806, -185988, 145671, -65437, -587187, -370406, 108909, 14308, -71561, 109400, 285084, 442756, 525545, 181981, 101738, 217389, -149196, -28353, -15268, -198057, 29802, -44203, -170567, -287354, 387654, 502421, 300013, 501161, 492799, 655808, 458100, 329522, 245898, 103527, 191603, 278463, 114699, 256491, 467389, 390224, -360049, -978959, -1123018, -620079, 89876, 179361, 80150, 571029, 792321, 140422, -560731, -248209, -234581, 89270, -82599, -36210, 319138, 428284, 7081, -92156, -36815, -188535]
871a88535J51099k50978l34390P476L02484k52874j76173N20260N88281n7248
861C09402k65281m41274M04406j02245l99361M25032J76413k02183J63511k40163
$$ y = [-188535, -37436, -288414, -622804, -615328, -312844, -565718, -741891, -221631, 366650, 309402, 44121, -397153, 7253, -94992, -494353, -69321, 107092, -95091, 68420, -171743]
$$ [...]
##END NTUPLES=NMR SPECTRUM
##END=
