##TITLE=1H_EC-3313(2)
 CDCl3
 8 sc, 
 9.2.2024
##JCAMPDX= 6.0         $$ Bruker NMR JCAMP-DX V2.0
##DATA TYPE= NMR SPECTRUM
##DATA CLASS= NTUPLES
##ORIGIN= UXNMR, Bruker Analytische Messtechnik GmbH
##OWNER= root
$$ XWIN-NMR		Version 3.5
$$ Fri Feb  9 14:01:16 2024 Russian Standard Time (UT+4h)  she@DPX200
##.OBSERVE FREQUENCY= 200.1313
##.OBSERVE NUCLEUS= ^1H
##.ACQUISITION MODE= SIMULTANEOUS
##.ACQUISITION SCHEME= undefined
##.AVERAGES= 8
##.DIGITISER RES= 18
##SPECTROMETER/DATA SYSTEM= spect
##.PULSE SEQUENCE= zg30
##.SOLVENT NAME= DMSO
##.SHIFT REFERENCE= (INTERNAL, DMSO, 0, 15.4858)
##AUDIT TRAIL= $$ (NUMBER, WHEN, WHO, WHERE, WHAT)
$$ ##TITLE= Audit trail, XWIN-NMR		Version 3.5
$$ ##JCAMPDX= 5.01
$$ ##ORIGIN= Bruker BioSpin GmbH
$$ ##OWNER= she
$$ F:/spectra/data/she/nmr/H-F/1/pdata/1/auditp.txt
$$ ##AUDIT TRAIL=  $$ (NUMBER, WHEN, WHO, WHERE, WHAT)
(   1,<2024-02-09 13:59:50.57 +0400>,<she>,<DPX200>,
      <created by zg, POWCHK disabled, PULCHK disabled
       configuration hash MD5:
       00 E9 B6 7A A2 85 ED C7 34 08 36 98 17 FE 4E 26
       data hash MD5: 16K
       D5 09 07 A0 23 69 69 F1 5B EA BC 7C 62 B6 95 7E>)
(   2,<2024-02-09 13:59:52.70 +0400>,<she>,<DPX200>,
      <Start of raw data processing
       efp BC_mod = 2 LB = 0.24 FT_mod = 6 PKNL = 1 PHC0 = -24599.48 PHC1 = 20.05267 SI = 16K 
       data hash MD5: 16K
       1C 76 94 6D C8 A5 E1 6D 29 38 0E 53 35 86 D1 5F>)
(   3,<2024-02-09 14:00:20.57 +0400>,<she>,<DPX200>,
      <pk PHC0 = 7.028785 PHC1 = -9.599998 
       data hash MD5: 16K
       66 00 EF 16 BE 8E 97 F3 F4 38 B2 44 A5 2F 50 5E>)
(   4,<2024-02-09 14:00:27.04 +0400>,<she>,<DPX200>,
      <abs ABSG = 5 
       data hash MD5: 16K
       1D E4 3D D0 0C 4A 7B F9 46 55 87 4B FB A2 42 33>)
$$ ##END=
$$ 
$$ hash MD5
$$ 99 31 B0 F8 BD 18 A7 7D 0D 1F 48 61 F7 47 23 DB
##$RELAX= 
##$RELAX= 
##$RELAX= 
##$RELAX= 
##$RELAX= 
##$RELAX= 
$$ Bruker specific parameters
$$ --------------------------
##$DU= <F:/spectra>
##$EXPNO= 1
##$NAME= <H-F>
##$PROCNO= 1
##$TYPE= <nmr>
##$USER= <she>
##$AMP= (0..31)
100 100 100 100 100 100 100 100 100 100 100 100 100 100 100 100 100 100 
100 100 100 100 100 100 100 100 100 100 100 100 100 100 
##$AQSEQ= 0
##$AQ_mod= 1
##$AUNM= <au_zg>
##$AUTOPOS= <>
##$BF1= 200.13
##$BF2= 200.13
##$BF3= 200.13
##$BF4= 200.13
##$BF5= 200.13
##$BF6= 200.13
##$BF7= 200.13
##$BF8= 200.13
##$BYTORDA= 1
##$CFDGTYP= 0
##$CFRGTYP= 5
##$CHEMSTR= <none>
##$CNST= (0..31)
1 1 145 1 1 1 1 1 1 1 1 1 1 1 1 1 1 1 1 1 1 1 1 1 1 1 1 1 1 1 1 1 
##$CPDPRG= <>
##$CPDPRG1= <>
##$CPDPRG2= <>
##$CPDPRG3= <>
##$CPDPRG4= <mlev>
##$CPDPRG5= <mlev>
##$CPDPRG6= <mlev>
##$CPDPRG7= <mlev>
##$CPDPRG8= <mlev>
##$CPDPRGB= <>
##$CPDPRGT= <>
##$D= (0..31)
0 1.2 0 0 0 0 0 0 0 0.06 0 0.03 0 0 0 0 0.0002 0 0 0 0 0 0 0 0 0 0 0 0 
0 0 0 
##$DATE= 1707472789
##$DBL= (0..7)
120 120 120 120 120 120 120 120 
##$DBP= (0..7)
150 150 150 150 150 150 150 150 
##$DBP07= 0
##$DBPNAM0= <>
##$DBPNAM1= <>
##$DBPNAM2= <>
##$DBPNAM3= <>
##$DBPNAM4= <>
$$ [...]
##$SUBNAM3= <"">
##$SUBNAM4= <"">
##$SUBNAM5= <"">
##$SUBNAM6= <"">
##$SUBNAM7= <"">
##$SUBNAM8= <"">
##$SUBNAM9= <"">
##$SW= 18.0517328524113
##$SWIBOX= (0..15)
0 0 2 0 0 0 0 0 0 0 0 0 0 0 0 0 
##$SW_h= 3612.71676300578
##$TD= 16384
##$TD0= 1
##$TE= 0
##$TE2= 300
##$TE3= 300
##$TEG= 300
##$TL= (0..7)
0 120 120 120 120 120 120 120 
##$TP= (0..7)
150 150 150 150 150 150 150 150 
##$TP07= 0
##$TPNAME0= <>
##$TPNAME1= <>
##$TPNAME2= <>
##$TPNAME3= <>
##$TPNAME4= <>
##$TPNAME5= <>
##$TPNAME6= <>
##$TPNAME7= <>
##$TPOAL= (0..7)
0.5 0.5 0.5 0.5 0.5 0.5 0.5 0.5 
##$TPOFFS= (0..7)
0 0 0 0 0 0 0 0 
##$TUNHIN= 0
##$TUNHOUT= 0
##$TUNXOUT= 0
##$USERA1= <user>
##$USERA2= <user>
##$USERA3= <user>
##$USERA4= <user>
##$USERA5= <user>
##$V9= 5
##$VALIST= <valist>
##$VCLIST= <CCCCCCCCCCCCCCC>
##$VD= 0
##$VDLIST= <DDDDDDDDDDDDDDD>
##$VPLIST= <PPPPPPPPPPPPPPP>
##$VTLIST= <TTTTTTTTTTTTTTT>
##$WBST= 1024
##$WBSW= 4
##$XGAIN= (0..3)
0 0 0 0 
##$XL= 0
##$YL= 0
##$YMAX_a= 301738
##$YMIN_a= -398125
##$ZGOPTNS= <>
##$ZL1= 120
##$ZL2= 120
##$ZL3= 120
##$ZL4= 120
##$ABSF1= 15.5089
##$ABSF2= -2.54295
##$ABSG= 5
##$ABSL= 3
##$ALPHA= 0
##$AQORDER= 0
##$ASSFAC= 0
##$ASSFACI= 0
##$ASSFACX= 0
##$ASSWID= 0
##$AUNMP= <proc_1d>
##$AZFE= 0.1
##$AZFW= 0.1
##$BCFW= 0
##$BC_mod= 2
##$BYTORDP= 0
##$COROFFS= 0
##$CY= -3
##$DATMOD= 1
##$DC= 0
##$DFILT= <>
##$DTYPP= 0
##$F1P= 0
##$F2P= 0
##$FCOR= 1
##$FTSIZE= 16384
##$FT_mod= 6
##$GAMMA= 0
##$GB= 0
##$INTBC= 1
##$INTSCL= 3.70164e-10
##$ISEN= 128
##$LB= 0.24
##$LEV0= 0
##$LPBIN= 0
##$MAXI= 10000
##$MC2= 0
##$MEAN= 0
##$ME_mod= 0
##$MI= 1.114404
##$NCOEF= 0
##$NC_proc= -7
##$NLEV= 6
##$NOISF1= 3.799351
##$NOISF2= 2.8
##$NSP= 0
##$NTH_PI= 0
##$NZP= 0
##$OFFSET= 15.48576
##$PC= 1
##$PHC0= -24592.45
##$PHC1= 10.45267
##$PH_mod= 1
##$PKNL= yes
##$PPARMOD= 0
##$PSCAL= 0
##$PSIGN= 0
##$REVERSE= no
##$SF= 200.130007192754
##$SI= 16384
##$SIGF1= 3
##$SIGF2= 2
##$SINO= 5.538805
##$SIOLD= 16384
##$SREGLST= <1H.CDCl3>
##$SSB= 0
##$STSI= 16384
##$STSR= 0
##$SW_p= 3612.71676300578
##$SYMM= 0
##$S_DEV= 0
##$TDeff= 16384
##$TDoff= 0
##$TI= <>
##$TILT= no
##$TM1= 0
##$TM2= 0
##$TOPLEV= 0
##$USERP1= <user>
##$USERP2= <user>
##$USERP3= <user>
##$USERP4= <user>
##$USERP5= <user>
##$WDW= 1
##$XDIM= 16384
##$YMAX_p= 522139995
##$YMIN_p= -950110
$$ End of Bruker specific parameters
$$ ---------------------------------
##NTUPLES= NMR SPECTRUM
##VAR_NAME=  FREQUENCY,     SPECTRUM/REAL,   SPECTRUM/IMAG
##SYMBOL=    X,             R,               I
##VAR_TYPE=  INDEPENDENT,   DEPENDENT,       DEPENDENT
##VAR_FORM=  AFFN,          ASDF,            ASDF
##VAR_DIM=   16384,         16384,           16384
##UNITS=     HZ,            ARBITRARY UNITS, ARBITRARY UNITS
##FACTOR=    0.220516191357247, 1,           1
##FIRST=     3099.16520717231, 0,            0
##LAST=      -513.551555833472, 0,           0
##MIN=       -513.551555833472, -950110,     0
##MAX=       3099.16520717231, 522139995,    0
$$ Real data points
##PAGE= N=1
##DATA TABLE= (X++(R..R)), XYDATA
$$ [...]
6531A639484M6626n4975n5285l6935J05183m5501J34841J42532j35196j33895
6521A606879j56244J76773Q649k04510K05265N0383L5174m0009j93486N207K63901
6510A757982j42019R4490K44L061M2855n9993N6416J52929p6630L9578N5845j69565
6498A755193k9316J158n5421J21174j10905J15961K16878j9880o0755m6154N8417
6487A946350l4957J7045K66900j39963P1906L0356n7970j34071J6676K36197J10160
6476B328629J25685m1008k37475L242q220K10916R1384J01539L0117j26426J50852
6465B629235J80n8598J71851K5512l0728J49384j63492K930J5305K22540K77841
6454C241960j98527m965Q3822L082K17018R6415K9225k20506R3580M26231J953
$$ plain form
6531 1639484 1686110 1631135 1575850 1538915 1644098 1598597 1733438 1875970 1740774 1606879
6521 1606879 1450635 1627408 1636057 1431547 1636812 1687195 1722369 1682360 1488874 1494081 1757982
6510 1757982 1615963 1710453 1710697 1713758 1756613 1696620 1753036 1905965 1829335 1868913 1924758 1755193
6498 1755193 1725877 1727035 1671614 1792788 1681883 1797844 2014722 1994842 1934087 1887933 1946350
6487 1946350 1911393 1928438 2195338 2055375 2127281 2157637 2099667 1965596 1982272 2218469 2328629
6476 2328629 2454314 2413306 2175831 2179073 2170853 2381769 2473153 2574692 2604809 2478383 2629235
6465 2629235 2629415 2570817 2742668 2768180 2737452 2886836 2723344 2726274 2741579 2964119 3241960
6454 3241960 3043433 3038468 3122290 3125372 3342390 3438805 3468030 3247524 3341104 3767335 3769288
6443C769288l38699N3190K17565K64295J06075K34493j01955K8206j7572K27155
6433D442041j7443l5753J19252j44393J3244L35628J76674j32378j18417K91635
6423D930090Q1199N958J97368P9429R5389L9356M7310J63997J01370J09794K44288
6412F095548K09425j6832p0543J02381N4966o5839J06172M76621J84140j05950
6402F970089R7908K73226K33061J35324K91589R5135J42815J50079K47387J35596
6392H772209K96934K43367K31123L62042K31745J75366K33103J22121K95430K92710
6382A1256150J83663K05822K82572L22706K77074M79761K53692M80264M59262
6373A4200966K05344L64812N32413M72546M36560M45449N84924Q28109P12041
$$ plain form
6443 3769288 3430589 3483779 3701344 3965639 4071714 4306207 4204252 4232458 4214886 4442041
6433 4442041 4424598 4388845 4508097 4363704 4376948 4712576 4889250 4756872 4638455 4930090
6423 4930090 5011289 5017247 5214615 5294044 5389433 5428789 5476099 5640096 5741466 5851260 6095548
6412 6095548 6304973 6288141 6217598 6319979 6374945 6309106 6415278 6891899 7076039 6970089
6402 6970089 7067997 7341223 7574284 7709608 8001197 8096332 8239147 8389226 8636613 8772209
6392 8772209 9069143 9312510 9543633 9905675 10137420 10312786 10545889 10668010 10963440 11256150
6382 11256150 11439813 11645635 11928207 12250913 12527987 13007748 13261440 13741704 14200966
6373 14200966 14406310 14771122 15303535 15776081 16212641 16658090 17243014 18071123 18783164
6364A8783164J033605Q20499P59546Q31231P38931R27736J350263J536296J503819
6355B8285090J708984K051172K236827K643882L092649L442176M207424M230306
6347E1898510M492767M552296L303785R18286r19125k389353k782210l400950
6339E5674006k951987k260698j446855j142746o09525k2839L17127Q42628J199025
6330D9598136J863219K479268L117035L843146M647911N505933O422109P920851
6322H5397608R226468R662796R205087O067672J068194m629512q975975j0655110
6314I6367228j0373169r045657p555383o064406n138861l960408l261800k289913
6306D8677631j557170j226794n92505J56969O30042R51172J607777K276856K831409
$$ plain form
6364 18783164 19816769 20637268 21396814 22228045 22966976 23894712 25244975 26781271 28285090
6355 28285090 29994074 32045246 34282073 36925955 40018604 43460780 47668204 51898510
6347 51898510 56391277 60943573 64247358 65165644 64246519 61857166 59074956 55674006
6339 55674006 52722019 50461321 49014466 47871720 47262195 47239356 47556483 48399111 49598136
6330 49598136 51461355 53940623 57057658 60900804 65548715 71054648 77476757 85397608
6322 85397608 94624076 104286872 113491959 119559631 120627825 115998313 107022338 96367228
6314 96367228 85994059 76948402 69393019 63328613 58189752 54229344 50967544 48677631
6306 48677631 47120461 45893667 45301162 45458131 46088173 47039345 48647122 50923978 53755387
6297E3755387L434269L855204L895126L052602J564688j411059l748958n420314
6289E8976945o193914n675440n075363m502814l998733l282681k640710k086510
6281B5520780j873683j725677j522628j357152j116742q09393j026380q90586
6273A5198539q13267r23951o38192l63381n75268n27188j92811l41163p72063
6264A0051255n00914j97692l42027l0023j01526l94007k53543k89125k94397k94122
6254G353879l26365l65853o4061o2036r3336m01267M2669P472o4694m39528r7344
6243E489536k00955j64973m064k06292J05476k03324r1173p5692p0920j83430
6233D394189k33917l3962k77741M7970M1365k99960j64925Q3281o5594j58506
$$ plain form
6297 53755387 57189656 61044860 64939986 67992588 69557276 68146217 64397259 58976945
6289 58976945 52783031 47107591 42032228 37529414 33530681 30248000 27607290 25520780
6281 25520780 23647097 21921420 20398792 19041640 17924898 17115505 16089125 15198539
6273 15198539 14385272 13461321 12823129 12459748 11884480 11357292 11164481 10823318 10051255
6264 10051255 9550341 9352649 9010622 8980599 8879073 8485066 8231523 7942398 7648001 7353879
6254 7353879 7027514 6661661 6597600 6535564 6442228 6040961 6083630 6091102 6026408 5586880 5489536
6243 5489536 5288581 5123608 5119544 4913252 5018728 4815404 4724231 4648539 4577619 4394189
6233 4394189 4160272 4126310 3848569 3896539 3937904 3637944 3473019 3556300 3490706 3332200
6223C332200m6454k8271k36350j04009K60215Q3742R2048j5250j18037k09306
6213C010528j53630K14333k65410J19393m0293j313q3110m0895J7952p789j19470
6202B650296p9559J1585o9465q0108o5235J80999j07844J73957k33290K372L6227
6191B419935P2035J40685l74991p7076N3579N005O9905K6886m37j84900M6027
6180B196653K1249o1145n8649o2658N7040Q4553k26743J05996J9105n7322P1337
6169B089416j3231m9882m0682J8329J6364l7656J29770K63699J30397k45168k7313
6158B234043R3714k771l66766L23181n1162j62665o673P1485J48516P2167k3015
6147B330054M2886m6853n2757J70841J29105J59952m9131p118J01182J95232K42147
$$ plain form
6223 3332200 3285746 3257475 3021125 2917116 3177331 3261073 3353121 3337871 3219834 3010528
6213 3010528 2856898 3071231 2805821 2925214 2884921 2883608 2800498 2759603 2777555 2769766 2650296
6202 2650296 2570737 2582322 2512857 2432749 2367514 2548513 2440669 2614626 2381336 2383708 2419935
6191 2419935 2491970 2632655 2257664 2180588 2234167 2239172 2309077 2335963 2335526 2150626 2196653
6180 2196653 2217902 2156757 2098108 2035450 2092490 2177043 1950300 2056296 2075401 2018079 2089416
6169 2089416 2076185 2026303 1985621 2003950 2020314 1982658 2112428 2376127 2506524 2261356 2234043
6158 2234043 2327757 2324986 1958220 2281401 2230239 2067574 2060901 2132386 2280902 2353069 2330054
6147 2330054 2372940 2326087 2273330 2444171 2573276 2733228 2684097 2676979 2778161 2973393 3215540
6136C215540K09235k2115M0795k00595J85714O6617j97111r9113k184k79949k22562
6125B694272n2865J93809l1806J59969m601O738J2696N2523L13823K19395J80882
6114C744835K78777j61971M3266J08730n2143K5881K23096j94102m63848k64391
6104C288130k47383k01367K19687r0162j47605j3171o469j01452J5178j01461
6094B613925j26121L07728j8185K22160J16422j06981j74083o2915L728j14186
6084B661492k16157K72331j25432l9089n6436k50488l2099J01083p0261k60961
6074A983983K8926k1604P3022K05419k95207N8256j88098k158j14556R7174K32887
6063B058044j62068K52M8135j0505K98720O615j74086k3692J01234J07230O265
$$ plain form
6136 3215540 3424775 3402660 3443455 3242860 3428574 3495191 3298080 3198967 3196783 2916834 2694272
6125 2694272 2641407 2835216 2803410 2963379 2958778 2965516 2978212 3030735 3344558 3563953 3744835
6114 3744835 4023612 3861641 3904907 4013637 3961494 3987375 4210471 4016369 3552521 3288130
6104 3288130 3040747 2839380 3059067 2968905 2821300 2808129 2801660 2700208 2715386 2613925
6094 2613925 2487804 2795532 2777347 2999507 3115929 3008948 2834865 2771950 2775678 2661492
6084 2661492 2445335 2717666 2592234 2553145 2496709 2246221 2214122 2315205 2244944 1983983
6074 1983983 2012909 1991305 2064327 2269746 1974539 2032795 1844697 1842539 1727983 1825157 2058044
6063 2058044 1895976 1896228 1944363 1933858 2232578 2239193 2065107 2041415 2142649 2249879 2256144
6052B256144k92068j03140l8547K22767L3986j62485q838l5449J72610L3875o9228
6041B009627k4436j24859k46379J23172M7070J34265m5298J61455R8209J79002
6031B311828J33699Q3506O5028J50581J30382k73332p4605k31531k6502P367J30341
6020B406762K9301k49518J19404J118N5058J55866M4725M0186O3895j43193J41045
6009B664649L6498l1370K40586O0311K9608J63788l63747m0788M2406l301o9257
5998B729383k8814k06647R592n4814o7571K26138k351l7036O1650R2246N8139
5987B779915n8899r428m4670K77624K44944j70733o0732j46664k10307j3038K19396
5976B807408k1695L31980K6762j04183J23293L4227j2721j47201n8420j64033
$$ plain form
6052 2256144 1964076 1860936 1822389 2045156 2079142 1916657 1907819 1872370 2044980 2078855 2009627
6041 2009627 1985191 1860332 1613953 1737125 1784195 1918460 1873162 2034617 2132826 2311828
6031 2311828 2445527 2529033 2594061 2744642 2875024 2601692 2527087 2295556 2269054 2276421 2406762
6020 2406762 2436063 2186545 2305949 2307067 2362125 2517991 2562716 2602902 2666797 2523604 2664649
6009 2664649 2701147 2669777 2910363 2970674 3000282 3164070 2800323 2759535 2801941 2798640 2729383
5998 2729383 2700569 2493922 2503514 2448700 2381129 2607267 2604916 2567880 2629530 2721776 2779915
5987 2779915 2721016 2711588 2666918 2944542 3189486 3018753 2958021 2811357 2601050 2588012 2807408
5976 2807408 2785713 3117693 3144455 3040272 3163565 3197792 3185071 3037870 2979450 2815417
5966B815417O7247K8896j64234L3974N0637j7205K10442J07202q5198M9327K94593
5955C391098J25201k36693n4861J44431p8431j70164K41891P5487J72866N1273
5945C662098J42998R8663R1421p2988O2754K34982o4461k8309k08663O1482J15893
5934D095870q5089M5209J29369J69997K67435j50897l1941K26924K56638K50588
5924E174103P0854J16953K6011j42741L7464K92217K22733K44727O8369J86361
5914F297051K48258l79915N8548Q059K29934P3402K11832P3306Q1792L40015K92839
5903G535121L73136J98564K66438M51711O30425M59174N19940L58747N50656J43658
5893A1487570l10430k07754j75880r9827j65413l18965L191m4642r2063r4919
$$ plain form
5966 2815417 2882664 2911560 2747326 2781300 2831937 2814732 3025174 3132376 3047178 3096505 3391098
5955 3391098 3516299 3279606 3224745 3369176 3290745 3120581 3362472 3437959 3610825 3662098
5945 3662098 3805096 3903759 3995180 3922192 3984946 4219928 4155467 4127158 3918495 3979977 4095870
5934 4095870 4010781 4055990 4185359 4355356 4622791 4471894 4439953 4666877 4923515 5174103
5924 5174103 5244957 5361910 5387921 5245180 5282644 5574861 5797594 6042321 6110690 6297051
5914 6297051 6545309 6165394 6223942 6232001 6461935 6535337 6747169 6820475 6902267 7242282 7535121
5903 7535121 7908257 8106821 8373259 8824970 9455395 9914569 10434509 10793256 11343912 11487570
5893 11487570 11177140 10969386 10793506 10693679 10528266 10209301 10212492 10167850 10075787 9980868
5883I980868L38662K57315K01477J59142L06421L53217J47400N62555L91313L74753
5873A3073123O71838P24278J072678J185015Q55499M37142R941n26762o07766
5864A6894986m92123l63994l59331L883j18338k35423Q4223K54977k1347J36102
5854A5783615L56048K03987J45856N46521L87069N76994N03575J72193N93107
5845A9268965R27278O65755O95130R27773L48975O51062O41085L49664K94928
5836B4770615M41762N27250Q77542J083352R28464J453579J525398J603831K240113
5827C5451906K620812K976389L280002L611351M510904N561951O080825O364311
5819G0458451N373329K980129n42531l019955m838208n165227m640115l804162
$$ plain form
5883 9980868 10319530 10576845 10778322 10937464 11243885 11597102 11744502 12307057 12698370 13073123
5873 13073123 13744961 14469239 15541917 16726932 17582431 18019573 18029514 17502752 16894986
5864 16894986 16402863 16038869 15679538 15683421 15565083 15329660 15413883 15668860 15647513 15783615
5854 15783615 16139663 16343650 16489506 17036027 17423096 18000090 18503665 18675858 19268965
5845 19268965 20196243 20861998 21557128 22484901 22833876 23484938 24126023 24475687 24770615
5836 24770615 25212377 25739627 26617169 27700521 28628985 30082564 31607962 33211793 35451906
5827 35451906 38072718 41049107 44329109 47940460 52451364 58013315 64094140 70458451
5819 70458451 75831780 78811909 78269378 75249423 70411215 65245988 60605873 56801711
5811E6801711k764024k004709j650010r45131j95647J87360R57182J605019K005759
5802E3997510K706957L626627M385116N505132O664583Q236372J0106348J2083862
5794A07312507J2069309R009155J717578o415658j1471369j2420668j1636755
5787H8164099j0156360q279480o783901n108257l865901l338812k653651j599075
5779D6378662j048725n29695l40276J99867P38645R61089J801229K094841K606482
5770E2862119L449602L839850L366415K059500o503k888893n027887n845613n418832
5761D6389758m737008m240534l630709k700746k415047j693205j502300j384332
5753B4085877j215721p87269q26724q89093n61980m07987m54043j51621l28044
$$ plain form
5811 56801711 54037687 52032978 50382968 49437837 49242190 49429550 50386732 51991751 53997510
5802 53997510 56704467 60331094 64716210 70221342 76885925 85122297 95228645 107312507
5794 107312507 119381816 128390971 130108549 123692891 112221522 99800854 88164099
5787 88164099 78007739 69728259 62944358 57836101 53970200 50631388 47977737 46378662
5779 46378662 45329937 44800242 44459966 44659833 45398478 46359567 48160796 50255637 52862119
5770 52862119 56311721 60151571 63517986 65577486 65570983 62682090 57654203 51808590 46389758
5761 46389758 41652750 37412216 33781507 31080761 28665714 26972509 25470209 24085877
5753 24085877 22870156 22082887 21256163 20367070 19805090 19397103 18943060 18791439 18463395
5744A8463395l0532R6750k51413m54096r07515o78324p66710p79516n62559l65722
5734A3763758p9308n92546m70236j14381m45294j54459j37988j68055j50450l02568
5724A1148473n8278R3210O7069j03216n6391K68069j92140n11261k73248j22010
5714A0260277k78125l02294l22046J9877k30045l07498J4380k81442l50211l35129
5704G887744k5880K5559o7094k2611O6740q5782P837K18564n0816K27452P7025
5693H258738l73381j28235L1990j73995j50503k22877j52001P7873j72010M2381
5683G037980j31139k80542L5623J39015J04230k81948Q6708J8644K8327p1126
5673F685772J71211J32204j26603K9579O329J94758O9168k53023J52161J91358
$$ plain form
5744 18463395 18432863 18529613 18278200 17824104 16916589 16238265 15471555 14692039 14129480 13763758
5734 13763758 13684450 13091904 12621668 12507287 12061993 11907534 11769546 11601491 11451041 11148473
5724 11148473 11090195 11183405 11250474 11147258 11090867 11358936 11166796 10655535 10382287 10260277
5714 10260277 9982152 9679858 9357812 9377689 9147644 8840146 8854526 8573084 8222873 7887744
5704 7887744 7861864 7887423 7820329 7797718 7864458 7778676 7786513 8005077 7954261 8181713 8258738
5693 8258738 7885357 7757122 7789112 7615117 7464614 7241737 7089736 7167609 6995599 7037980
5683 7037980 6906841 6626299 6661922 6800937 6905167 6623219 6709927 6728571 6756898 6685772
5673 6685772 6856983 6989187 6862584 6892163 6898492 7093250 7162418 6909395 7061556 7252914
5663G252914j2437K20922J08120k04105j27981j65602n2747N2900K20252j78474
5653G113762k93954J09928M8295k0371J6390j26288j00545L7416J20049k14409
5643F690273J17753J33285J55852J80332K37928p4174J7825L23257J93547M5965
5633H021843R7455J07732j3379K6974j06532R1886n6647K769J59359o0277j08091
5622H163092J31296K3617j03156o7751K52414K7439J92718J40616J28290R3901
5612H982476K47341J43498p7276l779Q941K26257L20059J43989Q4120m6017J36368
5601A0165977K17103L34553J02438J04170o844j05105P6501K84656J02519K99634
5591A1575602M863J89992J56791j34829L61031K80265J90575J36375J42785J48153
$$ plain form
5663 7252914 7240477 7461399 7569519 7365414 7237433 7071831 7019084 7071984 7292236 7113762
5653 7113762 6819808 6929736 6978031 6957660 6974050 6847762 6747217 6784633 6904682 6690273
5643 6690273 6808026 6941311 7097163 7277495 7515423 7441249 7459074 7782331 7975878 8021843
5633 8021843 8119298 8227030 8213651 8240625 8134093 8225979 8169332 8172101 8331460 8271183 8163092
5622 8163092 8294388 8318005 8214849 8147098 8399512 8426951 8619669 8760285 8888575 8982476
5612 8982476 9229817 9373315 9296039 9292260 9301201 9527458 9847517 9991506 10075626 10029609 10165977
5601 10165977 10383080 10717633 10820071 10924241 10917397 10812292 10888793 11173449 11275968 11575602
5591 11575602 11580465 11770457 11927248 11792419 12153450 12433715 12624290 12760665 12903450 13051603
5581A3051603J39108M54297L21768K28893K14676J30343K28583L48825N11430
5572A5629526P0052M3163M13656K76446K63339J68280L75445N56352K85594J02688
5562A8184541J01821M44260K73607L07486M8697M43727K03274K53625K19856J43413
5552B0624307M41221M04722M86384N85791N30535N21232O50337N18926P25967
5543B5489422M22510N62343N25417L35226L79842N94545O03590N61436O87816
5534C0162147L99585M96730N00008N29798P21228M68051P08561R62742J042960
5525C5991810R84797Q47147J115802Q62372R89613J417527J452852J494117J629446
5516D6785483J471881J861646J967676J848075J974426J483722J152155J179780
$$ plain form
5581 13051603 13190711 13645008 13966776 14195669 14410345 14540688 14769271 15118096 15629526
5572 15629526 15699578 15742741 16156397 16432843 16696182 16864462 17239907 17796259 18081853 18184541
5562 18184541 18286362 18730622 19004229 19311715 19360412 19804139 20007413 20261038 20480894 20624307
5552 20624307 21065528 21470250 21956634 22542425 23072960 23594192 24244529 24763455 25489422
5543 25489422 25911932 26474275 26999692 27334918 27714760 28309305 28912895 29474331 30162147
5534 30162147 30561732 31058462 31558470 32088268 32809496 33277547 33986108 34948850 35991810
5525 35991810 36976607 37823754 38939556 39801928 40791541 42209068 43661920 45156037 46785483
5516 46785483 48257364 50119010 52086686 53934761 55909187 57392909 58545064 59724844
5508E9724844J340733J679830K029782K409135K342208K468079J762594J905733
5500G5662938J811613J514835J244644R56247J267500J608649K260362L115278
5492H9442066M253917N282973O183303N451621L551722J802057N40080J029550
5484A17537289K160644L505687N072046O249749P576867Q732688R720024J0360477
5476A70915471J1916673J3097080J2411440J0841344J1039669J3010890J4926657
5469B58159224J3670593R097387L937681Q36379r19086k567725o319657j1492282
5461B64402514j5390013j5863842j3112782j0532569j1033444j1862608j1479042
5454A75128214r564924p987345o961910n577726m214277k423716r00013L72478
$$ plain form
5508 59724844 61065577 62745407 64775189 67184324 69526532 71994611 73757205 75662938
5500 75662938 77474551 78989386 80234030 81190277 82457777 84066426 86326788 89442066
5492 89442066 93695983 98978956 105162259 110613880 114165602 115967659 116507739 117537289
5484 117537289 119697933 123203620 128275666 134525415 142102282 150834970 160554994 170915471
5476 170915471 182832144 195929224 208340664 219182008 230221677 243232567 258159224
5469 258159224 271829817 280927204 284864885 285701264 284782178 282214453 275894796 264402514
5461 264402514 249012501 233148659 220035877 209503308 198469864 186607256 175128214
5454 175128214 165563290 157575945 150614035 145036309 140822032 138398316 137498303 137870781
5446A37870781J464901K465224L095190K273696o40241m198453p434532q648701
5438A26247865q012831o378669n066487l368496k110636j779118j216652p57808
5430I7557168l47679j48244l17919K729M97961J037054K463169L957793N775018
5421A10477050P632459R275845R907010P469249K253334l275857p286215j0485059
5413A25967816j2002609j1947912j0119800q123379o160018m499790k858495k200247
5405F8055566j430363j442647j528454j416185p50096j59448M59811J468743K497556
5396F5754483L254895M209315M880435M305548J913232k873501o308349q231716
5388F6904342p976645o832383n772782m575652l648869l248633k868371j936476
$$ plain form
5446 137870781 139335682 141800906 144896096 147169792 146529551 142331098 134896566 126247865
5438 126247865 118235034 111856365 106789878 103421382 101310746 99531628 98314976 97557168
5430 97557168 97209489 97061245 96743326 96746055 97244016 98281070 100744239 104702032 110477050
5421 110477050 118109509 127385354 137292364 144761613 147014947 143739090 136452875 125967816
5413 125967816 113965207 102017295 91897495 83774116 77614098 73114308 70255813 68055566
5405 68055566 66625203 65182556 63654102 62237917 61487821 61328373 61788184 63256927 65754483
5396 65754483 69009378 73218693 78099128 82404676 84317908 81444407 75136058 66904342
5388 66904342 58927697 52095314 46322532 41746880 38098011 34849378 31981007 30044531
5380C0044531k051253j869520j320039j145703q65043j111959q59174o13620q91506
5371A9316714n34629j91964n93867o61745p25480m83969p36334m02395l30259
5362A4656072k63352l51930m33508j39197k80241k24812j75631k14159k8415K971
5352A2547798k6693K21106L02470J75745k82553o72649l89132l93186n22144n28118
5342A0432644k14514k58180j55356k33048r5640J10135K3841j40131N4570q6418
5332I437903j67675J81959m5990K33704L07779N1010N4996L2399K77142N83630
5322A0946857O69972O51509P72960J174025R49477N34131k6247o53065j177709
5313A3841910r67133r20513q03297q28631o03631n62016k49148m11223m27822
$$ plain form
5380 30044531 27993278 26123758 24803719 23658016 22792973 21681014 20821840 20208220 19316714
5371 19316714 18782085 18590121 17996254 17334509 16609029 16125060 15388726 14986331 14656072
5362 14656072 14392720 14040790 13607282 13468085 13187844 12963032 12787401 12573242 12544827 12547798
5352 12547798 12521105 12742211 13044681 13220426 12937873 12265224 11876092 11482906 10960762 10432644
5342 10432644 10218130 9959950 9804594 9571546 9475906 9586041 9609882 9469751 9524321 9437903
5332 9437903 9270228 9452187 9406197 9639901 9947680 9998690 10053686 10086085 10363227 10946857
5322 10946857 11616829 12268338 13041298 14215323 15164800 15698931 15672684 15019619 13841910
5313 13841910 12874777 11954264 11150967 10322336 9718705 9156689 8907541 8496318 8068496
5304H068496n6548k48021j89689q361L0975q63N5017L7281N4625J63565L96130
5293H302607M2919N09052N97892N15480M93872J063656J128652Q84572J068309
5284A4607011J46263p60610j162078j057728q71276p53967p37429m28815p6460
5275H904911l89247L570j13380J56308K66899O4988j43638o86166l80127n88982
5265G095136l91109k86924n55925j75525O0366q0032J552J11280J14417K89468
5255F182704K64881M44960K17998j41622k86483l06916l33078m10738n77040k55993
5245D798673j49650l57676p2501j39295p4234p8227J78325L7481P4217k74362
5235C942751o2559J51763m12373k00933J41337l09927R686j34605n1858k47276
$$ plain form
5304 8068496 8011948 7763927 7574238 7565877 7596852 7595989 7651006 7688287 7742912 7906477 8302607
5293 8302607 8345526 8854578 9452470 9967950 10461822 11525478 12654130 13538702 14607011
5284 14607011 14753274 13992664 12830586 11772858 10901582 10147615 9410186 8981371 8904911
5275 8904911 8515664 8519234 8405854 8562162 8829061 8894049 8750411 8064245 7684118 7095136
5265 7095136 6704027 6417103 5861178 5685653 5746019 5665987 5667539 5778819 5893236 6182704
5255 6182704 6447585 6892545 7110543 6968921 6682438 6375522 6042444 5631706 5054666 4798673
5245 4798673 4649023 4291347 4218846 4079551 4005317 3927090 4105415 4142896 4217113 3942751
5235 3942751 3880192 4031955 3619582 3418649 3559986 3250059 3259745 3125140 3073282 2826006
5225B826006j68678N9557L7009P8059O8214j24027j57215L18554m5124k50756
5215B641599q4086J27371K38238n0498l7944J2718K15246K28480k5100j4138m4896
5204C206990K01647J04628k44959m1864k68676J455J10688n9358l69462k19780
5194B421309J18197j08322m1608J7602O4197L1173j4041p8059J06625j0016o7991
5183B439066j25680m7722J52506K73344j62580N8830K16965j51657o1747L43307
5173B934632m8528k7498M8507K02290k11855N8262J68306o6510k12985k66260
5163B578361N4465q6162l48106P7388J39679j28027K20242P0608o5628k2137l08627
5152B182056j78695J26010N5186j30916R208L478J62168l7100j46820N6771j15632
$$ plain form
5225 2826006 2657328 2716885 2753894 2831953 2900167 2776140 2618925 2937479 2892355 2641599
5215 2641599 2557513 2684884 2923122 2872624 2834680 2847398 3062644 3291124 3266024 3251886 3206990
5204 3206990 3408637 3513265 3268306 3226442 2957766 2959221 3069909 3010551 2641089 2421309
5194 2421309 2539506 2431184 2389576 2407178 2471375 2502548 2488507 2410448 2517073 2507057 2439066
5183 2439066 2313386 2265664 2418170 2691514 2528934 2587764 2804729 2653072 2591325 2934632
5173 2934632 2886104 2858606 2907113 3109403 2897548 2955810 3124116 3057606 2844621 2578361
5163 2578361 2632826 2546664 2198558 2275946 2415625 2287598 2507840 2578448 2512820 2490683 2182056
5152 2182056 2003361 2129371 2184557 2053641 2062849 2066327 2228495 2191395 2044575 2101346 1985714
5141A985714j57383J41142M5592J39637J09179J24236J51940l35767q5246p39
5131B118305k41955J59549P5846j7155r7979m9281m3038k61385J26734r9724P7075
5120A746992J40364k5623k26202r0727j7935J95955m8564N9119J00564L5226k49200
5109A619969j11041J99450n9382K0295R2102j56836K17670J00937k00554j3659
5099A708951J03010N7841j47450R1030P014q6703m1002K5065j48333j59890P0485
5088A480018n8568J05221J15203k33519j76460J19126Q3886o4885l1821Q2089
5078A420290J09103J0848j94826N3151J32454J12274J18391l6204M6238j30287
5068A641432p0477k11864j32939K24494j80683M1851j1466j90372R5381J46577
$$ plain form
5141 1985714 1828331 1969473 2015065 2154702 2263881 2388117 2540057 2204290 2119044 2118305
5131 2118305 1876350 2035899 2111745 2094590 1996611 1947330 1904292 1642907 1769641 1669917 1746992
5120 1746992 1887356 1861733 1635531 1544804 1526869 1722824 1674260 1733379 1833943 1869169 1619969
5109 1619969 1508928 1708378 1648996 1669291 1761393 1604557 1822227 1923164 1722610 1708951
5099 1708951 1811961 1869802 1722352 1813382 1820396 1733693 1692691 1717756 1569423 1409533 1480018
5088 1480018 1421450 1526671 1641874 1408355 1231895 1351021 1434907 1370022 1338201 1420290
5078 1420290 1529393 1540241 1345415 1398566 1531020 1643294 1761685 1725481 1771719 1641432
5068 1641432 1570955 1359091 1226152 1450646 1269963 1311814 1300348 1109976 1205357 1351934
5058A351934j84508n8559J78523K1687J41213j73546j5808P3590P0890j7016j5729
5047A372671J35461p0910k01994J16952K5935J30765o4676R5738p9286J42747
5037A603403O3392j0145k5333j85767R7712K04891P059j44493q3913k08947K40968
5026A558827J72200l5097j56534Q7748J618o8613K04478J26701j14606J59187
5016A935909r2585o3026k0505K30654p7037Q5509L1455j05556j89103j77128J77367
5005A735954R4993J68007K2108j92570r5294k07304M3198K70743q2188j25820
4995A631827K93514L62930k08782o6471L1037J65450m8215j12181r8536o2809
4985A887764p9241J42150j52823J34642L4638n3072j04716J9129N1514r9758J34611
$$ plain form
5058 1351934 1167426 1108867 1287390 1309077 1450290 1276744 1260936 1334526 1405416 1388400 1372671
5047 1372671 1508132 1437222 1235228 1352180 1378115 1508880 1444204 1539942 1460656 1603403
5037 1603403 1666795 1656650 1631317 1445550 1543262 1748153 1755212 1610719 1526806 1317859 1558827
5026 1558827 1731027 1695930 1539396 1627144 1628762 1560149 1764627 1891328 1776722 1935909
5016 1935909 1843324 1780298 1759793 1990447 1913410 1998919 2030374 1924818 1735715 1558587 1735954
5005 1735954 1830947 1998954 2021062 1828492 1733198 1525894 1569092 1839835 1757647 1631827
4995 1631827 1925341 2288271 2079489 2013018 2044055 2209505 2161290 2049109 1950573 1887764
4985 1887764 1808523 1950673 1797850 1932492 1967130 1914058 1809342 1828471 1879985 1780227 1914838
4974A914838k7220j21521j6161J37770j57295J26231J0988q2205J09185K8949
4964A923559J4705R0908k70505M3335R6460m7311L43410N9930q8478R4918k54151
4953B006780k32871J78152O097R6067j1543L20635J95890k70229K18714m6755
4943B460937M1284m5576m635N3055J0642J75604P6812n8113k8018J81806N0883
4932B914681J37725r3404l6489J10665R8528J00963J92712r1347J0262L17583
4922C661879J2563J94489K97669N2620Q1332J85736q3031N5652Q2380N1651M79848
4911E072788K45099Q7715P8220l2352l7727K74321J82742L39096L78331Q90114
4901G478347Q06925K48524L38081N31532P30596R27353J400742J704603K548380
$$ plain form
4974 1914838 1887618 1766097 1749936 1887706 1730411 1856642 1867630 1785425 1894610 1923559
4964 1923559 1938264 2029172 1758667 1802002 1898462 1851151 2194561 2254491 2166013 2260931 2006780
4953 2006780 1773909 1952061 1958158 2054225 2042682 2363317 2559207 2288978 2507692 2460937
4943 2460937 2502221 2456645 2452010 2505065 2515707 2691311 2768123 2710010 2681992 2863798 2914681
4932 2914681 3052406 2959002 2922513 3033178 3131706 3232669 3425381 3334034 3344296 3661879
4922 3661879 3674442 3868931 4166600 4219220 4300552 4486288 4403257 4458909 4541289 4592940 5072788
4911 5072788 5317887 5405602 5483822 5451470 5413743 5688064 5870806 6209902 6588233 7478347
4901 7478347 8285272 8533796 8871877 9403409 10134005 11061358 12462100 14166703 16715083
4892A6715083L874815M115766J747071j967339l104854k684895k735991k830310
4884A3129346k394026j431266r14074p30402o24156m56707n09877k35395Q6433
4875E919876l87474r0318p1767l01585O1587q4508r4386l473p8571j14865q8585
4864D665931O2961j13840j66384K38362J2864O5197Q1018R4811J11018j18319
4854D933619j2049K73155p1812j68209P5290M3345J7134J24147r0441j38582K67489
4843E253086K05881k5054r2262j02336n4843l2018K13990M4295Q9331J21363L12744
4832E934177j86444j95260K49015J86191J31200J55441p4K22152j8674j8805j1434
4821F447485k7458K30971J78063J07966K9034o6178J83223j32379J53179J88457
$$ plain form
4892 16715083 20589898 24705664 26452735 24485396 21380542 18695647 15959656 13129346
4884 13129346 10735320 9304054 8389980 7659578 7035422 6578715 6068838 5833443 5919876
4875 5919876 5532402 5442084 5370317 5068732 5130319 5045811 4951425 4947952 4869381 4754516 4665931
4864 4665931 4728892 4615052 4448668 4687030 4699894 4765091 4846109 4940920 5051938 4933619
4854 4933619 4921570 5194725 5122913 4954704 5029994 5073339 5090473 5214620 5124179 4985597 5253086
4843 5253086 5458967 5433913 5341651 5239315 5184472 5152454 5366444 5410739 5500070 5621433 5934177
4832 5934177 5747733 5552473 5801488 5987679 6118879 6274320 6274246 6496398 6477724 6458919 6447485
4821 6447485 6420027 6650998 6829061 6937027 6966061 6899883 7083106 6950727 7103906 7292363
4811G292363j26141K24301J40031K34560O5363j37466K13772K98022J16477K08882
4801H530164J54170N1388j51976J44711J27976M17731J71810J05102K47664L27793
4791A0126533L11170J82218K55291R1825K20485K77090L96743J85516J40340L91309
4781A2578520L33367M22188N06261N23704J86431K97513K69195L47190M66726
4772A5931095N02250O09504O75242K68858M99908P25095M89429O38666O46661
4763B0986708Q14086J012823J020770R87154J085984J307258J093943J340216
4755B9648942J377369J553199J561304J526449J931776K081929K333339K773568
4747D4787875L558005M093016M409835M999716M977541M157266K782965O04855
$$ plain form
4811 7292363 7166222 7390523 7530554 7765114 7830477 7693011 7906783 8204805 8321282 8530164
4801 8530164 8684334 8735722 8583746 8728457 8856433 9274164 9445974 9551076 9798740 10126533
4791 10126533 10437703 10619921 10875212 10967037 11187522 11464612 11861355 12046871 12187211 12578520
4781 12578520 12911887 13334075 13840336 14364040 14550471 14847984 15117179 15464369 15931095
4772 15931095 16433345 17042849 17718091 17986949 18486857 19211952 19701381 20340047 20986708
4763 20986708 21800794 22813617 23834387 24821541 25907525 27214783 28308726 29648942
4755 29648942 31026311 32579510 34140814 35667263 37599039 39680968 42014307 44787875
4747 44787875 48345880 52438896 56848731 61848447 66825988 70983254 73766219 74371074
4739G4371074j629868l003470l200892k934153k729530k044394j056473n60897
4731E7211397o3233N60863M76815O89263J235396J313823J763042K535193L651493
4722F9374052M635543N598718O385776O852672O233511M507754J990251r19236
4714A04659041m397981p098554p907896p736163o725084n632087m794199l663766
4706E6703311k518171k218664j909015j602672j296745r73514k61987J09827M09138
4697D6441508Q79569J738932K184301K499495K427965J872343K86799j813100
4689E6517812l835832m549943m637525m583040m258359l651961k874587k495827
4681B5630738j927540j968753j578909j309446j016533r36246j019953q98487
$$ plain form
4739 74371074 72741206 69737736 66536844 63602691 60873161 58828767 57772294 57211397
4731 57211397 57148164 57709027 58185842 58875105 60110501 61424324 63187366 65722559 69374052
4722 69374052 74009595 79608313 85994089 92846761 99080272 103588026 105578277 104659041
4714 104659041 100261060 93162506 85254610 77518447 70793363 65161276 60367077 56703311
4706 56703311 54185140 51966476 50057461 48454789 47158044 46184530 45922543 46032370 46441508
4697 46441508 47321077 49060009 51244310 53743805 56171770 58044113 58330912 56517812
4689 56517812 52681980 48132037 43494512 38911472 34653113 31001152 28126565 25630738
4681 25630738 23703198 21734445 20155536 18846090 17829557 16893311 15873358 14974871
4673A4974871n86178o52832q22294m14090m44094n01700l99534l42352k87070
4664A0524727l55805k72160j41867j57330l20075k51293o86767l31673j9485K5284
4654H013556r7991l44921m6762j48375l07293r8739l4197J5893m67520P3765m7868
4643F509548k21926o5833K4679J16512n6686k23504J02781m2345J31937L5974
4633F311137k0472j09170j26898L1749K16144J57186J78906K8310o4282R7317
4623F699927L7864P7899k76917n2920r8054p0463k27059J9668q0855k34789J2193
4612E806494O5889J64184R3903j21964K46658J20563J74324J13337o4936k9857
4602F568595J02261o5922j5358j22768j25230k03859l13230L5854L8433k58880
$$ plain form
4673 14974871 14388693 13735861 12913567 12499477 12055383 11553683 11154149 10811797 10524727
4664 10524727 10168922 9896762 9754895 9597565 9277490 9026197 8339430 8007757 7988272 8013556
4654 8013556 7915565 7570644 7523882 7375507 7068214 6969475 6935278 6951171 6483651 6557416 6509548
4643 6509548 6287622 6221789 6246468 6362980 6306294 6082790 6185571 6143226 6275163 6311137
4633 6311137 6290665 6181495 6054597 6086346 6302490 6459676 6638582 6666892 6602610 6699927
4623 6699927 6737791 6815690 6538773 6485853 6387799 6317336 6090277 6109945 6029090 5794301 5806494
4612 5806494 5872383 6036567 6130470 6008506 6255164 6375727 6550051 6663388 6598452 6568595
4602 6568595 6670856 6604934 6589576 6466808 6341578 6137719 5824489 5860343 5898776 5639896
4592E639896m95566k30906p6757J47273K23009k52717k07919J01553O3549J44592
4582E056007J6255l9503j91156P3183R7165p1993k10496P0486o849n08104j70602
4571D114393K9884l46990l08085q794j39479M4646j71589K1763r0938o6609j77083
4560B901119k4063n5423j33420K87550K1767M4563n5128M5957k18487J2463q1601
4549B745297K0310m1878j58083J19185o6446n9396P7599p0906j71323K56536R1521
4538B742416p0883M8893l1151k52048J73646J27065o1545q4831J51391r9103j43699
4527B500151J28148j65408K52230K27584N2024o5331j06417j13531L140K49624
4517B962214k15021K78385Q6525p6442j30424L9803o5079n4626l4520M6801k81228
$$ plain form
4592 5639896 5144330 4913424 4836667 4983940 5206949 4954232 4746313 4847866 4911415 5056007
4582 5056007 5072262 5032759 4841603 4914786 5011951 4939958 4729462 4799948 4793099 4284995 4114393
4571 4114393 4144277 3797287 3489202 3480408 3340929 3385575 3213986 3235749 3144811 3078202 2901119
4560 2901119 2877056 2821633 2688213 2975763 2997530 3042093 2986965 3032922 2814435 2826898 2745297
4549 2745297 2765607 2723729 2565646 2684831 2618385 2558989 2636588 2565682 2394359 2650895 2742416
4538 2742416 2671533 2720426 2689275 2437227 2610873 2737938 2676393 2591562 2742953 2643850 2500151
4527 2500151 2628299 2462891 2715121 2942705 2994729 2929398 2822981 2709450 2712590 2962214
4517 2962214 2747193 3025578 3112103 3035661 2905237 2945040 2879961 2825335 2790815 2837616 2556388
4506B556388J38061L00343R5494K23647Q6731j73983j51310K13871j67980J15076
4496C236338N005k52996K3288P3766J70310o8122L4060J94929j2184k70136k2369
4485C111889L2925j3094m5472J17713N2045l37194K6423P6967J97932k6343N3890
4474C247681J09252j00303k38446j8070o1469K3655J6055K8260M2283n4075K0918
4463C015741O713j22144l14115P5120K89972n1666J06870j57601j20847J00130
4453B828173L2433o6313O4653p923j27323J863K55799O6117j3381m21426q6748
4442B525924J00291K79419Q1838j4477N7265N3266o0800O1770m4885J11275L61298
4431C512184m14703k21303M19752J9455r6178N9769J75146k15428k4450J10170
$$ plain form
4506 2556388 2694449 2994792 3090286 3313933 3400664 3226681 3075371 3289242 3121262 3236338
4496 3236338 3241343 2988347 3011635 3085401 3255711 3187589 3221649 3416578 3404394 3134258 3111889
4485 3111889 3144814 3131720 3086248 3203961 3256006 2918812 2945235 3022202 3220134 3193791 3247681
4474 3247681 3356933 3256630 3018184 3000114 2938645 2962300 2978355 3006615 3048898 2994823 3015741
4463 3015741 3022454 2900310 2586195 2661315 2951287 2899621 3006491 2848890 2728043 2828173
4453 2828173 2860606 2794293 2858946 2851023 2723700 2725563 2981362 3047479 3034098 2612672 2525924
4442 2525924 2626215 2905634 2987472 2972995 3030260 3083526 3022726 3084496 3039611 3150886 3512184
4431 3512184 3097481 2876178 3295930 3315385 3219207 3278976 3454122 3238694 3214244 3324414
4421C324414p9469J78625n1092J02705K7835p6493n9016J89923r6378J05896K734
4410C569684m4818J88292L9479k08313K8488K73948M3448j5843j30374j49251
4400C594740k4318j08930j2243K30196J05037J4825m2836n4868K3469M6735j33903
4389C637904K03841L7025N9250J26425n4942j66684J5817J15055k4413J79856
4379D129134o1221N2975Q9242M0101n2338j66905J7313J7056N3378L25501J7782
4368D462018k86422N1978p0662r7139K25112K69073K62581o9475P5948o8555J496
4357D755953K25147l4971L3830l5297K00394O4107K5649k37283o6421L06947Q3880
4346E321935L8515R8244j2852O0198J86541n5392Q5810j8879K25553K5799L85869
$$ plain form
4421 3324414 3244945 3423570 3372478 3475183 3503018 3426525 3367509 3557432 3461054 3566950 3569684
4410 3569684 3524866 3713158 3752637 3544324 3572812 3846760 3890208 3874365 3743991 3594740
4400 3594740 3570422 3461492 3449249 3679445 3784482 3799307 3756471 3701603 3725072 3771807 3637904
4389 3637904 3841745 3878770 3938020 4064445 4009503 3842819 3858636 3973691 3949278 4129134
4379 4129134 4067913 4120888 4210130 4250231 4197893 4030988 4048301 4065357 4118735 4444236 4462018
4368 4462018 4175596 4227574 4156912 4059773 4284885 4553958 4816539 4747064 4823012 4754457 4755953
4357 4755953 4981100 4946129 4979959 4944662 5145056 5209163 5234812 4997529 4931108 5238055 5321935
4346 5321935 5360450 5458694 5445842 5506040 5692581 5637189 5722999 5704120 5929673 5955472 6341341
4335F341341J67546j44309p1446L6491J5450J01778K02136m316k95575J65317
4325F514413K82252J98015J09549Q1066O7236Q1129o4595J55779K89704K12138
4315G926686M3406N5624J88764K38503o8498K12269N8474J46776L76669J78095
4305I356768J3832L01296L75613P9108J59873K31331J29446K59035K61752K20136
4295A1388190K46308J64695K88776L12819K25850j19928L68814L04636K06369
4286A3386529L33496N41230n60K92820N00200J43627P0801J89631K26958O85269
4276A6370001K02572J1967M07675L81264K59465L77047K97057L76937K75377J65100
4266A9124462O08722K93368K65431L21517M89123L94297L03510M05418L90305
$$ plain form
4335 6341341 6508887 6364578 6293132 6329623 6345073 6446851 6648987 6644671 6349096 6514413
4325 6514413 6796665 6994680 7104229 7185295 7252531 7333660 7269065 7424844 7714548 7926686
4315 7926686 7970092 8025716 8214480 8452983 8384485 8596754 8655228 8802004 9178673 9356768
4305 9356768 9370600 9671896 10047509 10126617 10286490 10517821 10647267 10906302 11168054 11388190
4295 11388190 11634498 11799193 12087969 12400788 12626638 12506710 12875524 13180160 13386529
4286 13386529 13720025 14261255 14260695 14553515 15053715 15197342 15268143 15457774 15684732 16370001
4276 16370001 16572573 16584540 16992215 17373479 17632944 18009991 18307048 18683985 18959362 19124462
4266 19124462 19733184 20026552 20291983 20613500 21102623 21496920 21800430 22205848 22596153
4257B2596153L14378O85859O48562M35447N52099M85919N27563P00092Q88306
4248B7834378O49352O91195O49136J094773R49277J024205Q83567J005188J256613
4239C6037684J071992J385385J775594J360302J537919J520856J775991J879475
4231D8345198K062175K207697K170473K497942K420774K665978K708056K903756
4223F7982049L132597L200086L131678L190790L339443L342575L571546L671713
4215I4562477L237769L641747M217664L753071L887725L663068L683027L513483
4207A24160031L192762L309968L170244K789848K823582K809934K444145K163818
4199A46864332K163759K037209J697198J519798J039293Q80010K23448k08657
$$ plain form
4257 22596153 22910531 23596390 24244952 24680399 25232498 25718417 26245980 26946072 27834378
4248 27834378 28483730 29174925 29824061 30918834 31868111 32892316 33775883 34781071 36037684
4239 36037684 37109676 38495061 40270655 41630957 43168876 44689732 46465723 48345198
4231 48345198 50407373 52615070 54785543 57283485 59704259 62370237 65078293 67982049
4223 67982049 71114646 74314732 77446410 80637200 83976643 87319218 90890764 94562477
4215 94562477 97800246 101441993 105659657 109412728 113300453 116963521 120646548 124160031
4207 124160031 127352793 130662761 133833005 136622853 139446435 142256369 144700514 146864332
4199 146864332 149028091 151065300 152762498 154282296 155321589 156201599 156425047 156216390
4191A56216390n03109q26261j057926j319222j749174j611596j533084k117331
4183A45498687k409192k386456k909683k993188l140294l397876l469138l811314
4175A20981546m173374l969700l944724l976995l741029l584307l737814l615331
4167I0238272l400821l356215l626507l657850l563569l286901l231197l122163
4159F2993049k879385l089501k863537k494213k587558k399242k028128k156576
4151D2494909j987744j662400j889409j396170j243201j270170j323590j432560
4143C0289665j202951r16663r50459r11662o93388o72165o15368q60211m58857
4134B3007941l61085m03243m07329n05072l83236l46382l81121k27610l84560
$$ plain form
4191 156216390 155713281 154887020 153829094 152509872 150760698 149149102 147616018 145498687
4183 145498687 143089495 140703039 137793356 134800168 131659874 128261998 124792860 120981546
4175 120981546 116808172 112838472 108893748 104916753 101175724 97591417 93853603 90238272
4167 90238272 86837451 83481236 79854729 76196879 72633310 69346409 66115212 62993049
4159 62993049 60113664 57024163 54160626 51666413 49078855 46679613 44651485 42494909
4151 42494909 40507165 38844765 36955356 35559186 34315985 33045815 31722225 30289665
4143 30289665 29086714 28170051 27219592 26307930 25614542 24942377 24327009 23466798 23007941
4134 23007941 22646856 22243613 21836284 21331212 20947976 20601594 20220473 19992863 19608303
4125A9608303o33933j68276j85119o95985k88417j26611j33407l64631j12883
4116A6899041j74365m07757o5102l95123l19161k88887m21685k61349j74910k35333
4106A4155369l43604j87559K41l06987k93581q1847p0921k81380N5198R27j70580
4095A2475276l15711k04816Q193j77483o7802k20442k10742j09187q300J15703
4085A1284689j31069q7220P5897j15149o4298j77616k70513p4993P143M5760Q8764
4074A0581395J95412k03079K9824O5783l3482k02984k603q5206j58032K01670
4064A0388698l2191O547j18440J54177M70879j0108Q2368j34223n4198J68333
4054A0921842p52J11308o638K93080j38779m5589k7504J01169q329K2823q8736
$$ plain form
4125 19608303 18974370 18806094 18620975 17924990 17636573 17509962 17376555 17011924 16899041
4116 16899041 16724676 16316919 16251817 15856694 15537533 15248646 14826961 14565612 14390702 14155369
4106 14155369 13811765 13624206 13624447 13317460 13023879 12942032 12871111 12589731 12644929 12645856 12475276
4095 12475276 12159565 11954749 11962942 11785459 11717657 11497215 11286473 11177286 11168986 11284689
4085 11284689 11153620 11066400 11142297 11027148 10962850 10785234 10514721 10439728 10446871 10492631 10581395
4074 10581395 10776807 10573728 10603552 10669335 10635853 10432869 10430266 10345060 10187028 10388698
4064 10388698 10356507 10363054 10244614 10398791 10869670 10859562 10941930 10807707 10753509 10921842
4054 10921842 10921090 11032398 11025760 11318840 11180061 11134472 11106968 11208137 11199808 11222631 11133895
4043A1133895J37339L5198l21685J99372J28781r8987j2810l7776o2073n612l7394
4032A1058248j49980j66648l1316Q9747o8838j86617j50644N1777J54348j0812
4022A0589265j85400j8474P9513p0879q3993K00837K45113l2406o406Q0565q7242
4011A0710493L9870J79697Q5061O5504L3245o4994J86176N2725J1257J57953J29911
4000A1586898J49055K15610L31317K27791J20834K90667J44524K41250J56370
3991A3464316r0321J32875J00910P6464n803N5783R0236L7239L9140L11117n0353
3980A4161603q4347K77915K64102j6383k67151r642J3659j38880k64993K79552
3970A4215435j4313l6240J21221M3361J61857j1337K3215J94069L37965N4869
$$ plain form
4043 11133895 11271234 11306432 10984747 11184119 11312900 11213913 11201103 11163327 11101254 11095642 11058248
4032 11058248 10908268 10741620 10710304 10800051 10731213 10544596 10393952 10445729 10600077 10589265
4022 10589265 10403865 10385391 10464904 10394025 10310032 10510869 10755982 10723576 10717170 10797735 10710493
4011 10710493 10750363 10930060 11015121 11080625 11113870 11048876 11235052 11287777 11299034 11456987 11586898
4000 11586898 11735953 11951563 12282880 12510671 12631505 12922172 13066696 13307946 13464316
3991 13464316 13373995 13506870 13607780 13684244 13678441 13734224 13824460 13861699 13900839 14211956 14161603
3980 14161603 14077256 14355171 14619273 14602890 14335739 14326097 14339756 14200876 13935883 14215435
3970 14215435 14201122 14164882 14286103 14329464 14491321 14479984 14503199 14697268 15035233 15090102
3960A5090102m5382J74638o0681J24496J35987K42833K53043m6961J62081K44631
3950A6274787L13104J65721K12264L26746K68022K53153L27061L73186K26309
3941A8740353J12989L52372K18545M02175K99750L31448L55422K75211K36733
3932B1324998K53728N47512P84090K08403M77400K92001O07663N86825L88114
3923B5470734M40149J13155L60408N98452K74426O18692P90819M18237N71121
3914B9656193N55247N14028M69184O78648O87275Q14840O01582L32665P32600
3905C5042262J050053P80255J081103J156727O95525J030203J269185J358954
3897D3464267J469499J281299J649948J794085J950043K238004J893786K262003
$$ plain form
3960 15090102 15044720 15219358 15158677 15283173 15419160 15661993 15915036 15868075 16030156 16274787
3950 16274787 16587891 16753612 16965876 17292622 17560644 17813797 18140858 18514044 18740353
3941 18740353 18853342 19205714 19424259 19826434 20126184 20457632 20813054 21088265 21324998
3932 21324998 21578726 22126238 22910328 23118731 23596131 23888132 24495795 25082620 25470734
3923 25470734 25910883 26024038 26384446 26982898 27257324 27876016 28666835 29085072 29656193
3914 29656193 30211440 30725468 31194652 31873300 32560575 33375415 33976997 34309662 35042262
3905 35042262 36092315 36872570 37953673 39110400 39805925 40836128 42105313 43464267
3897 43464267 44933766 46215065 47865013 49659098 51609141 53847145 55740931 58002934
3889E8002934K247044J960626K133482J821927J412192J403573J490068J587423
3881G2059269J670817J641465J513340J736355J955678J891678J787826J701569
3873H5957997J475354J011191P90232K66243J86947O708l6098K16737O7591R6448
3863I0039350L79750M90371P29358P36309N29378N61970O83679M42804N36511
3854I5129480P80206N25635O02542R45912J279912J374527J574513J869611K285285
3845A06367623K542423K744372L192530L613011M075182M465191M809164M995431
3837A36804927N664532N411180N752874O110488N879497N802781N818424N573947
3829A82818650N551346N471012N785198O253922O348652O703102O700313O902720
$$ plain form
3889 58002934 60249978 62210604 64344086 66166013 67578205 68981778 70471846 72059269
3881 72059269 73730086 75371551 76884891 78621246 80576924 82468602 84256428 85957997
3873 85957997 87433351 88444542 89234774 89501017 89687964 89694672 89658574 89875311 89942902 90039350
3863 90039350 90419100 90909471 91638829 92375138 92904516 93466486 94150165 94592969 95129480
3854 95129480 95909686 96435321 97037863 97983775 99263687 100638214 102212727 104082338 106367623
3845 106367623 108910046 111654418 114846948 118459959 122535141 127000332 131809496 136804927
3837 136804927 142469459 147880639 153633513 159744001 165623498 171426279 177244703 182818650
3829 182818650 188369996 193841008 199626206 205880128 212228780 218931882 225632195 232534915
3821B32534915O724939O568555N819188N366019M667961L943340L747004L408330
3813B72780251L248786L561686L694013L997967M200571M137851M151694L780801
3805C03553620L689680L380483K799266K083198J620709J453908J175767J343315
3797C21099946J306178J171626J184713J207875J363002J054783J124421J098242
3789C30610786J094300N82134M55836M63301K95437L00067J014554J340366K024852
3780C38181633L436659M788307O443749Q366430J0660046J2577629J4700862J6708599
3772D15863914J8199366J9301620J8782670J7100929J4310448J0090349O189977
3765E19839273K300722j046006l361272m521848m719747m558954m415489l713828
$$ plain form
3821 232534915 239259854 245828409 251647597 257013616 261681577 265624917 269371921 272780251
3813 272780251 276029037 279590723 283284736 287282703 291483274 295621125 299772819 303553620
3805 303553620 307243300 310623783 313423049 315506247 317126956 318580864 319756631 321099946
3797 321099946 322406124 323577750 324762463 325970338 327333340 328388123 329512544 330610786
3789 330610786 331705086 332287220 332743056 333206357 333501794 333801861 334816415 336156781 338181633
3780 338181633 341618292 346406599 352850348 361216778 371876824 384454453 399155315 415863914
3772 415863914 434063280 453364900 472147570 489248499 503558947 513649296 519839273
3765 519839273 522139995 521093989 517732717 513210869 508491122 503932168 499516679 495802851
3757D95802851l823168m272286m967741p217942j0345439j4102177j7361710k1005871
3749D12706517k3176653k4600615k5496378k5081831k4254522k2512923k0638525
3742B46945070j8725884j6666879j5070205j3296169j1559048j0061122q460514
3735A53105249p954428o941333o387589n765484n333149m978685m811149m740194
3727A06193238m510299m130297l785794l560102l451340l303993k914648k805824
3719G7730941k964173k814247k584242k636575k585799k570012k181567k346523
3711E7047803k320830k006346k097992j746288j642102j652466j576148j504076
3703D2501555j396001j295207q90133j064030j109788j099764j003569o98749
$$ plain form
3757 495802851 491979683 487707397 482739656 475521714 465176275 451074098 433712388 412706517
3749 412706517 389529864 364929249 339432871 314351040 290096518 267583595 246945070
3742 246945070 228219186 211552307 196482102 183185933 171626885 161565763 153105249
3735 153105249 145150821 138209488 131821899 126056415 120723266 115744581 110933432 106193238
3727 106193238 101682939 97552642 93766848 90206746 86755406 83451413 80536765 77730941
3719 77730941 74766768 71952521 69368279 66731704 64145905 61575893 59394326 57047803
3711 57047803 54726973 52720627 50622635 48876347 47234245 45581779 44005631 42501555
3703 42501555 41105554 39810347 38920214 37856184 36746396 35646632 34643063 33944314
3695C3944314p79647o22143p63660m53790n88047p69180p83940m72500o28872
3686B8082535n13539o41599p39657k15570o08905o84152m84838n43274k41720
3677B3409281j79561n03755l96581l06525l59540m59293p0663l38820o80217n28760
3667A9585566o1413l80501m11989k91576k19406l18075k88707O459j93715k04589
3657A7222054J0910L3053k57730l61837j21780l8236l95909j76168j35910j64905
3647A5613542p6800j7263j1408r9806j26886l22739l9509o9868O1098k11159k45464
3636A4453738L0124o2926j52791j15781q2786j81542p2820R795j59502M4430J05708
3625A3815647r6405l02642j75744K4908j79256Q021R1210k4732J40872j83430
$$ plain form
3695 33944314 33164667 32542524 31778864 31325074 30737027 29967847 29183907 28711407 28082535
3686 28082535 27568996 26927397 26187740 25972170 25363265 24679113 24194275 23651001 23409281
3677 23409281 23229720 22725965 22329384 22022859 21663319 21204026 21133363 20794543 20114326 19585566
3667 19585566 19524153 19143652 18731663 18440087 18220681 17902606 17613899 17620358 17426643 17222054
3657 17222054 17232964 17266017 17008287 16646450 16524670 16486434 16090525 15914357 15778447 15613542
3647 15613542 15536742 15519479 15508071 15408265 15281379 14958640 14919131 14849263 14910361 14699202 14453738
3636 14453738 14483862 14420936 14268145 14152364 14069578 13888036 13815216 13825011 13665509 13709939 13815647
3625 13815647 13719242 13416600 13240856 13265764 13086508 13094529 13185739 13161007 13301879 13118449
3615A3118449q9529L35572O7676q0346k87823K08237J73823R80j8428Q5605K2789
3604A3537005k00253M1629J57748J70791r9896J04125J95490J77644j01692l506
3594A3979085m3185N469J18185k13721l4665j13634K07697j29294K93176J10207
3584A4179320j19539M05995K4224k72429l6462K47093M0122J88707P4795r1856
3574A4639970j780J30190O3531P5899R4183J14605L04890J85453k23358k56K28015
3563A5611342K18712p9453K33519J73259J78827N8684L103M16755K74168L9522
3553A7128438j61840J74282M05804K51377J85431K2036K06572J44429J83030L39568
3543A8879127K45478L55922O2723K49904J51358L19583M63250K68009L72365J98036
$$ plain form
3615 13118449 13028920 13364492 13432168 13351822 13063999 13272236 13446059 13447039 13428611 13514216 13537005
3604 13537005 13336752 13378381 13536129 13706920 13607024 13711149 13906639 14084283 13982591 13979085
3594 13979085 13935900 13941369 14059554 13845833 13811168 13697534 13905231 13775937 14069113 14179320
3584 14179320 14059781 14465776 14490000 14217571 14181109 14428202 14468324 14657031 14731826 14639970
3574 14639970 14638190 14768380 14831911 14907810 15001993 15116598 15421488 15606941 15383583 15383327 15611342
3563 15611342 15830054 15750601 15984120 16157379 16336206 16394890 16397993 16814748 17088916 17128438
3553 17128438 16966598 17140880 17546684 17798061 17983492 18005528 18212100 18356529 18539559 18879127
3543 18879127 19124605 19480527 19543250 19793154 19944512 20264095 20727345 20995354 21367719 21565755
3533B1565755M65023L77413M5083K74464L44107M38989N73810N66600N23838M33684
3523B5608766N29595O80818Q97107R82124Q58986J293981J394316J340881J088743
3514C4675317J074012P65659P01224N51589J53713L74400L98307O9825K7166R2914
3504C8884126J29176L72559M12642L19350K50990L53896J74634j25169l22886
3495D0449318n48244m84654p87448p85096m68611k67448l51797o8695J50345k14542
3485C6623128L01809M13365O34212P88485P71553J181045J228732J258737R74080
3476D4175146J423406J483047J694352J853363J689081J922959J553059J871245
3468E7665658J746499J318157Q65033J22183n89729j160701j414254j251687j252670
$$ plain form
3533 21565755 22030778 22408191 22453274 22727738 23071845 23510834 24084644 24651244 25175082 25608766
3523 25608766 26138361 26819179 27716286 28698410 29557396 30851377 32245693 33586574 34675317
3514 34675317 35749329 36514988 37216212 37767801 37921514 38295914 38694221 38764046 38791212 38884126
3504 38884126 39013302 39385861 39798503 40117853 40368843 40722739 40897373 40772204 40449318
3495 40449318 39901074 39416420 38628972 37843876 37375265 37107817 36756020 36687325 36837670 36623128
3485 36623128 36924937 37338302 37972514 38760999 39532552 40713597 41942329 43201066 44175146
3476 44175146 45598552 47081599 48775951 50629314 52318395 54241354 55794413 57665658
3468 57665658 59412157 60730314 61595347 61717530 61127801 59967100 58552846 57301159 56048489
3459E6048489p73115o41929j584355k291527k261370j934366j920273j482864
3451D3158690j413911j379876j222736j161017q43139n66685m65652k35029J7596
3442C5888241K56986J63975q5852m69265k09696K6396J23315M53887O05013Q16206
3432C7569206J065070N06912k3232Q24329J416613J992235J853125K90408j667832
3423D3826834k250561j976721j757985j948301j901928j761114j201136j017323
3415C0011765p54322n67381l05296k20937j8101m8887J09785N631j80168K19403
3405B8251492N46989N44246k12602n95449o07018k97457j41474J79620K53568
3396B7921915O11217R89161J174456O44598o68641r39881r63899r96910q38714
$$ plain form
3459 56048489 55275374 54633445 53049090 50757563 48496193 46561827 44641554 43158690
3451 43158690 41744779 40364903 39142167 37981150 37138011 36571326 36105674 35870645 35888241
3442 35888241 36145227 36309202 36223350 35754085 35544389 35570785 35694100 36147987 36753000 37569206
3432 37569206 38634276 39141188 39117956 39942285 41358898 43351133 45204258 45494666 43826834
3423 43826834 41576273 39599552 37841567 35893266 33991338 32230224 31029088 30011765
3415 30011765 29257443 28690062 28384766 28163829 28145728 28096841 28206626 28212257 28032089 28251492
3405 28251492 28798481 29342727 29130125 28534676 27927658 27630201 27488727 27668347 27921915
3396 27921915 28533132 29522293 30696749 31341347 30672706 29732825 28768926 27772016 26933302
3387B6933302q39843n77962m58268l07129l2032l52563j89451N1120J11108L69680
3377B4707962J25873J78064O66258O45021J030944J076906J282967M73211j208862
3368B8978344j532235j650723j177001q40727l87264m23688l32264l90113k4629
3359B2219700k54676r5024k4425q1904j932J88265q763L3337K18977J03217L97778
3348B2694550K49026N73039N40088P48400J313967J373366J8887j469105j713209
3339B4329009j290134j234851q24982m65902m57680j06955l26861l24625j88495
3330A9108524o1541j13169j30396k42447Q9238j00754k06565j10199k95874j60270
3320A7776547j35567o5951j53270O9703j00561n9015q6380k64298r4089j51479
$$ plain form
3387 26933302 26093459 25515497 25057229 24750100 24718068 24365505 24176054 24227174 24338282 24707962
3377 24707962 24833835 25011899 25678157 26323178 27354122 28431028 29713995 30187206 28978344
3368 28978344 27446109 25795386 24618385 23777658 23390394 22966706 22634442 22244329 22219700
3359 22219700 21965024 21870000 21845575 21763671 21761739 21950004 21941241 21974578 22193555 22296772 22694550
3348 22694550 22943576 23516615 24056703 24805103 26119070 27492436 27511323 26042218 24329009
3339 24329009 23038875 21804024 20979042 20513140 20055460 19948505 19621644 19297019 19108524
3330 19108524 19046983 18933814 18803418 18560971 18650209 18549455 18342890 18232691 17936817 17776547
3320 17776547 17640980 17575029 17421759 17491462 17390901 17331886 17245506 16981208 16887119 16735640
3310A6735640m0167j53268j19367J7833j93257M3671n6598j48210k57946n2217
3300A5776114q534j82507j73582o8341O2880M3692l51997k02960j0014j2987j27888
3289A4743876j885j99145p3225J63412r3139n10928q7465k1440k85401o072O056
3278A3634644K7768k57812j19759k30631L2632o0051R3448o8728n2345j80125
3268A2819041l23554K5063k7718k1848J72634l61455k28624K8863N7755n4945
3258A2085212n8222k25955j31336k34091m3537K17031j64776j25188l24824o5457
3248A0928857j238R6448k9968j87483j12822K59882n3759k29955k32801J8159
3238A0455320m0138r4835N2358o8262M3932K57905j14336j31610k81670m7771
$$ plain form
3310 16735640 16695473 16542205 16422838 16440671 16247414 16291085 16234487 16086277 15828331 15776114
3300 15776114 15767580 15585073 15411491 15343150 15406030 15449722 15097725 14894765 14884751 14871764 14743876
3289 14743876 14741991 14542846 14469621 14633033 14539894 14028966 13941501 13920061 13634660 13628588 13634644
3278 13634644 13662412 13404600 13284841 13054210 13086842 13026791 13120239 13051511 12999166 12819041
3268 12819041 12495487 12520550 12492832 12470984 12643618 12282163 12053539 12082402 12140157 12085212
3258 12085212 12026990 11801035 11669699 11435608 11392071 11609102 11444326 11319138 10994314 10928857
3248 10928857 10927619 11024067 10994099 10806616 10693794 10953676 10899917 10669962 10437161 10455320
3238 10455320 10415182 10320347 10372705 10304443 10348375 10606280 10491944 10360334 10078664 10030893
3228A0030893J49742M4246m689q1568N9912k71514j24882L4270J55280L314J86205
3217A0181209K96680O4925j51099K19428O4385j07349K30644j54638N0133j77888
3207A0516430o9528O297J38364q0208j16201N3516p3354J04394q4819k22890P2790
3196A0244791j66195L3150q4610q5877R4772J15113P6589o6716L9055L8455k1666
3185A0216861J79364L26506L91299K07872K30513J77957p8084J67779j37022l11593
3175A1371452j72766P7383L27722J57583L0831J18110J07847J75513l3469O3001
3165A2223207k57638J57765k4651O1933j68139J08450L91332J55782n9917J86218
3155A2774342J13026J25594K0759N5371K08096J61781K37975J52333q4893L782
$$ plain form
3228 10030893 10180635 10224881 10220192 10138624 10198536 9927022 9802140 9836410 9991690 9995004 10181209
3217 10181209 10477889 10542814 10391715 10611143 10675528 10568179 10798823 10644185 10694318 10516430
3207 10516430 10446902 10453199 10591563 10511355 10395154 10448670 10375316 10479710 10394891 10172001 10244791
3196 10244791 10078596 10111746 10027136 9941259 10036031 10151144 10227733 10161017 10200072 10238527 10216861
3185 10216861 10396225 10722731 11114030 11321902 11552415 11730372 11652288 11820067 11683045 11371452
3175 11371452 11198686 11276069 11603791 11761374 11792205 11910315 12018162 12193675 12160206 12223207
3165 12223207 11965569 12123334 12098683 12160616 11992477 12100927 12492259 12648041 12588124 12774342
3155 12774342 12887368 13012962 13033721 13089092 13297188 13458969 13696944 13849277 13764384 13768166
3145A3768166K8954M8974J28512J39563J6790J77917K86348N26356J32266J08816
3135A5362662M45549L41028N11044L35745J89140M74447P40284J07445n3089j34597
3125A8319658r3266l05128n79831q75595n59389o62100l01187j6066k86996l0970
3115A4609130O5903J90900J27488J0601P1342K87486M78346K44091J6167J72137
3105A6273591M75075J51747K78736J83626K66531N03k74836j34613k34921o05838
3095A6379601o11789n47405m66461o84341m96569m40774k94745l79755k85122
3086A2172640m7908J57420j70904r0415K1565p3142J22845N9822J9482R788l98247
3075A1782946l23819j28422k20744K8636l52843m40368n54805k42466n78152k51641
$$ plain form
3145 13768166 13797120 13846094 13974606 14114169 14130959 14308876 14595224 15121580 15253846 15362662
3135 15362662 15808211 16149239 16660283 16996028 17185168 17659615 18399899 18507344 18454255 18319658
3125 18319658 18226392 17921264 17341433 16465838 15906449 15244349 14943162 14927096 14640100 14609130
3115 14609130 14675033 14865933 14993421 15004022 15075364 15362850 15841196 16085287 16101454 16273591
3105 16273591 16748666 16900413 17179149 17362775 17629306 17629809 17354973 17220360 16985439 16379601
3095 16379601 15767812 15220407 14753946 14069605 13573036 13132262 12837517 12457762 12172640
3086 12172640 12124732 12282152 12111248 12020833 12042398 11969256 12092101 12151923 12171405 12181193 11782946
3075 11782946 11459127 11330705 11109961 11138597 10785754 10345386 9790581 9548115 8969963 8718322
3065H718322k76018m39029m04241j17520j64509j14508k41230k27233n4821j30779
3055F548434j89063k39838n7774j80391j8316r9258k62578j1882m4742k77639
3045E166953M0710j50685j30049k33332k26880N6306r9637J91767M7162k20095
3035D442220k76459M2936K9959j09690j73444m1424L7382j95536j77345j01646
3025C476953N1943p5050j19038j03957k5489K37064L3k32017k7746J32514O43
3014C315853k2327l98902N0627J82065m7744k08804m5303J75877l2019o6294j24740
3003B778289r13j26966M1215q8598m0989n1987K40999N2578l42043n8693K22045
2992B624937j89872n853k33195K0198J22555n1232q787n8670k00195J85116Q6053
$$ plain form
3065 8718322 8442304 8003275 7599034 7481514 7317005 7202497 6961267 6734034 6679213 6548434
3055 6548434 6359371 6119533 6061759 5881368 5863052 5763794 5501216 5489334 5444592 5166953
3045 5166953 5207663 5056978 4926929 4693597 4466717 4523023 4423386 4615153 4662315 4442220
3035 4442220 4165761 4208697 4238656 4128966 3955522 3914098 3951480 3755944 3578599 3476953
3025 3476953 3528896 3453846 3334808 3230851 3205362 3442426 3442459 3210442 3182696 3315210 3315853
3014 3315853 3293526 2894624 2945251 3127316 3079572 2870768 2825465 3001342 2969323 2903029 2778289
3003 2778289 2777376 2650410 2691625 2603027 2562038 2510051 2751050 2803628 2461585 2402892 2624937
2992 2624937 2435065 2429212 2196017 2216215 2338770 2287538 2278751 2220081 2019886 2205002 2291055
2981B291055k29759J06747j26478K31264k6714k93552j03745j23957j15590n1189
2971A558082O0442K11496m5658j40509J16102k63120l2125J55755j21312N1958
2961A551111O6080r580j69692K33546k11k21169J24049J82311P090j30274P993
2950A641254r3337p5701O7531j20291J01229p6518j24505J55255n5001p5530K69281
2939A613667P6983j58335p5184j05960L309j94734j50510J99649m6282j01570
2929A061033Q9318N5910M3647J6059l9775j20491j32703R3835Q6273J23886Q5708
2918A362700k31856q9476n4026J03777J66226q6108j10451j91958J77377k3584
2908A022621r4690o98j4985k580J12187j4269J33395o3534j93063J05348o0890
$$ plain form
2981 2291055 2061296 2168043 2041565 2272829 2246115 1952563 1848818 1724861 1609271 1558082
2971 1558082 1618524 1830020 1784362 1643853 1759955 1496835 1464710 1620465 1499153 1551111
2961 1551111 1617191 1607611 1437919 1671465 1671254 1450085 1574134 1756445 1763535 1633261 1641254
2950 1641254 1547917 1472216 1539747 1419456 1520685 1444167 1319662 1474917 1419916 1344386 1613667
2939 1613667 1690650 1532315 1457131 1351171 1354480 1159746 1009236 1208885 1162603 1061033
2929 1061033 1150351 1206261 1249908 1265967 1226192 1105701 972998 1066833 1153106 1276992 1362700
2918 1362700 1130844 1041368 987342 1091119 1257345 1171237 1060786 868828 1046205 1022621
2908 1022621 927931 927233 912248 909668 1021855 1007586 1140981 1077447 884384 989732 928842
2897I28842j76260R4768J20564o4057P4820r0883k5738k7807k5182j39129J42615
2886H12553J25444J21653R7564k75821J7394J51677J9257j48936m6341J52167
2876A026611j47456m5873j66747j3390N3746Q9646r8103M4088q5744j630j66387
2865D88761n3261L54653R3308O0283N0668j02177j56422J20957o7739o8920l8993
2854F81118J49091J16919k05846J60490j36120o7927N4052J6037l1154l02221
2844D34439J17448J26758R0514j15186K8785j63981K71673j66994n0299J21275
2834F94432j17954k2508R9265q3204n9963K79288N172j46625L4959q8765k14350
2823C79747J34829K70746r3654k0349k2958K1842J8220j20750K25662n286r4971
$$ plain form
2897 928842 752582 847350 967914 903857 978677 887794 862056 834249 809067 669938 812553
2886 812553 937997 1059650 1157214 881393 898787 1050464 1069721 920785 874444 1026611
2876 1026611 879155 833282 666535 653145 706891 796537 698434 742522 656778 655148 488761
2865 488761 435500 790153 883461 943744 994412 892235 735813 856770 789031 720111 681118
2854 681118 830209 947128 741282 901772 765652 697725 751777 767814 736660 434439
2844 434439 551887 678645 769159 653973 682758 518777 790450 623456 573157 694432
2834 694432 576478 553970 653235 570031 510068 789356 794528 647903 682862 594097 379747
2823 379747 514576 785322 691668 671319 648361 670203 688423 567673 793335 788049 693078
2812F93078R1087M8095j73933M7583j26700k6064n4139k37423q638K76807K0545
2801E50298o2808j35259j51246J72630L17980j06884n7740N2901N3034q1429q5423
2790D66054L7198j99920O6621Q3731j7911J19040P5582m3492j03203o4634q49
2779D18217o0350p2211M3382J05885j45773p1934K14999q3590R4914L8536j66051
2768C16024j67156L41183J39815n8187j73623P2258K35119j08406l17210J24824
2758D04641O1352N857q7538j78873J47763J07692P1644n2342l8990J30271k2231
2747E49246j4205k18861n8459J06025r0918l3277o6993j66758J70075J62328j83571
2736A54632K07495j16399L3322j53021J2608J91368L7317k57193N6575o1390J73697
$$ plain form
2812 693078 784165 832260 658327 705910 579210 553146 499007 261584 252946 529753 550298
2801 550298 487490 352231 200985 373615 691595 584711 526971 579872 632906 551477 466054
2790 466054 503252 303332 369953 453684 435773 554813 630395 586903 483700 419066 418217
2779 418217 357867 285656 329038 434923 289150 217216 432215 348625 443539 482075 316024
2768 316024 148868 490051 629866 571679 398056 470314 705433 597027 279817 404641
2758 404641 465993 471850 384312 205439 353202 460894 532538 480196 441206 571477 549246
2747 549246 535041 316180 257721 363746 272828 239551 172558 5800 175875 338203 154632
2736 154632 362127 245728 279050 126029 138637 330005 367322 110129 166704 105314 279011
2725B79011M0030N7608j01347P939O5001j80642j08259N6005q2507J90213J2088
2714B35140j6671J03750J34187P7203j22714L2251R17P3486j89874j23676J07295
2703C11294m3158j26016J3306L7789R8328j08001k3452J58338j57831k68782O5156
2692d3029L04918p3016p2470M243J23139K4225M3942o1382k81609J56761r6473
2681B9249J03719j11876J13045p025j32278K03808J88627j18757J63876j9224
2671D13164l233O2211j83571j66801m985O4502m6813k409j14343N6401J60592
2660B34715m0270j76552K24552K6804n8625j09470k5156K41629j30077k25449
2650c7899J54053j27318o9991J46673l4431J24077j89039r0906n5122O8209Q3556
$$ plain form
2725 279011 319041 376649 275302 283241 348242 167600 59341 115346 32839 223052 235140
2714 235140 218469 322219 456406 533609 410895 443146 444063 517549 327675 203999 311294
2703 311294 268136 142120 155426 193215 291543 183542 160090 318428 160597 -108185 -43029
2692 -43029 261889 188873 116403 120646 243785 268010 311952 250570 -31039 125722 29249
2681 29249 132968 21092 134137 127112 -5166 198642 387269 268512 432388 413164
2671 413164 409931 472142 288571 121770 116785 181287 134474 132065 17722 74123 234715
2660 234715 194445 17893 242445 269249 210624 101154 75998 317627 187550 -37899
2650 -37899 116154 -11164 -81155 65518 31087 155164 -33875 -124781 -179903 -111694 -28138
2639b8138L3665K17161J3505q8186J41968j32830m4453J8089j91135P8352J10114
2628A28112j41717J11360O7640l5775k8980M8452k5847j71176m43P5482J52877
2617A79985q6653K55382j21704q4476K0415J23884k2275j64463M4354J01587o1276
2606A84760n0114J96106j09124J74415j35913R575K59477J9372O0668k1584j29866
2595D57772l4494j26553P5385j1663j47602k7666j15935n8840J03780j433J52281
2584B65032J12694j07850K1868r4619M3121K5424L01523j19736j83243j62983
2574A01231J28055j7038k11983J13749j09382r6528K05845j52394k2729P6503
2564A5329J19975K36064j37389J2872o8420l3546j2118o1750O1158j38564p525
$$ plain form
2639 -28138 5527 222688 236193 148007 289975 157145 112692 130781 -60354 17998 128112
2628 128112 -13605 97755 165395 129620 100640 149092 123245 -47931 -48374 27108 179985
2617 179985 93332 348714 227010 142534 162949 286833 264558 100095 144449 246036 184760
2606 184760 134646 330752 221628 396043 260130 269705 529182 548554 609222 587638 457772
2595 457772 423278 296725 372110 360447 212845 185179 69244 10404 114184 112751 265032
2584 265032 377726 269876 291744 197125 240246 265670 567193 447457 264214 101231
2574 101231 229286 212248 265 114014 4632 -91896 113949 -38445 -61174 15329
2564 15329 135304 371368 233979 246851 178431 144885 132767 71017 132175 -6389 -13914
2553a3914K1057K5377K42135l5960J1905j22413Q5787R0175j50644N5780J22514
2542C31799m5969M6720m3449J986J19182m1249p3918R707p9507Q1494N5204Q5662
2530D47662k11888j9366o1271n2169K14924j40390q219o8144J018P8982n8251
2519A22888J67942J52287J7989k25219j33861j6555k4716J28641K7975o9568j08868
2508C8935M08J57690J29360j53240k08196L02917J0302m0147r3775K8307o583
2497A65978J60984k5743o2536J98991n8573o8560j0983J38822p7154n3665J52228
2486D59789J29251k13204o0116K6473R1419k96136n3732K04305L21881k25836
2476C84094j57533N5478k5001M242K1320J44816J42796o372M5048k4582o9581
$$ plain form
2553 -13914 7143 32520 274655 238695 250600 128187 213974 304149 153505 209285 331799
2542 331799 285830 332550 289101 291087 410269 369020 295102 304809 225302 306796 362000 447662
2530 447662 235774 216408 155137 102968 317892 177502 169283 101139 102157 181139 122888
2519 122888 290830 443117 461106 235887 102026 85471 60755 189396 217371 147803 38935
2508 38935 39343 197033 326393 173153 -35043 267874 278176 238029 144254 172561 165978
2497 165978 326962 301219 238683 437674 379101 310541 299558 438380 361226 307561 459789
2486 459789 589040 375836 315720 342193 433612 137476 83744 288049 609930 384094
2476 384094 226561 282039 257038 261280 282600 427416 570212 563840 608888 584306 514725
2465E14725K6813J8212j7832J45981k0422k59086n1506j21342L1818J5686O0494
2454C43541O6255k17354L8530M6886n8968P0181K02443K0598j05050J67613J19939
2443F94614k60665J48001J39463M9320L01246j34492R3021m8692k0274J06588
2433A068130o9390M62J54323J1603J78015P2896k15023J49574j78075J36782J72969
2422A482266K2363R4703j85335m7407K6007k0705J16878J58074J59297k20161
2412A585980k6424J54272l9739l496K21931N0421j55373j10402N8753O2177J26719
2401A924819M0452J0378m6794q2956J49140J33697R8225j18079j32799J26196
2391B102279K64484J01523M6597N30q6519k4424L06108K57117o156j14275J60256
$$ plain form
2465 514725 541538 559750 541918 687899 667477 408391 356885 235543 267361 283047 343541
2454 343541 409796 192442 230972 277858 218890 289071 491514 512112 407062 574675 694614
2443 694614 433949 581950 721413 770733 1071979 937487 1030508 981816 961542 1068130
2433 1068130 998740 999202 1153525 1165128 1343143 1416039 1201016 1350590 1172515 1309297 1482266
2422 1482266 1504629 1599332 1413997 1366590 1392597 1371892 1488770 1646844 1806141 1585980
2412 1585980 1559556 1713828 1674089 1670593 1892524 1942945 1787572 1677170 1735923 1798100 1924819
2401 1924819 1965271 1975649 1928855 1845899 1995039 2128736 2226961 2108882 1976083 2102279
2391 2102279 2366763 2468286 2514883 2515413 2428894 2404470 2710578 2967695 2961539 2847264 3007520
2380C007520J85519L19763o333p6611P6157K93944M2598J22479K32263Q9557J11631
2369D398487L29305J88740O2462O7636M73921j911K04262J39614K44610K56596
2359F363722m5012k1326R5559K04263M03437L00190L21895N61522K24540L35393
2349H744183N94000P01518N54023J077030Q35402P98220Q13408O35772J046414
2340A5799970J479029J926061K149679K852689L591476M865065O455259Q768331
2332D7887559J3152484J8960090J3088738q317333j9199597j6435594j1156250
2325C7980097p361440n732484m368772l101301k208841j569625j075059j036787
2317A1525788n68252n76673m75259p98880p89220p20219p37405n11037m93490
$$ plain form
2380 3007520 3193039 3512802 3506469 3429858 3506015 3799959 3842557 3965036 4197299 4286856 4398487
2369 4398487 4727792 4916532 4978994 5046630 5520551 5518640 5722902 5862516 6107126 6363722
2359 6363722 6318710 6297384 6392943 6597206 7000643 7300833 7622728 8184250 8408790 8744183
2349 8744183 9338183 10039701 10593724 11670754 12506156 13304376 14117784 14753556 15799970
2340 15799970 17278999 19205060 21354739 24207428 27798904 32663969 39119228 47887559
2332 47887559 61040043 80000133 93088871 84771538 65571941 49136347 37980097
2325 37980097 30618657 24886173 20517401 17416100 15207259 13637634 12562575 11525788
2317 11525788 10957536 10380863 9905604 9106724 8317504 7597285 6859880 6348843 5855353
2308E855353m67584l47541j94865k05592k90712j20810m7864m76091k16849k69958
2298C217487q6137k07819j10157j1072j26473j68724l081k29085l02624j54895
2288A817420m6218K1980j3681J9612j64500P2201J39462k03105k46459j4763K6893
2277A408842M7353j3420j76928N1191o1796k67001R9554J5158j80178j41501L1138
2266H12412Q6558m4437J86972M0221l80617J43061O6685m50j33723r9791L3728
2255G10619j02552j77027J19947M4001k8377k6311J16230J49650j80503j84034
2245D41643j4944P6259j33718R3708L2746N5555j65200j54019N8709J88370q4525
2234C94584J39373O9954j36908J9690J24718j70645J69K02258o7931j30065J26532
$$ plain form
2308 5855353 5387769 5040228 4845363 4639771 4349059 4228249 4180385 3704294 3487445 3217487
2298 3217487 3131350 2923531 2813374 2802302 2675829 2507105 2504024 2274939 1972315 1817420
2288 1817420 1771202 1793182 1779501 1799113 1634613 1706814 1846276 1643171 1396712 1381949 1408842
2277 1408842 1456195 1442775 1265847 1317038 1255242 988241 1087795 1102953 922775 781274 812412
2266 812412 898970 854533 1041505 1081726 701109 844170 910855 910405 776682 676891 710619
2255 710619 608067 431040 550987 594988 566611 540300 656530 806180 625677 441643
2245 441643 426699 502958 369240 462948 495694 551249 386049 232030 290739 479109 394584
2234 394584 533957 603911 467003 486693 611411 440766 440935 643193 575262 445197 571729
2223E71729K1229q4896j72081j9977n2168L9487j35458k65461K13462J63709K17800
2212D97375k27350n7772j63258k4816K11742Q821N750p1220l64854L8341J65938
2201A8697L03596J94699m7371k09557q5682J33699j62888L244R8974k48944j75357
2190a76890J05968R1606k73517Q7307K19067k80286R7142J11337j03155K70704
2180A49283Q0026j29850o2212J19320k7298j8865L5015p9713J6060K6783j09330
2169g81p2697J35797l09884J62681J04332l4921Q5881k1173j24936k1373N9258
2158c7816J51723K61592k86600j26457P519R4125m2606Q2496J02368K3729j84779
2147D5294N0380J1492j86786P5646l9047R735j00277r497N5232j5901j12261J39016
$$ plain form
2223 571729 592958 508062 335981 316004 263836 303323 167865 -97596 115866 279575 497375
2212 497375 270025 212253 48995 24179 235921 244742 250492 179272 -185582 -147241 18697
2201 18697 322293 516992 469621 260064 174382 308081 145193 148437 247411 -1533 -176890
2190 -176890 -70922 20684 -252833 -165526 53541 -226745 -129603 -18266 -121421 149283
2180 149283 229309 99459 37247 156567 129269 110404 145419 65706 81766 108549 -781
2169 -781 -73478 62319 -247565 -84884 19448 -15473 70408 49235 -75701 -97074 -37816
2158 -37816 113907 375499 88899 -37558 -30039 64086 21480 103976 206344 230073 45294
2147 45294 95674 107166 -79620 -3974 -43021 -33286 -133563 -143060 -87828 -103729 -215990 -76974
2135g6974O9000m4563k3753J27316J7552n2674J2645j43355j17334K56451j2886
2124A1425j3020J8970M884R9702j46354k76267J69540K71530N7978O5186r7076
2113A66498N5305j76571k966O7726P1486j17740l4029N6311J94078l6725m444
2102B38929L5949j16200j83494K5190J40786K36206J60618j48854r2390l13218
2092a6478J92403N4097j96379q2230J17759r798k10179J67807q6395j9994P8383
2081a1004J11281n0827j56253K7784K00254p7255j47484k02763K6837K79656j82107
2070a81881k3306R0454J5255j79526O8941K15448J40017R1559N4723J93564Q1927
2059E67175l17849L9994J9837q3578J52166j30758j37098R6236j79813k04270
$$ plain form
2135 -76974 -7974 -52537 -76290 51026 68578 15904 28549 -114806 -232140 24311 11425
2124 11425 -1595 17375 22259 121961 -24393 -300660 -131120 140410 198388 263574 166498
2113 166498 221803 45232 42266 109992 181478 63738 29709 86020 280098 243373 238929
2102 238929 274878 158678 -24816 374 141160 377366 537984 389130 296740 -16478
2092 -16478 175925 230022 33643 -48587 69172 59374 -150805 17002 -69393 -89387 -11004
2081 -11004 100277 49450 -106803 -79019 121235 43980 -103504 -306267 -279430 226 -181881
2070 -181881 -205187 -114733 -99478 -279004 -210063 5385 145402 236961 291684 485248 567175
2059 567175 249326 289320 309157 225579 377745 246987 109889 206125 26312 -177958
2049a77958K41509J4411k33111q3622P7354P9196j55671j53579L59402N0251n6203
2038c8021o355j28747J90926N1964j40918J05671O2221j52072J00513j68809k69795
2027c93422J01930J22487j1728O3218O9909M9398j82159O3741r5220O4556K98824
2016A51534k71344j1770J21300q1516k8960q6295M7259M770P8446N0121P5286
2005D8831j7032j30390r9384J32444J83732m7143N0016K140q3336k1688k43961
1994b25771M6194P2744O7783r6749l9919q6844L7744J22490j84099j53139J6081
1983d23485K00213J29996R5107k26198M6074k39j35265L1391R9696O7009R9222
1972a6479l681j42103J91227p7781m7952q5686o2123J82107k01549J75660J68480
$$ plain form
2049 -177958 63551 77962 -155149 -238771 -161417 -82221 -237892 -391471 -32069 18182 -38021
2038 -38021 -44376 -173123 17803 69767 -71151 34520 96741 -55331 45182 -123627 -393422
2027 -393422 -291492 -169005 -180733 -117515 -47606 1792 -180367 -116626 -211846 -147290 151534
2016 151534 -119810 -131580 -10280 -91796 -120756 -207051 -159792 -155022 -76576 -26455 48831
2005 48831 31799 -98591 -197975 -65531 118201 71058 121074 123214 39878 18190 -225771
1994 -225771 -179577 -106833 -39050 -135799 -175718 -262562 -224818 -102328 -286427 -439566 -423485
1983 -423485 -223272 -93276 1831 -224367 -178293 -178532 -313797 -282406 -182710 -115701 -16479
1972 -16479 -20160 -162263 28964 -48817 -96769 -182455 -244578 -62471 -264020 -88360 80120
1961H0120r2942j77566J01214J81719m1951j47056p2465K40997Q9129k82755k321
1950a23877j21788J53542o194p9576Q002L3568j65235R6344L6987j189J9735q6841
1938b36522Q7888L7775J24849l0072J13952k40522q4170J56150K1034m9499J17504
1927A8367o2679k17230J77870j48331k372J24439J0595p944j19706K19834j76447
1916a83604j694o8368o7382L22225j64698M747J76526j056m842p2880k26890M3494
1904b44422J16577l4833q8172q403r4938j32626L2307J7874J88045J71985j28841
1893b05447o5731P6773k2364m8160J38465q13R1552K4632n5011j42477L6977q8902
1881b60506j1065J82196J54662J02348p2640m6329j48185P1709q1765J56371n2475
$$ plain form
1961 80120 -12822 -190388 -89174 92545 50594 -96462 -168927 72070 161199 -121556 -123877
1950 -123877 -245665 -92123 -98317 -177893 -169891 -136323 -301558 -205214 -168227 -169416 -149681 -236522
1938 -236522 -148634 -110859 13990 -16082 97870 -142652 -226822 -70672 -49638 -99137 18367
1927 18367 -44312 -261542 -83672 -232003 -234375 -109936 -99341 -107285 -226991 -7157 -183604
1916 -183604 -185298 -253666 -321048 1177 -163521 -158774 17752 16696 11854 -61026 -287916 -244422
1904 -244422 -127845 -162678 -250850 -259253 -354191 -486817 -454510 -436636 -248591 -76606 -205447
1893 -205447 -271178 -194405 -216769 -264929 -126464 -127277 -35725 -11093 -66104 -208581 -171604 -260506
1881 -260506 -271571 -89375 65287 167635 94995 48666 -99519 -27810 -109575 46796 -5679
1870e679K97748n5866k37309k5796p7154R5976K38533j74010j86257j6122j15801
1859b61737J24240p5800M0466j09461O7547n3241M3019K07210j83785L4216K3596
1848a43730k9582J31784o0338Q3101K58544l6024k32896k52181J23188K47292
1838H9158l6834j40269R5944p9474J11911j60472p8879j50087L4440K64484J75064
1827A24986k75718k23997J19550m1301L1566J04977J01193l02240K26439M4774
1817h9771j2045N1686m1637m8045J71190j47495k81218P6105j2244J85536k5807
1806a73745N7716k2959N328K29824k29412L8145J51840r4469m0207j80270q897
1795b67106K06798Q9189j76462k5605M1212r8942q0255M8817J49887L1953K82864
$$ plain form
1870 -5679 292069 236203 -1106 -26902 -104056 -8080 230453 56443 -129814 -145936 -261737
1859 -261737 -137497 -213297 -172831 -282292 -214745 -267986 -224967 -17757 -201542 -167326 -143730
1848 -143730 -173312 -41528 -101866 -18765 239779 203755 -29141 -281322 -158134 89158
1838 89158 52324 -87945 7999 -71475 40436 -120036 -198915 -349002 -314562 -50078 124986
1827 124986 -150732 -374729 -255179 -296480 -264914 -159937 -58744 -360984 -134545 -89771
1817 -89771 -101816 -50130 -91767 -139812 31378 -116117 -397335 -321230 -333474 -147938 -173745
1806 -173745 -116029 -138988 -133660 96164 -133248 -95103 56737 -37732 -77939 -258209 -267106
1795 -267106 -60308 28881 -147581 -173186 -131974 -230916 -311171 -262354 -112467 -80514 202350
1784B02350k03266j52632J02474L7065M3996L6216j55712j87084o865J12194L3276
1773a37988J49090J00343j14774j12551j30802j09192o5171K52397N8913K8312
1763h1423M124J02330j13943r1280K2673p4236J81365J9114j75067K27121o5235
1752d4457j23812j25140j93374K24095j10685J72610N9341N4164o6972q8707r9008
1741c41945J20506N6397J40754Q731N5855k5194l4917o1924l71073K81012O0395
1730a11403o5665J95905Q6493j02192J28995j74251r9361R7112j77457J7638L25835
1719A21649j23679k52816Q699K00711j06559K8944l535o1831j07717J09782o182
1708a92534m4888K57549J7240J03381k8286j25733n4886j5792J83970L7584L4991
$$ plain form
1784 202350 -916 -153548 -51074 -14009 29987 66203 -89509 -276593 -283458 -171264 -137988
1773 -137988 11102 111445 -3329 -115880 -246682 -355874 -421045 -168648 -109735 -81423
1763 -81423 -77299 25031 -88912 -180192 -157519 -231755 -50390 -31276 -206343 20778 -44457
1752 -44457 -168269 -293409 -486783 -262688 -373373 -200763 -141422 -87258 -154230 -242937 -341945
1741 -341945 -221439 -165042 -24288 -15557 40298 15104 -19813 -81737 -452810 -171798 -111403
1730 -111403 -177068 18837 105330 3138 132133 -42118 -141479 -44367 -221824 -204186 121649
1719 121649 -2030 -254846 -246147 -45436 -151995 -123051 -126586 -188417 -296134 -186352 -192534
1708 -192534 -237422 20127 37367 140748 112462 -13271 -68157 -83949 100021 137605 172596
1697A72596k5063k61683j74808J65908M5769j37060J85665j06596N3027o0102
1687a42347p5706j0584K75437o491n8938Q2516j73906p1753J32079J46419j89399
1676i2673L1421J29883o1988r8817n6615N5943M3693k2986L3597k08344K35470
1665a1416p8376n0092K5188q5452l4290n2753N1858J05211j00366R1512J16914
1654b2062P4478j1083j3337j16484k37084J34617Q1801L8119J82030n8357j40680
1643h8042p6939J02173J6557J06261j63603j28305n1780L9111J84790j49421K03765
1632e433O0101j39888j92417L4894J07569o9647O0709K78070j55025N0752k18845
1621a89160o2120Q9499K13476J30368k99500j59691J38895m446l4076L9819O5381
$$ plain form
1697 172596 147533 -114150 -288958 -123050 -77281 -214341 -28676 -135272 -82245 -142347
1687 -142347 -218053 -228637 46800 40309 -18629 63887 -110019 -181772 -49693 96726 -92673
1676 -92673 -61252 68631 6643 -92174 -148789 -92846 -49153 -72139 -38542 -246886 -11416
1665 -11416 -89792 -139884 -114696 -200148 -234438 -287191 -235333 -130122 -230488 -138976 -22062
1654 -22062 52416 41333 27996 -88488 -325572 -190955 -109154 -71035 110995 52638 -88042
1643 -88042 -164981 -62808 -46251 60010 -103593 -231898 -283678 -244567 -59777 -209198 -5433
1632 -5433 54668 -85220 -277637 -242743 -135174 -204821 -144112 133958 -21067 29685 -189160
1621 -189160 -251280 -161781 51695 182063 -117437 -277128 -138233 -142679 -176755 -136936 -71555
1610g1555l23777J56170J35827q0667k04412J67532K40103J45119j36437k7018
1600H85j48927K6914M1268O025N9970k6361P6760P0556J2900k73084m1902j41074
1588c36070N3761R4530r5256R4875j5862K0901J17832m34904k70830M72294L17303
1577A8574j10954P1901J02861J34058K0554p5730j80619J68250J20971j6400k59775
1566f309k12515Q5097K64028l61448j9108o0798Q7765J61150K5042j90446Q8898
1555a38644J43217j52714J71152j1492j09466J20658J39678j53537O4184P5051
1545A48087j96176j16240J89652j1773n4119r5443Q7169j17670j21088J38477
1535a49124K8288N520j7691O8309j4593k3668L4946j52699J44453J88316k9191
$$ plain form
1610 -71555 -395332 -239162 -103335 -184002 -388414 -220882 19221 164340 27903 885
1600 885 -148042 -121128 -79860 -73835 -13865 -40226 36534 107090 119990 -153094 -194996 -336070
1588 -336070 -282309 -187779 -283035 -188160 -204022 -183121 -65289 -500193 -771023 -298729 18574
1577 18574 -92380 -20479 82382 216440 236994 161264 -19355 148895 269866 253466 -6309
1566 -6309 -218824 -133727 130301 -231147 -250255 -311053 -223288 -62138 -37096 -227542 -138644
1555 -138644 4573 -148141 23011 11519 -97947 22711 162389 8852 73036 148087
1545 148087 -48089 -164329 25323 13550 -40569 -136012 -48843 -166513 -287601 -149124
1535 -149124 -120836 -115316 -133007 -64698 -79291 -102959 -68013 -220712 -76259 112057 82866
1524H2866N7089k22895N183j44447N8588J58883n6544k14165P8243N120j434o9746
1512b63259K08389j25645K54140j3793k53963N4235M2048l1496R4799L0394j56132
1501a60283o6144K04965J30813k5510n8147p1493r8680J7461K40921k46112p5161
1490b07370J28011k4653K4308K16327j26925M8331K5986O6207j10875j64851J95336
1479F9832J9691o747l9547k02914O1385o6825J68261n215J2806o6953Q1405p5474
1467e0295J16929j67786P2427J89447k44186k1135q5887j09582Q8694J85670J33833
1456A08129j80095p7477q4115q0859J56122j40594J82903K04460j02239j19226
1446a32991m8328Q7029O2909K03505k2288p4252l91216K67574r5757j44637J08433
$$ plain form
1524 82866 139955 -82940 -77757 -222204 -163616 -4733 -61277 -275442 -197199 -192079 -193513 -263259
1512 -263259 -54870 -180515 73625 59832 -194131 -139896 -97848 -129344 -34545 -4151 -160283
1501 -160283 -226427 -21462 109351 83841 25694 -45799 -144479 -127018 113903 -132209 -207370
1490 -207370 -79359 -104012 -79704 136623 9698 58029 84015 150222 39347 -125504 69832
1479 69832 89523 82776 43229 -159685 -98300 -165125 3136 -2079 10727 -56226 25179 -50295
1467 -50295 66634 -101152 -28725 160722 -83464 -104599 -190486 -300068 -211374 -25704 108129
1456 108129 -71966 -149443 -233558 -314417 -158295 -298889 -115986 88474 -13765 -132991
1446 -132991 -181319 -94290 -31381 172124 149836 75584 -315632 -48058 -143815 -288452 -180019
1435a80019J03816K4332k10199K10887J52291l5541l77055K20547O6188j37996
1425a62749J21494j58343p1728J64529N9744j25386K8801J87555j9178j95921
1415a71182J38481m9253k28771l0554O589M6459j2828J92850J49105m6819q9173
1404i5096n7799M006N3594J28163k5021j03782L0831J53553k59226J68370l9108
1393d1515q7789j24362p5952K73847j24255J06290k45856J13510K72280o8971
1383b773j56734K67510Q6367r6811K1560J17640j98357O79j5124j35480j59283
1372b70806K85522j995p0708N1006j35689K3145J02069L9143p5028O0129l4010
1361b7222J7721Q7491O2755Q5016l6246j8296J83130j41976k47013M0375n4868
$$ plain form
1435 -180019 -76203 -51871 -262070 -51183 101108 65567 -311488 -90941 -24753 -162749
1425 -162749 -41255 -199598 -271326 -106797 -47053 -172439 -143638 43917 24739 -171182
1415 -171182 -32701 -81954 -310725 -341279 -334690 -288231 -301059 -108209 40896 -5923 -95096
1404 -95096 -152895 -148889 -95295 32868 7847 -95935 -65104 88449 -170777 -2407 -41515
1393 -41515 -129304 -253666 -329618 -55771 -180026 -73736 -319592 -206082 66198 -2773
1383 -2773 -159507 108003 194370 97559 119119 236759 38402 39081 23957 -111523 -270806
1372 -270806 14716 12721 -57987 -6981 -142670 -119525 -17456 21687 -53341 6788 -27222
1361 -27222 -9501 77990 140745 225761 189515 171219 354349 212373 -34640 5735 -49133
1350d9133Q770L6990J1053L7282n0110J1705N6615l8673O5662k38832m7305J31286
1338f4690k3312O8476j16886J84344M5659j55993k70518K88661k4318j21261L04946
1327A15108o7780j23849J76304j15678M7388o1062j88884K77189k19966N7004
1317a04226J41814j99406P1180J44174k25371J33204Q5522r0044j52019k79158
1307d74330J79803L28059o9454R1725j4897Q0891M0931o1470j41666Q6630L4934
1296H1156K07697O0524j68796k51739Q892P0916j73316J41554K4297J48670k4822
1285A25033J21699j67721o6127p2297o7164k9192l9985J07678J60606k13666K410
1274a38726M3329N7928Q232j09990J31545p044J82947J67073k74243p1378j07851
$$ plain form
1350 -49133 -40363 -3373 7680 44962 -5148 6557 63172 24499 90161 -148671 -195976 -64690
1338 -64690 -88002 -19526 -136412 47932 93591 -62402 -332920 -44259 -68577 -189838 115108
1327 115108 47328 -76521 99783 -15895 31493 -29569 -218453 58736 -161230 -104226
1317 -104226 37588 -161818 -90638 53536 -171835 -38631 46891 -43153 -195172 -474330
1307 -474330 -294527 33532 -35922 55803 40906 121797 162728 101258 -40408 46222 81156
1296 81156 288853 349377 180581 -71158 -62266 8650 -164666 -23112 1185 149855 125033
1285 125033 246732 79011 12884 -59413 -126577 -155769 -195754 -88076 72530 -141136 -138726
1274 -138726 -95397 -37469 -29237 -139227 -7682 -14726 168221 335294 61051 -10327 -118178
1263a18178K1883m3229m1776L33549j71169q7568M3029k21326J46469l8799j0437
1252a87552M4509l4103K46724k75674M9886M2640N0439J86438m9499j73301Q9971
1241i522J94937P660j22332k65588q3433J54703J50935J9149L9174j82292L73603
1230B76994p442j652P484K0051N5821r0063j67440j29635k6534P2960P2054l6717
1218D5881j33002K9017r7514j22919R3194J05689R1479J16441K8524l94981P25
1207b37466Q2979J09249J08057K24131o9071k4987r2617l2298j26746j43056J7773
1196a84052L35551k7904n7981J30551k31881L7080J74366k01970j04464J16622
1186a4082j25262K13998k29483L3642J37569o7286J3919q3484J05370K59349j73853
$$ plain form
1263 -118178 -96295 -139524 -181300 152249 -18920 -106488 -63459 -284785 -138316 -177115 -187552
1252 -187552 -143043 -177146 69578 -206096 -156210 -113570 -63131 123307 73808 -99493 -9522
1241 -9522 185415 193075 70743 -194845 -278278 -123575 27360 46509 85683 -96609 276994
1230 276994 269552 267900 275384 295435 351256 261193 93753 -35882 -62416 10544 82598 45881
1218 45881 -87121 -58104 -155618 -278537 -185343 -79654 11825 128266 156790 -238191 -237466
1207 -237466 -154487 -45238 62819 286950 217879 192892 100275 67977 -58769 -201825 -184052
1196 -184052 151499 123595 65614 196165 -35716 1364 175730 -26240 -130704 -14082
1186 -14082 -139344 74654 -154829 -121187 16382 -50904 -36985 -120469 -15099 244250 70397
1175G0397Q7711J35736j19481j33677J191R2276k40810p6521O8236O3345L6102
1164a5495M7800k7169k1035N3462n8332l1754L2364l6831L7114k7640J38281j28838
1152c8073j50371n958M2055J68834J03370j63324n9029P0946j70511J65917K09553
1141A73409R0959j98602q0050j40270O5465p4938j1545k9425l788K09944N4113
1130E5272n4614O107J15635r0088J9848k56936K37341J70622J34152j19768j25046
1119I2525m8044l4329j04117q1886L4123K4005K35732l00158P3641n6045R1004
1108g3549j8791j74011J92163K56074K48687k55380l21459k57827M0190K81517
1098h2386Q5458k6941P2325q4248J35909j32052K1685J2750L4993k0326j33844
$$ plain form
1175 70397 158108 293844 174363 40686 41877 134153 -106657 -183178 -114942 -51597 -15495
1164 -15495 32305 5136 -15899 37563 -20769 -52523 -20159 -56990 -19876 -47516 90765 -38073
1152 -38073 -188444 -194402 -152347 16487 119857 -43467 -102496 -31550 -202061 -36144 173409
1141 173409 264368 65766 -14284 -154554 -89089 -164027 -175572 -204997 -208785 1159 55272
1130 55272 658 6765 122400 32312 52160 -204776 32565 203187 337339 217571 92525
1119 92525 44481 10152 -93965 -175851 -141728 -117723 118009 -182149 -108508 -164553 -73549
1108 -73549 -92340 -266351 -74188 181886 430573 175193 -146266 -404093 -363903 -82386
1098 -82386 3072 -23869 48456 -35792 100117 -31935 -10250 2500 37493 17167 -116677
1087a16677j31957o6866J62064K13730j03869K93291l5097j55996j9798J98035
1077B36860j04048j77565J58794J98665J19518l36764j40936J92566p7820k03274
1067a34004j42207P1460Q8556Q0523J99659n2666l2280o7269j25994P8540k7766
1056f3448j5608L872K4166J08864n3842J19848j90838J87220j23210P384k801
1045A607p7295P1398q208Q2170Q1386j92997M3003R904k45069J98204J61297k67889
1033a42489J3725R9296N8430m121M6560R9687k3811J9031n0537k9301j49146r2897
1021a55573J84095m5617j6263J77002j75334K05458P9825k08429L3101k60014
1011a81749L2102O33K2610m8480J60067L11602j20502k24835k3766j27187o3807
$$ plain form
1087 -116677 -248634 -315500 -153436 60294 -43575 249716 214619 58623 38825 236860
1077 236860 132812 -44753 114041 312706 432224 95460 -45476 147090 69270 -134004
1067 -134004 -276211 -204751 -116195 -35672 163987 111321 79041 11772 -114222 -35682 -63448
1056 -63448 -79056 -75184 -51018 57846 4004 123852 -66986 120234 -2976 4408 1607
1045 1607 -75688 -4290 -12498 69672 151058 -41939 1064 10968 -234101 -35897 125400 -142489
1033 -142489 -128764 -29468 28962 24841 71401 171088 147277 166308 115771 86470 -62676 -155573
1021 -155573 28522 -17095 -33358 143644 -31690 173768 253593 45164 78265 -181749
1011 -181749 -149647 -149014 -126404 -174884 -14817 296785 176283 -48552 -72318 -199505 -263312
1000b63312J06382l3585p3605J28957l2668k5553R7189J70942j71009O7435j19020
989a47847J41580J53545M1396J0005k64860n638M0396O4295o5109J53359J95461
978C16583J14563k29902n8107l880l1509r0536M9167K28494j05403j40627p605
967D1238m9898m8607O8928L6742J07779J01102o7474N3722k9918L7732j03476
956A47870k2101K8094J19077j84844j81141P057j65613K2549J22849Q6898o681
945b5986k8569M4157o6068j71294q8261J10812L55703o2963k30125N9477J6419
934h6698j7099R0138J8487k2386k07751k77661J18353K36265J20249N3005j14610
923h9708k8872j2793N9369N4464R5418Q3220j37879O441J21678N825j33176M7057
$$ plain form
1000 -263312 -156930 -190515 -264120 -135163 -167831 -193384 -96195 74747 -96262 -28827 -147847
989 -147847 -6267 147278 188674 198679 -66181 -71819 -31423 32872 -32237 121122 316583
978 316583 431146 201244 143137 139257 107748 17212 66379 294873 189470 48843 41238
967 41238 -8660 -57267 11661 48403 156182 257284 189810 243532 213614 251346 147870
956 147870 125769 153863 272940 88096 -93045 -85988 -251601 -229052 -106203 -19305 -25986
945 -25986 -54555 -10398 -76466 -247760 -336021 -225209 130494 67531 -162594 -103117 -86698
934 -86698 -103797 -13659 4828 -17558 -225309 -502970 -384617 -148352 -28103 24902 -89708
923 -89708 -118580 -131373 -72004 -17540 77878 161098 23219 29660 151338 157163 23987 71044
911G1044k12045q4257J1317K40904O8243k2932J62154j82720j12314P0119j23456
900a13943J03322J66382k8794m7512L3596j48561O508m4473j8260k715J5068j4088
888i3470J02406J78445n269j52072J0232p7297K07062J21141l7190j32920J20921
877B41989O7713j43933j1674Q4250j39667o2214k85508r875N23286m5755j54549
866F4063q9615j39466p5038R3419J76371M5586j63705J21787o2177L293k08187
855b33669K05234M3281m2667p9658l217j8372N527J61225P276j7679o3072J40752
843A04961K570K7511q1604m852Q4040k37403j56088J40694L5052J25147P8008
832A18036j28871j61263J80122J24563k9831k27266k35655J48429J02437L5267
$$ plain form
911 71044 -141001 -225258 -213941 26963 95206 72274 234428 51708 -60606 9513 -113943
900 -113943 -10621 155761 126967 79455 113051 -35510 -29002 -73475 -91735 -94450 -79382 -93470
888 -93470 8936 187381 182112 30040 40272 -37025 170037 291178 253988 121068 241989
877 241989 309702 165769 154095 238345 98678 36464 -249044 -258919 264367 218612 64063
866 64063 -25552 -165018 -240056 -146637 29734 75320 -88385 33402 -28775 -25482 -233669
855 -233669 -28435 14846 -27821 -107479 -110696 -129068 -123541 37684 44960 27281 -35791 104961
843 104961 107531 135042 53438 48586 132626 -104777 -260865 -120171 -85119 40028 118036
832 118036 -10835 -172098 8024 132587 102756 -124510 -360165 -211736 -109299 -74032
822g4032j05915L16153l24077Q4984j78300Q6894K58769m7353N4086J0020M4919
811A26148o7554k48701r3670N6927P9251J68942P4906q1819j04182o4430K79843
800A25661j07902j08695j06566K70364R2929j19063O9924p2410J60528p2879r4917
789C6974k17993l3494K11574K17158J85878n4261m02010q8224o2053R4459O7852
778d4140j29358n1300J91657M6126k6476L5354m4351o5063J13073K0042n4830
767i266m1715J08967R2463N2157r2968k42456k18922N8855M8885J80253J31791
756F8044J23959l46468r4885R1552K32680l0544p1438q8931k01523J6604J27306
$$ plain form
822 -74032 -179947 136206 -187871 -102887 -281187 -194293 64476 17123 71209 81229 126148
811 126148 58594 -190107 -283777 -226850 -147599 21343 96249 14430 -89752 -154182 125661
800 125661 17759 -90936 -197502 72862 165791 46728 116652 44242 204770 131891 36974
789 36974 -181019 -214513 -2939 214219 400097 345836 -56174 -144398 -206451 -111992 -44140
778 -44140 -173498 -224798 -33141 12985 -13491 21863 -22488 -87551 25522 45564 -9266
767 -9266 -50981 57986 150449 202606 109638 -132818 -351740 -292885 -244000 -63747 68044
756 68044 192003 -154465 -249350 -157798 74882 44338 -27100 -116031 -317554 -300950 -173644
$$ [...]
##END NTUPLES=NMR SPECTRUM
##END=
