##TITLE=1H_EC-3313(1)
 CDCl3
 8 sc, 
 9.2.2024
##JCAMPDX= 6.0         $$ Bruker NMR JCAMP-DX V2.0
##DATA TYPE= NMR SPECTRUM
##DATA CLASS= NTUPLES
##ORIGIN= UXNMR, Bruker Analytische Messtechnik GmbH
##OWNER= root
$$ XWIN-NMR		Version 3.5
$$ Fri Feb  9 14:06:27 2024 Russian Standard Time (UT+4h)  she@DPX200
##.OBSERVE FREQUENCY= 200.1313
##.OBSERVE NUCLEUS= ^1H
##.ACQUISITION MODE= SIMULTANEOUS
##.ACQUISITION SCHEME= undefined
##.AVERAGES= 8
##.DIGITISER RES= 18
##SPECTROMETER/DATA SYSTEM= spect
##.PULSE SEQUENCE= zg30
##.SOLVENT NAME= DMSO
##.SHIFT REFERENCE= (INTERNAL, DMSO, 0, 15.4814)
##AUDIT TRAIL= $$ (NUMBER, WHEN, WHO, WHERE, WHAT)
$$ ##TITLE= Audit trail, XWIN-NMR		Version 3.5
$$ ##JCAMPDX= 5.01
$$ ##ORIGIN= Bruker BioSpin GmbH
$$ ##OWNER= she
$$ F:/spectra/data/she/nmr/H-F/1/pdata/1/auditp.txt
$$ ##AUDIT TRAIL=  $$ (NUMBER, WHEN, WHO, WHERE, WHAT)
(   1,<2024-02-09 14:05:15.28 +0400>,<she>,<DPX200>,
      <created by zg, POWCHK disabled, PULCHK disabled
       configuration hash MD5:
       00 E9 B6 7A A2 85 ED C7 34 08 36 98 17 FE 4E 26
       data hash MD5: 16K
       C8 55 25 8A 82 D5 C9 EE 22 25 1F 55 91 57 2E 2A>)
(   2,<2024-02-09 14:05:17.71 +0400>,<she>,<DPX200>,
      <Start of raw data processing
       efp BC_mod = 2 LB = 0.24 FT_mod = 6 PKNL = 1 PHC0 = -24592.45 PHC1 = 10.45267 SI = 16K 
       data hash MD5: 16K
       29 DB 12 86 03 38 EB 4E 39 3F BA B9 69 0C 33 72>)
(   3,<2024-02-09 14:05:34.50 +0400>,<she>,<DPX200>,
      <pk PHC0 = -0.6622362 PHC1 = 2 
       data hash MD5: 16K
       F1 EB 14 1D 96 9B CB 89 CA C7 77 B7 61 6F 83 63>)
(   4,<2024-02-09 14:05:37.54 +0400>,<she>,<DPX200>,
      <abs ABSG = 5 
       data hash MD5: 16K
       EE 61 E5 17 B7 EA 26 B6 47 4A B7 A0 F2 CB FD F7>)
$$ ##END=
$$ 
$$ hash MD5
$$ 39 BD 79 B8 D6 A0 72 14 74 96 60 07 0D 81 05 F4
##$RELAX= 
##$RELAX= 
##$RELAX= 
##$RELAX= 
##$RELAX= 
##$RELAX= 
$$ Bruker specific parameters
$$ --------------------------
##$DU= <F:/spectra>
##$EXPNO= 1
##$NAME= <H-F>
##$PROCNO= 1
##$TYPE= <nmr>
##$USER= <she>
##$AMP= (0..31)
100 100 100 100 100 100 100 100 100 100 100 100 100 100 100 100 100 100 
100 100 100 100 100 100 100 100 100 100 100 100 100 100 
##$AQSEQ= 0
##$AQ_mod= 1
##$AUNM= <au_zg>
##$AUTOPOS= <>
##$BF1= 200.13
##$BF2= 200.13
##$BF3= 200.13
##$BF4= 200.13
##$BF5= 200.13
##$BF6= 200.13
##$BF7= 200.13
##$BF8= 200.13
##$BYTORDA= 1
##$CFDGTYP= 0
##$CFRGTYP= 5
##$CHEMSTR= <none>
##$CNST= (0..31)
1 1 145 1 1 1 1 1 1 1 1 1 1 1 1 1 1 1 1 1 1 1 1 1 1 1 1 1 1 1 1 1 
##$CPDPRG= <>
##$CPDPRG1= <>
##$CPDPRG2= <>
##$CPDPRG3= <>
##$CPDPRG4= <mlev>
##$CPDPRG5= <mlev>
##$CPDPRG6= <mlev>
##$CPDPRG7= <mlev>
##$CPDPRG8= <mlev>
##$CPDPRGB= <>
##$CPDPRGT= <>
##$D= (0..31)
0 1.2 0 0 0 0 0 0 0 0.06 0 0.03 0 0 0 0 0.0002 0 0 0 0 0 0 0 0 0 0 0 0 
0 0 0 
##$DATE= 1707473114
##$DBL= (0..7)
120 120 120 120 120 120 120 120 
##$DBP= (0..7)
150 150 150 150 150 150 150 150 
##$DBP07= 0
##$DBPNAM0= <>
##$DBPNAM1= <>
##$DBPNAM2= <>
##$DBPNAM3= <>
##$DBPNAM4= <>
##$DBPNAM5= <>
$$ [...]
##$SUBNAM3= <"">
##$SUBNAM4= <"">
##$SUBNAM5= <"">
##$SUBNAM6= <"">
##$SUBNAM7= <"">
##$SUBNAM8= <"">
##$SUBNAM9= <"">
##$SW= 18.0517328524113
##$SWIBOX= (0..15)
0 0 2 0 0 0 0 0 0 0 0 0 0 0 0 0 
##$SW_h= 3612.71676300578
##$TD= 16384
##$TD0= 1
##$TE= 0
##$TE2= 300
##$TE3= 300
##$TEG= 300
##$TL= (0..7)
0 120 120 120 120 120 120 120 
##$TP= (0..7)
150 150 150 150 150 150 150 150 
##$TP07= 0
##$TPNAME0= <>
##$TPNAME1= <>
##$TPNAME2= <>
##$TPNAME3= <>
##$TPNAME4= <>
##$TPNAME5= <>
##$TPNAME6= <>
##$TPNAME7= <>
##$TPOAL= (0..7)
0.5 0.5 0.5 0.5 0.5 0.5 0.5 0.5 
##$TPOFFS= (0..7)
0 0 0 0 0 0 0 0 
##$TUNHIN= 0
##$TUNHOUT= 0
##$TUNXOUT= 0
##$USERA1= <user>
##$USERA2= <user>
##$USERA3= <user>
##$USERA4= <user>
##$USERA5= <user>
##$V9= 5
##$VALIST= <valist>
##$VCLIST= <CCCCCCCCCCCCCCC>
##$VD= 0
##$VDLIST= <DDDDDDDDDDDDDDD>
##$VPLIST= <PPPPPPPPPPPPPPP>
##$VTLIST= <TTTTTTTTTTTTTTT>
##$WBST= 1024
##$WBSW= 4
##$XGAIN= (0..3)
0 0 0 0 
##$XL= 0
##$YL= 0
##$YMAX_a= 215165
##$YMIN_a= -296442
##$ZGOPTNS= <>
##$ZL1= 120
##$ZL2= 120
##$ZL3= 120
##$ZL4= 120
##$ABSF1= 15.48576
##$ABSF2= -2.56609
##$ABSG= 5
##$ABSL= 3
##$ALPHA= 0
##$AQORDER= 0
##$ASSFAC= 0
##$ASSFACI= 0
##$ASSFACX= 0
##$ASSWID= 0
##$AUNMP= <proc_1d>
##$AZFE= 0.1
##$AZFW= 0.1
##$BCFW= 0
##$BC_mod= 2
##$BYTORDP= 0
##$COROFFS= 0
##$CY= -3
##$DATMOD= 1
##$DC= 0
##$DFILT= <>
##$DTYPP= 0
##$F1P= 0
##$F2P= 0
##$FCOR= 1
##$FTSIZE= 16384
##$FT_mod= 6
##$GAMMA= 0
##$GB= 0
##$INTBC= 1
##$INTSCL= 3.70164e-10
##$ISEN= 128
##$LB= 0.24
##$LEV0= 0
##$LPBIN= 0
##$MAXI= 10000
##$MC2= 0
##$MEAN= 0
##$ME_mod= 0
##$MI= 1.114404
##$NCOEF= 0
##$NC_proc= -7
##$NLEV= 6
##$NOISF1= 3.799351
##$NOISF2= 2.8
##$NSP= 0
##$NTH_PI= 0
##$NZP= 0
##$OFFSET= 15.48136
##$PC= 1
##$PHC0= -24593.11
##$PHC1= 12.45267
##$PH_mod= 1
##$PKNL= yes
##$PPARMOD= 0
##$PSCAL= 0
##$PSIGN= 0
##$REVERSE= no
##$SF= 200.130008074072
##$SI= 16384
##$SIGF1= 3
##$SIGF2= 2
##$SINO= 5.538805
##$SIOLD= 16384
##$SREGLST= <1H.CDCl3>
##$SSB= 0
##$STSI= 16384
##$STSR= 0
##$SW_p= 3612.71676300578
##$SYMM= 0
##$S_DEV= 0
##$TDeff= 16384
##$TDoff= 0
##$TI= <>
##$TILT= no
##$TM1= 0
##$TM2= 0
##$TOPLEV= 0
##$USERP1= <user>
##$USERP2= <user>
##$USERP3= <user>
##$USERP4= <user>
##$USERP5= <user>
##$WDW= 1
##$XDIM= 16384
##$YMAX_p= 275944934
##$YMIN_p= -590710
$$ End of Bruker specific parameters
$$ ---------------------------------
##NTUPLES= NMR SPECTRUM
##VAR_NAME=  FREQUENCY,     SPECTRUM/REAL,   SPECTRUM/IMAG
##SYMBOL=    X,             R,               I
##VAR_TYPE=  INDEPENDENT,   DEPENDENT,       DEPENDENT
##VAR_FORM=  AFFN,          ASDF,            ASDF
##VAR_DIM=   16384,         16384,           16384
##UNITS=     HZ,            ARBITRARY UNITS, ARBITRARY UNITS
##FACTOR=    0.220516191357247, 1,           1
##FIRST=     3098.2847889514, 0,             0
##LAST=      -514.43197405438, 0,            0
##MIN=       -514.43197405438, -590710,      0
##MAX=       3098.2847889514, 275944934,     0
$$ Real data points
##PAGE= N=1
##DATA TABLE= (X++(R..R)), XYDATA
$$ [...]
6593I53171k3989R3491j78964k3684K41693L4319Q244p6483k20726M5182Q0182
$$ 953171 929182 1022673 843709 820025 1061718 1096037 1104281 1027798 807072 852254 932436
6582I32436J20326J25944n4300j72347K6386n4544L04810J11939k39821l3221
$$ 932436 1052762 1178706 1124406 952059 978445 923901 1228711 1340650 1100829 1067608
6572A067608Q3099n8912j47570J51558J40705k140J60779o4824J32540N2409l20073
$$ 1067608 1150707 1091795 944225 1095783 1236488 1234348 1395127 1330303 1462843 1515252 1195179
6561A195179n2346K64731J61160K7528j13185K9688J42792k32913j05992j03166
$$ 1195179 1142833 1407564 1568724 1596252 1483067 1512755 1655547 1422634 1316642 1213476
6551A213476K26769K3166Q2614k26201P0296K27028R9129j22911k3491P2443N7732
$$ 1213476 1440245 1463411 1546025 1319824 1390120 1617148 1716277 1593366 1569875 1642318 1700050
6540A700050J94j59940l26638j23591P298K31617R3467j47037K4010K2564j74375
$$ 1700050 1700244 1540304 1213666 1090075 1097373 1328990 1422457 1275420 1299430 1321994 1147619
6529A147619k02125J66750K26959j80625J43890j22J7817J59405K4016k3233J0415
$$ 1147619 945494 1112244 1339203 1158578 1302468 1302346 1320163 1479568 1503584 1480351 1490766
6518A490766p9625k7321J12340k2859k7641L8067j38143J6874k70844j61866K28274
$$ 1490766 1411141 1383820 1496160 1473301 1445660 1483727 1345584 1362458 1091614 929748 1158022
6507A158022O5429L37933k24757M328J06176J3470n5976L0860J21087j30677j38750
$$ 1158022 1223451 1561384 1336627 1340955 1447131 1460601 1404625 1435485 1556572 1425895 1287145
6496A287145N2144m6953K4623L4878Q7005K54788j559k8060K28757j4531J27188
$$ 1287145 1339289 1292336 1316959 1351837 1438842 1693630 1692071 1664011 1892768 1878237 2005425
6485B005425L8085N3240q2361n9620l5513J87798j81976j43851J69203j81595
$$ 2005425 2043510 2096750 2014389 1954769 1919256 2107054 1925078 1781227 1950430 1768835
6475A768835N2165K10763j53611n2239q6916m8262J17435M1599J45644J64429
$$ 1768835 1821000 2031763 1878152 1825913 1738997 1690735 1808170 1849769 1995413 2159842
6465B159842o2824J62919n9749j33674p171N2611J34104k26922K0773K00056k36526
$$ 2159842 2097018 2259937 2200188 2066514 2059343 2111954 2246058 2019136 2039909 2239965 2003439
6454B003439R1694K13372o5554K38708k27227P7646j29841K20322J97936L6479
$$ 2003439 2095133 2308505 2242951 2481659 2254432 2332078 2202237 2422559 2620495 2656974
6444B656974m6546j65175J48469K80898q9593r8345K39955L2638k6430Q1264R5343
$$ 2656974 2610428 2445253 2593722 2874620 2785027 2686682 2926637 2959275 2932845 3014109 3109452
6433C109452J27570L35828j2073j63007k9662O4863J57231j42824k7441J98937
$$ 3109452 3237022 3572850 3560777 3397770 3368108 3432971 3590202 3447378 3419937 3618874
6423C618874J12124J5785K16562K08194j46560L0996J17608J05457R2375K28995
$$ 3618874 3730998 3746783 3963345 4171539 4024979 4055975 4173583 4279040 4371415 4600410
6413D600410J06155J20001J7265n9378J52698K73283k058J32011K16967L59557
$$ 4600410 4706565 4826566 4843831 4784453 4937151 5210434 5208376 5340387 5557354 5916911
6403E916911K20823J59038J80724o597L36462j90343j84807N11173K60942M02877
$$ 5916911 6137734 6296772 6477496 6470899 6807361 6617018 6432211 6943384 7204326 7607203
6393G607203J75633M688J92965K78153J67999K29302K04702K52674L51270L46558
$$ 7607203 7782836 7787524 7980489 8258642 8426641 8655943 8860645 9113319 9464589 9811147
6383I811147M06527L46609M22947N06381O47833O23990Q92868O08957O43016P94688
$$ 9811147 10217674 10564283 10987230 11493611 12141444 12765434 13658302 14267259 14910275 15704963
6373A5704963P97400J238984J325223J201719J677859J787489K298169K467655
$$ 15704963 16502363 17741347 19066570 20268289 21946148 23733637 26031806 28499461
6365B8499461K645081K498602K192892J557804L31674m60485j533832j969291
$$ 28499461 31144542 33643144 35836036 37393840 37725514 37265029 35731197 33761906
6357C3761906j647255j570302r32730q04254n31714m28414l5408L87435O31505
$$ 33761906 32114651 30544349 29611619 28807365 28275651 27847237 27811829 28199264 28830769
6348B8830769J117680R90514J889239J952622K331516K884390L381135M204421
$$ 28830769 29948449 30938963 32828202 34780824 37112340 39996730 43377865 47582286
6340D7582286M646802N403012N808074M470345K445079k14830l268630n279238
$$ 47582286 52229088 57632100 63440174 67910519 70355598 70140768 66872138 61592900
6332F1592900n972726n768513m659412m121518l304279k653598k190317j566709
$$ 61592900 55620174 49851661 45192249 41070731 37766452 35112854 32922537 31355828
6324C1355828j069329p81670n98583k40890K36262P27894Q62330Q56948J385119
$$ 31355828 30286499 29504829 28906246 28665356 28901618 29629512 30491842 31348790 32733909
6315C2733909J839446J863098K644274K050834J506280J81107j276323k427698
$$ 32733909 34573355 36436453 39080727 41131561 42637841 42818948 41542625 39114927
6307C9114927l510999l287527l046569k709600k518948j959747j429976j420830
$$ 39114927 35603928 32316401 29269832 26560232 24041284 22081537 20651561 19230731
6299A9230731j392802r46572p38183p89243o49678m85989o27820p07185o74496
$$ 19230731 17837929 16891357 16153174 15363931 14714253 14228264 13600444 12893259 12218763
6290A2218763o28280n66158p34190o30642m89966l30286l10536j73784k64985
$$ 12218763 11590483 11024325 10290135 9659493 9169527 8839241 8528705 8354921 8089936
6281H089936r3488l40414k99182J18946p8388j53060k66331P6183N8504j45460
$$ 8089936 7996448 7656034 7356852 7475798 7397410 7244350 6978019 7054202 7112706 6967246
6271F967246j00302j26625j10284m33102l02145j452j37531l60125l44054k01905
$$ 6967246 6866944 6740319 6630035 6196933 5894788 5893336 5755805 5395680 5051626 4849721
6261D849721l8316j62400m19807l9747l55114l835L3108l2781J57845k0403j95480
$$ 4849721 4811405 4649005 4229198 4189451 3834337 3830502 3863610 3830829 3988674 3968271 3772791
6250C772791p3830J43486l9854l32577k74612l5639R950J73818j04985o5958O1124
$$ 3772791 3698961 3842447 3802593 3470016 3195404 3159765 3169715 3343533 3238548 3172590 3233714
6239C233714M5240k09569j1980k61067j2667j66996j64183O5915Q1058k16843
$$ 3233714 3278954 3069385 3057405 2796338 2783671 2616675 2452492 2518407 2599465 2382622
6229B382622K4165J14350L1538l7889M0897r2924k45360l714J6395O9357M7769
$$ 2382622 2406787 2521137 2552675 2514786 2555683 2462759 2217399 2213685 2230080 2299437 2347206
6218B347206L5234N7868j3318J41354Q5924j4155J39758m7606j04602j20531N5939
$$ 2347206 2382440 2440308 2426990 2568344 2654268 2640113 2779871 2732265 2627663 2507132 2563071
6207B563071m3424k08663J76152r3361j28537P6227l7610J4797l54222J1092Q7123
$$ 2563071 2519647 2310984 2487136 2393775 2265238 2341465 2303855 2318652 1964430 1975522 2062645
6196B062645o260J27772l56770M6563K29126M7699J50703j65704J00669m537R9712
$$ 2062645 2056385 2184157 1827387 1873950 2103076 2150775 2301478 2135774 2236443 2231906 2331618
6185B331618j52088j25469J99602n0239Q0176K24256j19516K20435k5820m6906
$$ 2331618 2179530 2054061 2253663 2203424 2283600 2507856 2388340 2608775 2582955 2536049
6175B536049j47375l6926J68256j03N8728j99448o8929L64905J52294J58105o2096
$$ 2536049 2388674 2351748 2520004 2519901 2578629 2379181 2310252 2675157 2827451 2985556 2923460
6164B923460J02336J40791J82403M8573P6449J86414M1133M3337L35456K12391
$$ 2923460 3025796 3166587 3348990 3397563 3474012 3660426 3701559 3744896 4080352 4292743
6154D292743M10086R0446j34445Q4806j84530j91493k00849k75037j6840K20437
$$ 4292743 4702829 4793275 4658830 4743636 4559106 4367613 4166764 3891727 3874887 4095324
6144D095324j42000q944J3516J91613J65056J7482L38856K04142l532J13038K63121
$$ 4095324 3953324 3944380 3957896 4149509 4314565 4332047 4670903 4875045 4871513 4984551 5247672
6133E247672K43039L50101L24588J52540J94199J65701K0801m66876n07532k60172
$$ 5247672 5490711 5840812 6165400 6317940 6512139 6677840 6698641 6231765 5724233 5464061
6123E464061k76874n40690k66101m12912p1834j40360k24924O3953J37099K70802
$$ 5464061 5187187 4646497 4380396 3967484 3895650 3755290 3530366 3594319 3731418 4002220
6113D002220k73323j38591J47373p6175k7231K49608L97065j48120N8679K8116
$$ 4002220 3728897 3590306 3737679 3661504 3634273 3883881 4280946 4132826 4191505 4219621
6103D219621J9624k61088k76977l28778p1136J11048k85186j73214l98655n7277
$$ 4219621 4239245 3978157 3701180 3372402 3301266 3412314 3127128 2953914 2555259 2497982
6093B497982j60749j57782L7619k3618j40871k82084k03163J87849R2390j6778
$$ 2497982 2337233 2179451 2217070 2193452 2052581 1770497 1567334 1755183 1847573 1830795
6083A830795P4219l7801P9719j90570o0322p857J1525Q1902k51081K2525M8293
$$ 1830795 1905014 1867213 1946932 1756362 1696040 1688183 1699708 1781610 1530529 1553054 1601347
6072A601347j21312J07573m4270j01970R0684P1793M271j03766L1426J64460k06452
$$ 1601347 1480035 1587608 1543338 1441368 1532052 1603845 1608116 1504350 1535776 1700236 1493784
6061A493784P6912J11346J2142K14584j06868o2961j25172j0984n3917M5432K20624
$$ 1493784 1570696 1682042 1694184 1908768 1801900 1738939 1613767 1602783 1548866 1594298 1814922
6050A814922k65389K35443j82789q4619J64226K8640N3408p9303k62325M4180
$$ 1814922 1549533 1784976 1602187 1517568 1681794 1710434 1763842 1684539 1422214 1466394
6040A466394J00515K03701r4807n3260J41608n3637K35305K95250J64590j77003
$$ 1466394 1566909 1770610 1675803 1622543 1764151 1710514 1945819 2241069 2405659 2228656
6030B228656n2920j74021j61667R373j30842l6133J17697P7518O6303R3755j28572
$$ 2228656 2175736 2001715 1840048 1849421 1718579 1682446 1800143 1877661 1943964 2037719 1909147
6019A909147n1282J56949O7922j74509q5181J07243J8168j35158k60251L7161
$$ 1909147 1857865 2014814 2082736 1908227 1823046 1930289 1948457 1813299 1553048 1590209
6009A590209K15930J26902j81855P5813j01373Q5472r7698j4252K51232n3426
$$ 1590209 1806139 1933041 1751186 1826999 1725626 1811098 1713400 1699148 1950380 1896954
5999A896954Q8773J69635q1605L9756J54219j05234j15402R8615j48291M5972
$$ 1896954 1985727 2155362 2073757 2113513 2267732 2162498 2047096 2145711 1997420 2043392
5989B043392j75029j31804J59376j0466j54800L00543K1884k53916J45464o891
$$ 2043392 1868363 1736559 1895935 1885469 1730669 2031212 2053096 1799180 1944644 1937753
5979A937753K5978K0937m2643n065m7188J05818o1044M527P6364j53394J0756
$$ 1937753 1963731 1984668 1942025 1936960 1889772 1995590 1934546 1939073 2015437 1862043 1872799
5968A872799J09227J20250K446j29109O1305K46152Q3297o2794J23322j10803
$$ 1872799 1982026 2102276 2104722 1975613 2036918 2283070 2366367 2303573 2426895 2316092
5958B316092j56431N5098j08144K4424J02035M5156K68850J58254m1177O2982
$$ 2316092 2159661 2214759 2106615 2131039 2233074 2278230 2547080 2705334 2664157 2727139
5948B727139n4272o5827j67783J34206K00218N0544L1207M7593J16993K8562J16064
$$ 2727139 2672867 2607040 2439257 2573463 2773681 2824225 2855432 2903025 3020018 3048580 3164644
5937C164644n1275J07524J25351j55646K36324K20923m604j30831L7831n4070
$$ 3164644 3113369 3220893 3346244 3190598 3426922 3647845 3643241 3512410 3550241 3496171
5927C496171K29603J84246J42982n2685L2642L57225J52856R8452J25441J03610
$$ 3496171 3725774 3910020 4053002 4000317 4032959 4390184 4543040 4641492 4766933 4870543
5917D870543R0537K99203J52335R4780K64298N90618L17713K93821M18286P75893
$$ 4870543 4961080 5260283 5412618 5507398 5771696 6362314 6680027 6973848 7392134 8168027
5907H168027M00603k4876j11247r1213k52462n07159k29065k02247j1010j8575
$$ 8168027 8568630 8543754 8432507 8341294 8088832 7581673 7352608 7150361 7139351 7120776
5897G120776j28170m6403O077m9772K44876L88640K94212K36392K66899L12069
$$ 7120776 6992606 6946203 6952280 6902508 7147384 7536024 7830236 8066628 8333527 8645596
5887H645596M48140K88067O41439O08190O79605Q69713J092206O83891q3150o25654
$$ 8645596 9093736 9381803 10023242 10631432 11311037 12180750 13272956 13956847 13873697 13248043
5877A3248043p57909o17957o10431r6970l68174l28499j71037k23403K79856q9035
$$ 13248043 12490134 11872177 11261746 11164776 10796602 10468103 10297066 10073663 10353519 10264484
5867A0264484N148R2529j04966J07001M13947K30012K21937K40635N08751N00355
$$ 10264484 10269632 10362161 10257195 10364196 10778143 11008155 11230092 11470727 11979478 12479833
5857A2479833L50821O18413N28283M57431K91144L19281N0645P4228n0706R0057
$$ 12479833 12830654 13449067 13977350 14434781 14725925 15045206 15095851 15170079 15119373 15209430
5847A5209430L21616M68345M08683N16410N71480P21802Q71568J113933J162873
$$ 15209430 15531046 15999391 16408074 16924484 17495964 18217766 19089334 20203267 21366140
5838B1366140J413021J463513K122017K309405K703420L323491L381770L380292
$$ 21366140 22779161 24242674 26364691 28674096 31377516 34701007 38082777 41463069
5830D1463069K737615J334728l60922j693371k964033k865358k164004j879369
$$ 41463069 44200684 45535412 45174490 43481119 40517086 37651728 35487724 33608355
5822C3608355j778909j167459q24352m78127P7686K53290P78623R82127J393732
$$ 33608355 31829446 30661987 29837635 29359508 29437194 29690484 30469107 31451234 32844966
5813C2844966J937845K070755K746880L359861L810925M783555N827442O803062
$$ 32844966 34782811 36853566 39600446 42960307 46771232 51554787 57382229 64185291
5805F4185291O499141L977919K40709l590231n771828o791669o493195n137037
$$ 64185291 70684432 74662351 74903060 71312829 65541001 58749332 52256137 47119100
5797D7119100m273101l584480k864397k172108j979078j354439p46509r20633
$$ 47119100 42845999 39261519 36397122 34225014 32245936 30891497 30144988 29224355
5789B9224355k93045J15914J68757M58635R20399J243066J437202J864929J750706
$$ 29224355 28931310 29047224 29215981 29674616 30595015 31838081 33275283 35140212 36890918
5780C6890918J996796J943881J030544l93291j822340k718490k846941k897777
$$ 36890918 38887714 40831595 41862139 41468848 39646508 36928018 34081077 31183300
5772C1183300k659720j871565j735863j427954j558492j633275j263620r69821
$$ 31183300 28523580 26652015 24916152 23488198 21929706 20296431 19032811 18062990
5764A8062990o38044m75082p03566m20341l70527k18127P7324K54478k71941l30772
$$ 18062990 17424946 16949864 16246298 15825957 15455430 15237303 15314627 15569105 15297164 14966392
5754A4966392l32805m19773o70665m71189m69333m81918m24164Q419m7058k17810
$$ 14966392 14633587 14213814 13543149 13071960 12602627 12120709 11696545 11704964 11657906 11440096
5744A1440096n6534l54126l34814k90447j43091m36009j40264j66768j36895Q3746
$$ 11440096 11383562 11029436 10694622 10404175 10261084 9825075 9684811 9518043 9381148 9464894
5734I464894P4271r0941j08468j69550k17102k86789k45296l56555l95739k67374
$$ 9464894 9539165 9448224 9339756 9170206 8953104 8666315 8421019 8064464 7668725 7401351
5724G401351j93399R8788j8089k21175j09077k863N8492J11101L98605p7647k55550
$$ 7401351 7207952 7306740 7288651 7067476 6958399 6955536 7014028 7125129 7523734 7446087 7190537
5713G190537k3272K89119K0277j85651k64003k65524k2151j68716J22528l20414
$$ 7190537 7167265 7456384 7476661 7291010 7027007 6761483 6739332 6570616 6693144 6372730
5703F372730k29039o9712j50384k02950J29168J64461k91936p6844j90924J69112
$$ 6372730 6143691 6073979 5923595 5720645 5849813 6014274 5722338 5645494 5454570 5623682
5693E623682k5611m9835L7902J63771J14320J35965N4210K35884J8413j59145
$$ 5623682 5598071 5548236 5586138 5749909 5864229 6000194 6054404 6290288 6308701 6149556
5683F149556K832L5799M1817J86610k45277j59565k5813j82385p7697j6639k25331
$$ 6149556 6152388 6188187 6230004 6416614 6171337 6011772 5985959 5803574 5725877 5709238 5483907
5672E483907j77850P8302p8741O531o5845j36905M2073J39338O9047j12271K9222
$$ 5483907 5306057 5384359 5305618 5312149 5246304 5109399 5151472 5290810 5359857 5247586 5276808
5661E276808J19153J40202J88642k01024j34971k864K5673k28068P871O6612K1307
$$ 5276808 5395961 5536163 5724805 5523781 5388810 5385946 5411619 5183551 5191422 5258034 5279341
5650E279341p3182j045J49153O9886L10178J09221o5179K1090L6250j29329J85556
$$ 5279341 5206159 5205114 5354267 5424153 5734331 5843552 5778373 5799463 5835713 5706384 5891940
5639E891940n1372k09561Q1894n3164k07531O0585J40244L4448p9436Q1779K14040
$$ 5891940 5840568 5631007 5712901 5659737 5452206 5512791 5653035 5687483 5608047 5689826 5903866
5628E903866J0022j234k2945M51242M21K21621J59738L64944Q6453p592L3523
$$ 5903866 5913888 5912654 5889709 6340951 6341372 6562993 6722731 7087675 7174128 7166536 7200059
5617G200059j27898K3182J49784Q4827j33405M734K1203K37844J04664K35835
$$ 7200059 7072161 7095343 7245127 7329954 7196549 7201283 7222486 7460330 7564994 7800829
5607G800829Q4776J45316J26275L49726J0941j80353r1183O8942J96169J29474
$$ 7800829 7885605 8030921 8157196 8506922 8517863 8337510 8246327 8315269 8511438 8640912
5597H640912J34904o3953K29493J81815K21696J19512J4235L45855J65083L6135
$$ 8640912 8775816 8711863 8941356 9123171 9344867 9464379 9478614 9824469 9989552 10025687
5587A0025687N54994J73655K18660J72326L79204M27553L64045L26425M95666
$$ 10025687 10580681 10754336 10972996 11145322 11524526 11952079 12316124 12642549 13138215
5578A3138215J59681L81612M84464K25655R6547K3411J30729J27331R8172k06554
$$ 13138215 13297896 13679508 14163972 14389627 14486174 14509585 14640314 14767645 14865817 14659263
5568A4659263k14665Q7971L06678P8156K95407J39084L51114M44122J55296O46677
$$ 14659263 14444598 14532569 14839247 14917403 15212810 15351894 15703008 16147130 16302426 16949103
5558A6949103O25198M79362M89061M44879O67629R62833O94528Q09893P97472
$$ 16949103 17574301 18053663 18542724 18987603 19655232 20618065 21312593 22122486 22919958
5549B2919958M85549P80698L07590m22605l10036k88522k18988j79135m692M52712
$$ 22919958 23405507 24186205 24493795 24071190 23761154 23472632 23253644 23074509 23069817 23522529
5539B3522529N38816J87969M50039N07353N22024P07641P78601N06511P01720
$$ 23522529 24061345 24249314 24699353 25206706 25728730 26436371 27214972 27721483 28423203
5530B8423203R23077J030568J080013R75589R47357J083987J451469J156468J169888
$$ 28423203 29346280 30376848 31456861 32432450 33379807 34463794 35915263 37071731 38241619
5521C8241619J125999J089847M41049M48099M09423L76228N60974J103756J498676
$$ 38241619 39367618 40457465 40898514 41346613 41756036 42132264 42693238 43796994 45295670
5512D5295670J596276J583880J694423J225078J308361J120313J050018J207077
$$ 45295670 46891946 48475826 50170249 51395327 52703688 53824001 54874019 56081096
5504E6081096J235569J530362K789621L425139M404966N815862O338344M933955
$$ 56081096 57316665 58847027 61636648 65061787 69466753 75282615 81620959 86554914
5496H6554914J892485r47327j906529j494742q01188L55338J109127J741665K619368
$$ 86554914 88447399 87500072 85593543 84098801 83297613 83652951 84762078 86503743 89123111
5487H9123111L226566L873969M530017N309401O248970O267690N783296N261364
$$ 89123111 92349677 96223646 100753663 106063064 112312034 118579724 124363020 129624384
5479A29624384N641531O969519P335674N945389L598621J669515M27496k47288
$$ 129624384 135265915 142235434 149571108 155516497 159115118 160784633 161212129 160964841
5471A60964841j471068l559460o093498p399304p403614n625217m643569m539721
$$ 160964841 159493773 155934313 149840815 142441511 135037897 129412680 124769111 120229390
5463A20229390m610533m571205l671029k664358j407442n51634P17252J522450
$$ 120229390 115618857 111047652 107376623 104712265 103304823 102753189 103470441 104992891
5455A04992891J082827o7014j121874j774401j517932k456347l934258n068097
$$ 104992891 106075718 106008704 104886830 103112429 101594497 99138150 95203892 90135795
5447I0135795n195920m824360m034980k901262j628724j100180n82769l95720
$$ 90135795 84939875 80115515 76080535 73179273 71550549 70450369 69867600 69471880
5439F9471880n77272k93672l03018k28839j80745r6107J20104O44583J782767
$$ 69471880 68894608 68600936 68297918 68069079 67888334 67792227 67912331 68556914 70339681
5430G0339681K427583L479564M108861L921663K470985q6706k662849m429126
$$ 70339681 72767264 76246828 80355689 84277352 86748337 86661631 83998782 79569656
5422G9569656n617807o384522n892322n106823m068958k876910k119581j398938
$$ 79569656 73951849 67567327 61675005 56568182 52499224 49622314 47502733 46103795
5414D6103795j055368q45817j012274j001432j007140p02457k63406J57464N86288
$$ 46103795 45048427 44202610 43190336 42188904 41181764 40479307 40215901 40373365 40959653
5405D0959653Q85092J184892J904245K009296J510682K3842k005237l515761m318040
$$ 40959653 41844745 43029637 44933882 46943178 48453860 48477702 46472465 42956704 38638664
5396C8638664m133748l337766k820980k446602j754454j749028j271790j338330
$$ 38638664 34504916 31167150 28346170 25899568 24145114 22396086 21124296 19785966
5388A9785966j016819q16873q41319o35383m98709m38475o90960m35868m68844
$$ 19785966 18769147 17952274 17110955 16475572 15976863 15538388 14847428 14411560 13942716
5379A3942716l84037m91839m0190j65983l67391m02783o2797K59780n08190l73957
$$ 13942716 13558679 13066840 13026650 12860667 12493276 12090493 12027696 12287476 11779286 11405329
5369A1405329L6124j84132J15914O2857J7976N2458Q1074K60564J92795K66859
$$ 11405329 11441453 11257321 11373235 11436092 11454068 11506526 11587600 11848164 12040959 12307818
5359A2307818K93141M27681J02725J25627o1397m08599o34041n62478n12388l09916
$$ 12307818 12600959 13028640 13131365 13256992 13195595 12786996 12152955 11590477 11078089 10768173
5349A0768173l03015J60034j47588k15535N6102o9939J92492L04985J34240K9714
$$ 10768173 10465158 10625192 10477604 10262069 10318171 10248232 10440724 10745709 10879949 10909663
5339A0909663K91723J63082K11637N18796O39792L58461L79301M64539N43511
$$ 10909663 11201386 11364468 11576105 12094901 12734693 13093154 13472455 13936994 14480505
5330A4480505O49337R26106J504992J485831K039380J646582P60602n51317j580698
$$ 14480505 15129842 16055948 17560940 19046771 21086151 22732733 23493335 22942018 21361320
5321B1361320j910707j798444j065885p28209j111585q49233r33111q56997k73081
$$ 21361320 19450613 17652169 16586284 15858075 14746490 13897257 12964146 12107149 11834068
5312A1834068m41454j70415q2851j79638n6626M5517j05133K34025K21340L53409
$$ 11834068 11392614 11222199 11139348 10959710 10903084 10948601 10843468 11077493 11298833 11652242
5302A1652242K10779M66361N06588O06834O76297J124042J699336J814392J860267
$$ 11652242 11863021 12329382 12835970 13442804 14119101 15243143 16942479 18756871 20617138
5293B0617138J957390J304551j92141q50487j499685j249142p59921n22191k62164
$$ 20617138 22574528 23879079 23686938 22836451 21336766 20087624 19327703 18805512 18543348
5284A8543348j15125j11807J2128K4853o26735j259061j688982j748300j137736
$$ 18543348 18428223 18316416 18328544 18353397 17726662 16467601 14778619 13030319 11892583
5275A1892583r41610q46930m47208j05115k00329k14130k56523m31853n4640L01002
$$ 11892583 10950973 10104043 9656835 9551720 9351391 9137261 8880738 8448885 8394245 8695247
5265H695247K24938O6327K91206N03950P88504K88116n8378l76314o91950q85591
$$ 8695247 8920185 8986512 9277718 9781668 10570172 10858288 10799910 10423596 9731646 8846055
5255H846055o00880l33064m94802l54298m02661l96916j1558R0573k62162j06533
$$ 8846055 8245175 7912111 7417309 7063011 6660350 6263434 6251876 6342449 6080287 5973754
5245E973754n06091n1839J44678p5738l02510l40148k50352j12166n1568k07078
$$ 5973754 5467663 5415824 5560502 5484764 5182254 4842106 4591754 4479588 4428020 4220942
5235D220942j77450p9330P3434J82689k36253m52097m3594P1705o126J067j65862
$$ 4220942 4043492 3964162 4037596 4220285 3984032 3531935 3488341 3560046 3553920 3554987 3389125
5224C389125K6511J76386Q5156j11924L04008N6925J7341L74881J00394l2182
$$ 3389125 3415636 3592022 3677178 3565254 3869262 3926187 3943528 4318409 4418803 4386621
5214D386621Q0807K13668K33814j22567l7702J46500j05759l47971j52110j19922
$$ 4386621 4467428 4681096 4914910 4792343 4754641 4901141 4795382 4447411 4295301 4175379
5204D175379k65015j89786n127M367k78089j76562n6026m4879m2214L7371k19180
$$ 4175379 3910364 3720578 3715451 3719818 3441729 3265167 3209141 3164262 3122048 3159419 2940239
5193B940239r6435j64514k46381Q0830K97763R1978j9839p4963M72578q9748J51878
$$ 2940239 2843804 2679290 2432909 2513739 2811502 2903480 2883641 2808678 3281256 3191508 3343386
5182C343386J95159r5381l846L13777J83270J73397J5836k10328j49512O2449
$$ 3343386 3538545 3443164 3439318 3753095 3936365 4109762 4125598 3915270 3765758 3828207
5172C828207m0600n1189k65042j94300j74232n3876k16047j55834o1403k63784
$$ 3828207 3787607 3736418 3471376 3277076 3102844 3048968 2832921 2677087 2615684 2351900
5162B351900J32620q155j35723K209j23302K0007J60009q4216l16461o1461J47174
$$ 2351900 2484520 2476365 2340642 2342851 2219549 2239556 2399565 2315349 1998888 1937427 2084601
5151B084601J6678Q7293k7896R0186K51920K46830R762p3233j9334J05829q9157
$$ 2084601 2101279 2188572 2160676 2250862 2502782 2749612 2759374 2686141 2666807 2772636 2683479
5140B683479k72915n3709O2796q4033o3856q4169M0137n9066K2787l4485N2064
$$ 2683479 2410564 2356855 2419651 2335618 2271762 2187593 2227730 2168664 2191451 2156966 2209030
5129B209030n0290k58482r1185j84983J58367J78946Q783M3658l3797l59692n1680
$$ 2209030 2158740 1900258 1809073 1624090 1782457 1961403 1970186 2013844 1980047 1620355 1568675
5118A568675L38130q6979m48921Q4248J06875j72459K97589r7369J8220j21576
$$ 1568675 1906805 1819826 1370905 1455153 1562028 1389569 1687158 1589789 1608009 1486433
5108A486433K77780Q3843k19206M8126J33915M6161J03745o2965k25481k09224
$$ 1486433 1764213 1848056 1628850 1676976 1810891 1857052 1960797 1897832 1672351 1463127
5098A463127j4112j7952N6099r2218K63423J6521j25045j13477J60393O697k27998
$$ 1463127 1449015 1431063 1487162 1394944 1658367 1674888 1549843 1436366 1596759 1603456 1375458
5087A375458r3376m5032J7657m8430K20287P3316n8729j91537q9694J13579K47901
$$ 1375458 1282082 1237050 1254707 1206277 1426564 1499880 1441151 1249614 1159920 1273499 1521400
5076A521400n4559J10514p047l16301k8030K20502k06624O6508R6283j78513R6651
$$ 1521400 1466841 1577355 1570308 1254007 1225977 1446479 1239855 1306363 1402646 1224133 1320784
5065A320784M6185J14945n785p5592K35232K00725j72922j99424j23422m8020
$$ 1320784 1366969 1481914 1476129 1400537 1635769 1836494 1663572 1464148 1340726 1292706
5055A292706O8254r7246j3736k1022j02949J41557L38809O8278j50990j32716
$$ 1292706 1360960 1263714 1249978 1228956 1126007 1267564 1606373 1674651 1523661 1390945
5045A390945j3929J75022j15011n1041J77655k83952k1945K71635J15204J0453
$$ 1390945 1377016 1552038 1437027 1385986 1563641 1279689 1257744 1529379 1644583 1655036
5035A655036k22354k54217J12495J50841N028r3570R8118M7692J84104j03951
$$ 1655036 1432682 1178465 1290960 1441801 1446829 1353259 1451377 1499069 1683173 1579222
5025A579222r8253l0468J69021P0570p9678q6354J8092O7030r2778k62267O0432
$$ 1579222 1480969 1450501 1619522 1690092 1610414 1524060 1542152 1609182 1516404 1254137 1314569
5014A314569K18668J4087R9364k04077p6329J89204J70506Q8123j84467J20545
$$ 1314569 1533237 1547324 1646688 1442611 1366282 1555486 1725992 1814115 1629648 1750193
5004A750193l3588m9998R6145q1125j54822O1817j8445M4495K16174l0380J10160
$$ 1750193 1716605 1666607 1762752 1681627 1526805 1588622 1570177 1614672 1830846 1800466 1910626
4993A910626j81574k23737K57530L35173j62309j07197j82724R617L2658J15346
$$ 1910626 1729052 1505315 1762845 2098018 1935709 1828512 1645788 1655405 1688063 1803409
4983A803409P2794j66782m9640M31763L6781q872R9015l0514j58185q986J37318
$$ 1803409 1876203 1709421 1659781 2091544 2128325 2119453 2218468 2187954 2029769 2020783 2158101
4972B158101R9347j31965r5524j12984K9412K09831L8516o229n7051o1223J51967
$$ 2158101 2257448 2125483 2029959 1916975 1946387 2156218 2194734 2188505 2131454 2070231 2222198
4961B222198N0372L6636k2331l5816Q0145K22042r3276J80982K46981j72507k39372
$$ 2222198 2272570 2309206 2286875 2251059 2331204 2553246 2459970 2640952 2887933 2715426 2476054
4950B476054J83557L93196o0059j1714m7307k9091J27606M6724j10990Q2107L59014
$$ 2476054 2659611 3052807 2992748 2981034 2933727 2904636 3032242 3078966 2967976 3050083 3409097
4939C409097r1268K72767K59554l17j6669n2680L00138r9144J27989n3641L32255
$$ 3409097 3317829 3590596 3850150 3849833 3833164 3780484 4080622 3981478 4109467 4055826 4388081
4928D388081N53267m196P4679L66876L41745J62670L5027J29434J66752N43213
$$ 4388081 4941348 4937152 5011831 5378707 5720452 5883122 5918149 6047583 6214335 6757548
4918F757548L00164J70135o2639K6531K29347K79564L26366P63234J050212J092398
$$ 6757548 7057712 7227847 7165208 7191739 7421086 7700650 8027016 8790250 9840462 10932860
4908A0932860Q33095P22895P68362Q97555J420168J933352K505995L833672N227430
$$ 10932860 11765955 12488850 13257212 14154767 15574935 17508287 20014282 23847954 29075384
4899B9075384O480686M017782l27589l516505m304529m443194m570677m163779
$$ 29075384 35556070 39573852 39246263 35729758 31425229 26982035 22411358 18247579
4891A8247579l066118k232112j863581j165914j052116p75661p24299n93718k66840
$$ 18247579 15181461 12949349 11085768 9919854 8867738 8092077 7367778 6774060 6507220
4882F507220j57176m27393j56827q955k87887k22936j7533j71328k36826j86480
$$ 6507220 6350044 5922651 5765824 5756869 5468982 5246046 5228513 5057185 4820359 4633879
4872D633879j65443l318j55356J9260L9643q0536r5625j92542K0667N315Q6872
$$ 4633879 4468436 4465118 4309762 4329022 4368665 4288129 4192504 3999962 4020629 4025944 4112816
4861D112816P1015K01863j52436j4323j12802Q9037m4844j47856j65782Q2647
$$ 4112816 4183831 4385694 4233258 4218935 4106133 4195170 4150326 4002470 3836688 3919335
4851C919335j75537M6422j4359k4125r9281n8579J67416K06537m642k7358n1367
$$ 3919335 3743798 3790220 3775861 3751736 3652455 3593876 3761292 3967829 3963187 3935829 3884462
4840C884462M7090J26574J62269J19762j14897k556J5011J98742J71976l50091
$$ 3884462 3931552 4058126 4220395 4340157 4225260 4222704 4237715 4436457 4608433 4258342
4830D258342m2568O8122r1953p619J77103R920j84418J41365N6172J31474P9020
$$ 4258342 4215774 4283896 4191943 4184324 4361427 4371347 4186929 4328294 4384466 4515940 4594960
4819D594960m2592j13398j15360J47142K22784J62060K28264L0908R9092K9123
$$ 4594960 4552368 4438970 4323610 4470752 4693536 4855596 5083860 5114768 5213860 5242983
4809E242983J48080m989O6114j09759J45869L70843O9997P3933m7673J59975j0510
$$ 5242983 5391063 5386074 5452188 5342429 5488298 5859141 5929138 6003071 5955398 6115373 6104863
4798F104863J24454L32831K13957J61521P8770K88518J28911J10050L90380N0016
$$ 6104863 6229317 6562148 6776105 6937626 7016396 7304914 7433825 7543875 7934255 7984271
4788G984271L15257J58161K26425N08807K03122N08450K51283K4675K76326N69878
$$ 7984271 8299528 8457689 8684114 9192921 9396043 9904493 10155776 10180451 10456777 11026655
4778A1026655M89772J39542K93482L96165L17944M08860L71405M91546L91276
$$ 11026655 11516427 11655969 11949451 12345616 12663560 13072420 13443825 13935371 14326647
4769A4326647O56973P46609P01415O73443P08746P65434Q36936O53378N32649
$$ 14326647 14983620 15730229 16431644 17105087 17813833 18579267 19416203 20069581 20602230
4760B0602230O93067Q38936J152629J545806J522015J903721K285033K785991
$$ 20602230 21295297 22134233 23286862 24832668 26354683 28258404 30543437 33329428
4752C3329428L199086L193960K800580J727571J37510j279995k057930j970046
$$ 33329428 36528514 39722474 42523054 44250625 44388135 43108140 41050210 39080164
4744C9080164j777478j170741p54290l97262J39371K33414K20538Q0041J03695
$$ 39080164 37302686 36131945 35377655 34980393 35119764 35353178 35573716 35653757 35757452
4735C5757452k4955R2539P62266J387832J905494K435293L362108M216007M151741
$$ 35757452 35732497 35825036 36587302 37975134 39880628 42315921 45678029 49894036 54045777
4726E4045777M137934K819300J185901j071911l254857m535507n021138m986192
$$ 54045777 58183711 61003011 62188912 61117001 57862144 53326637 48305499 43319307
4718D3319307m078360k598978k253497j748111j223798j078599j227688j009286
$$ 43319307 39240947 36641969 34388472 32640361 31416563 30337964 29110276 28100990
4710B8100990o60045o18339k62329J10531K72091Q99160J346109J445612J569209
$$ 28100990 27440945 26822606 26560277 26670808 26942899 27842059 29188168 30633780 32202989
4701C2202989J648712Q30587j27865j167485k530101l282193k989341k693510
$$ 32202989 33851701 34682288 34554423 33386938 30856837 27574644 24585303 21891793
4693B1891793k344144j725389j634264j462482j134929r26048r67430p76178l82535
$$ 21891793 19547649 17822260 16187996 14725514 13590585 12664537 11697107 10920929 10538394
4684A0538394m13021l77067n17710o11579k59365l6541l62981l41490m11113p2785
$$ 10538394 10125373 9748306 9230596 8619017 8359652 8323111 7960130 7618640 7207527 7134742
4674G134742q3569m1356k51460j64560j65077l17584K78119k12017l2231k87449
$$ 7134742 7051173 7009817 6758357 6593797 6428720 6111136 6389255 6177238 6145007 5857558
4664E857558j86805k21660l1620j34319k23586k74622k7638L9254k17829J25124
$$ 5857558 5670753 5449093 5417473 5283154 5059568 4784946 4757308 4796562 4578733 4703857
4654D703857m2142k21856N647N3903J45742m0774j76042l351J55555j42808j5106
$$ 4703857 4661715 4439859 4445506 4499409 4645151 4604377 4428335 4424984 4580539 4437731 4422625
4643D422625J71471P3689K21432l7561O8791K49130J76327K16890l9874K4832
$$ 4422625 4594096 4667785 4889217 4851656 4920447 5169577 5345904 5562794 5522920 5547752
4633E547752J85635j92768l52542m06507N183q7133j19299j6295m2826l7911j24992
$$ 5547752 5733387 5540619 5188077 4781570 4786753 4699620 4580321 4564026 4521200 4483289 4358297
4622D358297J86049K35628J24658J14308L54933j55446K41934Q5323R4670R3053
$$ 4358297 4544346 4779974 4904632 5018940 5373873 5218427 5460361 5545684 5640354 5733407
4612E733407N7374o2494k3901j1417j48710k05796l11382k32733k02119J0485
$$ 5733407 5790781 5728287 5704386 5692969 5544259 5338463 5027081 4794348 4592229 4602714
4602D602714j09330j94140k30434N0074k14534o4493J38828J67704j27755O6720
$$ 4602714 4493384 4299244 4068810 4118884 3904350 3839857 3978685 4146389 4018634 4085354
4592D085354K37673J48140k3120K68289k62550j01090l3289j99332n60968l15910
$$ 4085354 4323027 4471167 4448047 4716336 4453786 4352696 4319407 4120075 3559107 3243197
4582C243197K8003m0998j18596k56159R5218j50698k19442j45617q7840J65924
$$ 3243197 3271200 3230202 3111606 2855447 2950665 2799967 2580525 2434908 2347068 2512992
4572B512992j61790q5823J09611L41L4225j56885M9289O5371n3675j69901N2497
$$ 2512992 2351202 2265379 2374990 2375331 2409556 2252671 2301960 2367331 2313656 2143755 2196252
4561B196252p9976j47208J82988K76821j29732j7076j17993j22532J18461r0445
$$ 2196252 2116276 1969068 2152056 2428877 2299145 2282069 2164076 2041544 2160005 2069560
4551B069560m4940N1558R2347j02358k32204m5823K20356n2943L8911l1319j41948
$$ 2069560 2024620 2076178 2168525 2066167 1833963 1788140 2008496 1955553 1994464 1963145 1821197
4540A821197j43342K39470N9590p0100j50698j09446J06352J11651R1781J51096
$$ 1821197 1677855 1917325 1976915 1906815 1756117 1646671 1753023 1864674 1956455 2107551
4530B107551j94574r2377j11970Q2448L76097j8153N1110j47948p4812k9869K44595
$$ 2107551 1912977 1820600 1708630 1791078 2167175 2149022 2200132 2052184 1977372 1947503 2192098
4519B192098j91207j03957p4771n7466J43120J43358o9527L0973J4521l0221R1522
$$ 2192098 2000891 1896934 1822163 1764697 1907817 2051175 1981648 2012621 2027142 1996921 2088443
4508B088443J73056J27559j87241o4967k83582J0311N2506J53278J01699j53722
$$ 2088443 2261499 2389058 2201817 2136850 1853268 1863579 1916085 2069363 2171062 2017340
4498B017340J138K00454L0053q7520J2755m7265R9283J64180j19939k00135K09804
$$ 2017340 2018478 2218932 2248985 2161465 2174220 2126955 2226238 2390418 2270479 2070344 2280148
4487B280148J5379J42156J3787k48139l64024J14114n2968N5333J42863M1799
$$ 2280148 2295527 2437683 2451470 2203331 1839307 1953421 1900453 1955786 2098649 2140448
4477B140448q5473K1253J35392m8611k1947j67772P8604O052l52291J40662Q8610
$$ 2140448 2054975 2076228 2211620 2163009 2141062 1973290 2051894 2057946 1705655 1846317 1934927
4466A934927k7612J00111k0817p2138J7117M2544o2886N0992l8705L216K37479
$$ 1934927 1907315 2007426 1986609 1914471 1931588 1974132 1911246 1962238 1923533 1926749 2164228
4455B164228M3706q1970O8168q0581J45056J06433j68349M3141L0552p7885K48961
$$ 2164228 2207934 2125964 2194132 2113551 2258607 2365040 2196691 2239832 2270384 2192499 2441460
4444B441460q19k6896j60884J18270L31877m7418j26272P85k48192P0375L12413
$$ 2441460 2440641 2413745 2252861 2371131 2703008 2655590 2529318 2530103 2281911 2352286 2664699
4433B664699n0213k7092o547O5766k12127J3613J57259j22303Q9206j16013L5514
$$ 2664699 2614486 2587394 2580847 2646613 2434486 2448099 2605358 2483055 2572261 2456248 2491762
4422B491762O9672m5422J5418J15523j27484N7426J85767o2876l4096j27293J09172
$$ 2491762 2561434 2516012 2531430 2646953 2519469 2576895 2762662 2699786 2665690 2538397 2647569
4411B647569k9715Q2248J09325k95044J43962O4432N2131J49289q3365j29462
$$ 2647569 2617854 2700102 2809427 2514383 2658345 2722777 2774908 2924197 2840832 2711370
4401B711370J22901J06218k11679J0978J81608j90710J49942K06593j18494m7164
$$ 2711370 2834271 2940489 2728810 2739788 2921396 2730686 2880628 3087221 2968727 2921563
4391B921563K44675o4566k90668K1615k9011P6051Q7806J72653j54590J45238
$$ 2921563 3166238 3101672 2811004 2832619 2803608 2879659 2967465 3140118 2985528 3130766
4381C130766O874j07022J09790L40246j74144o5872P0970j53987o0876p8923K72340
$$ 3130766 3137640 3030618 3140408 3480654 3306510 3240638 3311608 3157621 3096745 3017822 3290162
4370C290162l5428L0701l5680K15715j3300R9651L3890k48323p6281l1383k3298
$$ 3290162 3254734 3285435 3249755 3465470 3452170 3551821 3585711 3337388 3261107 3229724 3206426
4359C206426P6769J37304M8064K36695j4881l4809j08598K74160K38654Q0448
$$ 3206426 3283195 3420499 3468563 3705258 3690377 3655568 3546970 3821130 4059784 4140232
4349D140232J57376j56029r1658m7329J15745K47345L100k20485m2373r8633Q9625
$$ 4140232 4297608 4141579 4049921 4002592 4118337 4365682 4368782 4148297 4105924 4007291 4096916
4338D096916N6832j50900l1341Q7582O2440J86258j84561J5460K13647j10054
$$ 4096916 4153748 4002848 3971507 4059089 4121529 4307787 4123226 4138686 4352333 4242279
4328D242279K22921J08316J80211o6745k67102Q0381J29996l0084J15965O4977
$$ 4242279 4465200 4573516 4753727 4686982 4419880 4500261 4630257 4600173 4716138 4781115
4318D781115K43625M5981K17356J31582n5287J59834q810K26984K66049r7474
$$ 4781115 5024740 5070721 5288077 5419659 5364372 5524206 5515396 5742380 6008429 5910955
4308E910955o5287K50879M51227L61767R1787J81798m9229J00949J222N51L7473
$$ 5910955 5845668 6096547 6547774 6909541 7001328 7183126 7133897 7234846 7236068 7236619 7274092
4297G274092j0228L27854R8202J0549J91659L18935J84917p1137K02915J96677
$$ 7274092 7263864 7591718 7689920 7700469 7892128 8211063 8395980 8324843 8527758 8724435
4287H724435J72448J77480K1530L14975K28225P9981j2156K32842K39301K76147
$$ 8724435 8896883 9074363 9095893 9410868 9639093 9719074 9706918 9939760 10179061 10455208
4277A0455208L44929K81587j4453K05846K52006J54089Q5306K65258L19939K12674
$$ 10455208 10800137 11081724 11067271 11273117 11525123 11679212 11764518 12029776 12349715 12562389
4267A2562389P223K40291K06325J55167q0302K15136L05976K82844L96245J64327
$$ 12562389 12569612 12809903 13016228 13171395 13091093 13306229 13612205 13895049 14291294 14455621
4257A4455621L33355K35904K27696K1439N14743O61000O10595L21574M30993P41124
$$ 14455621 14788976 15024880 15252576 15274015 15788758 16449758 17060353 17381927 17812920 18554044
4247A8554044M89585N27160M47266O76250Q57098Q16229P52957J050813R65728
$$ 18554044 19043629 19570789 20018055 20694305 21551403 22367632 23120589 24171402 25137130
4238B5137130P80912J013085J072857J343337J090938J548302J361831J433731
$$ 25137130 25918042 26931127 28003984 29347321 30438259 31986561 33348392 34782123
4230C4782123J298241J344236J584423J780711J597008J698559J790964J695089
$$ 34782123 36080364 37424600 39009023 40789734 42386742 44085301 45876265 47571354
4222D7571354J878098J960299J791724J781329K098656J962478J797052J858697
$$ 47571354 49449452 51409751 53201475 54982804 57081460 59043938 60840990 62699687
4214F2699687J459071J853794J688081J383382J125687J301487J282233J147460
$$ 62699687 64158758 66012552 67700633 69084015 70209702 71511189 72793422 73940882
4206G3940882J151342J073427Q95771M70288P14351M40135L19732K76248m8561
$$ 73940882 75092224 76165651 77061422 77531710 78246061 78686196 79005928 79282176 79233615
4197G9233615k55229m49232r61551p01341q27480q04607j094786r88915j122774
$$ 79233615 78978386 78529154 77567603 76866262 76038782 75234175 74139389 73150474 72027700
4188G2027700j197166j367013j189511j642696j794390j896683j694247j724615
$$ 72027700 70830534 69463521 68274010 66631314 64836924 62940241 61245994 59521379
4180E9521379j889866j897830j951187j528590j633680j571935j282286j675545
$$ 59521379 57631513 55733683 53782496 52253906 50620226 49048291 47766005 46090460
4172D6090460j782301j461057j717105j440752j874588j509015j300418j483601
$$ 46090460 44308159 42847102 41129997 39689245 37814657 36305642 35005224 33521623
4164C3521623j454632j346851j265389j298091r20302p46590j053775q56832r20416
$$ 33521623 32066991 30720140 29454751 28156660 27236358 26489768 25435993 24579161 23658745
4155B3658745r59547q94054q20520p04498o21344n69747n17753o50032n96551
$$ 23658745 22699198 21805144 20984624 20280126 19658782 19089035 18571282 17921250 17324699
4146A7324699j60187l65797l50885k62815k17210l09759l42989m20383n8737j97336
$$ 17324699 17164512 16798715 16447830 16185015 15967805 15658046 15315057 14894674 14835937 14638601
4136A4638601m20020J556O9165Q5022l78649k29106j38316l41042l18208Q1217
$$ 14638601 14218581 14220137 14289302 14374324 13995675 13766569 13628253 13287211 12969003 13050220
4126A3050220k13865k60786j88170m08669l16676k50231r2502n0763j36090k08160
$$ 13050220 12836355 12575569 12387399 11978730 11662054 11411823 11319321 11268558 11132468 10924308
4116A0924308m5062k47128L9281l84867k85564n7114l79753j35373M0625L0900
$$ 10924308 10879246 10632118 10671399 10286532 10000968 9943854 9564101 9428728 9469353 9500253
4106I500253j89492j46031q5899j59833j1761K5744o9864j226k10402l22727k7436
$$ 9500253 9310761 9164730 9078831 8918998 8907237 8932981 8863117 8861891 8651489 8328762 8301326
4095H301326P0001j22825R036j41871j2811k3543k70425M07044M09144j36182
$$ 8301326 8371327 8248502 8257538 8115667 8102856 8079313 7808888 8215932 8625076 8488894
4085H488894m23843j86881p3063K38062j71742l26331J06967j17329j53803R8903
$$ 8488894 8065051 7878170 7805107 8043169 7871427 7545096 7652063 7534734 7380931 7479834
4075G479834m2294L7557m4505n0055K66052q4660J94298q861j28712N6078n0851
$$ 7479834 7437540 7475097 7430592 7380537 7646589 7561929 7756227 7747366 7618654 7674732 7623881
4064G623881O7633Q5300j03571p5522J13527J64310q2687r1024L7687o3069k0702
$$ 7623881 7691514 7776814 7673243 7597721 7711248 7875558 7792871 7701847 7739534 7676465 7655763
4053G655763J31678J45239n8963m3924j19957J23416K5110m4502r412j55491M7176
$$ 7655763 7787441 7932680 7873717 7829793 7709836 7833252 7858362 7813860 7804448 7648957 7696133
4042G696133J08530q9062j47649j5415k8163K20236r371N3731j73730k44512Q633
$$ 7696133 7804663 7715601 7567952 7552537 7524374 7744610 7735239 7788970 7615240 7370728 7379361
4031G379361J3771K39924m3871R4850J2806j3458j55621K33767O5347L1105n118
$$ 7379361 7393132 7633056 7589185 7684035 7696841 7683383 7527762 7761529 7826876 7857981 7852863
4020G852863j59354P0095K39022N5612N4359K25993O1580K42426K2371j59352
$$ 7852863 7693509 7763604 8002626 8058238 8112597 8338590 8400170 8642596 8664967 8505615
4010H505615K1373j19744L07409K93434n3359L14846M3937K48397R0266j08272
$$ 8505615 8526988 8407244 8714653 9008087 8954728 9269574 9313511 9561908 9652174 9543902
4000I543902J54796J17152R4151K23702j71318O5557J18093n7084j62659K0350
$$ 9543902 9698698 9815850 9910001 10133703 9962385 10027942 10146035 10088951 9926292 9946642
3990I946642M2224m564J40022P2010Q088J41981j65242j51210o8000k98357J53255
$$ 9946642 9988866 9984302 10124324 10196334 10204422 10346403 10181161 10029951 9961951 9663594 9816849
3979I816849j55284j88767j25362N7280K07209j48104j36193J56081J78178J8415
$$ 9816849 9661565 9472798 9347436 9404716 9611925 9463821 9327628 9483709 9661887 9680302
3969I680302K4983R6979O8766L02862J36880k43488J35680K6209K60422K43517
$$ 9680302 9705285 9802264 9871030 10173892 10310772 10067284 10202964 10229173 10489595 10733112
3959A0733112J05020K36698O0342J7699N496K25075J35382J3850K87775L2253
$$ 10733112 10838132 11074830 11135172 11152871 11158367 11383442 11518824 11532674 11820449 11852702
3949A1852702Q0724L61520J77153Q1547J97920R3127O5209Q3801L11596K76075
$$ 11852702 11933426 12294946 12472099 12553646 12751566 12844693 12909902 12993703 13305299 13581374
3939A3581374L73504K14072J8213K18470L18371N81752o8906J69555L69148K49439
$$ 13581374 13954878 14168950 14187163 14405633 14724004 15305756 15236850 15406405 15775553 16024992
3929A6024992K11425K11681L07393J11432M58221L31149K20498J22521K60427
$$ 16024992 16236417 16448098 16755491 16866923 17325144 17656293 17876791 17999312 18259739
3920A8259739J94633N96999M41139M54568M73693J90360K24288K59868O00223
$$ 18259739 18454372 19051371 19492510 19947078 20420771 20611131 20835419 21095287 21695510
3911B1695510M01843M74164M48462M09174L78682P89460Q15367O69231R03900
$$ 21695510 22097353 22571517 23019979 23429153 23807835 24597295 25412662 26081893 26985793
3902B6985793R23731J044917J217858R66722J199704J366702J087123J278199
$$ 26985793 27909524 28954441 30172299 31139021 32338725 33705427 34792550 36070749
3894C6070749J349309J148230J116292R68582Q26617R97302P81160N61075O54275
$$ 36070749 37420058 38568288 39684580 40653162 41479779 42477081 43258241 43819316 44473591
3885D4473591P64422R71821O77169Q50382J091303R75365O59901M98779L95780
$$ 44473591 45238013 46209834 46887003 47737385 48828688 49804053 50463954 50962733 51358513
3876E1358513J50985R4891j16346j09162j31210j87391J19434M11623J53126m840
$$ 51358513 51509498 51604389 51488043 51378881 51247671 51060280 51179714 51591337 51744463 51739623
3866E1739623K49177O20011M40458J89708K93599M32082P29693L31009N66202
$$ 51739623 51988800 52608811 53049269 53238977 53532576 53964658 54694351 55025360 55591562
3857E5591562N49832M55467O77322R26409J166975J355971J160657J370532J505742
$$ 55591562 56141394 56596861 57274183 58200592 59367567 60723538 61884195 63254727 64760469
3848F4760469K049849K050483K203687K612217K822759L068858K930478L032577
$$ 64760469 66810318 68860801 71064488 73676705 76499464 79568322 82498800 85531377
3840H5531377L037265K856838K802991K909903K935681K796886K510483K656938
$$ 85531377 88568642 91425480 94228471 97138374 100074055 102870941 105381424 108038362
3832A08038362L057856L375164L057545L240984L172935L049598L120564K765795
$$ 108038362 111096218 114471382 117528927 120769911 123942846 126992444 130113008 132878803
3824A32878803K316645K016874J755485J491164J176194J348606J355773J402531
$$ 132878803 135195448 137212322 138967807 140458971 141635165 142983771 144339544 145742075
3816A45742075J605175J651205J587126K091519J650533J570476J590899J454658
$$ 145742075 147347250 148998455 150585581 152677100 154327633 155898109 157489008 158943666
3808A58943666J168293J108142P25538Q53284R92232N95032P18307J088845J308651
$$ 158943666 160111959 161220101 161945639 162798923 163791155 164386187 165104494 166193339 167501990
3799A67501990J131857J090513J508516J687649J071607J613187J515655J371111
$$ 167501990 168633847 169724360 171232876 172920525 173992132 175605319 177120974 178492085
3791A78492085J510952J749658K507565K447879K828343L766991M639152N568772
$$ 178492085 180003037 181752695 184260260 186708139 189536482 193303473 197942625 203511397
3783B03511397O686915Q224992Q773089R702072R782688R257284Q458872O554844
$$ 203511397 210198312 218423304 227196393 236898465 246681153 255938437 264397309 270952153
3775B70952153L798840J193941j013641k946937m128479m457576m589872m004794
$$ 270952153 274750993 275944934 274931293 271984356 267855877 263398301 258808429 254803635
3767B54803635l025699k470215k055105j972281k780993l970099n591151p699332
$$ 254803635 251777936 249307721 247252616 245280335 242499342 238529243 232938092 225238760
3759B25238760r720007j1202566j2712923j3303021j3280001j2894930j1610849
$$ 225238760 215518753 204316187 191603264 178300243 165020242 152125312 140514463
3752A40514463j0505755q990952p706310o904762o071001m918547m449019l635241
$$ 140514463 130008708 121017756 113311446 106406684 100335683 95417136 90968117 87332876
3744H7332876l379746l220054k673034k270972k257966k361485j811930k319179
$$ 87332876 83953130 80733076 78060042 75789070 73531104 71169619 69357689 67038510
3736F7038510k223293k103846j998094j839864j926026j781120j612674j437840
$$ 67038510 64815217 62711371 60713277 58873413 56947387 55166267 53553593 52115753
3728E2115753j847405j373374j341378j439570j112749j302579j421405j190902
$$ 52115753 50268348 48894974 47553596 46114026 45001277 43698698 42277293 41086391
3720D1086391j186338j234779q74343j071518j195091r94790q25590q43624q74216
$$ 41086391 39900053 38665274 37790931 36719413 35524322 34529532 33703942 32860318 31986102
3711C1986102o45790p06119p14101p02336m81642n18043k63588o49345m97170
$$ 31986102 31340312 30634193 29920092 29217756 28736114 28218071 27954483 27305138 26807968
3702B6807968k26951k83202m66341l86539l07706k51169m20582m38225l03543
$$ 26807968 26581017 26297815 25831474 25444935 25137229 24886060 24465478 24027253 23723710
3693B3723710n05870l46300j71883j93951l61785j96935l89375l97769j24739
$$ 23723710 23217840 22871540 22699657 22505706 22143921 21946986 21557611 21159842 21035103
3684B1035103j92715r2170m2714K8793l50638k30393j31609J07212k14327k01425
$$ 21035103 20842388 20750218 20707504 20736297 20385659 20155266 20023657 20130869 19916542 19715117
3674A9715117j98448l22067K1933P2763p4566p0632j91463j85762j47923P5112
$$ 19715117 19516669 19194602 19216535 19289298 19214732 19144100 18952637 18766875 18618952 18694064
3664A8694064J0849k9296j17079M487L05131J18303n8676l65943r4072M2462J08362
$$ 18694064 18704913 18675617 18558538 18563025 18868156 18986459 18927783 18561840 18467768 18510230 18618592
3653A8618592r9868Q2650k49451J84851m4670M9298J21473J80609J4346j88840
$$ 18618592 18518724 18601374 18351923 18536774 18492104 18541402 18662875 18843484 18857830 18668990
3643A8668990J6714O2118k2380j13265n4362L8439J33405J31863N0726k76373
$$ 18668990 18685704 18747822 18725442 18612177 18557815 18596254 18729659 18861522 18912248 18635875
3633A8635875l2846Q1010J27459K08966n5809L071Q9775M8624j694K39300n2190
$$ 18635875 18603029 18684039 18811498 19020464 18964655 18967726 19057501 19106125 19104431 19343731 19291541
3622A9291541K00339j9351K96720L1586n5690K82360M2960j81976r5608J72689
$$ 19291541 19491880 19472529 19769249 19800835 19745145 20027505 20070465 19888489 19792881 19965570
3612A9965570L60236J63O6494O3017Q3968J57162L69741R3737N2525L31295J57987
$$ 19965570 20325806 20325969 20392463 20455480 20539448 20696610 21066351 21160088 21212613 21543908 21701895
3601B1701895J27555K98648Q0012j29574O9448J96572M07390J02343J50542j42438
$$ 21701895 21829450 22128098 22208110 22078536 22147984 22344556 22751946 22854289 23004831 22862393
3591B2862393K72707K34158R252K55399J41476P0903J84361J47294K75263J9162
$$ 22862393 23135100 23369258 23378510 23633909 23775385 23846288 24030649 24177943 24453206 24472368
3581B4472368J96875L64679O4575K05151K17565J28795M10236K43147J99211N76335
$$ 24472368 24669243 25033922 25098497 25303648 25521213 25650008 26060244 26303391 26502602 27078937
3571B7078937J58866r6542N15796J78669R5499M35353J90410N4657L34767N19740
$$ 27078937 27237803 27141261 27657057 27835726 27931225 28366578 28556988 28611645 28946412 29466152
3561B9466152L57121J26890K09152J82735M32682N53202K27158L79857K59238
$$ 29466152 29823273 29950163 30159315 30342050 30774732 31327934 31555092 31934949 32194187
3552C2194187L84135N45566O20235N06152L75014P54938M42641L80267M00672
$$ 32194187 32578322 33123888 33744123 34250275 34625289 35380227 35822868 36203135 36603807
3543C6603807P20159L40375L78236J58154M56200P26271Q10248N57870O88374
$$ 36603807 37323966 37664341 38042577 38200731 38656931 39383202 40193450 40751320 41439694
3534D1439694P39280L60279R26679J063189J046346P69553R96287J340072J346088
$$ 41439694 42178974 42539253 43465932 44529121 45575467 46345020 47341307 48681379 50027467
3525E0027467J284446J095305J349008J220916J031875J111705Q50192P18370
$$ 50027467 51311913 52407218 53756226 54977142 56009017 57120722 57970914 58689284
3517E8689284N89697L93671M06848N71316Q02616O10714J061761Q37365O55504
$$ 58689284 59278981 59672652 60079500 60650816 61453432 62064146 63125907 63963272 64618776
3508F4618776R66897R10779L96184K52471K43205O10790L53950L8204K2528L19623
$$ 64618776 65585673 66496452 66892636 67145107 67388312 67999102 68353052 68391256 68413784 68733407
3498F8733407O73026N45401P26935R45534J032394J088875J480853J727463J884559
$$ 68733407 69406433 69951834 70678769 71624303 72656697 73745572 75226425 76953888 78838447
3489G8838447K163160K111619K577712L159766L005785L840195L938968M260994
$$ 78838447 81001607 83113226 85690938 88850704 91856489 95696684 99635652 103896646
3481A03896646M373612M926112N280273N598968N840099N948993N817060N883350
$$ 103896646 108270258 113196370 118476643 124075611 129915710 135864703 141681763 147565113
3473A47565113N416272L995435K274239K49780j866037l626818m730324m925484
$$ 147565113 152981385 156976820 159251059 159500839 157634802 154007984 149277660 144352176
3465A44352176n303116n898290o419454o397239n954579n111036m697761m327392
$$ 144352176 139049060 133150770 126731316 120334077 114379498 109268462 104570701 100243309
3457A00243309m090174l749722l033728k529243k157274j908816k214463j987226
$$ 100243309 96153135 92403413 89369685 86840442 84683168 82774352 80559889 78572663
3449G8572663j378287j220717j014641j149307p09450n79505k08027K15313J5929
$$ 78572663 77194376 75973659 74959018 73809711 73100261 72520756 72312729 72528042 72543971
3440G2543971r7678J14546L55459M81319J218783J929424K874371K977183J151567
$$ 72543971 72446293 72560839 72916298 73397617 74616400 76545824 79420195 82397378 83548945
3431H3548945j944459l672116l942851l379900l366659l675728l248259l181476
$$ 83548945 81604486 77932370 73989519 70609619 67242960 63567232 60318973 57137497
3423E7137497k656391k161283j624531j188218j447346j382718p96622o73883
$$ 57137497 54481106 52319823 50695292 49507074 48059728 46677010 45880388 45206505
3415D5206505n07502m67298m72183n93088n22795o21260m99917j43109J53332
$$ 45206505 44699003 44231705 43759522 43166434 42643639 42022379 41522462 41379353 41532685
3406D1532685J14119K39152L63301R14009J498692J299031J259064l74689j521513
$$ 41532685 41646804 41885956 42249257 43163266 44661958 45960989 47220053 46845364 45323851
3397D5323851j922761j560193j448458j615513j110933j132468r43430p94664
$$ 45323851 43401090 41840897 40392439 38776926 37665993 36533525 35590095 34795431
3389C4795431m81219l12408k31450J73949J97880J83966M40456M08938J029070
$$ 34795431 34314212 34001804 33770354 33944303 34142183 34326149 34766605 35175543 36204613
3380C6204613J562898J933089K540590K913081K303265o9904k888169l893148
$$ 36204613 37767511 39700600 42241190 45154271 47457536 47387632 44499463 40606315
3372D0606315l679972k747295j852947j163951j103341p07299n75531o39115m85647
$$ 40606315 36926343 34179048 32326101 31162150 30058809 29351510 28775979 28136864 27651217
3363B7651217k24147k65848N2572Q5829M6869j00308L23350M51036O03057Q71831
$$ 27651217 27427070 27161222 27213794 27299623 27346492 27246184 27569534 28020570 28623627 29495458
3353B9495458J066566J506334J593683K219603K987654K263669n63627l334244
$$ 29495458 30562024 32068358 33662041 35881644 38869298 41132967 40569340 37235096
3345C7235096l982911l349612k289316j716011j252777j008503p67078m80816
$$ 37235096 33252185 29902573 27613257 25897246 24644469 23635966 22868888 22388072
3337B2388072n55198k38257m05668k87090j98335k37790l13168k9347l77172m16482
$$ 22388072 21832874 21594617 21188949 20901859 20703524 20465734 20152566 20123219 19746047 19329565
3327A9329565k69786q5453l91376j66724k70731l21024k57010k8252j2883k39050
$$ 19329565 19059779 18974326 18582950 18416226 18145495 17824471 17567461 17539209 17526326 17287276
3317A7287276l42139N3576J6540q8331k32675j72574j11404K35045o0051j49673
$$ 17287276 16945137 16998713 17015253 16926922 16694247 16521673 16410269 16645314 16585263 16435590
3307A6435590r8751k8213j1656j53286J11184L669j74678l22768l03600j41414
$$ 16435590 16336839 16308626 16296970 16143684 16254868 16258537 16083859 15761091 15457491 15316077
3297A5316077j23842m2948j54073j89206j47529q1337j30306l01878P3133j82771
$$ 15316077 15192235 15149287 14995214 14806008 14658479 14577142 14446836 14144958 14218091 14035320
3287A4035320j45455k53355J61005Q690j62282j28572q3539J1283K3686r4951
$$ 14035320 13889865 13636510 13797515 13806205 13643923 13515351 13431812 13443095 13466781 13371830
3277A3371830j20261k4638R1600K9182n4470l46633j94930j7050Q1313k22343
$$ 13371830 13251569 13226931 13318531 13347713 13293243 12946610 12751680 12734630 12815943 12593600
3267A2593600k6626N5685n8671j20617j47346j86146N210M7938J33865j31056
$$ 12593600 12566974 12622659 12563988 12443371 12296025 12109879 12115089 12163027 12296892 12165836
3257A2165836k71744K28489P4714J4506O278j56694J25677M4967j28543K27422
$$ 12165836 11894092 12122581 12197295 12211801 12218079 12061385 12187062 12232029 12103486 12330908
3247A2330908P7802j7861M8547k44328L13988P0119J42293J69411o6101R6765
$$ 12330908 12408710 12390849 12439396 12195068 12509056 12579175 12721468 12890879 12824778 12921543
3237A2921543n288J11627q4796n2608Q3071R1849K13129R4635K66824l8490j3392
$$ 12921543 12916255 13027882 12943086 12890478 12973549 13065398 13278527 13373162 13639986 13601496 13588104
3226A3588104O9213L23201M19390J12000J75307K69821N98909J96409K54066L02872
$$ 13588104 13657317 13980518 14399908 14511908 14687215 14957036 15555945 15752354 16006420 16309292
3216A6309292j4132k05373k40747j37511J13972L95437L35016J76282K44387L51151
$$ 16309292 16295160 16089787 15849040 15711529 15825501 16220938 16555954 16732236 16976623 17327774
3206A7327774M4422o1974j17612k14073P0110o1737J38033M5889L24116M2912
$$ 17327774 17372196 17310222 17192610 16978537 17048647 16986910 17124943 17170832 17494948 17537860
3196A7537860J16203J19430J65499J49560K00912M18888N89198M97746N58988
$$ 17537860 17654063 17773493 17938992 18088552 18289464 18708352 19297550 19795296 20354284
3187B0354284Q06456N67560K85392L17436j98042q7492J5798J09787J14868N16970
$$ 20354284 21160740 21728300 22013692 22331128 22133086 22045594 22061392 22171179 22286047 22803017
3177B2803017P65828L61971K89379J29535M5587Q6092K9368K54486M05804M99414
$$ 22803017 23568845 23930816 24220195 24349730 24395317 24481409 24510777 24765263 25171067 25670481
3167B5670481M92651N22119O24375M16415M91804N84923M27953N49069M89521
$$ 25670481 26163132 26685251 27309626 27726041 28217845 28802768 29230721 29779790 30269311
3158C0269311N86179J84087J51964M78951L40732L18313J69134J14440K93347
$$ 30269311 30855490 31039577 31191541 31670492 32011224 32329537 32498671 32613111 32906458
3149C2906458M73154O27791M94253L99762P11000Q94800P81237J111342J288419
$$ 32906458 33379612 34007403 34501656 34901418 35612418 36507218 37288455 38399797 39688216
3140C9688216Q97965J208892J138424J602051J678551J327232J332313J322564
$$ 39688216 40586181 41795073 42933497 44535548 46214099 47541331 48873644 50196208
3132E0196208R42642J52885o06493j318776j472783j507075j720837j372403j367386
$$ 50196208 51138850 51291735 50685242 49366466 47893683 46386608 44665771 43293368 41925982
3123D1925982p10275k78233k38642j87113K35109L32867N28888P46784J002561
$$ 41925982 41215707 40937474 40698832 40511719 40746828 41079695 41608583 42355367 43357928
3114D3357928J127467J106983R37706Q48939J066768J148588R26451Q60977P12045
$$ 43357928 44485395 45592378 46530084 47379023 48445791 49594379 50520830 51381807 52093852
3105E2093852K18937n6227o34508o26554j371568j392537j659145j843079j655068
$$ 52093852 52312789 52256562 51622054 50995500 49623932 48231395 46572250 44729171 43074103
3096D3074103k074763j578561j345278q06096p59849o88128l49002j37782k84374
$$ 43074103 40999340 39420779 38075501 37269405 36509556 35821428 35472426 35334644 35050270
3087C5050270J00857q4104J5583K36710N9943l9472l47551l71325n10891m41478
$$ 35050270 35151127 35067023 35082606 35319316 35379259 35339787 34992236 34620911 34110020 33668542
3077C3668542o40965j031862j084189j393795j517486j286299j362824j102495
$$ 33668542 33027577 31995715 30911526 29517731 28000245 26713946 25351122 24248627
3069B4248627j069554q19576q75158q45974m34683n35127n46293o90994m05785
$$ 24248627 23179073 22359497 21484339 20638365 20203682 19668555 19122262 18431268 18025483
3060A8025483n75090n34309k91520j55498k3122m99341l08922k15332j46924l33448
$$ 18025483 17450393 16916084 16624564 16469066 16445944 15946603 15637681 15422349 15275425 14941977
3050A4941977n78855l77314m76601k77325m66898l76048l13897l50143j86798
$$ 14941977 14363122 13985808 13509207 13231882 12764984 12388936 12075039 11724896 11538098
3041A1538098l36300k55350l64613l96086j23822n7007j22125l19225l01416j52861
$$ 11538098 11201798 10946448 10581835 10185749 10061927 10004920 9882795 9563570 9262154 9109293
3031I109293j07469j14621l49046j75814p5711j56540j96199Q4480j00111j95068
$$ 9109293 9001824 8887203 8538157 8362343 8286632 8130092 7933893 8018373 7918262 7723194
3021G723194o9095P1986m0407o9684j00055n0909n9369p4835l62468j76505Q8540
$$ 7723194 7654099 7726085 7685678 7615994 7515939 7465030 7405661 7330826 6968358 6791853 6880393
3010F880393l40658j43574n1670k34865j75839O1213J3589j20343l01166p9915
$$ 6880393 6539735 6396161 6344491 6109626 5933787 5995000 6008589 5888246 5587080 5507165
3000E507165j15743l4725j25230j39182q9201P058j37049N7570K30066o7457j88295
$$ 5507165 5391422 5356697 5231467 5092285 5003084 5010142 4873093 4930663 5160729 5093272 4904977
2989D904977l59415R8849n5427j81256K31424q368j79225k05199R2697j12141
$$ 4904977 4545562 4644411 4588984 4407728 4639152 4630784 4451559 4246360 4339057 4226916
2979D226916q9749k0986o5992N6236j29572N1472j78193j33941j14672k48657
$$ 4226916 4137167 4116181 4050189 4106425 3976853 4028325 3850132 3716191 3601519 3352862
2969C352862j81825K86621O4116M6945j45889q8864m3236k55460O2190P1010m367
$$ 3352862 3171037 3457658 3521774 3568719 3422830 3333966 3290730 3035270 3097460 3168470 3164103
2958C164103j5927p8382O340Q4486J21221j21094p9628j1854k91846j3867J08247
$$ 3164103 3148176 3069794 3076134 3160620 3281841 3160747 3081119 3069265 2777419 2763552 2871799
2947B871799k24281J9886l4607n750p7889J47357j87492j7579K93598J08675l27754
$$ 2871799 2647518 2667404 2632797 2627047 2549158 2696515 2509023 2491444 2785042 2893717 2565963
2936B565963L0895j62377n9557J89372j85631r0555Q592J15339J55466M2778q6651
$$ 2565963 2596858 2434481 2374924 2564296 2378665 2288110 2296702 2412041 2567507 2610285 2523634
2925B523634l29809p548r6998j81751J40481j40266J99994M9000l336j20118N6658
$$ 2523634 2193825 2186277 2089279 1907528 2048009 1907743 2107737 2156737 2153401 2033283 2089941
2914B089941J22191J37891j71050n9340o265L3523p38j20235Q6884k28886L8657
$$ 2089941 2212132 2350023 2178973 2119633 2113368 2146891 2146153 2025918 2112802 1883916 1922573
2903A922573M5837k04976J52848J05283P5093j83101J60232j80533j81232r0285
$$ 1922573 1968410 1763434 1916282 2021565 2096658 1913557 2073789 1893256 1712024 1621739
2893A621739P865P4182J71233K31054j93362M1296j42085j13640P357N3030k6769
$$ 1621739 1629604 1703786 1875019 2106073 1912711 1954007 1811922 1698282 1705639 1758669 1731900
2882A731900q0673O6318j1349R1455k0601j37513k70223L4756L56803q2351P1474
$$ 1731900 1651227 1717545 1706196 1797651 1777050 1639537 1369314 1404070 1760873 1678522 1749996
2871A749996Q4396j1393K4449j12936J29016l33052j22953M1629J00945J32945
$$ 1749996 1834392 1822999 1847448 1734512 1863528 1530476 1407523 1449152 1550097 1683042
2861A683042j57412M2959J33782j8021M1375k9862m504l7852l5545j92811J30158
$$ 1683042 1525630 1568589 1702371 1684350 1725725 1695863 1691359 1653507 1617962 1425151 1555309
2850A555309M5245j4644j39499l4018J05169Q1767Q7568r1746j9786j85396j50665
$$ 1555309 1600554 1585910 1446411 1412393 1517562 1599329 1686897 1595151 1575365 1389969 1239304
2839A239304J55230J49456J03111j14658L1972J04369j18594j2490j16439p8751
$$ 1239304 1394534 1543990 1647101 1532443 1564415 1668784 1550190 1537700 1421261 1342510
2829A342510n8124j69951J13541O0329j32797J13881J70321l9778O1345J63371
$$ 1342510 1284386 1114435 1227976 1288305 1155508 1269389 1439710 1399932 1461277 1624648
2819A624648o3117p5917k31981m8033J23998P6747o8305k2707J908J09646k61737
$$ 1624648 1561531 1485614 1253633 1205600 1329598 1406345 1338040 1315333 1317241 1426887 1165150
2808A165150K9859J18150j59220J54142q3488k8609J8327J1900J77563Q9305p17
$$ 1165150 1195009 1313159 1153939 1308081 1224593 1195984 1214311 1226211 1403774 1493079 1492362
2797A492362o7019k1149k29469j4470p0691J17746N9459n1660l7641J09788K88093
$$ 1492362 1425343 1404194 1174725 1160255 1089564 1207310 1266769 1215109 1177468 1287256 1575349
2786A575349p5678j92149J5416j48820l7951q2182Q7661j54103r1120j02899k32282
$$ 1575349 1499671 1307522 1322938 1174118 1136167 1053985 1141646 987543 896423 793524 561242
2775E61242J45638J40714K24983l4154o6815q4834m9593P5467j02031N9038o2025
$$ 561242 706880 847594 1072577 1038423 971608 886774 837181 912648 810617 869655 807630
2764H07630K4281L0577j36385J85874m2791n664J67301j56485M093L1330r3101
$$ 807630 831911 862488 726103 911977 869186 863522 1030823 874338 878431 909761 816660
2753H16660j11305l1692L20626o9229o9071J39356p7520m5576j75420p9307j6047
$$ 816660 705355 673663 994289 925060 855989 995345 917825 872249 696829 617522 601475
2742F01475L0586N287J03713J61490j54411m462N0400j59624r4212J90236P5891
$$ 601475 632061 637348 741061 902551 748140 743678 794078 634454 540242 730478 806369
2731H06369o734N9887o0426N0655r910k03487k80869K20184J32631o5541j43073
$$ 806369 799635 859522 799096 849751 839841 636354 355485 575669 708300 642759 499686
2720D99686J7819J86958j6434P6088J93892O7611l25523k18476R1892M2649M0608
$$ 499686 517505 704463 688029 764117 958009 1025620 700097 481621 573513 616162 656770
2709F56770j83520l9380J71061J01156N5728q0544K1992n3850J32517j34416n2142
$$ 656770 473250 433870 604931 706087 761815 681271 703263 649413 781930 647514 595372
2698E95372O9053l8298m8039j01964q6255Q0231m323j07826N6777n0059j69738
$$ 595372 664425 626127 578088 476124 389869 470100 465777 357951 414728 364669 194931
2687A94931J83501R9957J56045P259j62868M0502J88240P3368j47993k09526J81557
$$ 194931 378432 478389 634434 641693 478825 519327 707567 780935 632942 423416 604973
2676F04973J3176p2707J51549k20820j83268J48927O6863P4835k03973k32154
$$ 604973 618149 545442 696991 476171 292903 441830 508693 583528 379555 147401
2666A47401K16160N3191L34215q2712k96204P8268L08264j2263r2803J31133j74299
$$ 147401 363561 416752 750967 668255 372051 450319 758583 746320 653517 784650 610351
2655F10351j72291J15180m7196p6789j00370k55819K06533J46397j07353q2694
$$ 610351 438060 553240 506044 429255 328885 73066 279599 425996 318643 235949
2645B35949L00528N6542k50424k24251J17120Q171K91328K41616k17450L4035
$$ 235949 536477 593019 342595 118344 235464 243635 534963 776579 559129 593164
2635E93164j10504N6273O2821L6100j34926j06770P9345N3556n5785m7587J33361
$$ 593164 482660 538933 601754 637854 502928 396158 475503 529059 473274 425687 559048
2624E59048j98989q8637L8960l4063J65375Q0012p2766O4621l0789N865M4924
$$ 559048 360059 271422 310382 276319 441694 521706 448940 513561 482772 488637 533561
2613E33561o6565P5056R9888O9335Q3308k90653j27515K57207K09714m5595k16480
$$ 533561 466996 542052 641940 711275 794583 503930 376415 633622 843336 797741 581261
2602E81261n0868M49971J58233j58438j2815k90304j19311o2956k02461J79867
$$ 581261 530393 980364 1138597 980159 967344 677040 557729 494773 292312 472179
2592D72179J5715o8864L76838j92880j61421l216N84J19677j73637k58552J29126
$$ 472179 487894 419030 795868 602988 441567 438351 438935 558612 384975 126423 255549
2581B55549J45915j3314J4758J0498m0659n8255j13109N4989J28123j1234k11427
$$ 255549 401464 388150 402908 413406 372747 314492 201383 256372 384495 373261 161834
2570A61834J01828Q0208Q1617k7081J50797L6931j0894J625o0151l0740N2072
$$ 161834 263662 343870 425487 398406 549203 586134 575240 576865 516714 485974 538046
2559E38046j98321j73651K31813N1299q3566o2929O9144J7636J47724m8740J02505
$$ 538046 339725 166074 397887 449186 365620 302691 371835 389471 537195 488455 590960
2548E90960l16658K2515J44053j6857J4936j99287l5262K38567m5131r8414J02147
$$ 590960 274302 296817 440870 424013 438949 239662 204400 442967 397836 299422 401569
2537D01569L7134N2413p1300j01670K15111J4582j66231O7209l1451M0193Q5942
$$ 401569 438703 491116 419816 318146 533257 547839 381608 448817 417366 457559 543501
2526E43501j86292J34394J42993k75858p1008K9133J71543m7228K05880o1559
$$ 543501 357209 491603 634596 358738 287730 316863 488406 441178 647058 585499
2516E85499k59315L55514j2527j36186j45373k09542R7011j03838K75440m9814
$$ 585499 326184 681698 669171 532985 387612 178070 275081 171243 446683 396869
2506C96869p9269J53698N0579j4506M0018N2312k02668p2165M9043J23039J07205
$$ 396869 317600 471298 521877 507371 547389 599701 397033 324868 373911 496950 604155
2495F04155j50982o0054K63733J24638k83160m4432R8297O5575k8151Q0516j40549
$$ 604155 453173 393119 656852 781490 498330 453898 552195 617770 589619 670135 529586
2484E29586j92023M1852N1094J62935j49834j82563J08667L5224J00682N3779
$$ 529586 337563 379415 430509 593444 443610 261047 369714 404938 505620 559399
2474E59399q638J15993J8563J51128j20003N6988j03549j01846l1023J86498L1318
$$ 559399 550761 666754 685317 836445 716442 773430 669881 568035 537012 723510 754828
2463G54828J47749j91861k1175J30200j05180J62285l33056j01955K42571J92746
$$ 754828 902577 710716 689541 819741 714561 876846 543790 441835 684406 877152
2453H77152K2589j54949l9189J14602p5775k4298r0224J29559l8304J38938p998
$$ 877152 899741 744792 705603 820205 744430 720132 629908 759467 721163 860101 852103
2442H52103N5177q157Q3356k800j47360J3793J3111J34064K18254k1983J00330
$$ 852103 907280 899123 982479 979679 832319 846112 859223 993287 1211541 1189558 1289888
2431A289888p4305n376J06753L4488R1992j19440J27773j19073J49663J07854
$$ 1289888 1215583 1210207 1316960 1351448 1443440 1324000 1451773 1332700 1482363 1590217
2421A590217J19042j14527M3695P3111L1401k79293K03366N3460k3600J81169
$$ 1590217 1709259 1594732 1638427 1711538 1742939 1463646 1667012 1720472 1696872 1878041
2411A878041J76745M7275K8027o0615Q1333k94496j26739J96538k0026K05963
$$ 1878041 2054786 2102061 2130088 2069473 2150806 1856310 1729571 1926109 1906083 2112046
2401B112046k20138K40297K11027o000O0564N5924J23152q1004Q3175L2895R2254
$$ 2112046 1891908 2132205 2343232 2337232 2397796 2453720 2576872 2495868 2579043 2611938 2704192
2390B704192O5449M6554O0984r5375l6448K04148J89008N5396P916P2240L31878
$$ 2704192 2769641 2816195 2877179 2781804 2745356 2949504 3138512 3193908 3201824 3274064 3605942
2379C605942Q2912K57663J70521J71588K17551J66163q3103n8226J98740o1250
$$ 3605942 3688854 3946517 4117038 4288626 4506177 4672340 4589237 4531011 4729751 4668501
2369D668501L65270N85612J86492k09516K23256L25121M10559L8712l1073M68378
$$ 4668501 5033771 5619383 5805875 5596359 5819615 6144736 6555295 6594007 6562934 7031312
2359G031312K75724L53122J51453N33376K86976O18450M08797O13286J138753
$$ 7031312 7307036 7660158 7811611 8344987 8631963 9250413 9659210 10272496 11411249
2350A1411249Q75514J065427N15386O12382Q48449J111353J605973J480482K251577
$$ 11411249 12286763 13352190 13867576 14479958 15328407 16439760 18045733 19526215 21777792
2341B1777792L270701M125112N434605O924069R139417J3216616J8039921J2565074
$$ 21777792 25048493 29173605 34608210 41532279 50671696 63888312 81928233 94493307
2333I4493307l914099j6931623j8075639j2802411q560635o059643m608025l202632
$$ 94493307 90579208 73647585 55571946 42769535 34208900 28149257 23541232 20338600
2325B0338600k806703j942653j309791j059510p74725l42211n86770o91163r62117
$$ 20338600 17531897 15589244 14279453 13219943 12445218 12103007 11516237 10825074 9862957
2316I862957r98582o41887n01789n18117m55017m16732k58966l52599m12888k39515
$$ 9862957 8864375 8222488 7720699 7202582 6747565 6330833 6071867 5719268 5306380 5066865
2306E066865k42160k73479k32598j30689j65108j97671m8938J02863k40846l91044
$$ 5066865 4824705 4551226 4318628 4187939 4022831 3825160 3776222 3879085 3638239 3247195
2296C247195k79022k36626L2687j06686n8275r4110l15665J11460k7575Q3231
$$ 3247195 2968173 2731547 2764234 2657548 2599273 2505163 2189498 2300958 2273383 2356614
2286B356614J81077O2437k26447o0381l44036m1971k1044o3155K4510j1953k70900
$$ 2356614 2537691 2600128 2373681 2313300 1969264 1927293 1906249 1843094 1867604 1855651 1584751
2275A584751k0407m8772o8127J78050p9031j67783l79966K24791K3694j44348
$$ 1584751 1564344 1515572 1447445 1625495 1546464 1378681 998715 1223506 1247200 1102852
2265A102852o2588l7526J22226j08825q9958m1302L4737M2222K5156O8k44579
$$ 1102852 1040264 1002738 1124964 1016139 926181 884879 919616 961838 986994 987062 742483
2254G42483k8623j7597r6158J04777J55535J36916j97591j49134m5061J06442
$$ 742483 713860 696263 600105 704882 860417 997333 799742 650608 605547 711989
2244G11989J78482p8976k80464Q659K33251R3416j39491j15597o5000m5154J69318
$$ 711989 890471 811495 531031 539690 772941 866357 726866 611269 546269 501115 670433
2233F70433N60m4609q2352Q116j52983m8416J44082O6526m1984j03356Q3712K62791
$$ 670433 670993 626384 544032 552148 399165 350749 494831 561357 519373 416017 499729 762520
2221G62520r7816k88103l9198R1697L33205J01694r1599l20370K0305p5688K04871
$$ 762520 664704 376601 337403 429100 762305 863999 772400 452030 472335 396647 601518
2210F01518R605j77011l9059K6717J52229K5454r1718j28646J9517j22446p64
$$ 601518 611123 434112 395053 421770 573999 599453 507735 379089 398606 276160 275396
2199B75396j03963L2384K96842P5617q6873n4972p2727p0764o9545M6125J00302
$$ 275396 171433 203817 500659 576276 489403 434431 361704 290940 221395 267520 367822
2188C67822J67563p5683j07862j49384J15739N6668J37035j72349j59048O7653
$$ 367822 535385 459702 351840 202456 318195 374863 511898 339549 180501 248154
2178B48154k3052j5934K26150P1734j19998n3612p5066J09785J14721J7134K8390
$$ 248154 225102 209168 435318 507052 387054 333442 258376 368161 482882 500016 528406
2167E28406m3319k76845J9833K4255o642J2666j77966J57485K7543Q499o9856
$$ 528406 485087 208242 228075 252330 245688 258354 80388 237873 265416 273915 204059
2156B04059j82455J40829N1880J97236J3889l14928J3069L08327j48139m2771
$$ 204059 21604 162433 214313 411549 425438 110510 123579 431906 283767 240996
2146B40996j72401q322J39489K42305R9062k0973j46008k09323J6364N2567R4
$$ 240996 68595 60273 199762 442067 541129 520156 374148 164825 181189 233756 233850
2135B33850Q7733J87596m3165j38519j91971n7563R6900K4597N2344J755J45011
$$ 233850 321583 509179 466014 327495 135524 77961 174861 199458 251802 253557 398568
2124C98568J42968j38375k7077l2971k78235k23457L2062K65325J17127p7755
$$ 398568 541536 403161 376084 343113 64878 -158579 -126517 138808 255935 178180
2114A78180K2278Q958L8628l1096j58641l14728J16754J92028J27496K298L9054
$$ 178180 200458 209416 248044 216948 58307 -256421 -139667 52361 179857 182155 221209
2103B21209r6412J80505n4803j31577J77661O467L1074n5211r6846L7741L6441
$$ 221209 124797 305302 250499 118922 296583 303050 334124 278913 182067 219808 256249
2092B56249j02041k1882j73461R6041M8868j60568J73414J20914k49136o2030
$$ 256249 154208 132326 -41135 54906 103774 -56794 116620 237534 -11602 -73632
2082g3632J47872Q0509P4608K6679j2198K87580q0059j65882k6162J5940J65069
$$ -73632 74240 154749 229357 256036 243838 531418 451359 285477 259315 275255 440324
2071D40324j09162l5805P4298J80934k05249P2006L51958j42765Q7333j62821
$$ 440324 331162 295357 369655 550589 345340 417346 769304 626539 713872 551051
2061E51051j63277q9149j112P8243j7295o7320q2014K9333j34355j34194o0189
$$ 551051 387774 298625 297513 375756 358461 291141 209127 238460 104105 -30089 -90278
2050i0278J27100m6638L8296J21343R4760K2477l9622k4388p7459J2483j59388
$$ -90278 36822 -9816 28480 149823 244583 267060 227438 203050 125591 138074 -21314
2039b1314l5107J07808K60809n494j6286j93420p6280L2356O1563j55943R2722
$$ -21314 -56421 51387 312196 306702 290416 96996 20716 53072 114635 -41308 51414
2028E1414J92157j24027k0025j04375K07836R4477j69259j65968n4837l076K30009
$$ 51414 243571 119544 99519 -4856 202980 297457 128198 -37770 -92607 -95683 134326
2017A34326J16513J8591k60825K1391J77823M9454j97002K18189j40019j61507
$$ 134326 250839 269430 8605 29996 207819 257273 60271 278460 138441 -23066
2007b3066L515J38038j04766j66712K29402k9856N6184K9083j30198P4220J32424
$$ -23066 -19551 118487 13721 -152991 76411 46555 102739 131822 1624 75844 208268
1996B08268j03611j00806J78793m8700J8188j53933j04511N3041J34144m4900
$$ 208268 104657 3851 182644 133944 152132 -1801 -106312 -53271 80873 35973
1986C5973J3852J56176p1835O4039j89719j7475N9947p1912j48767J71122o7380
$$ 35973 49825 206001 134166 198205 8486 -8989 50958 -20954 -169721 1401 -65979
1975f5979K63970n48N349m9552m0684j4670o9804l8924J36106J01981j48731J80507
$$ -65979 197991 197443 202792 153240 112556 97886 28082 -10842 125264 227245 78514 259021
1963B59021k12198k67857J65193q904J09174K38494j45422k0269j0379o0115j2592
$$ 259021 46823 -221034 -55841 -64745 44429 282923 137501 117232 106853 46738 34146
1952C4146Q9967P739J16655M7113k34145K8871p1135q1070J27161J04098j16456
$$ 34146 124113 131852 248507 295620 61475 90346 19211 -61859 65302 169400 52944
1941E2944J26753p6928j7761k21516r5916K57212J4713J53762l4938k0134J39729
$$ 52944 179697 102769 85008 -136508 -232424 24788 39501 193263 158325 138191 277920
1930B77920L4203O611k7851q2482r2046q2771o4843J01469J43700p3853r9111
$$ 277920 312123 318734 290883 208401 116355 33584 -31259 70210 213910 140057 40946
1919D0946K05714p6592p2918J24420r3605j59464l6476J55619p0163L977P171
$$ 40946 246660 170068 97150 221570 127965 -31499 -67975 87644 17481 21458 28629
1908B8629K11141J04741l2310j38838n6225p774j07166J03617J40066R7699l99309
$$ 28629 239770 344511 312201 173363 117138 109364 2198 105815 245881 343580 -55729
1897e5729j28656j16838M9244K18347n270l31743J88422J46266o0537O3341j21938
$$ -55729 -184385 -301223 -251979 -33632 -38902 -370645 -182223 -35957 -96494 -33153 -155091
1886a55091J55985k16223K4700J44182Q6444J24782p3859p4257J59698J91544
$$ -155091 894 -215329 -190629 -46447 39997 164779 90920 16663 176361 367905
1876C67905k07145j43195R7230K0168K9336J6370j37085j24925J28080J67620
$$ 367905 160760 17565 114795 134963 164299 180669 43584 -81341 46739 214359
1866B14359m6886k19729N1888k2519K07706r7745k86686J15336K80149K8998k74958
$$ 214359 167473 -52256 -368 -22887 184819 87074 -199612 -84276 195873 224871 -50087
1855e0087q9188m0916J2914K20900R2739j49549j36691R9863j21746K5301K47845
$$ -50087 -139275 -180191 -167277 53623 146362 -3187 -139878 -40015 -161761 -136460 111385
1844A11385J23599O6924k67558N6096K31082l05488n2313K64153O3174j19406
$$ 111385 234984 301908 34350 90446 321528 16040 -36273 227880 291054 171648
1834A71648p1209l0397j03433k4500J60785K0716J07805l14898m2240K33620N0318
$$ 171648 100439 70042 -33391 -57891 102894 123610 231415 -83483 -125723 107897 158215
1823A58215q2886j11296q7053J36751K34683j5142k32282j67094j451j9712J93916
$$ 158215 75329 -35967 -123020 13731 248414 233272 990 -166104 -167555 -187267 6649
1812F649m2408N5627L9634q5875m6009R0283R224j06483j32191R2174N0737l8740
$$ 6649 -35759 19868 59502 -26373 -72382 17901 27125 -79358 -211549 -119375 -68638 -107378
1800a07378J75590K9969l915K6254k40853o3990J52841o1536L2971J67738k8582
$$ -107378 68212 98181 94266 120520 -120333 -184323 -31482 -93018 -60047 107691 79109
1789G9109N1437m3516J00378o4549n0395M8825J49994j16309k63729M1017J16444
$$ 79109 130546 87030 187408 122859 72464 121289 271283 154974 -108755 -67738 48706
1778D8706q975J38029k28861r1750P8136o9398K25767k3270l8331j85805P3868
$$ 48706 39731 177760 -51101 -142851 -64715 -134113 91654 68384 30053 -155752 -81884
1767h1884K47673k8070o4862j80282L8256M7336J7268M0184j07450k15986P1943
$$ -81884 165789 137719 72857 -107425 -69169 -21833 -4565 35619 -71831 -287817 -215874
1756b15874L80458r4381l5946q6483j10132K22438q4063l2897L6346j01942K06454
$$ -215874 164584 70203 34257 -52226 -162358 60080 -23983 -56880 -20534 -122476 83978
1745H3978p1770J31331n2677k15716K61961Q0635p0793j36258o9793o3025N7468
$$ 83978 12208 143539 90862 -124854 137107 217742 146949 10691 -59102 -122127 -64659
1734f4659K20971j14647q4663N2263K02256q754k44647l06047j46165J45695N9455
$$ -64659 156312 41665 -42998 9265 211521 202767 -41880 -347927 -494092 -348397 -288942
1723b88942J96082R8541k3874J5047o4146k8942J43729J32978j45776j05302J10114
$$ -288942 -92860 5681 -18193 -3146 -67292 -96234 47495 180473 34697 -70605 39509
1712C9509l3137k00068j50998K5399L70823k1740O6221p2590j63786J53882J6368
$$ 39509 6372 -193696 -344694 -319295 51528 29788 96009 23419 -140367 13515 29883
1701B9883p9638P365J25248p4677M3182j16614K3942J18489O1656J2307j49294
$$ 29883 -49755 -42390 82858 8181 51363 -65251 -41309 77180 138836 151143 1849
1690A849K133J16212J05440j24446j26902m5105N5328M1558p4406j03074k0429
$$ 1849 3982 120194 225634 101188 -25714 -70819 -15491 26067 -48339 -151413 -171842
1679a71842J01294Q4374K49208q0120j98238j62579J44536L9802q6575m7497J2747
$$ -171842 -70548 13826 263034 182914 -15324 -177903 -33367 6435 -80140 -127637 -114890
1668a14890P590K37602R1526j01532k86742N4775N3161J5842l7008J3284K0163
$$ -114890 -107300 130302 221828 120296 -166446 -111671 -58510 -42668 -79676 -66392 -46229
1657d6229k6795J09353j4898n689j16658L3288n1409J07285O5862J01803N107
$$ -46229 -73024 36329 21431 15742 -100916 -67628 -119037 -11752 54110 155913 161020
1646A61020k9001k49680N9439K3587p9129J31340p1081j37563J36509n4793k81897
$$ 161020 132019 -117661 -58222 -34635 -113764 17576 -53505 -191068 -54559 -109352 -391249
1635c91249K86668J3444J91008L53487k20033J11239l3401j14121j34952k55179
$$ -391249 -104581 -91137 99871 453358 233325 344564 311163 197042 62090 -193089
1625a93089J73959J20021O6050j2833j70722O1776N9862l08983j31474J90385
$$ -193089 -19130 100891 166941 154108 -16614 45162 105024 -203959 -335433 -145048
1615a45048K57829K8707m2664n8889j24909p1463L0218N0989J68561O1228k45976
$$ -145048 112781 141488 98824 39935 -84974 -156437 -126219 -75230 93331 154559 -91417
1604i1417j98785J62633J41343j623R2866Q5243k00171k64973J23456K04811q1592
$$ -91417 -290202 -127569 13774 12151 105017 190260 -9911 -274884 -151428 53383 -28209
1593b8209Q015J35605k28355M8706j46556J7903J57947J93965j46178Q599k03261
$$ -28209 -20194 115411 -112944 -64238 -210794 -192891 -34944 159021 12843 21442 -181819
1582a81819j40217O9603O9289O735J99250J91589k6724J3308r9894l7746k25196
$$ -181819 -322036 -252433 -183144 -176409 22841 214430 187706 201014 101120 63374 -161822
1571a61822p8969K6238J40212P376p4250P7736J32936p9192k13367K47037k41098
$$ -161822 -240791 -214553 -74341 -66965 -141215 -63479 69457 -9735 -223102 23935 -217163
1560b17163k96695L28812J37317O8317m4625N7060Q4839k4406j27217j3369J54029
$$ -217163 -513858 -185046 -47729 20588 -24037 33023 117862 93456 -33761 -47130 106899
1549A06899k4382j31377m1119l4247Q9616R2242o3383j57371N1845K61166q1867
$$ 106899 82517 -48860 -89979 -124226 -34610 57632 -5751 -163122 -111277 149889 68022
1538F8022j02534J40761R5837n9439k63333p9886p3716J71490n5923k1949J09744
$$ 68022 -34512 106249 202086 142647 -120686 -200572 -274288 -102798 -158721 -180670 -70926
1527g0926p6759k188K68019P9776K703j643j95826N1499j45185j27249J68024
$$ -70926 -147685 -149873 118146 197922 200625 198982 3156 54655 -90530 -217779 -49755
1516d9755J73334q2132q3306p1344J80035k491J31430O6200M1789k64156j09772
$$ -49755 123579 41447 -41859 -113203 66832 64341 195771 261971 303760 39604 -70168
1505g0168J14551j20446J93631n8902j41114l9712J22955j81636J13442J61778
$$ -70168 44383 -76063 117568 58666 -82448 -122160 795 -180841 -67399 94379
1495I4379k4739n9103K3226j3413k8605N2649J51592K890j35374j51989m9673
$$ 94379 69640 10537 33763 20350 -8255 44394 195986 198876 63502 -88487 -138160
1484a38160J48758N7174j95167J61382N6453Q7153l838k64853J03420P5975k3481
$$ -138160 10598 67772 -127395 33987 90440 177593 173755 -91098 12322 88297 64816
1473F4816J5455R7342m3667p1637J8887J53475p5899N5123q8654P3433R13j63576
$$ 64816 80271 177613 133946 62309 81196 234671 158772 213895 125241 198674 199587 36011
1461C6011m8780o0867J45764q9307M5919j53976R9982R4512j15639J9758j25857
$$ 36011 -12769 -73636 72128 -17179 28740 -125236 -25254 69258 -46381 -26623 -152480
1450a52480k9736J65677q4677q1025r8783K65281K49075M1888J20474k94849K3670
$$ -152480 -182216 -16539 -101216 -182241 -281024 -15743 233332 275220 395694 100845 124515
1439A24515R023j80369J69072o3592P9129L6607l7475k03306J1688K46047j0725
$$ 124515 133538 -46831 122241 58649 137778 174385 136910 -66396 -54708 191339 180614
1428A80614k6597j28165n2978P3867R0465R8381j79061N1911K76932j76115j88632
$$ 180614 154017 25852 -27126 46741 137206 235587 56526 108437 385369 209254 20622
1417B0622K7863J03585L0856J09965r9326j66108q2921o9019J14710P2866k41867
$$ 20622 48485 152070 182926 292891 193565 27457 -55464 -124483 -9773 63093 -178774
1406a78774J05480q5360K3894J20940m0162j49534k6468N701O9512K88837n0306
$$ -178774 -73294 -158654 -134760 -13820 -53982 -203516 -229984 -224283 -154771 134066 83760
1395H3760q1064o8454N4475j0944p8964J28726q2784K60501m4505j68374R5107
$$ 83760 2696 -65758 -11283 -22227 -101191 27535 -55249 205252 160747 -7627 87480
1384H7480o4007j1057K05956k43870r9404J00109p8682m7774O8797J87956q4329
$$ 87480 23473 12416 218372 -25498 -124902 -24793 -103475 -151249 -82452 105504 21175
1373B1175o0340o9126J88390K4523j38480J43779j67599j04431K320P8724P4858
$$ 21175 -39165 -108291 80099 104622 -33858 109921 -57678 -162109 -159789 -81065 -6207
1362f207k7045M8894j41577K7210P3505r8208O5038M7428j8383R4028k47923Q7540
$$ -6207 -33252 15642 -125935 -98725 -25220 -123428 -58390 -10962 -29345 64683 -183240 -95700
1350i5700K79889j70047j14810R9208n3003j62661K27204P80j8944j24748K20492
$$ -95700 184189 14142 -100668 -1460 -54463 -217124 10080 10860 -8084 -132832 87660
1339H7660J20460R277J5567k58185j1425K20037K20556j35230j98228m3878L7690
$$ 87660 208120 217397 232964 -25221 -36646 183391 403947 268717 70489 26611 64301
1328F4301J10906m06669Q7558K11963j46844j09900m5160P3390N7870J59366J44481
$$ 64301 175207 -231462 -143904 68059 -78785 -188685 -233845 -160455 -102585 56781 201262
1317B01262K3634k76998k6566J78810J46876j78560j20080l0039O6556o8281n7352
$$ 201262 224896 -52102 -78668 100142 247018 68458 -51622 -81661 -15105 -83386 -140738
1306a40738J03548n3928P7381K6158k5866J54420k12160L2081L1679L19181j2549
$$ -140738 -37190 -91118 -13737 12421 -13445 140975 -71185 -39104 -7425 311756 299207
1295B99207k45012j64223j49058J29059O7785K09772J76755j14720k98755k8762
$$ 299207 54195 -110028 -259086 -130027 -62242 147530 324285 209565 -89190 -117952
1285a17952N0088M9675O8678J74301n5366j7646J10974J8667m5125O7506k57880
$$ -117952 -67864 -18189 50489 224790 169424 151778 262752 281419 236294 303800 45920
1274D5920j27745O7462l3564K13458j46171J00140j27240l1161j61261J82866
$$ 45920 -81825 -14363 -47927 165531 19360 119500 -7740 -38901 -200162 -17296
1264a7296L5160q0531K09503J54635p3957m9303o9784q0359O2086K91712j51994
$$ -17296 17864 -62667 146836 301471 227514 178211 108427 28068 90154 381866 229872
1253B29872j9825r0436k40474J12218J5149q3865M4761K73884j08555p6442j04365
$$ 229872 210047 119611 -120863 -8645 6504 -77361 -32600 241284 132729 56287 -48078
1242d8078M8774m6562N6199K35497O3749k31918k63602J33664R0872L0584J12169
$$ -48078 696 -45866 10333 245830 309579 77661 -185941 -52277 38595 69179 181348
1231A81348R4350q0404k24207p4595J40363o3581j81378J4401o2197k8775K02673
$$ 181348 275698 195294 -28913 -103508 36855 -26726 -208104 -193703 -255900 -284675 -82002
1220h2002K55304n6002j56818l4534n6953O3311L4959Q5150N5535j52962M8596
$$ -82002 173302 117300 -39518 -74052 -131005 -67694 -32735 52415 107950 -45012 3584
1209C584O7360j18838P8024J46766n8972N6549P0227k97192Q125J49269j57848
$$ 3584 70944 -47894 30130 176896 117924 174473 244700 -52492 -44367 104902 -52946
1198e2946K4679R9627j25037l04335K05396J69330l0498R7495k0431j21226K40425
$$ -52946 -28267 71360 -53677 -358012 -152616 16714 -13784 83711 63280 -57946 182479
1187A82479j30955O9832q2611M0449O3233j23308j23381J43808k23169J53748
$$ 182479 51524 121356 38745 79194 142427 19119 -104262 39546 -183623 -29875
1177b9875k6831m9160K62639j13721j98768L6020J75969j6802j36710J45899M6564
$$ -29875 -56706 -105866 156773 43052 -155716 -119696 56273 39471 -97239 48660 95224
1166I5224M2914j38167k5981j10530j70605J91569J51008R4956j29811J21028
$$ 95224 138138 -29 -26010 -136540 -307145 -115576 35432 130388 577 121605
1156A21605j73020o4440P4468k1179O0418Q9685M5555m0170m0072j13428o0004
$$ 121605 -51415 -115855 -41387 -62566 -2148 87537 133092 92922 52850 -60578 -120582
1145a20582J17862j972m104j96165J79968m725J7702J62592N4152q775j78942
$$ -120582 -2720 -4692 -8796 -204961 -24993 -29718 -12016 150576 204728 195953 17011
1134A7011L9011n2975M9893m480j72631P1229J72964L2925j07865j8396k4994
$$ 17011 56022 3047 52940 48460 -124171 -52942 120022 152947 45082 26686 1692
1123A692m4254R782K5357j73815J08684J6219j92525J28536K80910m0137o1378
$$ 1692 -42562 -32780 -7423 -181238 -72554 -56335 -248860 -120324 160586 120449 59071
1112E9071J56658r7532j18770q3012j28552J98660j14928J15250K05943k21242
$$ 59071 215729 118197 -573 -83585 -212137 -13477 -128405 -13155 192788 -28454
1102b8454J0785K81032l7827k82542K4036P6603j06055K47695j51246l3733J07779
$$ -28454 -17669 263363 225536 -57006 -32970 43633 -62422 185273 34027 294 108073
1091A08073j45408o475j01566j24915R5561K11542j39241j67121k9371J73584
$$ 108073 -37335 -43810 -145376 -270291 -174730 36812 -102429 -269550 -298921 -125337
1081a25337J28778L2672J11843o3122p4173m6943j1312O0557J39960J38244k33508
$$ -125337 3441 36113 147956 84834 10661 -36282 -47594 12963 152923 291167 57659
1070E7659j50315K30677j43295j58853q940k5112k1730N1745L01732k1087j08598
$$ 57659 -92656 138021 -5274 -164127 -173067 -198179 -219909 -168164 133568 112481 3883
1059C883R3055o0886j67217J26157K45925j89385O734o8572N5083m1857P5974
$$ 3883 96938 36052 -131165 -5008 240917 51532 58266 -10306 44777 2920 78894
1048G8894J67419j61552j2188j28624J04440p2320j54037j20881J60512K14969
$$ 78894 246313 84761 72573 -56051 48389 -23931 -177968 -298849 -138337 76632
1038G6632Q7506J3402j06694N1257Q9470N175j45777k24225K22176P6601j23194
$$ 76632 164138 177540 70846 122103 211573 216748 70971 -153254 68922 145523 22329
1027B2329l6500K12292J71612k13695k32145J34986j0601j72571Q2053j42368
$$ 22329 -14171 198121 369733 156038 -76107 58879 48278 -124293 -42240 -184608
1017a84608r920K41271m3013j08344L44177k5068m710j41649r4814j00795j16576
$$ -184608 -194528 46743 3730 -104614 239563 214495 209785 68136 -26678 -127473 -244049
1006b44049K55133p7118J14808R3693j24257p5051k34976K24044J94598k27231
$$ -244049 11084 -66034 48774 142467 18210 -56841 -291817 -67773 126825 -100406
996a00406q0533j70351j9661M05645L14028k62786n6117Q0224N7060j58608J13738
$$ -100406 -180939 -351290 -370951 34694 348722 85936 29819 110043 167103 8495 122233
985A22233P9921J15861O3035k32908R7033k9288j58836n4908K1065J23878j05560
$$ 122233 202154 318015 381050 148142 245175 215887 57051 2143 23208 147086 41526
974D1526J0358R7383l3962j65345N9107L3263j06237J18588J51951O9100j81136
$$ 41526 51884 149267 115305 -50040 9067 42330 -63907 54681 206632 275732 94596
963I4596k59791l0275R0228P7031j80486L6211J57846j54859K6526J0437l694
$$ 94596 -165195 -195470 -105242 -28211 -208697 -172486 -14640 -169499 -142973 -132536 -136230
952a36230j5125M0571n3613L2617l0927j56776j02300M1169J27424l9297J00444
$$ -136230 -151355 -110784 -164397 -131780 -162707 -319483 -421783 -380614 -253190 -292487 -192043
941a92043N9411M9239L9724j39418l7648L2809R9226R3251n7252K354J58965o9445
$$ -192043 -132632 -83393 -43669 -183087 -220735 -187926 -88700 4551 -52701 -50347 108618 39173
929C9173j92235k03633P7273L11108q5301j4378L4295j14111j7900J47083J13154
$$ 39173 -153062 -356695 -279422 31686 -53615 -67993 -33698 -147809 -165709 -18626 94528
918I4528j6717r7825j33921J56892j30779o8730K96677n1774J58372k64708l5290
$$ 94528 77811 -20014 -153935 2957 -127822 -196552 100125 48351 206723 -57985 -93275
907i3275J00396j41107R6298k8078K09490j4470j50473k2112l1430l11561p3125
$$ -93275 7121 -133986 -37688 -65766 143724 129254 -21219 -43331 -74761 -386322 -459447
896d59447K56324J79841J87748j42887m1713j16161r0768J49344o7044J84808
$$ -459447 -203123 -23282 164466 21579 -20134 -136295 -227063 -77719 -144763 40045
886D0045r267J0049N1531j08057l1884n1332N5831M4165J01147p6685j02081J89655
$$ 40045 30778 40827 92358 -15699 -47583 -98915 -43084 1081 102228 25543 -76538 113117
874A13117j56413N7211P6846P5955j44715N8234M5511n2196j39908l9917J03933
$$ 113117 -43296 13915 90761 166716 22001 80235 125746 73550 -66358 -106275 -2342
863b342q84L21191l7504j78931k0774J3752j84112J63593q0207j33538m0044R0642
$$ -2342 -3226 317965 280461 101530 80756 94508 -89604 73989 -6218 -139756 -179800 -89158
851h9158k3127j0140J0504k6110r3682N9801K12207L2909m545o3564j679q7265
$$ -89158 -112285 -122425 -111921 -138031 -231713 -171912 40295 73204 68659 5095 3416 -83849
839h3849J20953N0981M9643k65953J18455j55919p0058p4323J08356J13769O8791
$$ -83849 37104 88085 137728 -128225 -9770 -165689 -235747 -310070 -201714 -87945 -19154
828a9154J64105J32170j51404P2884L5507n5635K64J5754j4524k07798n1045j68100
$$ -19154 144951 277121 125717 198601 234108 178473 178737 194491 179967 -27831 -78876 -246976
816b46976L1831q335K310J2802j10594j60844K46531N2593J49720o2519M1635
$$ -246976 -215145 -223480 -221170 -208368 -318962 -479806 -233275 -180682 -30962 -93481 -51846
805e1846O1374N8294n216o1289l2055K15394k423l8886j42375j77004m897K4697
$$ -51846 9528 67822 62606 1317 -30738 184656 182233 143347 972 -176032 -180929 -156232
793a56232j17667l8533K61394O0220m3209j67401j9019P9752J4077q2629j14242
$$ -156232 -273899 -312432 -51038 9182 -34027 -201428 -220447 -140695 -126618 -209247 -323489
$$ [...]
##END NTUPLES=NMR SPECTRUM
##END=
