##TITLE=1H_EC-3312(V-1)oc
 DMSO
 8 sc, 
 27.6.2024
##JCAMPDX= 6.0         $$ Bruker NMR JCAMP-DX V2.0
##DATA TYPE= NMR SPECTRUM
##DATA CLASS= NTUPLES
##ORIGIN= UXNMR, Bruker Analytische Messtechnik GmbH
##OWNER= root
$$ XWIN-NMR		Version 3.5
$$ Thu Jun 27 14:18:29 2024 Russian Standard Time (UT+4h)  she@DPX200
##.OBSERVE FREQUENCY= 200.1313
##.OBSERVE NUCLEUS= ^1H
##.ACQUISITION MODE= SIMULTANEOUS
##.ACQUISITION SCHEME= undefined
##.AVERAGES= 8
##.DIGITISER RES= 18
##SPECTROMETER/DATA SYSTEM= spect
##.PULSE SEQUENCE= zg30
##.SOLVENT NAME= DMSO
##.SHIFT REFERENCE= (INTERNAL, DMSO, 0, 15.51)
##AUDIT TRAIL= $$ (NUMBER, WHEN, WHO, WHERE, WHAT)
$$ ##TITLE= Audit trail, XWIN-NMR		Version 3.5
$$ ##JCAMPDX= 5.01
$$ ##ORIGIN= Bruker BioSpin GmbH
$$ ##OWNER= she
$$ F:/spectra/data/she/nmr/H-F/1/pdata/1/auditp.txt
$$ ##AUDIT TRAIL=  $$ (NUMBER, WHEN, WHO, WHERE, WHAT)
(   1,<2024-06-27 14:17:04.20 +0400>,<she>,<DPX200>,
      <created by zg, POWCHK disabled, PULCHK disabled
       configuration hash MD5:
       00 E9 B6 7A A2 85 ED C7 34 08 36 98 17 FE 4E 26
       data hash MD5: 16K
       45 D8 B1 B6 61 92 29 4A 9C DF 09 62 C8 F9 23 BD>)
(   2,<2024-06-27 14:17:06.64 +0400>,<she>,<DPX200>,
      <Start of raw data processing
       efp BC_mod = 2 LB = 0.24 FT_mod = 6 PKNL = 1 PHC0 = -25315.85 PHC1 = 8.787479 SI = 16K 
       data hash MD5: 16K
       B1 CC B2 68 54 DD 3E E8 07 A6 B2 06 0D 91 99 5C>)
(   3,<2024-06-27 14:17:24.21 +0400>,<she>,<DPX200>,
      <pk PHC0 = -5.1736 PHC1 = 4 
       data hash MD5: 16K
       12 A5 B9 F4 27 D3 A3 70 83 41 0B DA DA C3 4A 2A>)
(   4,<2024-06-27 14:17:27.65 +0400>,<she>,<DPX200>,
      <abs ABSG = 5 
       data hash MD5: 16K
       5D E9 A7 DF A4 B7 11 D7 35 58 1B 34 32 DE 77 54>)
$$ ##END=
$$ 
$$ hash MD5
$$ C5 E5 47 3F 22 E1 05 D2 C5 C7 2C 63 EC 54 62 63
##$RELAX= 
##$RELAX= 
##$RELAX= 
##$RELAX= 
##$RELAX= 
##$RELAX= 
$$ Bruker specific parameters
$$ --------------------------
##$DU= <F:/spectra>
##$EXPNO= 1
##$NAME= <H-F>
##$PROCNO= 1
##$TYPE= <nmr>
##$USER= <she>
##$AMP= (0..31)
100 100 100 100 100 100 100 100 100 100 100 100 100 100 100 100 100 100 
100 100 100 100 100 100 100 100 100 100 100 100 100 100 
##$AQSEQ= 0
##$AQ_mod= 1
##$AUNM= <au_zg>
##$AUTOPOS= <>
##$BF1= 200.13
##$BF2= 200.13
##$BF3= 200.13
##$BF4= 200.13
##$BF5= 200.13
##$BF6= 200.13
##$BF7= 200.13
##$BF8= 200.13
##$BYTORDA= 1
##$CFDGTYP= 0
##$CFRGTYP= 5
##$CHEMSTR= <none>
##$CNST= (0..31)
1 1 145 1 1 1 1 1 1 1 1 1 1 1 1 1 1 1 1 1 1 1 1 1 1 1 1 1 1 1 1 1 
##$CPDPRG= <>
##$CPDPRG1= <>
##$CPDPRG2= <>
##$CPDPRG3= <>
##$CPDPRG4= <mlev>
##$CPDPRG5= <mlev>
##$CPDPRG6= <mlev>
##$CPDPRG7= <mlev>
##$CPDPRG8= <mlev>
##$CPDPRGB= <>
##$CPDPRGT= <>
##$D= (0..31)
0 1.2 0 0 0 0 0 0 0 0.06 0 0.03 0 0 0 0 0.0002 0 0 0 0 0 0 0 0 0 0 0 0 
0 0 0 
##$DATE= 1719483423
##$DBL= (0..7)
120 120 120 120 120 120 120 120 
##$DBP= (0..7)
150 150 150 150 150 150 150 150 
##$DBP07= 0
##$DBPNAM0= <>
##$DBPNAM1= <>
##$DBPNAM2= <>
##$DBPNAM3= <>
##$DBPNAM4= <>
##$DBPNAM5= <>
$$ [...]
##$SUBNAM3= <"">
##$SUBNAM4= <"">
##$SUBNAM5= <"">
##$SUBNAM6= <"">
##$SUBNAM7= <"">
##$SUBNAM8= <"">
##$SUBNAM9= <"">
##$SW= 18.0517328524113
##$SWIBOX= (0..15)
0 0 2 0 0 0 0 0 0 0 0 0 0 0 0 0 
##$SW_h= 3612.71676300578
##$TD= 16384
##$TD0= 1
##$TE= 0
##$TE2= 300
##$TE3= 300
##$TEG= 300
##$TL= (0..7)
0 120 120 120 120 120 120 120 
##$TP= (0..7)
150 150 150 150 150 150 150 150 
##$TP07= 0
##$TPNAME0= <>
##$TPNAME1= <>
##$TPNAME2= <>
##$TPNAME3= <>
##$TPNAME4= <>
##$TPNAME5= <>
##$TPNAME6= <>
##$TPNAME7= <>
##$TPOAL= (0..7)
0.5 0.5 0.5 0.5 0.5 0.5 0.5 0.5 
##$TPOFFS= (0..7)
0 0 0 0 0 0 0 0 
##$TUNHIN= 0
##$TUNHOUT= 0
##$TUNXOUT= 0
##$USERA1= <user>
##$USERA2= <user>
##$USERA3= <user>
##$USERA4= <user>
##$USERA5= <user>
##$V9= 5
##$VALIST= <valist>
##$VCLIST= <CCCCCCCCCCCCCCC>
##$VD= 0
##$VDLIST= <DDDDDDDDDDDDDDD>
##$VPLIST= <PPPPPPPPPPPPPPP>
##$VTLIST= <TTTTTTTTTTTTTTT>
##$WBST= 1024
##$WBSW= 4
##$XGAIN= (0..3)
0 0 0 0 
##$XL= 0
##$YL= 0
##$YMAX_a= 150228
##$YMIN_a= -164477
##$ZGOPTNS= <>
##$ZL1= 120
##$ZL2= 120
##$ZL3= 120
##$ZL4= 120
##$ABSF1= 15.48136
##$ABSF2= -2.570489
##$ABSG= 5
##$ABSL= 3
##$ALPHA= 0
##$AQORDER= 0
##$ASSFAC= 0
##$ASSFACI= 0
##$ASSFACX= 0
##$ASSWID= 0
##$AUNMP= <proc_1d>
##$AZFE= 0.1
##$AZFW= 0.1
##$BCFW= 0
##$BC_mod= 2
##$BYTORDP= 0
##$COROFFS= 0
##$CY= -3
##$DATMOD= 1
##$DC= 0
##$DFILT= <>
##$DTYPP= 0
##$F1P= 0
##$F2P= 0
##$FCOR= 1
##$FTSIZE= 16384
##$FT_mod= 6
##$GAMMA= 0
##$GB= 0
##$INTBC= 1
##$INTSCL= 3.70164e-10
##$ISEN= 128
##$LB= 0.24
##$LEV0= 0
##$LPBIN= 0
##$MAXI= 10000
##$MC2= 0
##$MEAN= 0
##$ME_mod= 0
##$MI= 1.114404
##$NCOEF= 0
##$NC_proc= -6
##$NLEV= 6
##$NOISF1= 3.799351
##$NOISF2= 2.8
##$NSP= 0
##$NTH_PI= 0
##$NZP= 0
##$OFFSET= 15.51
##$PC= 1
##$PHC0= -25321.02
##$PHC1= 12.78748
##$PH_mod= 1
##$PKNL= yes
##$PPARMOD= 0
##$PSCAL= 0
##$PSIGN= 0
##$REVERSE= no
##$SF= 200.130002341596
##$SI= 16384
##$SIGF1= 3
##$SIGF2= 2
##$SINO= 5.538805
##$SIOLD= 16384
##$SREGLST= <1H.CDCl3>
##$SSB= 0
##$STSI= 16384
##$STSR= 0
##$SW_p= 3612.71676300578
##$SYMM= 0
##$S_DEV= 0
##$TDeff= 16384
##$TDoff= 0
##$TI= <>
##$TILT= no
##$TM1= 0
##$TM2= 0
##$TOPLEV= 0
##$USERP1= <user>
##$USERP2= <user>
##$USERP3= <user>
##$USERP4= <user>
##$USERP5= <user>
##$WDW= 1
##$XDIM= 16384
##$YMAX_p= 449835066
##$YMIN_p= -410181
$$ End of Bruker specific parameters
$$ ---------------------------------
##NTUPLES= NMR SPECTRUM
##VAR_NAME=  FREQUENCY,     SPECTRUM/REAL,   SPECTRUM/IMAG
##SYMBOL=    X,             R,               I
##VAR_TYPE=  INDEPENDENT,   DEPENDENT,       DEPENDENT
##VAR_FORM=  AFFN,          ASDF,            ASDF
##VAR_DIM=   16384,         16384,           16384
##UNITS=     HZ,            ARBITRARY UNITS, ARBITRARY UNITS
##FACTOR=    0.220516191357247, 1,           1
##FIRST=     3104.01638212428, 0,            0
##LAST=      -508.700380881504, 0,           0
##MIN=       -508.700380881504, -410181,     0
##MAX=       3104.01638212428, 449835066,    0
$$ Real data points
##PAGE= N=1
##DATA TABLE= (X++(R..R)), XYDATA
$$ [...]
8632e4744K1614n269o5853m9898J07012P1376r9036l5581L0066O6302P6232m2381
$$ -54744 -33130 -38399 -104252 -154150 -47138 24238 -74798 -110379 -80313 -14011 62221 19840
8620A9840J1324J1470n3422L4058M6281K1065m6139l7247O9633k7445q3088m2334
$$ 19840 31164 42634 -10788 23270 69551 90616 44477 7230 76863 49418 -33670 -76004
8608g6004M7219p957J1339q9602l8450J01874M3320J5719L0870p6854r4897M740
$$ -76004 -28785 -36742 -25403 -115005 -153455 -51581 -8261 7458 38328 -38526 -133423 -128683
8596a28683J82L3063R3073L6057k7891m3809J15963P4665O369k07667m0231j02053
$$ -128683 -128501 -95438 -2365 33692 5801 -38008 77955 152620 158989 -48678 -88909 -190962
8584a90962P4245R2311n913R0684k907L2819o9252l8329L061r20P2147j2305j31379
$$ -190962 -116717 -24406 -30319 60365 57458 90277 21025 -17304 -14243 -15163 56984 44679 -86700
8571h6700J63749K8517n7651o5739O3278M2604l9944M9869n564r9677L9821m3075
$$ -86700 77049 105566 47915 -17824 45454 88058 48114 97983 92419 -7258 32563 -10512
8559a0512L2005M4070k06934J25522J07296p7661p7170L5541M3739m1842L0042
$$ -10512 21493 65563 -141371 -15849 91447 13786 -63384 -27843 15896 -25946 4096
8548D096O5395p4529l1149N3889o4936m2002L035L6460m1381p3057P771O0911
$$ 4096 69491 -5038 -36187 17702 -47234 -89236 -86201 -49741 -91122 -164179 -156408 -95497
8536i5497J5992P8614o3662j6101J0763N2875j836j0412l9696M9564p8102J10614
$$ -95497 -79505 -891 -64553 -80654 -69891 -17016 -18852 -29264 -68960 -19396 -97498 13116
8524A3116o3006j7943N2223P613Q4135r6244p4794m1105J09648O6368l8127Q4737
$$ 13116 -49890 -67833 -15610 -7997 76138 -20106 -94900 -136005 -26357 40011 1884 86621
8512H6621j3233r7718r3013p513n6855j3487M9667R5538J0492l4715L7056J3432
$$ 86621 73388 -24330 -117343 -124856 -181711 -195198 -145531 -49993 -39501 -74216 -37160 -23728
8500b3728r8536n5987Q7117q3235O743J41617P1765o8894l1580q3942J19412K9063
$$ -23728 -122264 -178251 -91134 -174369 -167626 -26009 45756 -23138 -54718 -138660 -19248 9815
8488I815r431j524r6668K879k1271p7402P6222J09746m6252Q3669j5758P2054
$$ 9815 384 -1140 -97808 -94929 -116200 -193602 -117380 -7634 -53886 29783 14025 86079
8476H6079j12695j754J9021k11433J21906R2420q3403N2780Q4897k0097k7289
$$ 86079 -26616 -28370 -9349 -220782 -98876 -6456 -89859 -37079 47818 27721 432
8465D32P2978K598o1930m2440L6488m2044N6079Q9600j5867K8984j28138o2258
$$ 432 73410 76008 14078 -28362 8126 -33918 22161 111761 95894 124878 -3260 -65518
8453f5518j049J9360j0513Q2869j05646n9692L2922Q1862J5805l168P4710r798
$$ -65518 -66567 -47207 -57720 25149 -80497 -140189 -107267 -25405 -9600 -12768 61942 52144
8441E2144o069n9298j92939Q4847J6355J85595P5310j9487j86754O6776K3674
$$ 52144 46075 -13223 -206162 -121315 -104960 80635 155945 136458 -50296 16480 40154
8430D0154q8131Q5036l8118j88653J26061O35J00656J26117n5546q8073l1854
$$ 40154 -47977 37059 -1059 -189712 -63651 -63016 37640 163757 108211 20138 -11716
8419a1716l3745q2940L1715K8889J4450l7592J59151o7089o748q6142j3211N0761
$$ -11716 -45461 -128401 -96686 -67797 -53347 -90939 68212 1123 -5625 -91767 -104978 -54217
8407e4217p7066K03930L4235j00213o4769K9612n4502k7326N3774K6584j75900
$$ -54217 -131283 72647 106882 6669 -58100 -28488 -82990 -110316 -56542 -29958 -205858
8396b05858P6226J24316N5857q4581J25812j1118o4963R8388p5651j13006N454
$$ -205858 -129632 -5316 50541 -34040 91772 80654 15691 114079 38428 -74578 -69124
8385f9124R4630n165q4396J7553P9275j27462q1843q5015J0413N5967J28492j27875
$$ -69124 25506 20341 -64055 -46502 32773 -94689 -176532 -261547 -251134 -195167 -66675 -194550
8373a94550j477N8557J32506j29608K3987m72M9238j0850K3141p9825R6606j38931
$$ -194550 -196027 -137470 -4964 -134572 -110585 -111057 -61819 -72669 -49528 -129353 -32747 -171678
8361a71678P7310o1285M812J5483J12533J26593r8460m7202j1549k3059K3064
$$ -171678 -94368 -155653 -150841 -135358 -22825 103768 5308 -41894 -53443 -76502 -53438
8350e3438j13508m674K2005O2995L1665L6383q106r3880n8079K6111Q4714J52010
$$ -53438 -166946 -171620 -149615 -86620 -54955 -18572 -26678 -120558 -178637 -152526 -67812 84198
8338H4198j39894o538L2210j58596J60381O6912M403r119O3773j0758N9246j58296
$$ 84198 -55696 -62234 -30024 -188620 -28239 38673 43076 33957 97730 86972 146218 -12078
8326a2078R8538k8931j38327O700J03757j00233K4258P410m1778K5941l4955l9209
$$ -12078 86460 57529 -80798 -74098 29659 -70574 -46316 -38906 -80684 -54743 -89698 -128907
8314a28907O0406o653r0474O1208J47535n1202j21652o5205J02141L5424r190
$$ -128907 -68501 -75154 -165628 -104420 43115 -8087 -129739 -194944 -92803 -57379 -66569
8303f6569q231o347o3777m4395O4958Q8237l3177P125N0855N6458n7086q4432
$$ -66569 -74800 -81147 -144924 -189319 -124361 -36124 -69301 -62176 -11321 45137 -11949 -96381
8291i6381J66407q922J8683j46676n1656R4197j249O0723r9866O5017j58430j1591
$$ -96381 70026 61104 79787 -66889 -118545 -24348 -25597 35126 -64740 277 -158153 -169744
8279a69744m1810J07235K25107r7403k3761O5660K8406k1769j4128q1598N7139
$$ -169744 -211554 -104319 120788 23385 -376 65284 93690 71921 57793 -23805 33334
8268C3334R7230j36354j03091J23177L556M068m7955M1776J9167n674p7167j25761
$$ 33334 130564 -5790 -108881 14296 17852 21920 -26035 15741 34908 29234 -47933 -173694
8256a73694L2990R1522k5823N306p3349j21369K03532J02726j9425j01824l7813
$$ -173694 -140704 -49182 -75005 -69699 -143048 -264417 -60885 41841 22416 -79408 -117221
8245a17221l0724N7501r9736P5348K08713j06409p0463M2200M0966j19432l020
$$ -117221 -147945 -90444 -190180 -114832 93881 -12528 -82991 -40791 175 -119257 -122277
8234a22277J25997J6053o0774n6658P4339P6928o5378q564j11849o6290M0109
$$ -122277 3720 19773 -41001 -97659 -23320 53608 -11770 -20334 -132183 -198473 -158364
8223a58364O5266k7285J1357J46495n7769k19909N6354J2065J06512l2083j22288
$$ -158364 -93098 -120383 -109026 37469 -20300 -240209 -183855 -171790 -65278 -97361 -219649
8212b19649L9603R6346M9197k7421J0848L0357l186m4193j1078K0286k2553L3157
$$ -219649 -180046 -83700 -34503 -61924 -51076 -20719 -23905 -68098 -79176 -58890 -81443 -48286
8200d8286r6816k3654J30864R8688j7811q6102j3344L72481P90338o30243n15052
$$ -48286 -145102 -168756 -37892 60796 42985 -43117 -56461 316020 1106358 476115 -38937
8189c8937M6320k6826o7840n3129O2290m9919j37919O1223Q6022O5448J31739
$$ -38937 7383 -19443 -87283 -140412 -78122 -128041 -265960 -204737 -118715 -53267 78472
8178G8472K6923q0274l8230J4036P3965j86144Q6466J14892j16558n250j5914
$$ 78472 105395 25121 -13109 927 74892 -111252 -24786 90106 -26452 -31702 -47616
8167d7616k3117p5453Q3923n8569m1047J08643J07409j49858r479J48718M6872
$$ -47616 -70733 -146186 -62263 -120832 -161879 -53236 54173 -95685 -105164 43554 90426
8156I0426j30464J20727M0662r5907j85772K3850J08347N2455k4456Q2664O2019
$$ 90426 -40038 80689 121351 25444 -160328 -136478 -28131 24324 -132 82532 144551
8145A44551j01249j14230K7954K9208l646K1618O582j8965n1533J637q8434K3055
$$ 144551 43302 -70928 -42974 -13766 -17412 4206 10788 -8177 -59710 -58073 -146507 -123452
8133a23452O7929K2317N6402j99229J3635K08282m9685j44903L8504J50374J54328
$$ -123452 -55523 -33206 23196 -176033 -162398 45884 -3801 -148704 -110200 40174 194502
8122A94502k8171j82040n8517L0405o1264j0947k4155M5008P0166J5057L8849
$$ 194502 166331 -15709 -74226 -43821 -105085 -116032 -140187 -95179 -25013 -9956 28893
8111B8893k0333m4491j8871l1065q0082M8313R9764J16604j32484n2130J61852
$$ 28893 8560 -35931 -54802 -85867 -165949 -117636 -17872 98732 -33752 -85882 75970
8100G5970j25896M010K4928L815Q7145M7636j20078N2092j89126P580K63113j55559
$$ 75970 -49926 -45916 -20988 -17173 69972 117608 -2470 49622 -139504 -131924 131189 -24370
8088b4370j31226o2949M0523M6491m7881M3627J70804j402o7297m1682J70835
$$ -24370 -155596 -218545 -178022 -131531 -179412 -135785 35019 33617 -33680 -75362 95473
8077I5473n9671j3916o1251m9476n3171k1851J06905O172P9274Q8839m7630j21991
$$ 95473 35802 21886 -39365 -88841 -142012 -163863 -56958 -50786 28488 117327 69697 -52294
8065e2294o1663R2969j3783p996J1564j3702m8692q3303N9297N8371p8712L6733
$$ -52294 -113957 -20988 -34771 -42767 -31203 -44905 -93597 -176900 -117603 -59232 -137944 -101211
8053a01211M7688m4069L103K7441Q0522j8321j00919R1825l8936n3596O1285j8534
$$ -101211 -53523 -97592 -94489 -67048 13474 -4847 -105766 -13941 -52877 -106473 -45188 -63722
8041f3722p3275L1859M0851o0607L07R4417J01577j02299L5467r3420j713k5589
$$ -63722 -136997 -105138 -64287 -124894 -124587 -30170 71407 -30892 4575 -88845 -90558 -116147
8029a16147k1674k4374O753J1637r4602L9205l516K7651M4246O4285R7265J3724
$$ -116147 -137821 -162195 -155442 -143805 -238407 -199202 -202718 -175067 -130821 -66536 30729 44453
8017D4453j0668k9493m1227J20936k1558r3710n1370n3296l7338J15941J520L7614
$$ 44453 33785 4292 -36935 84001 62443 -31267 -82637 -135933 -173271 -57330 -55810 -18196
8005a8196P7858K6856k7095j33700L9395K38881o8568j90263n9674J0962p8509
$$ -18196 59662 86518 59423 -74277 -34882 203999 135431 -54832 -114506 -103544 -182053
7994a82053n49O7413P9073J16190r2419O6994j8819j3409K200j03254J5867J25467
$$ -182053 -182602 -115189 -36116 80074 -12345 54649 35830 22421 24621 -78633 -62766 62701
7982F2701o9736n5421K0104p3704j4627k636J29166q840q6168K0986J24918j21350
$$ 62701 -7035 -62456 -42352 -116056 -130683 -133319 -4153 -12993 -99161 -78175 46743 -74607
7970g4607j05011J34901Q0929r1172j68872n0937J6362J194K5773P4981P9189
$$ -74607 -179618 -44717 36212 -54960 -223832 -274769 -258407 -257213 -231440 -156459 -77270
7959g7270N8010m1293N025K4450k2005K9175R7385n6962q8498m1109J9144N4434
$$ -77270 -19260 -60553 -55528 -31078 -53083 -23908 73477 16515 -71983 -113092 -93948 -39514
7947c9514K4968n1941J26156n3504q8570N4777o0801K332L9481k1305k9031R2051
$$ -39514 -14546 -66487 59669 6165 -82405 -27628 -88429 -86097 -46616 -67921 -96952 -4901
7935d901m3542q8641N8819P0806p45k8786j9760l2256j1531R1757K7401l0044
$$ -4901 -48443 -137084 -78265 -7459 -8204 -36990 -56750 -89006 -100537 -8780 18621 -11423
7923a1423M2335J33937P2835q1814m0852P810k3233j5087j23278o0567J21059
$$ -11423 30912 164849 237684 155870 115018 122828 99595 84508 -38770 -99337 21722
7912B1722o3430Q5667K217j65205k1040j7854K5995P2862J61226L1580r2508L6071
$$ 21722 -41708 43959 46176 -119029 -140069 -157923 -131928 -59066 102160 133740 41232 77303
7900G7303q2771j03892j45321P1253J5667J82594o4718q4563Q5468K7087K8429
$$ 77303 -5468 -109360 -254681 -183428 -167761 14833 -49885 -134448 -48980 -21893 6536
7889F536j46133k7152Q1608n7525l3952L6510J9473N5834J24608n1832q7737j04774
$$ 6536 -139597 -166749 -85141 -142666 -176618 -140108 -120635 -64801 59807 7975 -79762 -184536
7877a84536P0543J20239J7447j3840q293Q0930K8754p5712j797j2234j93054K84
$$ -184536 -113993 6246 23693 9853 1560 82490 111244 35532 33735 21501 -171553 -171269
7865a71269M8131J17628j52993J91514P5630L9613j28979o0889K9758J95228j56916
$$ -171269 -123138 -5510 -158503 33011 108641 148254 19275 -41614 -11856 183372 26456
7854B6456o8960J5285m0400J25166p6548Q524n9898j49334N4665P5307k985N8281
$$ 26456 -42504 -27219 -67619 57547 -19001 -10477 -70375 -219709 -165044 -89737 -92722 -34441
7842c4441L3239n8181p3112m754P1249l344k6853K864O817Q7085l5455j005J28726
$$ -34441 -1202 -59383 -132495 -137249 -66000 -69344 -96197 -93333 -86516 569 -34886 -35891 92835
7829I2835q8529m85Q7234n9246j9456r759J1354n5216J22242k3514l8756J3371
$$ 92835 4306 3821 91055 31809 12353 2594 13948 -41268 80974 57460 18704 32075
7817C2075j7823J7886J51780l3365O8126k26670j04698J98720l2543p1401L8263
$$ 32075 14252 32138 183918 150553 218679 -7991 -112689 86031 53488 -17913 20350
7806B0350n6643k464j1348J45220j53095j60913l6202Q8286J35037l2025j47676
$$ 20350 -36293 -38757 -50105 95115 -57980 -218893 -255095 -166809 -31772 -63797 -211473
7795b11473j2202J30902J8324r2748j08533N9724J34574K1803k2485l5745o0336
$$ -211473 -223675 -92773 -74449 -167197 -275730 -216006 -81432 -59629 -82114 -117859 -178195
7784a78195R6374J397j3934L3781l7814K899O4166m7869P8357j63927J26382J2023
$$ -178195 -81821 -80424 -94358 -60577 -98391 -95492 -31326 -79195 -838 -164765 -38383 -26360
7772b6360l0726m8688L4273K05456j08844J37825n7326j87511L3823M3930N4364
$$ -26360 -57086 -105774 -71501 133955 25111 162936 105610 -81901 -48078 -4148 50216
7761E0216o160o2025O8449p1209j03057L6341K1124Q108j9408J15927N9817j29919
$$ 50216 44056 -17969 50480 -20729 -123786 -87445 -66321 -58213 -77621 38306 98123 -31796
7749c1796n5758J54543k6727L3160J9378j26560L7915K3594j43790J255M0969
$$ -31796 -87554 66989 40262 73422 92800 -33760 4155 27749 -116041 -114786 -73817
7738g3817J43789j1475J2597j20124j05547O7217M4573j17338O419r136M0691
$$ -73817 69972 58497 71094 -49030 -154577 -87360 -42787 -160125 -153706 -162842 -122151
7727a22151q1916l4456Q5078M8121Q1412m4141J08648o1782J8798K7962N4706
$$ -122151 -204067 -238523 -153445 -105324 -23912 -68053 40595 -21187 -2389 25573 80279
7716H0279R5106k01504p1419L4142Q27j11224p9957O0970N9918J4309J40490J32237
$$ 80279 175385 -26119 -97538 -63396 -62569 -173793 -253750 -192780 -132862 -118553 21937 154174
7704A54174j24970j22382j37407m7321P2608L2632M0123O2794j1528K674Q4172
$$ 154174 29204 -93178 -230585 -277906 -205298 -172666 -132543 -69749 -81277 -78603 5569
7693E569L2274J1068k0312j1126R821k7864M3622o0271n770J253j8630j71406
$$ 5569 37843 48911 28599 17473 27294 -570 43052 -17219 -22989 -21736 -40366 -211772
7681b11772J28592N2757j5192m9804j25699J38104J90515p4140q163o2880n2376
$$ -211772 -83180 -30423 -45615 -95419 -221118 -83014 107501 33361 25198 -37682 -90058
7670i0058Q1869n1195R2210J01857o3458k9176j82366j8707J0744J66553M4207
$$ -90058 -8189 -59384 32826 134683 71225 42049 -140317 -159024 -148280 18273 62480
7659F2480Q2603n7187r7842J17371l9832N1854r6030k0478j22675o2592J51357
$$ 62480 145083 87896 -9946 107425 67593 119447 23417 2939 -119736 -182328 -30971
7648c0971r5945j4407Q5851o9840k9611K29451j58666k04086K1786R0820R7759
$$ -30971 -126916 -141323 -55472 -125312 -154923 74528 -84138 -288224 -266438 -175618 -77859
7637g7859J755J67125n968j05628Q156p466j13678J29405K8267m2859J41725r8845
$$ -77859 -76104 91021 85053 -20575 -12419 -19885 -133563 -4158 24109 -18750 122975 24130
7625B4130q8053J6346p1199Q8953J47n5789N4686P1965M2411N3533j14879N780
$$ 24130 -63923 -47577 -118776 -29823 -29676 -85465 -30779 41186 83597 137130 22251 28031
7613B8031m3015k4680q2565m6718J32992N7599j0334p1342M9368Q8054k9607l4045
$$ 28031 -14984 -39664 -122229 -168947 -35955 21644 11310 -60032 -10664 77390 47783 13738
7601A3738j7631k4665j05411M1367Q0808J31652J5544j31481r3638l9616Q7928
$$ 13738 -3893 -28558 -133969 -92602 -11794 119858 135402 3921 -89717 -129333 -41405
7590d1405r8801N5169N8120M7705n9606r2693L2171L2240q7832P8254K10139m8843
$$ -41405 -140206 -85037 -26917 20788 -38818 -131511 -99340 -67100 -154932 -76678 133461 84618
7578H4618l2723j51352Q3149N364K1889L1404N1922J24529q9038l8784o4281l9041
$$ 84618 51895 -99457 -16308 -10944 10945 42349 94271 218800 129762 90978 26697 -12344
7566a2344O499p5792L5609o144j52692J823K8937J13608J35021J35494J67971
$$ -12344 -5845 -81637 -46028 -52172 -204864 -203041 -174104 -60496 74525 210019 377990
7555C77990k40341j09863r681J7768j5351k09432M4061N3805L295j1776R3488
$$ 377990 137649 27786 18105 35873 20522 -188910 -144849 -91044 -87749 -99525 -6037
7544f037P3726K4640m7482k8506p5737j09187J40169P461j23528k9053M8872l7516
$$ -6037 67689 92329 44847 16341 -59396 -168583 -28414 -20953 -144481 -173534 -124662 -162178
7532a62178j765j2925J33429L1588o1544J31784M5493j20532j15116R4917j25436
$$ -162178 -163943 -176868 -43439 -11851 -73395 58389 103882 -16650 -131766 -36849 -162285
7521a62285j2408l446Q4453R8814j16160Q410j5742J88926k2792k09870K5915
$$ -162285 -174693 -178139 -93686 5128 -111032 -102622 -118364 70562 47770 -162100 -136185
7510a36185J48086q525m1688j4634J14043j01131J1647q6223M5504K14959j81723
$$ -136185 11901 3376 -38312 -52946 61097 -40034 -28387 -114610 -69106 145853 -35870
7499c5870j58419J52427J85149j46133m8789Q8610P4218p1485M7494j32575J7151
$$ -35870 -194289 -41862 143287 -2846 -51635 36975 111193 39708 87202 -45373 -28222
7488b8222n1914l4835J4051k8853N2265k2074p7617J38313R4718l1316J149J8820
$$ -28222 -80136 -114971 -100920 -129773 -77508 -99582 -177199 -38886 55832 24516 25665 44485
7476D4485M88N4799j14882k797O8490k5571l5772j88505m769K9084J84804P6698
$$ 44485 44973 99772 -15110 -17907 50583 25012 -10760 -199265 -204034 -174950 9854 86552
7464H6552Q521O9388n4297o8607j3569n3572M9209l6777P050N1731J393R162r8350
$$ 86552 95073 164461 110164 41557 27988 -25584 23625 -13152 -6102 45629 47022 56184 -42166
7451d2166N0975N2531l024m2270O6732r0811n550n1436j3532R3501J51184o5253
$$ -42166 8809 61340 58316 16046 82778 -8033 -13583 -65019 -78551 14950 166134 100881
7439A00881j28916Q7335J0090N1871m2068K6079M0699j79150j32902J7077p4105
$$ 100881 -28035 59300 69390 121261 79193 105272 145971 -33179 -166081 -149004 -223109
7428b23109L6017K46440L2099r4943K8356R353K06q2574J19296m8474J1127k1947
$$ -223109 -187092 59348 91447 -3496 24860 34213 34419 -48155 71141 22667 33794 11847
7416A1847l0331O9n031J8833J44443j7242r8377R7070k288q7938j36388O3323
$$ 11847 -18484 -18415 -23446 -4613 139830 122588 24211 121281 118993 31055 -105333 -42010
7404d2010N3231l110r614j57403o4386J92766o0962j11151k7951L9872L7933P4553
$$ -42010 11221 8111 -1503 -158906 -223292 -30526 -91488 -202639 -230590 -190718 -152785 -78232
7392g8232L425l8021q317M3702j0686J14276m208j0553P4766o1105n2413p9406
$$ -78232 -74807 -112828 -121145 -77443 -88129 26147 21939 11386 86152 25047 -27366 -106772
7380a06772l7525l7850J64531m122j38536J768K6713J33844J98336p2801j63326
$$ -106772 -144297 -182147 -17616 -21738 -160274 -158506 -131793 2051 200387 127586 -35740
7369c5740m2513O8187N0804p8495l8060J92228j44137M8329R7667l8251m1758
$$ -35740 -78253 -10066 40738 -37757 -75817 116411 -27726 20603 118270 80019 38261
7358C8261O8802n5631Q6039j07502k19451J09621j0242p2975K02376R3319j15121
$$ 38261 107063 51432 137471 29969 -189482 -79861 -90103 -163078 39298 132617 17496
7347A7496n7617r4999J9208O2988J15057l4601l1877j56803l0351K6744j3095
$$ 17496 -40121 -135120 -115912 -52924 62133 27532 -4345 -161148 -191499 -164755 -177850
7336a77850J69783m6020r1601J67137o4311J14400j60430P534J64767J0711L9986
$$ -177850 -8067 -54087 -145688 21449 -42862 71538 -88892 -81358 83409 94120 134106
7325A34106p9644j47723O2638J04760k696k7772k6962j05793P9825Q56L5384q6993
$$ 134106 54462 -93261 -30623 74137 71441 43669 16707 -89086 -9261 -8405 26979 -60014
7313f0014o1039M8230j25068l3482J69250N3075j25447P9898p4388N6457o3603
$$ -60014 -121053 -72823 -197891 -231373 -62123 -9048 -134495 -54597 -128985 -72528 -136131
7302a36131P8313N7550N9797n5932j58761Q2914J63313p4122p3586J4828k0523
$$ -136131 -57818 -268 59529 3597 -155164 -72250 91063 16941 -56645 -41817 -62340
7291f2340M4765J29666M9978p1411j30101J1079n2752j05168N8877J992N0665
$$ -62340 -17575 112091 162069 90658 -39443 -28364 -81116 -186284 -127407 -125415 -74750
7280g4750L0956M7143k7998p212N4362l8732J17497j12603l5556O4167K6848k1717
$$ -74750 -43794 3349 -24649 -31861 22501 -16231 101266 -11337 -46893 17274 44122 22405
7268B2405N0096L3369p6955p2817p8953m2115L3827J33494j7639p4113l5132o2758
$$ 22405 72501 105870 28915 -43902 -122855 -164970 -131143 2351 -15288 -89401 -124533 -187291
7256a87291J36407O4963o4847J10186j00809N7357j2559r4347o5407J07841P6130
$$ -187291 -50884 14079 -50768 59418 -41391 15966 3407 -90940 -156347 -48506 27624
7245B7624j42794m8249P6764R5021L7976j22308N0857J23451o1152p5338p3980
$$ 27624 -115170 -163419 -86655 8366 46342 -75966 -25109 98342 37190 -38148 -112128
7234a12128L0911J5229R404K0303R2836O8933Q5192k6597r2307m3970o4763j68151
$$ -112128 -81217 -65988 -56584 -36281 56555 125488 210680 184083 91776 47806 -16957 -185108
7222a85108R1796R5818l281M7062r3707R6090m5961n7478N2212J9727j7973Q3298
$$ -185108 -93312 2506 -775 46287 -47420 48670 2709 -54769 -2557 17170 -803 82495
7210H2495j18003j13180J21873M4434j7877J06004l1644j48667l6753M9234k3360
$$ 82495 -35508 -148688 -26815 17619 -258 105746 74102 -74565 -111318 -62084 -85444
7199h5444n021L4350J3852j25986J6222K34044O5414k18132N5020l3552j0827
$$ -85444 -90465 -56115 -42263 -168249 -152027 82017 147431 -70701 -15681 -49233 -60060
7188f0060K0244j24492O6120J82195j1553n4884q6130N660P3507L0850J2862n7981
$$ -60060 -39816 -164308 -98188 84007 72454 17570 -68560 -62900 10607 41457 54319 -3662
7176c662L6237J7000l424o2273l9798r0680R1348J26160q1889L9904L9548q7639
$$ -3662 32575 49575 46151 -16122 -55920 -146600 -55252 70908 -10981 28923 68471 -19168
7164a9168L9001q0226M3896O294N9560K1829M2926q0258n3515p1134N1936j4705
$$ -19168 19833 -60393 -16497 -10203 49357 71186 114112 33854 -19661 -90795 -38859 -53564
7152e3564o8328L4554N9778K369O903m1952Q4869R287p3305R419L826J55101k08527
$$ -53564 -121892 -87338 -27560 -25191 -18288 -60240 24629 33916 -39389 -29970 -26144 128957 -79570
7139g9570K0028J30689m2657O0775p1089M201m2615p7650K1529Q1504N6819J21958
$$ -79570 -59542 71147 28490 89265 18176 22377 -20238 -97888 -76359 5145 61964 183922
7127A83922p1055q7470j37295J7149R3686m1758j3858Q7000j17738L2528O2345
$$ 183922 112867 25397 -111898 -94749 -1063 -42821 -56679 30321 -87417 -54889 7456
7116G456P1684p7697j9038N4749J5212k0884q6322j045N8207o783k6868M503q1651
$$ 7456 79140 1443 -17595 37154 52366 31482 -54840 -55885 2322 -4461 -31329 -26826 -108477
7103a08477J05845K517J28213k9340j32656M0110L9186J4472N4828p2371p2862
$$ -108477 -2632 -115 128098 98758 -33898 6212 45398 59870 114698 42327 -30535
7092c0535K3816R331j02965L8767K18954N3209k20858q3768J2522J28597p5666
$$ -30535 -6719 2612 -100353 -61586 157368 210577 -10281 -94049 -81527 47070 -28596
7081b8596J21624M8305N4047n9931m0732p0943P0536j43715K0506n7193K2545
$$ -28596 93028 141333 195380 135449 94717 23774 94310 -49405 -28899 -86092 -63547
7070f3547M8075k4995j47233l4709K13968n1575Q7803N0779j29812p6289J9928
$$ -63547 -15472 -40467 -187700 -222409 -8441 -60016 27787 78566 -51246 -127535 -107607
7059a07607J54754N680n9142k5536m7257M5221N5159O5610q4052O3101K3311j7475
$$ -107607 47147 52827 -6315 -31851 -79108 -33887 21272 86882 2830 65931 89242 71767
7047G1767n1014J1001J2836j70303j2636J39119j37577M8995J15286j3443n8020
$$ 71767 20753 31754 44590 -125713 -138349 770 -136807 -87812 27474 14031 -43989
7036d3989p624j30953J53700J42611q7012j4999M394n4787L5488M6643p9381j01244
$$ -43989 -51613 -182566 -28866 113745 26733 11734 16128 -38659 -3171 43472 -35909 -137153
7024a37153j04589L3244J22573N0597J0746r7430J9627K4670J03844O9901P9422
$$ -137153 -241742 -208498 -85925 -35328 -24582 -122012 -102385 -77715 26129 96030 175452
7013A75452j68938N574K0059o2934P6038J34774j67495j07062N1524L9526O2479
$$ 175452 6514 12088 32147 -30787 45251 180025 12530 -94532 -43008 -3482 58997
7002E8997j08652J064j3472J75955j23066k8465N5823o5878M370l7514K8182J35095
$$ 58997 -49655 -48591 -62063 113892 -9174 -37639 18184 -47694 -43324 -80838 -52656 82439
6990H2439l646q5645o7977m2543R5884k2153L3345P5752k2128R4067o6264j43083
$$ 82439 78793 -6852 -74829 -117372 -21488 -43641 -10296 65456 43328 137395 71131 -71952
6978g1952Q3047M6716J0047Q59r6100P7710l6593m0793K4682j15702M7643j35897
$$ -71952 11095 57811 67858 68717 -27383 50327 13734 -27059 -2377 -118079 -70436 -206333
6966b06333Q6434P0940k7513m9352m0666Q6276Q7408N9511L8973j10995k2813
$$ -206333 -119899 -48959 -76472 -125824 -166490 -80214 7194 66705 105678 -5317 -28130
6955b8130O7221p5977N1839k0968j27246J8859J09842J8824M1215J01451K6661
$$ -28130 39091 -36886 14953 -6015 -133261 -114402 -4560 14264 55479 156930 183591
6944A83591n8928n157n6407k6028O1322n3790J3689K6724n6831O5710m1121K8347
$$ 183591 124663 119506 63099 37071 98393 44603 58292 85016 28185 93895 52774 81121
6932H1121r6633j8124J58079L9625k01848j55680P4103M1100m509J5469J15656
$$ 81121 -15512 -33636 124443 164068 -37780 -193460 -119357 -78257 -82766 -67297 48359
6921D8359K4014j04731j28481R3021k2839k9440M7689Q37P362j15223K6150O7111
$$ 48359 72373 -32358 -160839 -67818 -90657 -120097 -72408 -71571 -64209 -179432 -153282 -86171
6909h6171o7789M8423K23307o6112P9058o2570J6735j1571L1924j9800N1869M1544
$$ -86171 -153960 -105537 117770 51658 130716 68146 84881 73310 105234 85434 137303 178847
6897A78847p7317l0206L2712Q577j13206o4036N9922J7484L1812M9635K2289k1437
$$ 178847 101530 71324 104036 112613 -593 -64629 -4707 12777 44589 94224 116513 95076
6885I5076o3635Q102P2115o3050J8304R7254n9797M3587m0131j07549J2002P0152
$$ 95076 31441 39543 111658 48608 66912 164166 104369 147956 107825 276 12278 82430
6873H2430M1625J14583k41204p3882K8046K9466J18K1667J87329Q5639l2427o2458
$$ 82430 124055 238638 -2566 -76448 -48402 -18936 -18818 2849 190178 275817 243390 180932
6861A80932L1207j62272r8978j5522j1377O0680J48870J312o7820M153P3866M4650
$$ 180932 212139 49867 -49111 -64633 -76010 -15330 133540 134852 67032 71185 145051 189701
6849A89701j26622j05217P2912l075J0992L9329o7257N7442P767J24054l4313
$$ 189701 63079 -42138 30774 27699 38691 78020 10763 68205 75972 200026 165713
6838A65713N1829j27243o1212M9088m6165Q8709l903j47111J39303K9310j24818
$$ 165713 217542 90299 29087 78175 32010 120719 116816 -30295 109008 138318 13500
6827A3500K7128J02619q2397N577j01293j0440K8061k3556J80951j41348j48618
$$ 13500 40628 143247 60850 66427 -34866 -45306 -17245 -40801 140150 -1198 -149816
6816a49816J75607M2271n9335M9104O985J17800l6112j8892k4357R369l8277k0318
$$ -149816 25791 68062 8727 57831 64816 182616 146504 127612 103255 112624 74347 54029
6804E4029k4106N323R6908l1998J410o4868o0124k216J42876O9740p2549J0522
$$ 54029 29923 35246 132154 100156 101566 36698 -23426 -25642 117234 186974 114425 124947
6792A24947P4337r6478p3862l7737P3948J31996j39157m7236L6244P0532J60408
$$ 124947 199284 102806 28944 -8793 65155 197151 57994 10758 47002 117534 277942
6781B77942L8565K2049m3855j73502N1504K0163K6134N887N0721m8644K7602m9261
$$ 277942 316507 338556 294701 121199 172703 192866 219000 224887 275608 226964 254566 205305
6769B05305p1141N8098r5228J28615n1857Q194Q5628o2279j16015j4830R969J41158
$$ 205305 134164 192262 97034 225649 173792 181986 267614 205335 89320 74490 84459 225617
6757B25617P4184l0740R9486N1934m8385k03455p2307M4261K8584k9159q7258
$$ 225617 299801 269061 368547 420481 372096 168641 96334 140595 169179 140020 52762
6746E2762N0117J9225j4129J10455p462j08032j5460Q9647j228M9930j5566j2040
$$ 52762 102879 122104 107975 218430 210968 102936 87476 177123 175895 225825 210259 198219
6734A98219q419N1903m2739j95761J63037Q037M4300o5828q3098l0329L5853J37414
$$ 198219 189800 241703 198964 3203 166240 174277 218577 152749 69651 39322 75175 212589
6722B12589j0323k2325N5987J5184j36844k2323q7250l7395R9096K24083j15767
$$ 212589 202266 179941 235928 251112 114268 91945 4695 -32700 66396 290479 174712
6711A74712j27115l3263J92038n7088K800L0391L9771P8708j886m8777m5658p6042
$$ 174712 47597 14334 206372 149284 152084 182475 222246 300954 299068 250291 204633 128591
6699A28591k011q9574J19261p7146M078J1041p2721J92193R4034n9655j31071
$$ 128591 126580 37006 156267 79121 83199 94240 21519 213712 307746 248091 117020
6688A17020l4812n6838M3320Q8657R1651J2445K6407J1521R225r0298m104K2403
$$ 117020 82208 25370 68690 157347 248998 261443 287850 299371 308596 218298 214194 236597
6676B36597J03120j00760k7216j6395M779P5959R1738k4058j7825L3699j00420
$$ 236597 339717 238957 211741 195346 200125 276084 367822 343764 325939 359638 259218
6665B59218j05308Q059K7721R0611j13821m069j5387L1446n4418N76J3199N8222
$$ 259218 153910 161969 189690 280301 166480 162411 147024 178470 124052 124628 137827 196049
6653A96049K7814j3118j4680l7604J582j6469L2250k5668l2018q9366K10523O9870
$$ 196049 223863 210745 196065 158461 160043 143574 175824 150156 118138 28772 239295 309165
6641C09165r2967n3042J19461o0294j08698l6161N2155j2439J18853J2033o8294
$$ 309165 216198 163156 282617 222323 113625 77464 129619 117180 236033 248066 179772
6630A79772O7123P9427j02996n5799J63927k7488k2367k7179p7758p5961l072
$$ 179772 246895 326322 223326 167527 331454 303966 281599 254420 176662 100701 97629
6619I7629Q9506n318m501l9422O8852J93300j946J5914m5470J05026n0851o671
$$ 97629 187135 181817 177316 137894 206746 400046 398100 414014 368544 473570 422719 416048
6607D16048k6371R1164q7576O4569J6247j30959R060O7597N3062m0358O7278L6364
$$ 416048 389677 480841 393265 457834 474081 343122 352182 419779 472841 432483 499761 536125
6595E36125n7018M4558N1805o9163L7359O3067n2822L1682p3682r439J42273j10976
$$ 536125 479107 523665 575470 506307 543666 606733 553911 585593 511911 502472 644745 533769
6583E33769p2890K188P4876L6255J27274Q8399n6415p3485j3402R551N9711k5058
$$ 533769 460879 463067 537943 574198 701472 789871 733456 659971 646569 656120 715831 690773
6571F90773k6414J67936M267K2134N0330j6835k6731L9240J15058K714r3520M0011
$$ 690773 664359 832295 836562 858696 909026 892191 865460 904700 1019758 1022472 928952 968963
6559I68963N4355J06830J6060j37640J16662K2223l7680L7561q4930p4937R8782
$$ 968963 1023318 1130148 1146208 1008568 1125230 1147453 1109773 1147334 1062404 987467 1086249
6548A086249J09592k7307j09230J7820J1663q1260p3433K3240L0594k3709j1371
$$ 1086249 1195841 1168534 1059304 1077124 1088787 1007527 934094 957334 987928 964219 952848
6537I52848K62329q9070j17535r366j22651k1928J02487j17367L3998L70N3008
$$ 952848 1215177 1126107 1008572 999206 876555 854627 957114 839747 873745 874115 927123
6526I27123L9910M3285j09051l3583M7284o9725J53125J04588j6008j68018L4224
$$ 927123 967033 1010318 901267 867684 914968 845243 998368 1102956 1086948 918930 953154
6515I53154j477l7666n8095O1937P3024m6063O057J15714j2642m2667O3219R5126
$$ 953154 951677 914011 855916 917853 990877 944814 950871 1066585 1053943 1011276 1074495 1169621
6503A169621L9856O2033K1817n1815Q4718Q0912O8282r3453q656J69460J35675
$$ 1169621 1209477 1271510 1293327 1241512 1326230 1407142 1475424 1381971 1373315 1542775 1678450
6492A678450N7550l8076l3890j05600J5043O3015p1675J14981P6629K17454J81873
$$ 1678450 1736000 1697924 1664034 1558434 1573477 1636492 1564817 1679798 1756427 1973881 2155754
6481B155754O9327K66867K29032J65165N2544R6465J7678K56366J10889n8980
$$ 2155754 2225081 2491948 2720980 2886145 2938689 3035154 3052832 3309198 3420087 3361107
6471C361107l6119J43248N8385K89m3929J2442N9250K6340N2698j8283Q9681N8220
$$ 3361107 3324988 3468236 3526621 3526910 3482981 3495423 3554673 3581013 3633711 3615428 3705109 3763329
6459C763329L0205J68493J57372J07129J38301K40618J68193J07785K08705M550
$$ 3763329 3793534 3962027 4119399 4226528 4364829 4605447 4773640 4881425 5090130 5094680
6449E094680o949O5017n4394L0186j34263j72588j60084j82778P3325k69553j09136
$$ 5094680 5087731 5152748 5098354 5128540 4994277 4821689 4661605 4478827 4552152 4282599 4173463
6438D173463M1699j00487j45080j26461K8149K0347p8155j42185J6844m818J97750
$$ 4173463 4215162 4114675 3969595 3843134 3871283 3891630 3813475 3671290 3688134 3683316 3881066
6427C881066n9488j2854j66456j87378M6595J1175Q9372k27153j40300j65552
$$ 3881066 3821578 3808724 3642268 3454890 3501485 3512660 3602032 3374879 3234579 3069027
6417C069027j01147j45640J2054j11944j20588M2225j6802m0197M7005k46679
$$ 3069027 2967880 2822240 2834294 2722350 2601762 2643987 2627185 2586988 2633993 2387314
6407B387314j97706j3945j21941n6574r2484q758L6982q3758n9579j6563m1754
$$ 2387314 2189608 2175663 2053722 1997148 1904664 1895906 1932888 1849130 1789551 1772988 1731234
6396A731234O0869r9861N2995J15266P3181j88309n420k1393J30604j37279j51634
$$ 1731234 1792103 1692242 1745237 1860503 1933684 1745375 1739955 1718562 1849166 1711887 1560253
6385A560253N3224l2703O8839j28698p662N2088N24m3350Q8845j29717j6998M86
$$ 1560253 1613477 1580774 1649613 1520915 1513253 1565341 1565865 1522515 1611360 1481643 1464645 1465131
6373A465131J09827r2425n6099K6776r5903K6892O017j1680J3354m6267N0225
$$ 1465131 1574958 1482533 1426434 1453210 1357307 1384199 1390216 1378536 1391890 1345623 1395848
6362A395848k8698q8793o4550l6803L247q088j6841J25850J423o0302M5985m9466
$$ 1395848 1367150 1278357 1213807 1177004 1180251 1172163 1155322 1281172 1282595 1222293 1268278 1218812
6350A218812M7780N5507l8494K7748N1795q1217K5493j03201J426M8730J54849
$$ 1218812 1266592 1322099 1283605 1311353 1363148 1281931 1307424 1204223 1205649 1254379 1409228
6339A409228P7845n6669Q1211k9593l9548O23J04042Q4592K9857M5294m8797j25860
$$ 1409228 1487073 1430404 1511615 1482022 1442474 1443097 1547139 1631731 1661588 1706882 1658085 1532225
6327A532225M1019J40317q1019O9697m0651K7340Q6286J9327M2761K2467Q6616
$$ 1532225 1573244 1713561 1632542 1702239 1661588 1688928 1775214 1794541 1837302 1859769 1946385
6316A946385J7132P3971O964L346K7099K598J56995j42432J92612P6831J7794
$$ 1946385 1963517 2037488 2044452 2047798 2074897 2077495 2234490 2092058 2284670 2361501 2379295
6305B379295n5947L3533J66409J04841L3675N9672J55768Q6023j1521O5728J50552
$$ 2379295 2323348 2356881 2523290 2628131 2661806 2721478 2877246 2963269 2951748 3017476 3168028
6294C168028P9598J05488J73705K18980k1155J22305J89280P8231K3046K33240
$$ 3168028 3247626 3353114 3526819 3745799 3724644 3846949 4036229 4114460 4137506 4370746
6284D370746J85539J25887J61774K32606J29772R6102K63751L22428J42588K99105
$$ 4370746 4556285 4682172 4843946 5076552 5206324 5302426 5566177 5888605 6031193 6330298
6274F330298J87401K54647K71913L25831J72243L28735L99025K05260K78979J14305
$$ 6330298 6517699 6772346 7044259 7370090 7542333 7871068 8270093 8475353 8754332 8868637
6264H868637J66891L26199K85467R139N8132K95962J40060L2836J83142K60207
$$ 8868637 9035528 9361727 9647194 9656333 9714465 10010427 10150487 10183323 10366465 10626672
6254A0626672M6726J60910J76119J27327K67772K95886K87063K72143K30001K10195
$$ 10626672 10673398 10834308 11010427 11137754 11405526 11701412 11988475 12260618 12490619 12700814
6244A2700814R4986J88495K4931l5524n9886k53055j69015k72091l81301k72195
$$ 12700814 12795800 12984295 13009226 12973702 12913816 12660761 12491746 12219655 11838354 11566159
6234A1566159l93980k23810k90021k17621j44705l26034l17532j89833K1997k6930
$$ 11566159 11172179 10948369 10658348 10440727 10296022 9969988 9652456 9462623 9484620 9457690
6224I457690n8687k04089j99967r2269j71798k12824j33060k67700j63851l52671
$$ 9457690 9399003 9194914 8994947 8902678 8730880 8518056 8384996 8117296 7953445 7600774
6214G600774m31040k94276l08365l85099k71740k37617k62427l05953k85852k70066
$$ 7600774 7169734 6875458 6567093 6181994 5910254 5672637 5410210 5104257 4818405 4548339
6204D548339k26343j75635j10518k65166k43468p5514l727j34929K7563j50606
$$ 4548339 4321996 4146361 4035843 3770677 3527209 3451695 3447968 3313039 3340602 3189996
6194C189996j30428j12325n3274l7932j71594k25854j3224n7689K4696J07608
$$ 3189996 3059568 2947243 2893969 2856037 2684443 2458589 2445365 2387676 2412372 2519980
6184B519980k78957m0242l5793j43501k2142j06970J55184q5422j67375J36695
$$ 2519980 2241023 2200781 2164988 2021487 1999345 1892375 2047559 1962137 1794762 1931457
6174A931457j46516l5127q4695K078o9346j51365k7768J03756o6459J3079L4003
$$ 1931457 1784941 1749814 1665119 1667197 1597851 1446486 1418718 1522474 1456015 1469094 1503097
6163A503097r465J1046N8471j2750K695l8798j30387k7442J40695J7879P095J7882
$$ 1503097 1493632 1504678 1563149 1550399 1553094 1514296 1383909 1356467 1497162 1515041 1522136 1540018
6151A540018l4723p981j03529M947j57410O221L2235k716J33449q3023L2026J59161
$$ 1540018 1505295 1497314 1393785 1398732 1241322 1247543 1279778 1277062 1410511 1327488 1359514 1518675
6139A518675L9843J24502j10886l7776J74870o5333p5876M7238j22091K550J58147
$$ 1518675 1558518 1683020 1572134 1534358 1709228 1643895 1568019 1615257 1493166 1495716 1653863
6128A653863J10685o0988M5651j10449J72637J95143r093Q5730K3695J76330o0023
$$ 1653863 1764548 1703560 1749211 1638762 1811399 2006542 1997449 2083179 2106874 2283204 2223181
6117B223181J41917K67954Q2838O5209J95296L33006L18502K83188J97333J00059
$$ 2223181 2365098 2633052 2715890 2781099 2976395 3309401 3627903 3911091 4108424 4208483
6107D208483o9939m2146o7169m4889M7750L1999N9101J06706K23463P2905j0275
$$ 4208483 4138544 4096398 4029229 3984340 4032090 4064089 4123190 4229896 4453359 4526264 4515989
6096D515989J35783k9611K436J4673O1146J27985K04241P8270j79206j89422K1351
$$ 4515989 4651772 4622161 4624597 4639270 4700416 4828401 5032642 5110912 4931706 4742284 4763635
6085D763635j43807j17420J15915m4268k3671O3278p0111j96913m2939j16913
$$ 4763635 4619828 4502408 4618323 4574055 4550384 4613662 4543551 4346638 4303699 4186786
6075D186786j95351n4982M8319O6479K21473P892M2641j39559j85694m28842k60431
$$ 4186786 3991435 3936453 3984772 4051251 4272724 4280616 4323257 4183698 3998004 3569162 3308731
6064C308731k92101j86315k04600j21866j77331j12690k02746o8566j67243p1629
$$ 3308731 3016630 2830315 2625715 2503849 2326518 2213828 2011082 1942516 1775273 1703644
6054A703644K0467o3912j6463k26089j28301L8635m728l7699o4574L0900j6420
$$ 1703644 1724111 1660199 1643736 1417647 1289346 1327981 1323253 1285554 1220980 1251880 1235460
6043A235460k69625j16914N8604L2514j12819J6607J0441m8474j56508L7664L7485
$$ 1235460 965835 848921 907525 940039 827220 843827 854268 805794 649286 686950 724435
6032G24435R5212l4556J22355j52737j2577m1906q841j8202O7668q2424r6862
$$ 724435 819647 785091 907446 754709 742132 700226 691385 673183 740851 658427 561565
6021E61565N6548n6612l6042N2827q160K5439P344K316p0463M922K5040j08346
$$ 561565 618113 561501 525459 578286 570126 595565 602909 605225 534762 539684 564724 456378
6009D56378l2093m8590J72000L7019o4985M5916R8277J4454m9805k4028j8168
$$ 456378 424285 375695 547695 584714 519729 565645 663922 678376 628571 604543 586375
5998E86375j48377j15511M645J23873j22160M1171R8339J9355j09359l4366r1359
$$ 586375 437998 322487 327132 451005 328845 370016 468355 487710 378351 343985 252626
5987B52626O0229J34080L6939L8848j2085j6934j19785p2920J15184O6055j38518
$$ 252626 312855 446935 483874 522722 510637 493703 373918 300998 416182 482237 343719
5976C43719J03977k3593j4068j26698J84887p2542r3023m1026p5414J02947J35904
$$ 343719 447696 424103 410035 283337 468224 395682 302659 261633 186219 289166 425070
5965D25070m5227o4473k5241l7428O0516L4618L3391m9892Q6782J6896M4693q1357
$$ 425070 379843 315370 290129 252701 313217 347835 381226 331334 418116 435012 479705 398348
5953C98348m2417J30634j09875L571L5393j96811k5947Q9077j04329R6547Q3144
$$ 398348 355931 486565 376690 380261 415654 218843 192896 281973 177644 274191 357335
5942C57335P536Q377o2907M317M7908k4849M3389J04172M6655p1146j34252m6141
$$ 357335 364871 373248 310341 314658 362566 337717 381106 485278 531933 460787 326535 280394
5930B80394m7051N6591Q010Q8741N6885k2556j00360N0674O3638n4133m7599Q6230
$$ 280394 233343 289934 297944 386685 443570 421014 320654 371328 434966 380833 333234 419464
5918D19464j3206r2486M9597J22223K5994o409r9593j27622r659K0935P4177m0093
$$ 419464 406258 313772 363369 485592 511586 505177 405584 277962 268303 289238 363415 323322
5906C23322O3200O6425q5226N9707m5657O5350K4163n7564K9896p0548m7868r510
$$ 323322 386522 452947 367721 427428 381771 447121 471284 413720 443616 373068 325200 315690
5894C15690k2029P4034m8226M1651K7734l0619P0306j3267o2245L7041j19104
$$ 315690 293661 367695 319469 361120 388854 358235 428541 415274 353029 390070 270966
5883B70966J8478J85041P8855r0149r3315p5078m1227J18702m297r7347N5958
$$ 270966 289444 474485 553340 463191 369876 294798 253571 372273 367976 270629 326587
5872C26587j3429j37024l3581J30236l440K0604N5415j5231l0802J11776R5881
$$ 326587 313158 176134 142553 272789 269349 289953 345368 330137 299335 411111 506992
5861E06992J9774j75831L5781M3218r6111M9371M5001k1813K4456J16627j72387
$$ 506992 526766 350935 386716 429934 333823 383194 428195 406382 430838 547465 375078
5850C75078J10445o5906M9125N7639r7285o4275K09801J23450J449m2769k0516
$$ 375078 485523 419617 468742 526381 429096 364821 574622 698072 699521 656752 636236
5839F36236m4959j94728n9984M7031O0473n6546O3413K1284q3786J14399P8684
$$ 636236 591277 396549 336565 383596 444069 387523 450936 472220 388434 502833 581517
5828E81517l8196J61843k0875j37129j4360J64849r1982q0946M5879Q6652J35398
$$ 581517 543321 705164 684289 547160 532800 697649 605667 524721 570600 657252 792650
5817G92650j5382o3149J7140P8803j7299j5657Q0867O8551r8761J818j7244J73687
$$ 792650 777268 714119 731259 810062 792763 777106 857973 926524 827763 829581 812337 986024
5805I86024J3680r6641M1489M9040J14809M1676O5482r3564K2072j7542p5197
$$ 986024 999704 903063 944552 993592 1108401 1150077 1215559 1121995 1144067 1126525 1051328
5794A051328P6967N339J12738J6863Q1343j02716Q7894M5593K6444P9068l9878
$$ 1051328 1128295 1133634 1246372 1263235 1344578 1241862 1329756 1375349 1401793 1480861 1440983
5783A440983j4462R7164k9878l3792K2169J29090J07244P4656L3616n2635J00682
$$ 1440983 1426521 1523685 1493807 1460015 1482184 1611274 1718518 1793174 1826790 1774155 1874837
5772A874837j5164l3266J08266P1392Q5178N5576J15200N2861K1724J16240J71170
$$ 1874837 1859673 1826407 1934673 2006065 2091243 2146819 2262019 2314880 2336604 2452844 2624014
5761B624014O5545o0003K8470J53063J05686K21536L8691R5787L1646J94246K01904
$$ 2624014 2689559 2629556 2658026 2811089 2916775 3138311 3177002 3272789 3304435 3498681 3700585
5750C700585q8893J31138O4976J71967J4075J90424N7034J7781o0159N1896j32805
$$ 3700585 3611692 3742830 3807806 3979773 3993848 4184272 4241306 4259087 4198928 4250824 4118019
5739D118019j47320J00115J54653N6488Q9966L5810o2896J01663J62018J44878
$$ 4118019 3970699 4070814 4225467 4281955 4371921 4407731 4344835 4446498 4608516 4753394
5729D753394J76105K49533J83333J51913J96309O2144j55108K2849j07384k63799
$$ 4753394 4929499 5179032 5362365 5514278 5710587 5772731 5617623 5640472 5533088 5269289
5719E269289l043j98334o8301j20886k25741j71946j02399j67874n4744p6723
$$ 5269289 5266246 5067912 4999611 4878725 4652984 4481038 4378639 4210765 4156021 4079298
5709D079298K2946J0902o8834N2337k3622o0433J47347k9596r1054P7298O2008
$$ 4079298 4102244 4113146 4044312 4096649 4073027 4012594 4159941 4130345 4039291 4116589 4178597
5698D178597k5542k45867R339n4498k67874j09312P3807n4716j50227m948j9962
$$ 4178597 4153055 3907188 3916527 3862029 3594155 3484843 3558650 3503934 3353707 3348759 3328797
5687C328797j86064j33813J23386j48769k49757j28159m0020j27666j16479K09173
$$ 3328797 3142733 3008920 3132306 2983537 2733780 2605621 2565601 2437935 2321456 2530629
5677B530629l6720j23472M0214n084q4964m2371N2640L6672l5685m4775M6940
$$ 2530629 2493909 2370437 2410651 2405567 2320603 2278232 2330872 2367544 2331859 2287084 2334024
5666B334024k6143m6418K03873r0809j12006o6608J09190K4464j06852Q4213O6541
$$ 2334024 2307881 2261463 2465336 2374527 2262521 2195913 2305103 2329567 2222715 2306928 2373469
5655B373469K5406p4388o5714J1260p0029M565J0172J51229j52168o0167L9189
$$ 2373469 2398875 2324487 2258773 2270033 2200004 2204569 2214741 2365970 2213802 2153635 2192824
5644B192824n8169J48877L9449O4390L7835N5563p0084q2631m0408J50915K2050
$$ 2192824 2134655 2283532 2322981 2387371 2425206 2480769 2410685 2328054 2287646 2438561 2460611
5633B460611m6875J68318p0385n7175M1940M7402n4071P7262j221o037l8788J7009
$$ 2460611 2413736 2582054 2511669 2454494 2496434 2543836 2489765 2567027 2565806 2559769 2520981 2537990
5621B537990J28508j16540N0222Q7633N8888n5016p9864L508J8404J7637J50817
$$ 2537990 2666498 2549958 2600180 2687813 2746701 2691685 2611821 2615329 2633733 2651370 2802187
5610B802187O3236J7876P3766r4707P7537R9567n6449p7592J51367N9997l3709
$$ 2802187 2865423 2883299 2957065 2862358 2939895 3039462 2983013 2905421 3056788 3116785 3083076
5599C083076K3005O5361J00988k8061j1518M7901Q123k6919k9427J37144P8410
$$ 3083076 3106081 3171442 3272430 3244369 3232851 3280752 3288875 3261956 3232529 3369673 3448083
5588C448083J53963J38645k6351M5509O9179R1545P1044R1805N6924j31022q5888
$$ 3448083 3602046 3740691 3714340 3759849 3829028 3920573 3991617 4083422 4140346 4009324 3923436
5577C923436O6165l4117n089Q4173O2255J7491k8358M6435K17674J90144P2547
$$ 3923436 3989601 3955484 3950395 4034568 4096823 4114314 4085956 4132391 4350065 4540209 4612756
5566D612756Q3429J59028n1831J25666J57390N986J5634J17233J00595O2189M8712
$$ 4612756 4696185 4855213 4803382 4929048 5086438 5092424 5108058 5225291 5325886 5388075 5436787
5555E436787j5976K15977J31255l0096K74280J30269Q4680J65907O5114l7650
$$ 5436787 5420811 5636788 5768043 5737947 6012227 6142496 6227176 6393083 6458197 6420547
5545F420547J37622Q6405K09440J04795Q9396J20390L2814J68876J71798J45131
$$ 6420547 6558169 6644574 6854014 6958809 7048205 7168595 7201409 7370285 7542083 7687214
5535G687214J59619J29290J05546O8851J35716K26199J43616K01718J73174K14549
$$ 7687214 7846833 7976123 8081669 8150520 8286236 8512435 8656051 8857769 9030943 9245492
5525I245492K27514K29699K93089L36303K40700K29003K85605L86869L49984N11248
$$ 9245492 9473006 9702705 9995794 10332097 10572797 10801800 11087405 11474274 11824258 12335506
5515A2335506N28279L06765L51508M82583N18733L23327J26586K99540K63079
$$ 12335506 12863785 13170550 13522058 14004641 14523374 14846701 14973287 15272827 15535906
5506A5535906L16090J95391P2476J19169J42534J80721K67561Q1757K42045K74832
$$ 15535906 15851996 16047387 16119863 16239032 16381566 16562287 16829848 16911605 17153650 17428482
5496A7428482L97827L76926L72683J98232M25181M99711L63302M83534L27353
$$ 17428482 17826309 18203235 18575918 18774150 19199331 19699042 20062344 20545878 20873231
5487B0873231L28141K96125J18735J56766O9281j16353L3045j17929J15210J47280
$$ 20873231 21201372 21497497 21616232 21772998 21842279 21725926 21758971 21641042 21756252 21903532
5477B1903532N9612R4495n7026j14466k02256j24143n8477K85806J76921J78671
$$ 21903532 21963144 22057639 22000613 21886147 21683891 21559748 21501271 21787077 21963998 22142669
5467B2142669L51769L20938J52218K38155L09892J38747J47845J39050L32239
$$ 22142669 22494438 22815376 22967594 23205749 23515641 23654388 23802233 23941283 24273522
5458B4273522L14754K76290J62749Q4828K8828L65691L07267J09476K97079L67877
$$ 24273522 24588276 24864566 25027315 25112143 25140971 25506662 25813929 25923405 26220484 26588361
5448B6588361M14582L40233L05509K60973L59987L86781L30002M68827M27790
$$ 26588361 27002943 27343176 27648685 27909658 28269645 28656426 28986428 29455255 29883045
5439B9883045N62397L49582O17818P08565O39272M29433N22966N50006O22932
$$ 29883045 30445442 30795024 31412842 32121407 32760679 33190112 33713078 34263084 34886016
5430C4886016Q17449J031626Q39772Q52512Q37934J013559J102264J342782J274050
$$ 34886016 35703465 36735091 37574863 38427375 39265309 40278868 41381132 42723914 43997964
5421D3997964J113276J248601J390014J527436J532925J685080J896906K047993
$$ 43997964 45111240 46359841 47749855 49277291 50810216 52495296 54392202 56440195
5413E6440195K031367J890817K365410K583128K870948L231560L781304M136271
$$ 56440195 58471562 60362379 62727789 65310917 68181865 71413425 75194729 79331000
5405G9331000M680048N611919O060871O424650P058201P814082R330419J0960521
$$ 79331000 84011048 89622967 95683838 102108488 109166689 116980771 126311190 137271711
5397A37271711J3130873J5780104J8666120K2077969K5502388L0957026M1178960
$$ 137271711 150402584 166182688 184848808 206926777 232429165 263386191 304565151
5390C04565151N3608758N9769913L1891244j9737542m2713178m6522381m7541151
$$ 304565151 358173909 417943822 449835066 430097524 387384346 340861965 293320814
5383B93320814m1476977l1901080k4187079j9729116j7425196j5332941j3672478
$$ 293320814 251843837 219942757 195755678 176026562 158601366 143268425 129595947
5376A29595947j2517307j0875088r290640p715665o738831n805040n177590m717196
$$ 129595947 117078640 106203552 96912912 89197247 82458416 76653376 71475786 66758590
5368F6758590l979097l556159l186035k804779k521900k348359k348718j965908
$$ 66758590 62779493 59223334 56037299 53232520 50710620 48362261 46013543 44047635
5360D4047635j723003j886860j722692j627614j505889j502616j448557j301797
$$ 44047635 42324632 40437772 38715080 37087466 35581577 34078961 32630404 31328607
5352C1328607j111422j188191j065842q87432q07256q77440p65406p79841p53523
$$ 31328607 30217185 29028994 27963152 27075720 26268464 25391024 24625618 23845777 23092254
5343B3092254n37773n66959o46592n67716n59073n16120m15523k85133o07103
$$ 23092254 22554481 21987522 21340930 20773214 20214141 19698021 19282498 18997365 18390262
5334A8390262n10910l98747n60702m65606m92936k18728j57602l97913n36385
$$ 18390262 17879352 17480605 16919903 16454297 15961361 15742633 15585031 15187118 14650733
5325A4650733k99223k20915k68849k53651r3278k21316k41575j51721j80746k63514
$$ 14650733 14351510 14130595 13861746 13608095 13514817 13293501 13051926 12900205 12719459 12455945
5315A2455945k70575j67699j55459j36117l12895l29781j19053j73120m0165j62331
$$ 12455945 12185370 12017671 11862212 11726095 11413200 11083419 10964366 10791246 10751081 10588750
5305A0588750l4154j93584l55838k10128M0422j16358k03744j02872k03857q6678
$$ 10588750 10554596 10361012 10005174 9795046 9835468 9719110 9515366 9412494 9208637 9121959
5295I121959O2016n9661j26021j29587j24028j38034L4879r6561p7666j98933
$$ 9121959 9183975 9124314 8998293 8868706 8744678 8606644 8641523 8544962 8467296 8268363
5285H268363j64036j14569j82682q4331q9961j42450N3069k5499l5927N2923M0775
$$ 8268363 8104327 7989758 7807076 7722745 7632784 7490334 7543403 7517904 7481977 7534900 7575675
5274G575675j31350J80451K8016O7918o8252k5068Q7239P4253J9701p0415J64535
$$ 7575675 7444325 7624776 7652792 7720710 7652458 7627390 7714629 7788882 7808583 7738168 7902703
5263G902703J82172J13756N0571K07464J83679J36505K04033J93165J95905K41338
$$ 7902703 8084875 8198631 8249202 8456666 8640345 8776850 8980883 9174048 9369953 9611291
5253I611291K10752M00093L34607K00707M57302L71048J10939J76410K61868K76957
$$ 9611291 9822043 10222136 10556743 10757450 11214752 11585800 11696739 11873149 12135017 12411974
5243A2411974L96370M60593M14627M63362J53699J0902P2707J92870J36278J09770
$$ 12411974 12808344 13268937 13683564 14146926 14300625 14311527 14384234 14577104 14713382 14823152
5233A4823152J44261K89438J93158L04822L27238M14048M78794O75356Q27814
$$ 14823152 14967413 15256851 15450009 15754831 16082069 16496117 16974911 17650267 18478081
5224A8478081R81286R57094J295360J443730J347168J103866P55753L38919m50139
$$ 18478081 19459367 20416461 21711821 23155551 24502719 25606585 26362338 26701257 26251118
5215B6251118q13412j179428j431005j476563j429627j396589j131896j176269
$$ 26251118 25437706 24258278 22827273 21350710 19921083 18524494 17392598 16216329
5207A6216329j068671r02135q45198r80680o79598n75006m01949m12180n17467
$$ 16216329 15147658 14245523 13400325 12419645 11740047 11165041 10763092 10350912 9833445
5198I833445n54433m55133k94389k75820k28729j97274k71572j73865j10860k17287
$$ 9833445 9279012 8823879 8529490 8253670 8024941 7827667 7556095 7382230 7271370 7054083
5188G054083p2430L4503n2873j71837j46762k25610n9329o0880q0940j65164J71256
$$ 7054083 6981653 7016156 6963283 6791446 6644684 6419074 6359745 6298865 6217925 6052761 6224017
5177F224017L4237l9130j51252P8455L8129J09675l0840J18195K80389J82252
$$ 6224017 6258254 6219124 6067872 6146327 6184456 6294131 6263291 6381486 6661875 6844127
5167F844127J32784J31288L04649M73674L20987K97210N28059O88728P70701Q35353
$$ 6844127 6976911 7108199 7412848 7886522 8207509 8504719 9032778 9721506 10492207 11327560
5157A1327560O81059J001842J571257J973881K423459J588205n86253j857462
$$ 11327560 12008619 13010461 14581718 16555599 18979058 20567263 19981010 18123548
5149A8123548j937633j903177j579682j179318q87197q38597o45944n48271m88965
$$ 18123548 16185915 14282738 12703056 11523738 10636541 9797944 9152000 8603729 8114764
5140H114764n85861k40217l46860k92179l2407k21704k52814n85711m10015j06354
$$ 8114764 7528903 7288686 6941826 6649647 6617240 6395536 6142722 5557011 5146996 5040642
5130E040642j94054k08264q5591j39341j87021j14180o3521r8305j49028j5169
$$ 5040642 4846588 4638324 4552733 4413392 4226371 4112191 4048670 3950365 3801337 3786168
5120C786168O5548j73955k28779j80522j99339j7845P2205j24971j77147q0936
$$ 3786168 3851716 3677761 3448982 3268460 3069121 3051276 3123481 2998510 2821363 2740427
5110B740427M6935j06930j70348m3035L5807M1855k3149j06756n1568j38613j98240
$$ 2740427 2787362 2680432 2510084 2467049 2502856 2544711 2521562 2414806 2363238 2224625 2026385
5099B026385J05691j36904j15856P3954R5542j58854R299k844j37404l0854Q5399
$$ 2026385 2132076 1995172 1879316 1953270 2048812 1889958 1899257 1896413 1759009 1728155 1813554
5088A813554j6464l0368j03503N6654k9651j52853p013J05389n6062L211R6929
$$ 1813554 1797090 1766722 1663219 1719873 1690222 1537369 1530356 1635745 1579683 1582894 1679823
5077A679823N9865m5617j33941j75345r8574N8235Q706J2030Q8138j4172l2027
$$ 1679823 1739688 1694071 1560130 1384785 1286211 1344446 1353152 1365182 1453320 1439148 1407121
5066A407121J20437m5038k9761o3308k056Q8230p7450k4224k6812J58586j82806
$$ 1407121 1527558 1482520 1452759 1389451 1387395 1475625 1398175 1373951 1347139 1505725 1322919
5055A322919P3121J17965L1677Q1484q05J04815J33660J23923j60062l9734n9085
$$ 1322919 1396040 1514005 1545682 1627166 1626361 1731176 1864836 1988759 1828697 1788963 1729878
5044A729878k00488k17861m6053j01522P0368J5472j6528j39217r2788Q0020l4492
$$ 1729878 1529390 1311529 1265476 1163954 1234322 1249794 1233266 1094049 1001261 1081281 1046789
5033A046789j9580k5132O5223q7041J8288J44147j2377q4035o1030R254p2068
$$ 1046789 1027209 1002077 1067300 980259 998547 1142694 1130317 1046282 985252 994506 922438
5022I22438m9934J52328r3066j11799N7939P3209j9891j22288j19189n8248K9673
$$ 922438 872504 1024832 931766 819967 877906 951115 931224 808936 689747 631499 661172
5011F61172N2524P4747j1211N7725o4553p4419j0983O3552n1530K7614M8490L2301
$$ 661172 713696 788443 777232 834957 770404 695985 685002 748554 697024 724638 773128 805429
4999H05429q0451j57965J28007R7653r8976m1668L5694K9643r4808o4048P4996
$$ 805429 724978 567013 695020 792673 693697 652029 687723 717366 622558 558510 633506
4988F33506m9977k7727Q9234j2496K0151J8216p8176J4676o208j4036J25369j65658
$$ 633506 583529 555802 645036 632540 652691 670907 592731 607407 601199 587163 712532 546874
4976E46874L4208k6215M0642J9121p8935p2033o2987J05312O5857j4488K0370
$$ 546874 581082 554867 595509 614630 535695 463662 400675 505987 571844 557356 577726
4965E77726P765J8932m5144j03235P4571p3370R7511k3873K8673p243r3919O4625
$$ 577726 585491 604423 559279 456044 530615 457245 554756 530883 559556 552313 458394 523019
4953E23019J23969j29881o3294J24510l4922O2498K7017n6884K2381m2604N7319
$$ 523019 646988 517107 453813 578323 543401 605899 632916 576032 598413 555809 613128
4942F13128P1717q71q7360O5434J54547p0642q3767M6810M533m0545O2709k6351
$$ 613128 684845 683974 596614 662048 816595 745953 662186 708996 713529 672984 735693 709342
4930G09342o7213l3750J39901J13435j59354R3265J04931L0730N7211J0143R3188
$$ 709342 642129 608379 748280 861715 702361 795626 900557 931287 988498 998641 1091829
4919A091829l9732k910J28936K69887j2754J25120J8264o2381K496p2580j48452
$$ 1091829 1052097 1049187 1178123 1448010 1435256 1560376 1578640 1516259 1518755 1446175 1297723
4908A297723l8384j9198k62846J4391m991P680K654n1179R2393k5198N7612J4312
$$ 1297723 1259339 1240141 977295 991686 986695 994375 997029 945850 1038243 1013045 1070657 1084969
4896A084969P0332j50584j16851K0506J20656o1228j50641R6365N6382n2337J8654
$$ 1084969 1155301 1004717 887866 908372 1029028 967800 817159 913524 969906 917569 936223
4885I36223p2953r2721M2958K8447o0926n3340n2072m3197K6078j5322K7490k7293
$$ 936223 863270 770549 813507 841954 781028 727688 675616 632419 658497 643175 670665 643372
4873F43372m5733j1701J15358j21034o9749m6824O3885j345N4190R456o8897R0503
$$ 643372 597639 585938 701296 580262 510513 463689 527574 526229 580419 589875 520978 611481
4861F11481j05021j36945J21057O0695J2112P8599q3684J27491K8975J4503q2422
$$ 611481 506460 369515 490572 551267 563379 641978 558294 685785 714760 729263 646841
4850F46841k01223O5586L4712L2700L3518j9495o8246r445P1716J16707k4440
$$ 646841 445618 511204 545916 578616 612134 592639 524393 514948 586664 703371 678931
4839F78931p7350p9710m5052K11358n248j73092R0612m1987o6663R1094J44834
$$ 678931 601581 521871 476819 688177 682929 509837 600449 558462 491799 582893 727727
4828G27727j07049o6559k4950J03784m6161j2572L0017p3971r840M1046K9326
$$ 727727 620678 554119 529169 632953 586792 574220 604237 530266 520426 561472 590798
4817E90798J55382J9671j52922r1447R7655J44405K3798j63536M4830j22625q2689
$$ 590798 746180 765851 612929 521482 619137 763542 787340 623804 668634 546009 463320
4806D63320k8734R6160O5300p3361p0956N827k7463J2942P2885M9726n103j01415
$$ 463320 434586 530746 596046 522685 451729 457556 430093 443035 515920 565646 560543 459128
4794D59128p475R5281N0562O38n4088j16297M1248m0586O8239L931L6623k3352
$$ 459128 451653 546934 597496 598134 544046 427749 468997 428411 496650 500581 537204 513852
4782E13852M768M0559q8296M6352M0356J6573P7237j30799L8156Q0974j25802
$$ 513852 518620 559179 470883 517235 557591 574164 651401 520602 558758 639732 513930
4771E13930k8444L6182j18986K17902P7921N4697q6487l2416P0649k3139M9579
$$ 513930 485486 521668 402682 620584 698505 753202 666715 634299 704948 681809 731388
4760G31388j0789R534K6880j16996m5911K02025k1209j05781R858J7274M1575
$$ 731388 720599 730133 757013 640017 594106 796131 774922 669141 678999 696273 737848
4749G37848p3884J29892k5201o5262r4919M7826o6920J08116L7039M852R5099
$$ 737848 663964 793856 768655 703393 608474 656300 589380 697496 734535 739387 834486
4738H34486J72309N4197j71225k2689o5148P6168J5748n8204P2947j355K7462
$$ 834486 1006795 1060992 889767 867078 801930 878098 893846 835642 908589 907234 934696
4727I34696k1593j24011k6563L4005J70736J80251j56742n3165k5910J164p5852
$$ 934696 913103 789092 762529 796534 967270 1147521 990779 937614 911704 912868 837016
4716H37016P3182O5388J7634N6440R0320q5992N360J14810p3231J02257J4857
$$ 837016 910198 975586 993220 1049660 1139980 1053988 1059348 1174158 1100927 1203184 1218041
4705A218041M9583l4965O6829O0545l8615o4969l8693Q1328J71288q6204n2967
$$ 1218041 1267624 1232659 1299488 1360033 1321418 1256449 1217756 1299084 1470372 1384168 1331201
4694A331201q531Q2036J62669p0562l0562R8310j39279J96524l9004m9406J42881
$$ 1331201 1322670 1404706 1567375 1496813 1466251 1564561 1425282 1621806 1582802 1533396 1676277
4683A676277K9395R1523J28637O5667l9896L745k2647J84137J04816j00835J03423
$$ 1676277 1705672 1797195 1925832 1991499 1951603 1955348 1932701 2116838 2221654 2120819 2224242
4672B224242j1947J47686J18954J15331q0270N6543K08492M7883Q7130N0434j568
$$ 2224242 2212295 2359981 2478935 2594266 2513996 2570539 2779031 2826914 2914044 2964478 2962910
4661B962910O3966m2J95004J18270J03002J59396P7064K07333J21094J02577j10003
$$ 2962910 3026876 3026834 3221838 3340108 3443110 3602506 3679570 3886903 4007997 4110574 4000571
4650D000571J48290J76152l210K66703K42623J39134R9257M5934J68685J41438
$$ 4000571 4148861 4325013 4321803 4588506 4831129 4970263 5069520 5115454 5284139 5425577
4640E425577K27601J56427J83108J11102O7596L35418J89055K91292J54630J36241
$$ 5425577 5653178 5809605 5992713 6103815 6171411 6506829 6695884 6987176 7141806 7278047
4630G278047J87073K29873M15344L07843J56666J72925L81069M71927M20205L05203
$$ 7278047 7465120 7694993 8110337 8418180 8574846 8747771 9128840 9600767 10020972 10326175
4620A0326175L39556K98589N48638N45165O06775O79760P99468P43872P71661
$$ 10326175 10665731 10964320 11512958 12058123 12664898 13344658 14144126 14887998 15659659
4611A5659659J038495J223068J263873J248509J590495J852502K054663K580447
$$ 15659659 16698154 17921222 19185095 20433604 22024099 23876601 25931264 28511711
4603B8511711K659641K681326K240556K052285J790789J721160K291482K901591
$$ 28511711 31171352 33852678 36093234 38145519 39936308 41657468 43948950 46850541
4595D6850541L506618L549035K968849J517140O96481M76290N46434J458341K369595
$$ 46850541 50357159 53906194 56875043 58392183 59088664 59564954 60111388 61569729 63939324
4586F3939324K704508K250350L28520j630452k581683k611898k137502j288471
$$ 63939324 66643832 68894182 69222702 67592250 65010567 62398669 60261167 58972696
4578E8972696m01418k50202j171450k496960l402606l625069l368264k688055
$$ 58972696 58571278 58321076 57149626 54652666 51250060 47624991 44256727 41568672
4570D1568672k034577j766756j755164k205122k768614k606716k595817k465268
$$ 41568672 39534095 37767339 36012175 33807053 31038439 28431723 25835906 23370638
4562B3370638j951753j782905j532633j253451j073488j002260j047632q31469
$$ 23370638 21418885 19635980 18103347 16849896 15776408 14774148 13726516 12895047
4554A2895047p07026o59890n76259o26688n95089m12490m11040k96128l22553
$$ 12895047 12188021 11528131 10951872 10325184 9730095 9317605 8906565 8610437 8287884
4545H287884l42935l07349k68258k59732k40766j85531k61955n3867j98471k03599
$$ 8287884 7944949 7637600 7369342 7109610 6868844 6683313 6421358 6367491 6169020 5965421
4535E965421j87304k22038j78961l01000j42240j29884j30879k62278j57983K339
$$ 5965421 5778117 5556079 5377118 5076118 4933878 4803994 4673115 4410837 4252854 4255193
4525D255193o5o7649j81612k49676j05174J9614j05697L95k9356q8811j4309j44086
$$ 4255193 4255128 4187479 4005867 3756191 3651017 3670631 3564934 3565329 3535973 3447162 3432853 3288767
4513C288767j12213j4889k24278j29740q2179J08767p116o1996j04281j50640
$$ 3288767 3176554 3161665 2937387 2807647 2725468 2834235 2827119 2765123 2660842 2510202
4503B510202q3543O113K4488o7327p62j6710p5569m8432q7287j36723M0649o5584
$$ 2510202 2426659 2432772 2457260 2389933 2389171 2372461 2296892 2248460 2161173 2024450 2065099 1999515
4491A999515m7046N928j17767q252P565M8671j80717o7334N1829j963o2399o9910
$$ 1999515 1952469 1958397 1840630 1832378 1839943 1888614 1707897 1640563 1692392 1690429 1628030 1558120
4479A558120o1769j961j07783J0029j24730p3873J80020J3992j26846k4365l8275
$$ 1558120 1496351 1494390 1386607 1396636 1271906 1198033 1378053 1392045 1265199 1240834 1202559
4468A202559J05987k0234j54826j9290M2805m5373j32728L457O5538p9711m3330
$$ 1202559 1308546 1288312 1133486 1114196 1157001 1111628 978900 982357 1047895 968184 924854
4457I24854r4592L3303o0815J7712J00298j39289Q465Q236J0367P3866o4919j45501
$$ 924854 830262 863565 802750 820462 920760 781471 789936 798172 808539 882405 817486 671985
4445F71985M0667m3525M2493m785M4394q0054M7851k7817j8579J28472n264o6846
$$ 671985 712652 669127 711620 706835 751229 671175 719026 691209 672630 801102 795838 728992
4433G28992o0483n6301P0608M8125q2922r1450m6662L9719J54749j60969q5072
$$ 728992 668509 612208 682816 730941 648019 556569 509907 549626 704375 543406 458334
4422D58334J61061o2099Q096J04104L923K0262n2765l8152l0062J6548j3029j6989
$$ 458334 619395 557296 565392 669496 673419 693681 640916 602764 572702 589250 576221 559232
4410E59232K104Q2450Q3252o710M2875m8511K9904P8042M9373J09345o518n3646
$$ 559232 561336 643786 727038 720328 763203 714692 744596 822638 872011 981356 974838 921192
4398I21192L7985M6124n4402k18513j98508L1027k3911l4384k067J02012j25137
$$ 921192 959177 1005301 950899 732386 533878 564905 540994 506610 504543 606555 481418
4387D81418k1138K8724j8858P8002J31171j4694m0313j05752m8873L921q6370
$$ 481418 460280 489004 470146 548148 679319 664625 624312 518560 469687 473608 387238
4376C87238j11438N659R1897j4078J4673Q4628n526j91063L0342J40368m5147
$$ 387238 275800 281459 373356 359278 373951 458579 453053 261990 292332 432700 387553
4365C87553o1197J2048l935k1141L3242J7657j14261R2347n7877P9007M7102L1679
$$ 387553 326356 338404 334469 313328 346570 364227 249966 342313 284436 363443 410545 442224
4353D42224L8655p2266j22481p0254o4931M9062J04571j00952N3739q332O7115
$$ 442224 480879 408613 286132 215878 150947 200009 304580 203628 257367 249035 316150
4342C16150K1923j21589o273l1729M5093J2424L5318N2250M933N8423m6425o0219
$$ 316150 338073 216484 210211 178482 223575 235999 271317 323567 328500 386923 340498 280279
4330B80279K9808j5366J9735l8129k2665L4626n4960M119R2658Q193j57601N5924
$$ 280279 310087 294721 314456 276327 253662 288288 233328 237447 330105 338298 180697 236621
4318B36621Q4077j46537J60388P4070p5598n2662J2157m1374K8580J9721o9381
$$ 236621 320698 174161 334549 408619 333021 280359 292516 251142 279722 299443 230062
4307B30062R235L7901L5281r8323o0135J2143Q1444J02662l4953r5485n5311J1669
$$ 230062 239297 277198 312479 214156 154021 166164 247608 350270 315317 219832 164521 176190
4295A76190l589P7636N9887o912R2118m795M0707l696M1628k7418K9616l6621
$$ 176190 172601 250237 310124 303212 395330 390535 431242 427546 469174 441756 471372 434751
4283D34751p7647R3125O2561L409n1863K9618K2200j27444j4829J01384J05082
$$ 434751 357104 450229 512790 516199 464336 493954 516154 388710 373881 475265 580347
4272E80347J14151n3942o5331p1532j08524k8848m7157K4367N0486l9179N9751
$$ 580347 694498 640556 575225 503693 395169 366321 319164 343531 394017 354838 414589
4261D14589M7662R2853k63133k2807R7634J22610M7594N5140k4191k27147m9487
$$ 414589 462251 555104 291971 269164 366798 489408 537002 592142 567951 340804 291317
4250B91317N216k1727p0842Q0736j06440m0553J50660o6868q3114P9213O4590
$$ 291317 296533 274806 203964 284700 178260 137707 288367 221499 138385 217598 282188
4239B82188J2210o4766m0108j3073J39410l27j79253M5958J34188L6199n1315
$$ 282188 294398 229632 189524 176451 315861 315534 136281 182239 316427 352626 301311
4228C01311N423k5113n9191L7341M1926N1135k7103J4738O6937p2197n6975j34218
$$ 301311 306734 281621 222430 259771 301697 352832 325729 340467 407404 335207 278232 144014
4216A44014K43079J3126L8234K44269j08022j3099L3154J89574J28117P6252J25855
$$ 144014 387093 400219 438453 682722 574700 561601 594755 784329 912446 988698 1114553
4205A114553J52842R1289k43558k82793m5745N3560j14577j30507j01298p4916
$$ 1114553 1267395 1358684 1115126 832333 786588 840148 725571 595064 493766 418850
4195D18850o257p0282l8828n3679J12748Q289j01270L0197n2245J8627k4997o4950
$$ 418850 412593 342311 303483 249804 362552 370841 269571 299768 247523 266150 241153 176203
4183A76203J01860j08179P771n6892N8418Q5278o3989o7555n9950K1618Q0613
$$ 176203 278063 169884 177655 120763 179181 264459 200470 132915 72965 94583 175196
4172A75196p173J9116M7209J23892j98073o689l6849p166M9772l0016o0094q2307
$$ 175196 168023 187139 234348 358240 160167 153478 116629 109463 159235 129219 69125 -13182
4160a3182O9263O1978o2009K3140J00236M718q6486J3495M9098o7361Q3533j5075
$$ -13182 56081 118059 56050 79190 179426 184144 97658 111153 160251 92890 176423 161348
4148A61348o6896r756k0605J693n4396O4738O5060o7630k5485n8600N5050J24743
$$ 161348 94452 84696 64091 65784 11388 76126 141186 73556 48071 -10529 44521 169264
4136A69264J39886r6742L0705n6595j05550O423Q8339l4335j08604P5031R0134
$$ 169264 309150 212408 243113 186518 80968 87391 175730 141395 32791 107822 197956
4125A97956k8357m0851m2293r5780q31J21106j32870J51440j11554K1682k543
$$ 197956 169599 128748 86455 -9325 -10156 110950 -21920 129520 17966 39648 37105
4114C7105q6762n1407m0282R5812q386M4980q647j8621l8012J27788J43378l0937
$$ 37105 -49657 -101064 -141346 -45534 -53920 -8940 -17587 -36208 -74220 53568 196946 166009
4102A66009L4867o8482p110m1489j67371K08494Q2747j3621p2170k4563p4405
$$ 166009 200876 132394 125284 83795 -83576 124918 207665 194044 121874 97311 22906
4091B2906J77421j35622j01342K54081K7612j41887P8714o1694O9350L8041j31471
$$ 22906 200327 64705 -36637 217444 245056 103169 181883 120189 189539 227580 96109
4080I6109r0814J10307K8253J03082n9168q569o3624r4185J41281L9951o4787
$$ 96109 5295 115602 143855 246937 187769 179200 115576 21391 162672 202623 137836
4069A37836k02167J11176n429K0063m956j33359K3556L49936N1512j03481j48636
$$ 137836 -64331 46845 41416 61479 56523 -76836 -53280 296656 348168 244687 96051
4058I6051o927N941r7737o1776N1292L847M7744M6355L5554K4635o6069j6417
$$ 96051 89124 95065 -2672 -64448 -13156 -9309 38435 84790 120344 144979 78910 62493
4046F2493o9658J01246J0459r6000P8937j4758R9284K3251n1467j08834q784m235
$$ 62493 -7165 94081 104540 8540 87477 72719 172003 195254 143787 34953 26169 21934
4034B1934n351M9927J05219o6708j20931k5390J26634N0782p1253l3384J0846
$$ 21934 16583 66510 171729 105021 -15910 -41300 85334 136116 64863 31479 42325
4023D2325N9331n8744K6688N9926J383J9636q5847J07337j4709n9551o6650k2408
$$ 42325 101656 42912 69600 129526 130909 150545 64698 172035 157326 97775 31125 8717
4011H717O1611M6037j7225p284k9080m3769m2524J2213O8102r4422O1207J00907
$$ 8717 70328 116365 99140 91856 62776 19007 -23517 -11304 56798 -37624 23583 124490
3999A24490L9257m4887R785m3765m7751J0798L5112J417J45009j66292L5042n9054
$$ 124490 163747 118860 128645 84880 37129 47927 83039 84456 229465 63173 98215 39161
3987C9161q5869P9831K0578K6109r6954J42830k3158j55253R5321J42115p6989
$$ 39161 -46708 33123 53701 79810 -17144 125686 102528 -52725 42596 184711 107722
3976A07722o2993R5916q1545M8255O6094q7839L9193q086o9223J9339K7769o418
$$ 107722 44729 140645 59100 107355 173449 85610 124803 116717 47494 66833 94602 88184
3964H8184J26699P5089p2960l2936n6193P1598n1756J23546l9712j36629N4550
$$ 88184 214883 289972 217012 184076 127883 199481 147725 271271 231559 94930 149480
3953A49480j3091o0983K7961M9537M8345p0371m8294J8648O2871r5960m3546J09874
$$ 149480 136389 75406 103367 152904 201249 130878 82584 101232 164103 68143 24597 134471
3941A34471N8203j3813J47511r7076j22467K6932r77p858j08451J44018q1114
$$ 134471 192674 178861 326372 229296 106829 133761 132784 124926 16475 160493 79379
3930G9379Q705p7697K3432p6904M5537J55334n1134N9764m9876j01503l1314N0185
$$ 79379 88084 10387 33819 -43085 2452 157786 106652 166416 116540 15037 -16277 33908
3918C3908M5006j01190L6283M8220J5354p2474R1004k6060J01560J67945j60078
$$ 33908 78914 -22276 14007 62227 77581 5107 96111 70051 171611 339556 179478
3907A79478o5482J0075J75242o3546j4023O0599M0366j76335o9466m6819P4874
$$ 179478 113996 124071 299313 235767 221744 282343 322709 146374 76908 30089 104963
3896A04963K9195J13909o9665r0564j0009O6922o273n3755J76471p3867O4191
$$ 104963 134158 248067 178402 87838 77829 144751 138478 84723 261194 187327 251518
3885B51518p7872j1641j2335L6566l3048n0637J7835m0814O4659J25802m0414
$$ 251518 173646 162005 149670 186236 153188 102551 120386 79572 144231 270033 229619
3874B29619K1772q640l0386L0362n2921o870Q0822j3348O5677j778N1663p7163
$$ 229619 251391 242751 212365 242727 189806 182936 263758 250410 316087 314309 365972 288809
3862B88809j36154m76J7912n377j70673J31454Q0251k4896R8530m1905R3388N6718
$$ 288809 152655 152179 170091 164714 -5959 125495 205746 180850 279380 237475 330863 387581
3850C87581q4912r5192R6216j8573k10938J45146N1532j3772j00088P555J7421
$$ 387581 302669 207477 303693 285120 74182 219328 270860 257088 157000 164555 181976
3839A81976J9119o2180N4645N7620R9757J08078j2587R282j23037j2810r6601
$$ 181976 201095 138915 193560 251180 350937 459015 446428 455710 332673 319863 223262
3828B23262J8129k3081l0315l0498O3528k8159L2028L2370j6853j4802j03002
$$ 223262 241391 218310 187995 157497 221025 192866 224894 257264 240411 225609 122607
3817A22607o2648J63971m823J5603O6546l7695Q749M9106L7298K9561j83705j6166
$$ 122607 59959 223930 219107 234710 301256 263561 272310 321416 358714 388275 204570 188404
3805A88404p7710K8338O8621j9021K6482m7999J4236l6043O180o807J90351j16559
$$ 188404 110694 139032 207653 188632 215114 167115 181351 145308 151488 144681 335032 218473
3793B18473j02632j2727J09817M7128r4705Q4350J7424J35690q8731j33068J14138
$$ 218473 115841 103114 212931 260059 165354 249704 267128 402818 314087 181019 295157
3782B95157m7962K648q1290M2622Q4085m3759j5537q4058K3414J30823L3332n9185
$$ 295157 247195 249843 168553 211175 295260 251501 235964 151906 175320 306143 339475 280290
3770B80290Q7533l3208p4133P8547j4089n095J3226R4075j35904N7140j29784
$$ 280290 367823 334615 260482 339029 324940 319845 333071 427146 291242 348382 218598
3759B18598n7341M8575J51476m8744n4137J590l6891Q2311J5159r2002l3164M2407
$$ 218598 161257 209832 361308 312564 258427 260017 223126 305437 320596 228594 195430 237837
3747B37837n0532Q5745J9880M6212L2536l1545m0256N9304j40509N2087O9747
$$ 237837 187305 273050 292930 339142 371678 340133 299877 359181 218672 270759 340506
3736C40506K2718Q5739p3378k6695p0287J2310P7412L2162q598j11344N7106m4583
$$ 340506 363224 448963 375585 348890 278603 290913 368325 400487 391889 280545 337651 293068
3724B93068M4523K1248l7768J7906j23935j5822J80514j26325j34428J26937Q7059
$$ 293068 337591 358839 321071 338977 215042 199220 379734 253409 118981 245918 332977
3713C32977R6934J1628r2419o2960o2330J04221K7419l2523N6686m3752p03L1073
$$ 332977 429911 441539 349120 286160 223830 328051 355470 322947 379633 335881 335178 366251
3701C66251Q3460K501l3611J2283K9197J33142j15078n7551j91833m6248K02962
$$ 366251 449711 452212 418601 430884 460081 593223 478145 420594 228761 182513 385475
3690C85475K0632R502p171K1199J8606N6081m2434M1367l2605o9332K4575j13646
$$ 385475 406107 415609 408438 429637 448243 504324 461890 503257 470652 401320 425895 312249
3678C12249j3047Q0811R5144q1881j00164M2327j10568J68695K3212J15795p8985
$$ 312249 299202 380013 475157 393276 293112 335439 224871 393566 416778 532573 453588
3667D53588o1295K1816O1992J6361o306p6298q642L7222o620L0510p9991k220
$$ 453588 392293 414109 476101 492462 486156 409858 401216 438438 431818 462328 382337 380117
3655C80117l7665J2163J05924Q5632K4086o7202j7834j0707k9009j02729L1546
$$ 380117 342452 354615 460539 546171 570257 503055 485221 474514 445505 342776 374322
3644C74322J34298K1743j20851k4538n1403O4802k6688P5114l6025p4288k0004
$$ 374322 508620 530363 409512 384974 333571 398373 371685 446799 410774 336486 316482
3633C16482o7434J27635M4812N6841j22434J25622O5928j37129l4977O2982N7573
$$ 316482 249048 376683 421495 478336 355902 481524 547452 410323 375346 438328 495901
3622D95901N1129j7158p4902o308L7399K6016J10909j20306K3250K4750j9325
$$ 495901 547030 529872 454970 448662 486061 512077 622986 502680 525930 550680 531355
3611E31355r8119P5102P9842o109l8654j25041P3588R6738j8246R5341j0842r1625
$$ 531355 433236 508338 588180 582071 543417 418376 491964 588702 570456 665797 654955 563330
3599E63330m6533N303o9449R9896L2926k1146o2847m3801K0680J04216P5616r4968
$$ 563330 516797 522100 452651 552547 585473 564327 501480 457679 478359 582575 658191 563223
3587E63223p2482Q2050j55719J29786L7073j22209N1392K2807M5647k5657l9722
$$ 563223 490741 572791 417072 546858 583931 461722 513114 535921 581568 555911 516189
3576E16189M2658K1609n7142m9220P204P9465k1605J22754L911k19794l2979m2765
$$ 516189 558847 580456 523314 474094 481298 560763 539158 661912 665823 446029 413050 370285
3564C70285J17461J44846J30371O2430n5635M2610j82356j5009m2966m7581o132
$$ 370285 487746 632592 762963 825393 769758 812368 630012 615003 572037 524456 518324
3553E18324P9486j64091L8428J11773P9845J6861l230m310K9942n0953j13608
$$ 518324 597810 433719 472147 583920 663765 680626 677396 673086 703028 652075 538467
3542E38467O3539p6367Q2182P64m3382p6180l1334P7452o5374M8565N4763K9002
$$ 538467 602006 525639 607821 608585 565203 489023 457689 535141 469767 518332 573095 602097
3530F02097K40099j17099j52240K2161O9061K3916r6645P1962J11473j725J23385
$$ 602097 842196 725097 572857 595018 664079 687995 591350 663312 774785 773060 896445
3519H96445j2267j31542q0461M3565l4628k498K01014r9938l6781j5866J08128
$$ 896445 884178 752636 672175 715740 681112 678614 879628 779690 742909 727043 835171
3508H35171o553R43p3058J40671M5301q1817j473l6130K8720M2943N3875K5016
$$ 835171 828618 829561 756503 897174 942475 860658 859185 823055 851775 894718 948593 973609
3496I73609q5386k8044J32113K1827p6949J13339r9330J12437M0610l6889r3422
$$ 973609 888223 860179 992292 1014119 937170 1050509 951179 1063616 1104226 1067337 973915
3485I73915J04328Q2190n8439Q313q1667l4777j9565Q0039j03415J0168J39165
$$ 973915 1078243 1160433 1101994 1110307 1028640 993863 974298 1054337 950922 961090 1100255
3474A100255k3618R1988k1620M106J68025K8465j01357m0020J64252Q505l6262
$$ 1100255 1076637 1168625 1147005 1151111 1319136 1347601 1246244 1206224 1370476 1378981 1342719
3463A342719j34122J40437K3017r7895K19772j11627j22014O8384k3503j4363
$$ 1342719 1208597 1349034 1372051 1274156 1493928 1382301 1260287 1328671 1305168 1290805
3453A290805K8557j1968L6029o6771P9813N0893J03206P2910j37711J01265J44206
$$ 1290805 1319362 1307394 1343423 1276652 1356465 1407358 1510564 1583474 1445763 1547028 1691234
3442A691234R415p2580J24086K8578l283O490P0865l200K8060q9599J50738J8893
$$ 1691234 1700649 1628069 1752155 1780733 1777450 1783940 1854805 1851605 1879665 1790066 1940804 1959697
3430A959697J05679M4686K9765J05760o3448J2650J1823J18437Q84n3960J40984
$$ 1959697 2065376 2110062 2139827 2245587 2182139 2194789 2206612 2325049 2325933 2271973 2412957
3419B412957O4070O840O5194K6048J80633N4726l9909P2976p8782O8816O6130
$$ 2412957 2477027 2483867 2549061 2575109 2755742 2810468 2770559 2843535 2764753 2833569 2899699
3408B899699k9291N2449n7823j82440n8708Q5674o1695m8736O7381j70995o0143
$$ 2899699 2870408 2922857 2865034 2682594 2623886 2709560 2647865 2599129 2666510 2495515 2435372
3397B435372j0716k5359k3569J59147j43476p507R1347k3563L6585k3634Q1219
$$ 2435372 2424656 2399297 2375728 2534875 2391399 2383892 2475239 2451676 2488261 2464627 2545846
3386B545846K0253k6688j14733R4878K2236J4017m3823N5018R467p4942O0825
$$ 2545846 2566099 2539411 2424678 2519556 2541792 2555809 2511986 2567004 2576471 2501529 2562354
3375B562354l4619R6059r3830j82202J23633R0688j79047p9870J18172j51996
$$ 2562354 2527735 2623794 2529964 2347762 2471395 2562083 2383036 2303166 2421338 2269342
3365B269342J03873J306o4j00657L31N4442o5905j77073q6500Q0387J0640P9453
$$ 2269342 2373215 2374521 2374457 2273800 2274131 2328573 2262668 2085595 1999095 2079482 2090122 2169575
3353B169575J9345J43797j2057J0854p534q3923N956J6245n6800K5262p9262Q9166
$$ 2169575 2188920 2332717 2320660 2331514 2323980 2240057 2246013 2262258 2205458 2230720 2151458 2240624
3341B240624Q4212p6900l3968j00853m4194O5980m3627j05896J0049j49979l9363
$$ 2240624 2324836 2247936 2213968 2113115 2068921 2134901 2091274 1985378 1995427 1845448 1806085
3330A806085n4980K4002J26663K1802q3402L3769j2179j20745o5825J7793o0187
$$ 1806085 1751105 1775107 1901770 1923572 1840170 1873939 1861760 1741015 1675190 1692983 1632796
3319A632796o6165n2842o3492Q7532J76503k5319j31729J59625O1429N1175J66458
$$ 1632796 1566631 1513789 1450297 1537829 1714332 1689013 1557284 1716909 1778338 1829513 1995971
3308A995971R7222J0266j46475l3983k1085r2668p8823r0507O83r9907m7932o4943
$$ 1995971 2093193 2103459 1956984 1923001 1901916 1809248 1730425 1639918 1640601 1540694 1492762 1427819
3296A427819L7625M8973j74950n8476J676M5758M3984N3616k0070j6013j37018
$$ 1427819 1465444 1514417 1339467 1280991 1282667 1328425 1372409 1426025 1405955 1389942 1252924
3285A252924k1894K6724J0342J18673j15502Q2399j2251N7248O5187L8551k2865
$$ 1252924 1231030 1257754 1268096 1386769 1271267 1353666 1341415 1398663 1463850 1502401 1479536
3274A479536j95025R4686o1112r7960j0964O4273q2508M7971l2979j9707j0433
$$ 1479536 1284511 1379197 1318085 1220125 1209161 1273434 1190926 1238897 1205918 1186211 1175778
3263A175778r4303M3266l4563j00021L4261J47150o4449p3379o4687k1650N9715
$$ 1175778 1081475 1124741 1090178 990157 1024418 1171568 1107119 1033740 969053 947403 1007118
3252A007118k0543q6110J26932J62103j15479r6875j7288o4341M0065M7589j35342
$$ 1007118 986575 900465 1027397 1189500 1074021 977146 959858 895517 935582 983171 847829
3241H47829o0330O1849N2012M0994n6148J38763j16208q4760K1309L617J5105
$$ 847829 787499 849348 901360 942354 886206 1024969 908761 824001 845310 848927 864032
3230H64032J38563p9824j24432R1196l0364M0016j05l0430q1887J4002p1537P0371
$$ 864032 1002595 922771 798339 889535 859171 899187 899082 868652 786765 800767 729230 799601
3218G99601M9977O4658k3989p5651r7083R7258M581j23442k9783J20649J67908
$$ 799601 849578 914236 890247 814596 717513 814771 819352 695910 666127 786776 954684
3207I54684r4706J552k8326p932m367K2526j72988K4126L5819j09542l1761P4772
$$ 954684 859978 861530 833204 825272 820905 843431 670443 694569 730388 620846 589085 663857
3195F63857j6353K9980j7730O4132l265R831O388j35990J56799P4295r486j64236
$$ 663857 647504 677484 659754 723886 720621 730452 736840 600850 757649 831944 822458 658222
3183F58222O6620J0190j1520M6598k5901q6877l1998p4464J5089J16325J18679
$$ 658222 724842 735032 723512 770110 744209 657332 625334 550870 565959 682284 800963
3172H00963J7671N0508M8572j17447q232j10853j02433K19959L6896L1135O4385
$$ 800963 818634 869142 917714 800267 792035 681182 578749 798708 835604 866739 931124
3161I31124j94796j7676J24354M2319j53272q5742o7816J00015J10807o4764j16729
$$ 931124 736328 718652 843006 885325 732053 646311 578495 678510 789317 724553 607824
3150F07824O5952L5689R417J6104M638J3503n4343M4049l840q4639J22080L2195
$$ 607824 673776 709465 718882 734986 739624 753127 698784 742833 738993 654354 776434 808629
3138H08629o7323J24308J7209J10974K9786r1021j98434n8775J23828j1211P6005
$$ 808629 741306 865614 882823 993797 1023583 932562 734128 675353 799181 787970 863975
3127H63975o3010P5220r8240M4192j3581m6302Q8159o6179J1427R1911k5907N0864
$$ 863975 800965 876185 777945 822137 808556 762254 850413 784234 795661 887572 861665 912529
3115I12529K3112J5963J09590l9105O9124l1461p8803r0678M1374J46163N6453
$$ 912529 935641 951604 1061194 1022089 1091213 1059752 980949 890271 931645 1077808 1134261
3104A134261J5964k6211L9466n7982P7195K583p520Q107R414r0389J19760p8326
$$ 1134261 1150225 1124014 1163480 1105498 1182693 1185276 1177756 1185863 1195277 1104888 1224648 1146322
3092A146322L0366J20709l6469P6136o3888k1285K559M758l8701J15657J97957
$$ 1146322 1176688 1297397 1260928 1337064 1273176 1251891 1254450 1259208 1220507 1336164 1534121
3081A534121L4972j85689J07128R1705k5240j6315j03925j59260K9512N1390o8048
$$ 1534121 1569093 1383404 1490532 1582237 1556997 1540682 1436757 1277497 1307009 1358399 1290351
3070A290351k9173k1123o6306J99522J91213j62745j76714J17354O1187m6197
$$ 1290351 1261178 1240055 1173749 1373271 1564484 1401739 1225025 1342379 1403566 1357369
3060A357369K4498r317k3395J20616P6301j30294J2688J03115k0705M490m6585
$$ 1357369 1381867 1372550 1349155 1469771 1546072 1415778 1428466 1531581 1510876 1515366 1468781
3049A468781L2430o0223M093k031K8723j7376l1654O03M7809j13682r1598J23758
$$ 1468781 1501211 1440988 1445081 1443050 1471773 1454397 1422743 1423346 1471155 1357473 1265875 1389633
3037A389633m3012j09687O4203R9196N2357p7193N6313k0632m9121o0190J66946
$$ 1389633 1346621 1236934 1301137 1400333 1452690 1375497 1431810 1411178 1362057 1301867 1468813
3026A468813q8726p355K0178Q4076K2216k97542n4317o054P3561k2507R076N6607
$$ 1468813 1380087 1372732 1392910 1476986 1499202 1201660 1147343 1141289 1214850 1192343 1201419 1258026
3014A258026L6968p2129m3943L6984j46915J25381K6082p7244J02926q741n6522
$$ 1258026 1294994 1222865 1178922 1215906 1068991 1194372 1220454 1143210 1246136 1237395 1180873
3003A180873j7995R5933j08051j05996o0357K09794J29898n0168j6166O5237j88178
$$ 1180873 1162878 1258811 1150760 1044764 984407 1194201 1324099 1273931 1257765 1323002 1134824
2992A134824p7213j1811O1525j04693o7342O8140M1945o3471j01826J6629p8956
$$ 1134824 1057611 1045800 1107325 1002632 935290 1003430 1045375 981904 880078 896707 817751
2981H17751J54307k5301o1651p1928M0915R6626l6648L7359K8952O376r3330j3962
$$ 817751 972058 946757 885106 813178 854093 950719 914071 951430 980382 986758 893428 879466
2969H79466L8501N7506k66780m2483j88938q729J18486N8141J04104K8102k0576
$$ 879466 917967 975473 708693 666210 477272 468543 587029 645170 749274 777376 756800
2958G56800k2255o0071n2218J6012L8367m2244q6908N7531J0317o1018J1521r951
$$ 756800 734545 674474 622256 638268 676635 634391 547483 605014 615331 554313 565834 555883
2946E55883J6168K7989K9828o0942q7743k421P3887m8510k4397J7688O8286R7632
$$ 555883 572051 600040 629868 568926 481183 478762 552649 504139 479742 497430 565716 663348
2934F63348j32389K8085j18739P3735l5788L5185P8052q4059j5271l2819k5343
$$ 663348 530959 559044 440305 514040 478252 513437 591489 507430 492159 459340 433997
2923D33997N4792k8598L368n0859j3028O1104j21898R7334k3844K1119j30527
$$ 433997 488789 460191 463559 412700 399672 460776 338878 436212 412368 433487 302960
2912C02960J7630M2552N038k213p987Q8314l4570j71148N7626R5506J2940m4860
$$ 302960 320590 363142 368180 365967 357980 446294 411724 240576 298202 393708 406648 361788
2900C61788J15925J1536j10802N3977n0919N8874L2371k3106j00333l5803M1550
$$ 361788 477713 489249 378447 432424 381505 440379 472750 449644 349311 313508 355058
2889C55058L5568j86425O749Q8724P0822q3352k3572L2818O8509q9701M9924N9922
$$ 355058 390626 204201 210950 299674 370496 287144 263572 296390 364899 275198 325122 385044
2877C85044p9508M557J8848m5451r981o5782J78439j1653k1980M6927r7409l5810
$$ 385044 305536 310093 328941 283490 273509 207727 386166 374513 352533 399460 302051 266241
2865B66241K3988j17330p5055J27728J14807P5601o002o8067n3450j9163J6333
$$ 266241 290229 172899 97844 225572 340379 415980 409978 341911 288461 269298 285631
2854B85631j5634L1670J02856j20175o0065o5498j15069Q4922K2894O9201k875
$$ 285631 269997 301667 404523 284348 224283 158785 43716 128638 151532 220733 217858
2843B17858L0808J7990M0313l1549j17621L1934l0734n4482j25590J25775J23984
$$ 217858 248666 266656 306969 275420 157799 189733 158999 104517 -21073 104702 228686
2832B28686J9776J9161J69713j18332j77236j21518K2198J22386k8633J42286
$$ 228686 248462 267623 437336 319004 141768 20250 42448 164834 136201 278487
2822B78487J5500j1048m3667j36848J28994j01117l6124l4180p9286K0444J04001
$$ 278487 293987 282939 239272 102424 231418 130301 94177 59997 -19289 1155 105156
2811A05156J36970o6870m7502J37526j45213j32006J49274j12703M4347K6p0083
$$ 105156 242126 175256 127754 265280 120067 -11939 137335 24632 68979 69005 -1078
2800a078O1182R0066l4348L8451L7918J646j2676m2432n8566k4854L5598l0130
$$ -1078 60104 150170 115822 154273 192191 193837 181161 138729 80163 55309 90907 60777
2788F0777K7517m9122p2019L5102J32787l331J5704J8878k7401K0648J3246j17856
$$ 60777 88294 39172 -32847 2255 135042 131711 147415 166293 138892 159540 172786 54930
2776E4930k3528O4155J3099Q5489P368j2420j9846k1837l557K7249p34j71451
$$ 54930 31402 95557 108656 194145 201513 189093 169247 147410 143853 171102 170368 -1083
2764a083J71140m7577m6868O5435L3894o124m9613M0224k0767P3230j2358m4295
$$ -1083 170057 122480 75612 141047 174941 168817 119204 159428 138661 211891 199533 155238
2752A55238o1198j3739o628j1024j10969k3703J60179N6407o3220l6760n1321
$$ 155238 94040 80301 73673 62649 -48320 -72023 88156 144563 81343 44583 -6738
2741f738J41360N8397j03619P209J50931r5432q7006J19626p4817p9754K0458
$$ -6738 134622 193019 89400 96609 247540 152108 65102 184728 109911 30157 50615
2730E0615N5036J2610l2830p1229J11537O0155l4392m5351m0573J4175o9489L7577
$$ 50615 105651 118261 85431 14202 125739 185894 151502 106151 65578 79753 10264 47841
2718D7841K3364r055J1457M637P3297m3496q339n5835j00135k8897N3331J17371
$$ 47841 71205 62150 73607 78244 151541 108045 99706 43871 -56264 -85161 -31830 85541
2706H5541J0830j47267k9348j7184M5407k242l4116Q5940O5247m6246P6580l0291
$$ 85541 96371 -50896 -80244 -97428 -52021 -54263 -88379 -2439 62808 16562 93142 62851
2694F2851n995L6659R19M0362l1444K693q387n8821p8463J39783k4325j28192
$$ 62851 56856 93515 94434 134796 103352 106045 97658 38837 -39626 100157 75832 -52360
2682e2360L8238r6441K8707Q9595l1160K7238N987K9930n5749L1511L6814K6802
$$ -52360 -14122 -110563 -81856 7739 -23421 3817 9804 39734 -16015 15496 52310 79112
2670G9112j23836O3793R2000M7273n0989o7756j2052m4391P0303P6846j12225
$$ 79112 -44724 19069 111069 158342 107353 39597 27545 -16846 53457 130303 18078
2659A8078L5874J09866j66674J1879K5592L6635K3047p9884R1636r6913l728Q4614
$$ 18078 53952 163818 -2856 9023 34615 71250 94297 14413 106049 9136 5408 90022
2647I0022L2145j8897l6428k9774j8989M8361k0159j50116P9729J7326Q9541R1191
$$ 90022 122167 103270 66842 37068 18079 66440 46281 -103835 -24106 -6780 82761 173952
2635A73952r9044j08221M8976P4477m6902J02637n0400j59082J5536j0613J49957
$$ 173952 74908 -33313 15663 90140 43238 145875 95475 -63607 -48071 -58684 91273
2624I1273n6042o251K3730K7994r1548l7280l0287J13928J49520j50421k8339
$$ 91273 35231 28980 52710 80704 -10844 -48124 -78411 35517 185037 34616 6277
2613F277l3517L4153p790j71M1289J64111r5041n4894j64798N4008j6671J17672
$$ 6277 -27240 6913 -877 -1048 40241 204352 109311 54417 -110381 -56373 -73044 44628
2601D4628j5927p2605j8108K6117l9328J55604p8059m8516k3515p9355J66971
$$ 44628 28701 -43904 -62012 -35895 -75223 80381 2322 -46194 -69709 -149064 17907
2590A7907r3370M812Q4104j65054J06017m0632j1605L1086o5812J38460m3339
$$ 17907 -75463 -70651 13453 -151601 -45584 -86216 -97821 -66735 -132547 5913 -37426
2579c7426m2618J9543O6357l036J2405j34236J33423O4369J1032j05448L8779
$$ -37426 -80044 -60501 5856 2820 15225 -119011 14412 78781 89813 -15635 23144
2568B3144M8333j33013M4044q3985K8785j056L3331M0807J12126L6545r2971J14406
$$ 23144 71477 -61536 -17492 -101477 -72692 -73748 -40417 390 112516 149061 56090 170496
2556A70496j18428k2254k8652o9986M7631J46O1299n8785k616m7175J8248N6612
$$ 170496 52068 29814 1162 -68824 -21193 -21047 40252 -18533 -21149 -68324 -50076 6536
2544F536n6018J47238j9568j01711J174J78577L1973p002j28801r8330J34077
$$ 6536 -49482 97756 78188 -23523 -22349 156228 188201 181199 52398 -45932 88145
2533H8145N6208N0611j63639n8613m869J3709K4063o5057R2435O9176o1263l4639
$$ 88145 144353 194964 31325 -27288 -32157 -18448 5615 -59442 32993 102169 40906 6267
2521F267r7354Q9185Q5259m1899k9319j38807J7004P6560m0783O9457K2373J0712
$$ 6267 -91087 -1902 83357 41458 12139 -126668 -109664 -33104 -73887 -4430 17943 28655
2509B8655J22082j16843M5313l6075K9344m4277j19076p7577N0712j0146p4111
$$ 28655 150737 33894 79207 43132 72476 28199 -90877 -168454 -117742 -127888 -201999
2498b01999O6917M0601n6328j2755J54750N4291J3088K8085l1384p2915J2594
$$ -201999 -135082 -94481 -150809 -163564 -8814 45477 58565 86650 55266 -17649 -5055
2487e055q0744m846J12785R2310j61641l4427P4607Q8941K0263J31935j23002
$$ -5055 -85799 -90645 22140 114450 -47191 -81618 -7011 81930 102193 234128 111126
2476A11126k09266M8326J05650k5070r9722O9090o1627K3972J67112Q7774o8835
$$ 111126 -98140 -49814 55836 30766 -68956 134 -61493 -37521 129591 217365 148530
2465A48530j41480l4724m5276j0100O0992K8429p0850r57o68r4860j1864n477
$$ 148530 7050 -27674 -72950 -83050 -22058 6371 -64479 -65436 -66104 -160964 -172828 -178305
2453a78305Q3242O617Q6063p892R881k5257J8252n2303m377J14212M6673M4389
$$ -178305 -95063 -88446 -2383 -10275 -394 -25651 -7399 -59702 -64079 50133 96806 141195
2441A41195l9614l5391l5836j20273K5113m4051m7197J03162q0216R10j4441P2339
$$ 141195 101581 66190 30354 -89919 -64806 -108857 -156054 -52892 -133108 -132198 -146639 -74300
2429g4300R0165k0236R73j4539K1044l9872R3831j16787Q6513J33058j11400l4752
$$ -74300 15865 -4371 -3398 -17937 3107 -36765 57066 -59721 26792 159850 48450 13698
2417A3698j8667J18315L1783M5895q2516j03465R1885J30496o9199j11857n4683
$$ 13698 -4969 113346 145129 191024 108508 5043 96928 227424 158225 46368 -8315
2406h315L3130k9709N0163L3802J3555q1097O5240l2003p2994k6791K0238J21755
$$ -8315 24815 -4894 45269 79071 92626 11529 76769 44766 -28228 -55019 -34781 86974
2394H6974Q727m5783m9354k9726N9018R8643m8122o1135k5902o0269J0895P4806
$$ 86974 95701 49918 564 -29162 29856 128499 80377 19242 -6660 -66929 -56034 18772
2382A8772m4049K115O8181J7191o0730M0592l3929k5879r041O8591J33761N1614
$$ 18772 -25277 -23162 45019 62210 1480 42072 8143 -17736 -26777 41814 175575 227189
2370B27189k2103L2870K0540l7317p4513p2003L1052N5708o5392P9787J20272
$$ 227189 205086 237956 258496 221179 146666 74663 105715 161423 96031 175818 296090
2359B96090q0235j47514J07655l0174p1613R0672m5627J63507n7256k03675O1310
$$ 296090 215855 68341 175996 145822 74209 164881 119254 282761 225505 21830 83140
2348H3140J05384J19831q1955l5993K4074j63774Q1044M7103N0093K0442j46934
$$ 83140 188524 308355 226400 190407 214481 50707 131751 178854 228947 249389 102455
2337A02455O8284K14164j04092O5528O4420Q6265j17963j06179Q5636k6780J21582
$$ 102455 170739 384903 280811 346339 410759 497024 379061 272882 358518 331738 453320
2326D53320O7255O4956R3606O6334o6939K5161R1631N8395j9455j3708K02577
$$ 453320 520575 585531 679137 745471 678532 703693 795324 853719 834264 820556 1023133
2315A023133J19533P1258J89980J68687K48331K60472N72019M98266M20230j72139
$$ 1023133 1142666 1213924 1403904 1572591 1820922 2081394 2653413 3151679 3571909 3399770
2305C399770o21921l51499l95439k92994k01522j25184j55738j99721L4235j12445
$$ 3399770 2777849 2426350 2030911 1737917 1536395 1411211 1255473 1055752 1089987 977542
2295I77542j47277m1357j07047o6025j9987M1014j36877j96761n9567K00368j06823
$$ 977542 830265 788908 681861 615836 595849 636863 499986 303225 243658 444026 337203
2284C37203p5528Q3778p6022j8230j05091M6635Q8594q0792o7930l683K4170M982
$$ 337203 261675 345453 269431 251201 146110 192745 281339 200547 132617 128934 153104 158086
2272A58086j04759l2987M6892l7436J06351j4595J1493N4266n4959J07903j21372
$$ 158086 53327 20340 67232 29796 136147 121552 133045 187311 132352 240255 118883
2261A18883J4180M3133j5226P4152j0918m0350J9918N7918K8885k03063j04168
$$ 118883 133063 176196 160970 235122 224204 183854 203772 261690 290575 87512 -16656
2250a6656J05112O984p686J5392M1443j31610M3811N089J209J19734j40642j24515
$$ -16656 88456 95440 87754 103146 144589 12979 56790 61879 63088 182822 42180 -82335
2238h2335J88688j00588P38J0348M1973R4291j28084j33791k543M0067L6680J41286
$$ -82335 106353 5765 6503 16851 58824 153115 25031 -108760 -111303 -71236 -34556 106730
2226A06730j04077m1137p128J3535L6777l4538K0837o5733N954k0408j5434M1385
$$ 106730 2653 -38484 -45612 -32077 4700 -29838 -9001 -74734 -68780 -89188 -104622 -63237
2214f3237n5666l7383N34J09954N7851N6955r6462p6606k6372J29421p2643l0678
$$ -63237 -118903 -156286 -155752 -45798 12053 69008 -27454 -104060 -130432 -1011 -73654 -104332
2202a04332K6828l010K2077j6489m2512n4509K3691p7141M5053Q491N6481J23030
$$ -104332 -77504 -80514 -58437 -74926 -117438 -171947 -148256 -225397 -180344 -171853 -115372 7658
2190G658m97k5986o0359l3914K0462J26452J00988l8023p8645j43170j49J14706
$$ 7658 7161 -18825 -79184 -113098 -92636 33816 134804 96781 18136 -125034 -125183 -10477
$$ [...]
##END NTUPLES=NMR SPECTRUM
##END=
