##TITLE=1H_EC-3312(V-1)
 CDCl3
 8 sc, 
 27.6.2024
##JCAMPDX= 6.0         $$ Bruker NMR JCAMP-DX V2.0
##DATA TYPE= NMR SPECTRUM
##DATA CLASS= NTUPLES
##ORIGIN= UXNMR, Bruker Analytische Messtechnik GmbH
##OWNER= root
$$ XWIN-NMR		Version 3.5
$$ Thu Jun 27 14:08:34 2024 Russian Standard Time (UT+4h)  she@DPX200
##.OBSERVE FREQUENCY= 200.1313
##.OBSERVE NUCLEUS= ^1H
##.ACQUISITION MODE= SIMULTANEOUS
##.ACQUISITION SCHEME= undefined
##.AVERAGES= 8
##.DIGITISER RES= 18
##SPECTROMETER/DATA SYSTEM= spect
##.PULSE SEQUENCE= zg30
##.SOLVENT NAME= CDCl3
##.SHIFT REFERENCE= (INTERNAL, CDCl3, 0, 15.4814)
##AUDIT TRAIL= $$ (NUMBER, WHEN, WHO, WHERE, WHAT)
$$ ##TITLE= Audit trail, XWIN-NMR		Version 3.5
$$ ##JCAMPDX= 5.01
$$ ##ORIGIN= Bruker BioSpin GmbH
$$ ##OWNER= she
$$ F:/spectra/data/she/nmr/H-F/1/pdata/1/auditp.txt
$$ ##AUDIT TRAIL=  $$ (NUMBER, WHEN, WHO, WHERE, WHAT)
(   1,<2024-06-27 14:07:12.95 +0400>,<she>,<DPX200>,
      <created by zg, POWCHK disabled, PULCHK disabled
       configuration hash MD5:
       00 E9 B6 7A A2 85 ED C7 34 08 36 98 17 FE 4E 26
       data hash MD5: 16K
       9F D6 46 16 E9 84 31 01 6D 2C AE A5 A9 AA 6E 79>)
(   2,<2024-06-27 14:07:16.15 +0400>,<she>,<DPX200>,
      <Start of raw data processing
       efp BC_mod = 2 LB = 0.24 FT_mod = 6 PKNL = 1 PHC0 = -25319.29 PHC1 = 12.58748 SI = 16K 
       data hash MD5: 16K
       5A BB 54 B9 7F 20 83 38 0B 8F 18 03 83 00 D3 80>)
(   3,<2024-06-27 14:07:38.25 +0400>,<she>,<DPX200>,
      <pk PHC0 = 3.437589 PHC1 = -3.8 
       data hash MD5: 16K
       64 6E 08 0A 47 84 AE C9 36 CA 4D 74 70 52 0D 32>)
(   4,<2024-06-27 14:07:41.62 +0400>,<she>,<DPX200>,
      <abs ABSG = 5 
       data hash MD5: 16K
       34 F9 B5 7F E5 37 95 2E C7 E8 4E FD F4 C7 AC 26>)
$$ ##END=
$$ 
$$ hash MD5
$$ 0A 9F 54 13 58 14 6D A6 40 91 BF 12 87 91 30 1B
##$RELAX= 
##$RELAX= 
##$RELAX= 
##$RELAX= 
##$RELAX= 
##$RELAX= 
$$ Bruker specific parameters
$$ --------------------------
##$DU= <F:/spectra>
##$EXPNO= 1
##$NAME= <H-F>
##$PROCNO= 1
##$TYPE= <nmr>
##$USER= <she>
##$AMP= (0..31)
100 100 100 100 100 100 100 100 100 100 100 100 100 100 100 100 100 100 
100 100 100 100 100 100 100 100 100 100 100 100 100 100 
##$AQSEQ= 0
##$AQ_mod= 1
##$AUNM= <au_zg>
##$AUTOPOS= <>
##$BF1= 200.13
##$BF2= 200.13
##$BF3= 200.13
##$BF4= 200.13
##$BF5= 200.13
##$BF6= 200.13
##$BF7= 200.13
##$BF8= 200.13
##$BYTORDA= 1
##$CFDGTYP= 0
##$CFRGTYP= 5
##$CHEMSTR= <none>
##$CNST= (0..31)
1 1 145 1 1 1 1 1 1 1 1 1 1 1 1 1 1 1 1 1 1 1 1 1 1 1 1 1 1 1 1 1 
##$CPDPRG= <>
##$CPDPRG1= <>
##$CPDPRG2= <>
##$CPDPRG3= <>
##$CPDPRG4= <mlev>
##$CPDPRG5= <mlev>
##$CPDPRG6= <mlev>
##$CPDPRG7= <mlev>
##$CPDPRG8= <mlev>
##$CPDPRGB= <>
##$CPDPRGT= <>
##$D= (0..31)
0 1.2 0 0 0 0 0 0 0 0.06 0 0.03 0 0 0 0 0.0002 0 0 0 0 0 0 0 0 0 0 0 0 
0 0 0 
##$DATE= 1719482832
##$DBL= (0..7)
120 120 120 120 120 120 120 120 
##$DBP= (0..7)
150 150 150 150 150 150 150 150 
##$DBP07= 0
##$DBPNAM0= <>
##$DBPNAM1= <>
##$DBPNAM2= <>
##$DBPNAM3= <>
##$DBPNAM4= <>
$$ [...]
##$SUBNAM3= <"">
##$SUBNAM4= <"">
##$SUBNAM5= <"">
##$SUBNAM6= <"">
##$SUBNAM7= <"">
##$SUBNAM8= <"">
##$SUBNAM9= <"">
##$SW= 18.0517328524113
##$SWIBOX= (0..15)
0 0 2 0 0 0 0 0 0 0 0 0 0 0 0 0 
##$SW_h= 3612.71676300578
##$TD= 16384
##$TD0= 1
##$TE= 0
##$TE2= 300
##$TE3= 300
##$TEG= 300
##$TL= (0..7)
0 120 120 120 120 120 120 120 
##$TP= (0..7)
150 150 150 150 150 150 150 150 
##$TP07= 0
##$TPNAME0= <>
##$TPNAME1= <>
##$TPNAME2= <>
##$TPNAME3= <>
##$TPNAME4= <>
##$TPNAME5= <>
##$TPNAME6= <>
##$TPNAME7= <>
##$TPOAL= (0..7)
0.5 0.5 0.5 0.5 0.5 0.5 0.5 0.5 
##$TPOFFS= (0..7)
0 0 0 0 0 0 0 0 
##$TUNHIN= 0
##$TUNHOUT= 0
##$TUNXOUT= 0
##$USERA1= <user>
##$USERA2= <user>
##$USERA3= <user>
##$USERA4= <user>
##$USERA5= <user>
##$V9= 5
##$VALIST= <valist>
##$VCLIST= <CCCCCCCCCCCCCCC>
##$VD= 0
##$VDLIST= <DDDDDDDDDDDDDDD>
##$VPLIST= <PPPPPPPPPPPPPPP>
##$VTLIST= <TTTTTTTTTTTTTTT>
##$WBST= 1024
##$WBSW= 4
##$XGAIN= (0..3)
0 0 0 0 
##$XL= 0
##$YL= 0
##$YMAX_a= 298030
##$YMIN_a= -375142
##$ZGOPTNS= <>
##$ZL1= 120
##$ZL2= 120
##$ZL3= 120
##$ZL4= 120
##$ABSF1= 15.51
##$ABSF2= -2.541849
##$ABSG= 5
##$ABSL= 3
##$ALPHA= 0
##$AQORDER= 0
##$ASSFAC= 0
##$ASSFACI= 0
##$ASSFACX= 0
##$ASSWID= 0
##$AUNMP= <proc_1d>
##$AZFE= 0.1
##$AZFW= 0.1
##$BCFW= 0
##$BC_mod= 2
##$BYTORDP= 0
##$COROFFS= 0
##$CY= -3
##$DATMOD= 1
##$DC= 0
##$DFILT= <>
##$DTYPP= 0
##$F1P= 0
##$F2P= 0
##$FCOR= 1
##$FTSIZE= 16384
##$FT_mod= 6
##$GAMMA= 0
##$GB= 0
##$INTBC= 1
##$INTSCL= 3.70164e-10
##$ISEN= 128
##$LB= 0.24
##$LEV0= 0
##$LPBIN= 0
##$MAXI= 10000
##$MC2= 0
##$MEAN= 0
##$ME_mod= 0
##$MI= 1.114404
##$NCOEF= 0
##$NC_proc= -6
##$NLEV= 6
##$NOISF1= 3.799351
##$NOISF2= 2.8
##$NSP= 0
##$NTH_PI= 0
##$NZP= 0
##$OFFSET= 15.48136
##$PC= 1
##$PHC0= -25315.85
##$PHC1= 8.787479
##$PH_mod= 1
##$PKNL= yes
##$PPARMOD= 0
##$PSCAL= 0
##$PSIGN= 0
##$REVERSE= no
##$SF= 200.130008073767
##$SI= 16384
##$SIGF1= 3
##$SIGF2= 2
##$SINO= 5.538805
##$SIOLD= 16384
##$SREGLST= <1H.CDCl3>
##$SSB= 0
##$STSI= 16384
##$STSR= 0
##$SW_p= 3612.71676300578
##$SYMM= 0
##$S_DEV= 0
##$TDeff= 16384
##$TDoff= 0
##$TI= <>
##$TILT= no
##$TM1= 0
##$TM2= 0
##$TOPLEV= 0
##$USERP1= <user>
##$USERP2= <user>
##$USERP3= <user>
##$USERP4= <user>
##$USERP5= <user>
##$WDW= 1
##$XDIM= 16384
##$YMAX_p= 303887700
##$YMIN_p= -1350066
$$ End of Bruker specific parameters
$$ ---------------------------------
##NTUPLES= NMR SPECTRUM
##VAR_NAME=  FREQUENCY,     SPECTRUM/REAL,   SPECTRUM/IMAG
##SYMBOL=    X,             R,               I
##VAR_TYPE=  INDEPENDENT,   DEPENDENT,       DEPENDENT
##VAR_FORM=  AFFN,          ASDF,            ASDF
##VAR_DIM=   16384,         16384,           16384
##UNITS=     HZ,            ARBITRARY UNITS, ARBITRARY UNITS
##FACTOR=    0.220516191357247, 1,           1
##FIRST=     3098.28478894668, 0,            0
##LAST=      -514.431974059102, 0,           0
##MIN=       -514.431974059102, -1350066,    0
##MAX=       3098.28478894668, 303887700,    0
$$ Real data points
##PAGE= N=1
##DATA TABLE= (X++(R..R)), XYDATA
$$ [...]
8534A93808P6949j7411j06076n339J21403o66j76449J2317J7979q1350J5262M1302
8522I1729P0798L0482q7729j26319m6395J41944R5329L6297j9582J5027O28n8612
8510A43597j9864K6265O9435j11548n8026K9158j935J5100k9735n6604j31J4477
8498B0189P5706o1329o2468m8049Q8453K564M1372k5120J67683K8415k41033P538
8486f079P020O4607J5256o8581k2813P5129O1100j7636M0957o0669n7954r3751
8474f3414N4124J80921O529l0048o3001O8931j04630N3946J06919j07853m7510
8463E4914N2506p935K2332O9419k5536m7390J4685L0820k4271j2081N9790J26687
8451C13940l1354n1697M9371o9156K7671J58425J07748j14701j19019o3600m2087
$$ y = [193808, 270757, 253346, 147270, 141931, 263334, 262668, 86219, 98536, 116515, 35165, 50427, 91729, 162527, 193009, 105280, -21039, -67434, 74510, 169839, 206136, 186554, 201581, 202209, 143597, 123733, 149998, 219433, 107885, 49859, 79017, 77082, 92182, 62447, 5843, 5712, 20189, 95895, 34566, -27902, -75951, 12502, 15066, 56438, 31318, 199001, 227416, -13617, -6079, 941, 65548, 80804, 12223, -10590, 64539, 125639, 108003, 148960, 88291, 30337, -63414, -9290, 171631, 178160, 148112, 85111, 154042, 49412, 103358, 210277, 102424, 54914, 107420, 99485, 121817, 191236, 165700, 118310, 132995, 163815, 139544, 127463, 187253, 313940, 282586, 230889, 280260, 211104, 238775, 397200, 504948, 390247, 271228, 207628, 165541]
8440A65541m3548M244J3996m8586O1399N9706n1629r9437N437l3908o644K3285
8428D9856M8064r4507K2429K21457q4321j38500o907k4873Q5914J75592k608n6430
8416A95166M0722M0804j34279p2202l1645J00014L612j20624n1547Q4732M1433
8405I6186p9250Q0466k2322L1747J08752L6427J54529j7320j24116j12521J29982
8394B82560L3993j01919m4004J12164N1355J49468P9155j03452O0488K8897J6612
8383E65317R9815j45728Q2161N5062m9922j13704j63671P3697J997q8137o7902
8372B48985p8626J41812l5585j41166L392l758L1704n173J78374l8734m3542n554
8360B52129j42348l3450J00468K9574R773m6291J21652k5206j9938n4305J1436
$$ y = [165541, 121993, 126237, 140233, 91647, 153046, 212752, 161123, 61686, 67123, 33215, 26571, 49856, 97920, 3413, 25842, 247299, 162978, 24478, 17571, -7302, 78612, 254204, 251596, 195166, 235888, 276692, 142413, 70211, 38566, 138580, 142192, 21568, -29979, 54753, 96186, 16936, 97402, 75080, 106827, 215579, 252006, 406535, 389215, 265099, 152578, 282560, 316553, 214634, 170630, 282794, 334149, 483617, 562772, 459320, 519808, 548705, 565317, 665132, 519404, 601565, 656627, 606705, 493001, 329330, 403027, 405024, 316887, 248985, 170359, 312171, 276586, 135420, 138812, 135054, 166758, 161585, 339959, 301225, 257683, 252129, 109781, 76331, 176799, 206373, 216146, 169855, 291507, 266301, 246363, 192058, 203494]
8349B03494J45783L9318P3770J48478j55820j0289N8925J03926p1475j83026p6048
8338B77036J07545j3967j03613J0042j83770L8884n1066M3721N7216M8176j0209
8327B19995j96592n568J20117L3283o3956P7383r6925R5454j04893n8832O2340
8316H1806P2549q2985j05989K09504n8373o4693j04177Q596J07313R993k8845
8305D4699N7556Q9454l7828j10869p2992J19006M8685o0245j40502j37863P3598
8294a27301p1862P2096J46792k7938n0608k0306R1135j50276O1841J03992J01194
8283A28759Q8256j72696q7812k8807K4308J1316N7529l0335m4276k8572Q8302
8272E972K564n1247K1600J69927j11833j11202N1419J20200n209j1833M7873l3242
$$ y = [203494, 349277, 388595, 462365, 610843, 455023, 444734, 503659, 607585, 536110, 353084, 277036, 384581, 370614, 267001, 277043, 93273, 132157, 81091, 124812, 182028, 230204, 219995, 23403, 17835, 137952, 171235, 107279, 184662, 87737, 183191, 78298, 19466, 81806, 154355, 71370, -34619, 174885, 116512, 51819, -52358, -43762, 63551, 73544, 44699, 102255, 191709, 153881, 43012, -29980, 89026, 137711, 77466, -63036, -200899, -127301, -199163, -127067, 19725, -8213, -58821, -79127, 12008, -138268, -76427, 27565, 128759, 217015, 44319, -43493, -72300, -47992, -36676, 20853, -9482, -53758, -82330, 5972, 8536, -42711, -21111, 148816, 36983, -74219, -22800, 97400, 92191, 80358, 128231, 94989]
8260I4989q2743L5464J65814l6405j13243l0187N8809p5440k6059j0329r1228
8249a10558O6754N8476P9550q9116k3650J19711p2033q7652j7389L1147m1796
8238h6556m408J3887M8116J39644j12508k0905O5508p4103J4331n1498J48758
8227H0266j7000J3419O8780o9814r1889j4781L3445j6427m6971M2197n918P2961
8215D8268P236P9962K9223P2593j26577m8072O1485R2376r1636p5756N5482k6716
8203G7868j6945O3897O7547J29136J1978J85925L9866k37699J81688J5637l2036
8192D86862j836928K48633R00884M5121J16057K4296J67255j31020J18163n6540
8182H2783K9573k4840J63046n4423l6497O470K6654Q0355j0982j25676J38599
$$ y = [94989, 12246, 47710, 213524, 177119, 63876, 33689, 92498, 17058, -9001, -19330, -110558, -43804, 14672, 94222, 5106, -18544, 101167, 29134, -58518, -75907, -44760, -86556, -90964, -77077, -28961, 110683, -1825, -22730, 42778, -31325, -16994, -68492, 80266, 63266, 76685, 145465, 75651, -16238, -31019, 2426, -14001, -60972, -18775, -24693, 48268, 55504, 135466, 164689, 237282, 110705, 62633, 124118, 216494, 124858, 49102, 104584, 77868, 60923, 124820, 192367, 321503, 333481, 519406, 559272, 321573, 503261, 518898, 486862, -1350066, -1101433, -200549, -155428, -39371, -15075, 152180, 21160, 139323, 82783, 112356, 87516, 250562, 196139, 159642, 166112, 192766, 273121, 262139, 136463, 275062]
8171B75062p2674n1128M9549k0874J52662j9968L8677M1878Q6568J01587k3911
8160E57428r9393l1889l9416r8027J25475O453O524j9355M5281q5803j31830o3032
8148A72416J9218M7063k4848M9294K844J953j43035o1730O8083M3230p7876Q3253
8136A79865J49139r4445q2456J18827J18559q4563M5030j11697k4694Q9776J12108
8125D15449r35j8872J18459J52630q4397k4255j7802j29309j05784m9692o9372
8114A86120l0395L3410j01764Q8334N8620j4711o9501m7614J33819J09709j71644
8103A74383q3988M6091K486o1545L7191J6515o1248Q4168L811l3855k9192k1870
8091G2947L532j8226k1632O241k288l8943M9457o6495K8739j17889R3280o7935
$$ y = [275062, 202388, 151260, 200809, 179935, 332597, 312629, 351306, 393184, 479752, 581339, 557428, 458035, 426146, 386730, 288703, 414178, 420631, 427155, 407800, 453081, 367278, 235448, 172416, 191634, 238697, 213849, 263143, 265987, 267940, 124905, 63175, 131258, 174488, 96612, 179865, 329004, 234559, 152103, 270930, 389489, 304926, 349956, 238259, 213565, 303341, 415449, 414514, 395642, 514101, 666731, 582334, 558079, 540277, 410968, 305184, 255492, 186120, 155725, 189135, 87371, 175705, 234325, 219614, 150113, 102499, 236318, 346027, 174383, 90395, 136486, 138972, 77427, 114618, 131133, 69885, 154053, 157864, 124009, 94817, 72947, 76479, 58253, 36621, 42862, 40574, 1631, 51088, -15407, 13332, -104557, -11277, -79212]
8079g9212j22276J33746m3022J00035n8503j04163K10431J4533j07337K5940n8870
8068h8698j1595J04948M9578m9727N8784p7025N1803j1764m3764O7831J12419
8057A62790j1717m0725o4901j00149J27867j2519j1256P608j1007n7285k3631
8046c4925j6343P3392O2122r1456j7780M2254K449K8608R853j55109J22107n8330
8034c3158n1594K3370q0392J22731J70198j9776m5330K661l1037j79772L2828
8023h9271Q4127J51929K4192l00414q267P1904q9788O2227J7861n741P0917M4178
8011C3854p0647o0475m93m8386M659J4391k5680P9859J09232j09135m5976j5952
7999a34749L6113r350K9614p8901j1361J54940k3580m2166R9199j2819r4751Q713
$$ y = [-79212, -201488, -67742, -110764, -10729, -69232, -173395, 37036, 51569, -55768, -29828, -88698, -100293, 4655, 54233, 4506, 63290, -13735, 38068, 26304, -17460, 50371, 162790, 151073, 110348, 45447, -54702, 73165, 60646, 49390, 56998, 45991, -11294, -34925, -51268, 22124, 84246, -7210, -24990, 17264, 19713, 48321, 58174, -96935, 25172, -33158, -84752, -61382, -141774, -19043, 151155, 131379, 86049, 88710, 57673, -122099, -89271, -5144, 146785, 170977, -129437, -137704, -65800, -155588, -93361, -75500, -81241, -10324, 33854, -36793, -97268, -97761, -146147, -141488, -127097, -152777, -72918, 36314, -72821, -118797, -134749, -98636, -107986, -78372, -157273, -168634, -13694, -37274, -79440, 19759, 6940, -87811, -79098]
7987g9098r2775o7344J09478J24278o3497j73954l0754L3478l9350j7640J77832
7976a19346k0259m1026J838o255k2964J12615q9909P524k2873N5390J67248p8197
7964e6214P137Q7485j29177J1400K3074m3839p5017k1963L4792k5397K8646K3736
7952a35337Q2409m0137j0074J3902J30993O1563j75241j00495J33931n2172L9847
7941e0811l6463l3943R4552M5753N3300k9896M8137m4146j00403k5886j928R7585
7929A5851P9135j6227j43877j13492l6730K09803R1622j0716j22955q9730j31303
7918b68619J06276J07491j36747L4727K8168P37J70072M7246n9311J5125j07547
7907f2382q0281l2316Q1740m4399j8637r5974M4690O3612j4646O7200O7160J39604
$$ y = [-79098, -171873, -239217, -129739, -5461, -68958, -242912, -273666, -240188, -279538, -297178, -119346, -139605, -180631, -178793, -185048, -208012, -95397, -185306, -177782, -200655, -145265, 21983, -56214, -49077, 38408, -90769, -79369, -56295, -100134, -175151, -197114, -162322, -187719, -159073, -135337, -52928, -93065, -103139, -89237, 41756, 103319, -71922, -172417, -38486, -90658, -50811, -87274, -121217, -26665, 19088, 72388, 42492, 90629, 46483, -53920, -79806, -81734, 15851, 94986, 78759, -65118, -178610, -215340, -5537, 86085, 75369, -47586, -137316, -268619, -162343, -54852, -191599, -156872, -128704, -127967, 42105, 89351, 30040, 45165, -62382, -142663, -174979, -93239, -137638, -156275, -252249, -207559, -143947, -158593, -91393, -24233, 115371]
7895A15371J7147j31849n1028l6849M4849P070K6645N7223M6768j63729O2926
7884e456m8001L0021l2954l1740O0513M2050k4169j75401M2795Q671j1859O106
7872a39424R721N5587M2386o3771J64240j8596r8228L2535J45287j57069m5593
7861g2925L6231M0238N0670p0945o0858J09389Q2949q5114K9241M8456O1763l9574
7849A29521j83238k9787p1805m1015J32733J64403j67695l3603r0131N4938J35469
7838b10k0605J64236J2318j9202l5283p2546j586P4910j26361N617K4253n7062
7826e1521j22181O3625J48403M5559p5908l8553O3875P8154k8274j65639M1341
7815d1119k4183k9964Q3347R9381o8327j13815J10865J7174m0014M0699k0053
$$ y = [115371, 132518, 669, -50359, -87208, -42359, -35289, -8644, 48579, 95347, -68382, -5456, -53457, -23436, -56390, -88130, -27617, 14433, -9736, -185137, -142342, -133671, -145530, -139424, -129703, -74116, -31730, -95501, 68739, 50143, -48085, -15550, 129737, -27332, -72925, -36694, 3544, 54214, -16731, -77589, 31800, 114749, 29635, 58876, 107332, 169095, 129521, -53717, -83504, -155309, -196324, -63591, 100812, -66883, -100486, -190617, -135679, -210, -20815, 143421, 155739, 136537, 101254, 28708, 27122, 102032, -24329, -18712, 5541, -51521, -173702, -110077, 38326, 83885, 7977, -30576, 33299, 111453, 83179, -82460, -41119, -65302, -95266, -11919, 87462, 19135, -94680, 16185, 33359, -6655, 34044, 13991]
7804A3991o7334K832p6406J41807j0769p8414l7073M1913P0318j13351J26559
7793A4073M7210j03440j39506L702L2020o120L2520J8576J0041j2036M8644K6609
7781b7707J23586K7505p3482K5134j7712Q264p4021o8099r5360m8418N2070P9514
7769h8726O7292l5241l3283l1590n3937J29315j44091M7453J72087j20494j13290
7758b04505P9899K6772Q698P5416J6420j11775J6223K6345M6540j3065r2096p1797
7746a96925L6542N8900L1730K2984o5769R964k045o0057P160K8831n0137J04389
7734g4433j31527L5469J18375J15764p9555o1234J40253n5241r3902P6201k5019
7723c4849q3457K0687O3874N7112o4132q1233O1142L5553m2465L2621n6494m3488
$$ y = [13991, -53343, -50511, -126917, 14890, 4121, -74293, -111366, -69453, 865, -112486, 14073, 61283, -42157, -181663, -177961, -145941, -152061, -119541, -100965, -90924, -102960, -54316, -27707, 95879, 123384, 49902, 75036, 57324, 65588, -8433, -76532, -171892, -220310, -168240, -88726, -21434, -56675, -89958, -121548, -175485, -46170, -190261, -142808, 29279, -91215, -204505, -124606, -97834, -89136, -13720, 2700, -109075, -92852, -66507, -19967, -33032, -125128, -196925, -160383, -101483, -69753, -46769, -112538, -102574, -104619, -164676, -157516, -128685, -178822, -74433, -205960, -170491, -52116, 63648, -15907, -77141, 63112, 7871, -86031, -9830, -34849, -118306, -97619, -33745, 23367, -40765, -121998, -60856, -25303, -67768, -35147, -91641, -135129]
7711a35129J14318l6727J50470j6152r0655J7462M162M2691N9081j77649j16557
7700a84685n2018k2639K8188J68484P8298J0887K0563l7674j01726J4331R115
7689f8876k8830N7990J13852p4090o5905N8737k2623q3304L8709J6469K5673q5393
7677a17591j8259K6444m9341R8777J18405m1760q0629R9046k0430q9321p2616
7666a47275n518Q53L3982O3727P7071o6964l1538q1292R6929M333J62129j7377
7654H9060r8721J4330N4400j64508j493J89825N0739l443j49208J7476R9119l4592
7642F2984L0143n3525n3936J30352J11781n2279j14915p4660K5097p1170m6064
7631a06192M0364J1898L3490J02663O1207O5494j30740L258o1614n5196n2274
$$ y = [-135129, -20811, -57538, 92932, 76780, -13875, 3587, 7749, 50440, 109521, -68128, -184685, -236703, -259342, -231154, -62670, 15628, 26515, 47078, 9404, -92322, -77991, -68876, -97706, -39716, 74136, 46, -65859, -7122, -29745, -113049, -74340, -57871, -32198, -117591, -135850, -109406, -158747, -59970, 58435, 16675, -63954, 35092, 14662, -74659, -147275, -152793, -151940, -117958, -54231, 22840, -44124, -75662, -156954, -60025, -55692, 106437, 89060, -9661, 4669, 59069, -105439, -106932, 82893, 133632, 130189, -19019, -1543, 97576, 62984, 93127, 39602, -14334, 116018, 227799, 175520, 60605, -14055, 11042, -60128, -106192, -65828, -53930, -20440, 82223, 143430, 208924, 78184, 81442, 19828, -35368, -87642]
7620h7642l0765O5013R2735K6377p9574N4139k901p2773J61295n7160Q942L9579
7608A17265o0813k1159n3742R375m7834j39512L3462l1449P0915J73217l6872
7597A2853J8097J3881L778p1301o1085L8073M3384P8442K9474k18651m9306Q5374
7585g6987J19317n1214q8736N0697o282K7751N9587j12595R8125J9538n6253O3113
7573D6061P7224j34075j6156L6419N7176j02752k2418K9012k7381l6835J29361
7562C5636r2573N4237M1770l4385n2597n4698p687P2354j5122L007M9293J08531
7550A07766o2719p0762N4026j01639R8661o759m1184L507N2527L9186j6213k5417
7538C0980j20490K7949J1220L5566j273j00517j4941q2409J27336j1558p5802
$$ y = [-87642, -118407, -53394, 39341, 65718, -13856, 40283, 37382, -35391, 125904, 68744, 77686, 117265, 56452, 35293, -18449, -9074, -56908, -196420, -162958, -194407, -123492, 49725, 12853, 30950, 44831, 48609, -22692, -83777, -45704, -2320, 76122, 105596, -113055, -162361, -76987, 42330, -8884, -97620, -46923, -53205, -25454, 34133, -78462, 19663, 39201, -17052, 46061, 123285, -10790, -26946, 9473, 66649, -36103, -58521, -29509, -56890, -93725, 35636, -56937, -2700, 39070, 4685, -47912, -102610, -110297, -37943, -53065, -50058, -765, 107766, 45047, -25715, 28311, -73328, 25333, 18574, -22610, -19103, 33424, 72610, 56397, 30980, -89510, -61561, -50341, -14775, -16048, -116565, -131506, -213915, -86579, -98137, -173939]
7527a73939L8386J12363N4323J6376o7768K3437O858l9586o1697K9445P6170O956
7515B1324l2373m6719J01950K2499K4948Q9832n126j66153k4836O1890K657K9031
7503G8924q0386M6359m256P2104n9143j29396L8927O7304p1456O6329p7047j13370
7491a65107J8904j8558R2780L3880l6650Q7627R1286j56056L244j1155n8145J04351
7479a3599Q200n3171L0456J7051k5759k43J6563R55O8603l4407j04272Q6101l6286
7466c9808m4323R4789J18471p4713o6543o2076L3899R03Q160j125j34181l8069
7454b04616J19114J38171N3422o2862M4506M1277O0354m6152j27148J0039p4345
7443d8240L080O4849p5736O7361N3943j62329J41508j7494j0898P0272L5843n0508
$$ y = [-173939, -135553, -23190, 31133, 47509, -20259, 3178, 10036, -29550, -91247, -61802, 14368, 21324, -11049, -57768, 44182, 66681, 91629, 181461, 176335, 10182, -14654, 47236, 49893, 78924, -1462, 44897, 40641, 112745, 53602, -75794, -36867, 30437, -41019, 25310, -51737, -165107, -146203, -164761, -71981, -38101, -74751, 12876, 104162, -51894, -48650, -59805, -117950, -13599, -5399, -58570, -28114, -11063, -36822, -37065, -20502, -19547, 49056, 14649, -89623, -3522, -39808, -84131, 10658, 129129, 54416, -12127, -74203, -40304, -39401, -31241, -32366, -166547, -204616, -85502, 52669, 106091, 43229, 87735, 129012, 189366, 143214, 16066, 26105, -48240, -45160, 19689, -56047, 11314, 65257, -97072, 44436, 26942, 16044, 86316, 122159, 71651]
7431G1651m7971R311o4150j18227n2139J14081M6504Q0733l7590l3928J44638
7420A12913J2788j36778n38J94601n838j13543j63312L5549J03690j7712n0819
7409b8999N877k3020P1138n3942L64Q9260o5211L7365l3637k6104J9096R1933
7397H4120L846o5271Q5763q9703O907Q027k4835j2756P4808j6230K0788j9621
7385E5843j00302J91778l7157k49607J02993J05420m3886J07606Q2517o5444j40793
7374H968k4936n3966M1116O2735j08958n8307O4674J74641j9894q8478L1761M5236
7362G4592q744L7208l013r4116k5054q020P8278O3225J70983j46583k3736O0180
7350A75200j8261l7164J782J24392o5888O5285R984L1929m5171q508j4244q991
$$ y = [71651, 23680, 32991, -31159, -149386, -201525, -87444, -40940, 39793, 2203, -31725, 112913, 125701, -11077, -11615, 182986, 177148, 63605, -99707, -64158, 39532, 21820, -28999, -23122, -46142, 24996, -28946, -28582, 60678, -4533, 32832, -805, -26909, -7813, 84120, 87966, 22695, 108458, 18755, 25662, 33689, 8854, -3902, 70906, 54676, 75464, 55843, -44459, 147319, 110162, -139445, -36452, 68968, 25082, 132688, 215205, 149761, 8968, -15968, -69934, -28818, 33917, -75041, -133348, -68674, 105967, 86073, -2405, 29356, 74592, 65848, 103056, 100043, 5927, -19127, -27147, 51131, 114356, 285339, 138756, 115020, 175200, 156939, 119775, 121557, 245949, 180061, 245346, 255330, 287259, 242088, 233580, 219336, 210345]
7338B10345J23316j25687j8775O4415M5527p8841j06773m2880L6093l2192J40947
7327B15495l7338M7797j9167k7330J4139j06465J31726N0270j50180q8756n9602
7316b9411K25573j0135j04028J83375n4844j14235P6184q7315j28576P2920R3311
7305A22819M4399j54640L1131l9362L9200N5897j1575L0089L2859o0612k83k0699
7293F9223N9807j09706n4383P6275J18681M3516j5796L5453O475p3979n590r7350
7281E2626l1078J65703j05651J41234R9002j27380n2006J01524n179j4772l8133
7270A85890n6068O1270K9495N7524J9218j15389m4357m4266n1077r798R9939N4524
7258A86905m1991o3979o4591J32310n2100k1355J52693l5241j18456q526L2510
$$ y = [210345, 333661, 207974, 189199, 253614, 299141, 220300, 113527, 70647, 106740, 74548, 215495, 178157, 225954, 206787, 179457, 193596, 87131, 218857, 269127, 118947, 30191, -29411, 196162, 186027, 81999, 265374, 210530, 96295, 172479, 85164, -43412, 29508, 122819, 167218, 12578, 43709, 4347, 43547, 99444, 87869, 117958, 150817, 90205, 89922, 69223, 129030, 19324, -35059, 41216, 159897, 203413, 187617, 223070, 229545, 155566, 149976, 52626, 21548, 187251, 81600, 222834, 321836, 194456, 142450, 243974, 238795, 224023, 185890, 129822, 191092, 220587, 278111, 297329, 181940, 137583, 93317, 42240, 32442, 132381, 186905, 144914, 80935, 16344, 148654, 96554, 75199, 227892, 192651, 74195, 65669, 98179]
7247I8179l882O4513J07600j53580j8975J5260k0879J01271j6662Q2362j1342
7236B43865o7717O6704r2983K2285j1204K3766J67728r5886j25055M4743R200
7225A85446r3680p3099J29597J07451j29355J13223l1120n8054L7255L4274J04197
7214C26135p5776R033q9345O3196l7449o4884J22521P1683Q2228R0257l9077l2118
7202D26404M8425L0717j18509o0617O7338j32620K3790j7976J34250J17352r2429
7191D26125p1596j0751M035O7019n9640k4279J03455N8453R2261j26600p3741
7180C84741O4005N004l9689J31527N8659r8285m2251n987L5093o0842r0713m024
7168C37238m5862K2166r2454O173K0939P184j4587J2291R6365m5368J14297j5667
$$ y = [98179, 94297, 158810, 266410, 112830, 93855, 109115, 88236, 189507, 172845, 255207, 243865, 176148, 242852, 149869, 172154, 160950, 184716, 352444, 256558, 131503, 176246, 185446, 91766, 18667, 148264, 255715, 126360, 239583, 208463, 150409, 187664, 221938, 326135, 250359, 259392, 170047, 233243, 195794, 130910, 253431, 325114, 407342, 497599, 458522, 426404, 474829, 505546, 387037, 326420, 393758, 261138, 284928, 266952, 401202, 518554, 426125, 354529, 343778, 347813, 414832, 355192, 330913, 434368, 492821, 585082, 458482, 384741, 448746, 453750, 414061, 545588, 604247, 505962, 463711, 457724, 492817, 431975, 341262, 337238, 291376, 313542, 221088, 227261, 248200, 255384, 240797, 253088, 349453, 304085, 418382, 402715]
7156D02715J7072Q3529j03577L7532j86626n7298k1389Q252J04220j1555n8418
7145B14457J14542L113n4633j00806R2676R9693r4030j10063j130J87202j29688
7134B21333l1802J5270Q8128j59516J2794J04702K9997o2173q4569l670j5354
7123A15140n2848o5904q4297J9145R4114J14867p3797Q5387r02j2474Q4595m8551
7111A74475O6716J71641j77717J9581k5182o3088L0009k6363K2963Q0360R6239
7100C69634l3713m2261n2802J52640j0419O1731p856q881l399n0512p4435K6947
7088C26674M6122n1512q897L4310q5314l7007K3288j10646J54442Q195q8767q4163
7076A26725p8775L5507k1895j7437P7881M6035r5981k8875K30809J64983o0511
$$ y = [402715, 419787, 503316, 399739, 437271, 250645, 193347, 171958, 180210, 284430, 272875, 214457, 328999, 332112, 277479, 176673, 269349, 369042, 275012, 164949, 163819, 351021, 221333, 189531, 204801, 292929, 133413, 146207, 250909, 280906, 218733, 134164, 130494, 115140, 62292, -3612, -87909, -68764, 25350, 140217, 66420, 151807, 150905, 138431, 223026, 174475, 241191, 412832, 235115, 254696, 229514, 166426, 196435, 170072, 193035, 273395, 369634, 335921, 293660, 240858, 393498, 383079, 444810, 436954, 428073, 424674, 374162, 299727, 326674, 372796, 321284, 312387, 346697, 261383, 224376, 247664, 137018, 291460, 299655, 210888, 126725, 47950, 83457, 61562, 44125, 122006, 168041, 72060, 43185, 273994, 438977, 378466]
7065C78466j50320N9388J12874m3042r073N4987L2349k21418J53637M889L7769
7054D10506p791j0841K616L0645l2175k5129j72124o8373M8989j3262J39703p8544
7042B24220J9061j24273R9372M9744k4629N6946j01021r1314J06833J17046P5722
7031D07707j53046m5635Q6083R1094M8333j63276j34521o702J33014O0079J14977
7020D38107o2863r9389o9249k6196P3536J90706R6483m7239N3969L760j27916
7009D23709m1812p3206j34904N7839J61892L9286j24182j5520K5553j48258j0080
6998A60317J65010q7020j77447N6528M6140P6415n7059J474m1503j08647J79041
6987B13249J09803n724p4096k9542k3968n6427J03290R0843J04956m2041L6903
$$ y = [378466, 228146, 287534, 400408, 357366, 348293, 403280, 435629, 214211, 367848, 372737, 410506, 402715, 391874, 394490, 425135, 392960, 367831, 195707, 127334, 176323, 163061, 302764, 224220, 243281, 119008, 218380, 268124, 243495, 300441, 199420, 108106, 214939, 331985, 407707, 254661, 209026, 295109, 386203, 434536, 271260, 136739, 130037, 263051, 323130, 438107, 375244, 275855, 206606, 180410, 253946, 444652, 541135, 493896, 547865, 551625, 423709, 381897, 308691, 173787, 231626, 393518, 432804, 308622, 293102, 318655, 170397, 160317, 325327, 238307, 60860, 117388, 163528, 239943, 182884, 184358, 142855, 34208, 213249, 323052, 317328, 243232, 213690, 189722, 133295, 236585, 327428, 432384, 390343, 427246]
6976D27246j6909j23571n5626j7962Q1879R2920j1550l6139o045k3176L9492k0111
6964C30448J1724j29700J43241J25205j14056J8477N4120j9373l1847R124p0919
6953C26444Q9113K5245m2716O8074K1197n981l5598M238j40387n4509l5694K2979
6941B42405K1680J8764O9171m0090j8577N6142O4815j48534J19228J91799m897
6930E71906j43403m8081J22153j14467m8841J20238J16933p7395K468k0110M1956
6919E23357J15078j87881K3880J9795J3170P7209j58243m0277L001K9426m36j38005
6907B80074J17343k6881j18472R3084n3590q8354J01044J37407J03864n1195m0887
6896D53437Q9547L6669J0994j61685l4974l9567o2360p9339P6608J6713k6349
$$ y = [427246, 410337, 286766, 231140, 213178, 295057, 387977, 376427, 340288, 334243, 311067, 350559, 330448, 342172, 212472, 355713, 480918, 366862, 385339, 439459, 420086, 388239, 397363, 326444, 415557, 440802, 398086, 466160, 487357, 481376, 445778, 450016, 309629, 255120, 219426, 242405, 264085, 282849, 352020, 311930, 293353, 349495, 414310, 265776, 385004, 576803, 571906, 428503, 380422, 502575, 388108, 339267, 459505, 576438, 499043, 501511, 481401, 523357, 638435, 450554, 474434, 494229, 507399, 584608, 426365, 386088, 389089, 418515, 418079, 280074, 397417, 370536, 252064, 345148, 291558, 203204, 304248, 441655, 545519, 494324, 453437, 542984, 579653, 590647, 428962, 393988, 354421, 292061, 212722, 289330, 306043, 279694]
6885B79694j34435j05531K63801m1588o5672O1819Q1068m0791q8054j06797K9835
6874A33349P1826j3929M9031j32402j48921j1876J36411k3495k5658M8918N8035
6863A41289K01786j02122j27326Q1534j21150l736Q5416M0433j9558L8127m7401
6852A67292l8866R8247K6124j51587R9540o4895K8460L449j0435k2046j09292
6841B5991J27853j06049k4125L8157O8910J6100J849J00121Q5023l2223r0115
6830B11492n5036O588o687k7156m4791Q3563J07304J00875O7304j44269j00981
6819A98206M4500O4270J5537O7132j26215p2965l8420J15142M2461L0711J14987
6808D55346j63555p9239N6930N6021p5875Q3923j03680k7054Q7800J4227r7389
$$ y = [279694, 145259, 39728, 303529, 261941, 196269, 258088, 339156, 298365, 210311, 103514, 133349, 205175, 191246, 240277, 107875, -41046, -52922, 83489, 59994, 34336, 83254, 141289, 343075, 240953, 113627, 195161, 74011, 70275, 155691, 196124, 176566, 214693, 167292, 128426, 226673, 252797, 101210, 200750, 135855, 164315, 167764, 157329, 135283, 25991, 153844, 47795, 23670, 61827, 130737, 146837, 148686, 248807, 333830, 301607, 211492, 156456, 163044, 156357, 129201, 84410, 167973, 275277, 376152, 443456, 299187, 198206, 242706, 306976, 322513, 389645, 263430, 190465, 152045, 267187, 309648, 340359, 455346, 291791, 212552, 269482, 325503, 249628, 333551, 229871, 202817, 290617, 304844, 207455]
6797B07455J09001J6775Q2089l6756p2364m8455r476J9843j51883J46566J8104
6786B80899N4228j00899N7962j17990L97K96099O3179l6448q9466q6058J03237
6775D25140N0034j0115J59285p4823n4345p3942K3880J5554Q9462l5178J41815
6764F56767j04320p4541P2063J20139k2903j09713j04221O9093J56529m5873o2553
6753E50467J02686m71k286M1881N0554P9475n8045O6694j8241l6557q0490k6593
6741F69074J16044l3044p6173k6433j1187N1553R1818R547J12740P7472K0637
6730A002048P3272O103m6986O3916K05576J7366J94J01608P4451L4489J110o5490
6718A467657M9658L4453m858j15985n4316o497M2810o8926l08J5985k8767N4125
$$ y = [207455, 316456, 333231, 415320, 378564, 306200, 257745, 248269, 268112, 116229, 262795, 280899, 335127, 234228, 292190, 174200, 174597, 470696, 533875, 497427, 407961, 321903, 425140, 475174, 465059, 624344, 549521, 495176, 421234, 445114, 460668, 550130, 514952, 656767, 552447, 477906, 549969, 670108, 647205, 537492, 433271, 502364, 658893, 613020, 550467, 653153, 652682, 650396, 692277, 742831, 822306, 764261, 830955, 812714, 776157, 695667, 669074, 785118, 752074, 675901, 649468, 638281, 689834, 781652, 791199, 903939, 981411, 1002048, 1075320, 1081423, 1034437, 1098353, 1303929, 1321295, 1321489, 1423097, 1497548, 1532037, 1533147, 1467657, 1517315, 1551768, 1546910, 1430925, 1376609, 1370112, 1412922, 1343996, 1343688, 1359673, 1330906, 1385031]
6706A385031P7355m0511K7548R1062K25848K1357J35760J19722J37503J17286
6696B297961J15096J16788m3401r0390l1589q8539j88236k28002j49605N5807
6686A765890j69267j85875r194M5963p503j23078J16259J3519j53307j06791J23852
6675A310468l7210M4562K01461l8324J70588K834r085l178j61270j41733k8029
6664A311084L1709N8653j38905l4544j04346r1565K920r0213p3895R0390J37405
6653A098693r5962j5841Q2867j45356M6177o6679k0168Q2107j30923J02520n8022
6642H79413P9412n3778p6301P0520k1342q0571l397j0521L9823O7571N3120N93
6630I44542p8595n0246K9170J09904M8039p2347m2385j9163J3077Q0133r4898
$$ y = [1385031, 1462386, 1421875, 1449423, 1540485, 1766333, 1787690, 1923450, 2043172, 2180675, 2297961, 2413057, 2529845, 2486444, 2396054, 2364465, 2275926, 2087690, 1859688, 1710083, 1765890, 1596623, 1410748, 1401554, 1447517, 1440014, 1316936, 1433195, 1446714, 1293407, 1186616, 1310468, 1273258, 1317820, 1519281, 1480957, 1651545, 1654379, 1645294, 1642116, 1480846, 1339113, 1311084, 1342793, 1401446, 1262541, 1227997, 1123651, 1032086, 1035006, 944793, 870898, 961288, 1098693, 1002731, 986890, 1069757, 924401, 970578, 903899, 883731, 965838, 834915, 937435, 879413, 958825, 905047, 828746, 899266, 877924, 797353, 793956, 783435, 823258, 890829, 943949, 944542, 865947, 815701, 844871, 954775, 1002814, 930467, 888082, 868919, 881996, 962129, 867231]
6619H67231k676J19256o7650k984K7418M3163r3519J07793K4754K6508o6409p7331
6607I05554r0313j05075K17030N1946j5389O333j8523n3887J5722j679N6573j13359
6595H54933P906L3470o9584N1270r955p6026M5328J13732M369r7757J12987O80
6583I71353r0235J10236Q4416j51448q8240L8069M3893J07417m16k5946N8792
6572A057891o9585L5355Q9119o384m0925p8282k2168M0507R4339K6701o6757m7225
6560A012586m2319K33323J31331K51968k3928j47195M3858J8594K161m0825o1954
6549A377600M636N069L3849o9235J9486O736J09662J5035J01649p9688J085N5404
6537A581288j76500O5787J57811Q1069M1458j44128N8936R6392j4311r319M2442
$$ y = [867231, 864555, 983811, 916161, 913177, 940595, 983758, 890239, 998032, 1022786, 1049294, 982885, 905554, 815241, 710166, 927196, 979142, 963753, 970086, 951563, 897676, 913398, 911719, 968292, 854933, 862839, 896309, 826725, 877995, 868040, 792014, 837342, 951074, 955443, 857686, 970673, 971353, 881118, 991354, 1075770, 924322, 836082, 874151, 918044, 1025461, 1025045, 999099, 1057891, 988306, 1023661, 1112780, 1106396, 1065471, 987189, 965021, 1005528, 1099867, 1126568, 1059811, 1012586, 970267, 1203590, 1334921, 1586889, 1562961, 1415766, 1459624, 1478218, 1480379, 1439554, 1377600, 1382236, 1387305, 1421154, 1351919, 1371405, 1378141, 1487803, 1502838, 1604487, 1524799, 1525884, 1581288, 1404788, 1470575, 1628386, 1709455, 1750913, 1606785, 1665721, 1762113, 1747802, 1738483, 1780925]
6526A780925o991O755J5645n0737r811K2559N9383L6498N1481k4399N3435K2999
6514A957742j19026j7854J56657J60274N2306J0081O8378n3579J25301j2038r1109
6503B237133p0535J1730M6762j46313n6909J32116J8696L6587j29578m5988j8646
6492B015055J6848J06438O1915R4260k1572l72J04618m3075Q7824r6316J18785
6481B444408j8326q9128j20057l912J78894J7591n3376P1779j14449m1940P4147
6470B345631k8814O1403J8239K3263K1497J39870O2658q5312P0785q3649J84917
6459B730488j32219J12856l8984l093K13285J54732J34182m8804O1011J95856
6449C379310L757j55959J26597K08620P7168O2022J17075J05603m0315O2371L57567
$$ y = [1780925, 1773934, 1780689, 1796334, 1745597, 1735786, 1758345, 1817728, 1854226, 1905707, 1881308, 1934743, 1957742, 1838716, 1820862, 1977519, 2137793, 2190099, 2200180, 2268558, 2214979, 2340280, 2328242, 2237133, 2166598, 2178328, 2225090, 2078777, 2021868, 2153984, 2172680, 2209267, 2079689, 2033701, 2015055, 2031903, 2138341, 2200256, 2294516, 2272944, 2272572, 2377190, 2334115, 2421939, 2325623, 2444408, 2426082, 2336954, 2216897, 2212985, 2391879, 2409470, 2356094, 2427873, 2313424, 2271484, 2345631, 2316817, 2378220, 2396459, 2419722, 2441219, 2581089, 2643747, 2558435, 2629220, 2545571, 2730488, 2598269, 2711125, 2672141, 2669048, 2882333, 3037065, 3171247, 3122443, 3183454, 3379310, 3383067, 3227108, 3353705, 3562325, 3639493, 3701515, 3818590, 3924193, 3883878, 3946249, 4303816]
6438D303816J57533Q1854N3802J77843J12133J72437P958N1273J32345K05596
6428E456590K06286J61265K54424J82794R5137J49554r9107j88976l09465k36435
6418E672067l9119p0176R5773j5157M6854J91227J05176N4506K63481L14468J36779
6407F755879L66808L40766L48324K53841L56120L14536M26304N96920O86955M06019
6397A0852472M2809j33087l43013o02460m68206l27109k62919m1258j09212J8261
6387H626278J21542N4459Q3178J25531L14403K22112K60090J35177K73991P0583
6377A0287344J33806L89086L01649L17300K49567K44845J66632j17553j84076
6368A1788600r6905o5059M6318P0995J65682J22778K26518K73750K67726N06122
$$ y = [4303816, 4461349, 4543203, 4597005, 4774848, 4886981, 5059418, 5067376, 5118649, 5250994, 5456590, 5662876, 5824141, 6078565, 6261359, 6356496, 6506050, 6406943, 6217967, 5908502, 5672067, 5632948, 5562772, 5658545, 5643388, 5690242, 5881469, 5986645, 6041151, 6304632, 6619100, 6755879, 7122687, 7463453, 7811777, 8065618, 8421738, 8736274, 9162578, 9759498, 10446453, 10852472, 10895281, 10762194, 10419181, 9816721, 9348515, 9021406, 8758487, 8717229, 8608017, 8626278, 8747820, 8802279, 8885457, 9010988, 9325391, 9547503, 9807593, 9942770, 10216761, 10287344, 10421150, 10810236, 11111885, 11429185, 11678752, 11923597, 12090229, 11972676, 11788600, 11691695, 11626636, 11672954, 11743949, 11909631, 12032409, 12258927, 12532677, 12800403, 13306525]
6358A3306525M91156M22693N05459N23959N74757N91371M63761O51137P48931
6349A8279749P09266P63000P96849J127590J079160J377280J476810J732045J764508
6340B9106257J868060J864512J834693J780895J024318L60769l98972q79356j148846
6331C5412330r84006j059887o55168m45189j75310J56384M68037P59558R95240
6322C4471989J412415J778893K211924K334562K570929K730196L043516L277415
6314E3831839L465433L311275K890154J756036j18509k032036l820832m510757
6306E4772603m411832l962177l221283k583089k080519j744365j323187p87826
6298C4658325m12362l27775M2503K07444M13004P32037Q86915R68641J016967
$$ y = [13306525, 13797681, 14220374, 14725833, 15249792, 15824549, 16415920, 16879681, 17530818, 18279749, 18989015, 19752015, 20548864, 21676454, 22755614, 24132894, 25609704, 27341749, 29106257, 30974317, 32838829, 34673522, 36454417, 37478735, 37839504, 37440532, 36561176, 35412330, 34428324, 33368437, 32713269, 32268080, 32092770, 32249154, 32717191, 33476749, 34471989, 35884404, 37663297, 39875221, 42209783, 44780712, 47510908, 50554424, 53831839, 57297272, 60608547, 63498701, 65254737, 65136228, 63104192, 59283360, 54772603, 50360771, 46398594, 43177311, 40594222, 38513703, 36769338, 35446151, 34658325, 34245963, 33918188, 33960691, 34168135, 34581139, 35313176, 36200091, 37168732, 38185699]
6289C8185699J325878J249944R08371L02837p58491j736195k356725k568799k646986
6280C1905533k389737k063453j836224j484976j393226j158279q78309r37366
6272A9763963p68150o83879q27975q86455q35233q08686p10539n87721o02549
6263A3052776n38758m54147k68910k22819l67295m11985k79863k05908k64835
6254A0038256m5299k72993J5853J00194q7755k20632j36313k18690q6832P5299
6244I161088k55315l18557l20595k54492k09404m00863j84663k06724j59600j53163
6234F697712k17066j62719j77777J1074k59874k1573k2221n4122M9222j3033q995
6223E820628j62673L6298L7673J05420m3426K3194j9537J39103J34830m1083j58550
$$ y = [38185699, 39511577, 40761521, 41669892, 41972729, 41214238, 39478043, 37121318, 34552519, 31905533, 29515796, 27452343, 25616119, 24131143, 22737917, 21579638, 20701329, 19763963, 18995813, 18311934, 17483959, 16597504, 15762271, 14953585, 14243046, 13655325, 13052776, 12514018, 12059871, 11790961, 11568142, 11200847, 10788862, 10508999, 10303091, 10038256, 9992957, 9719964, 9735817, 9836011, 9748256, 9527624, 9391311, 9172621, 9085789, 9161088, 8905773, 8587216, 8266621, 8012129, 7802725, 7401862, 7217199, 7010475, 6850875, 6697712, 6480646, 6317927, 6140150, 6151224, 5891350, 5869777, 5847556, 5793434, 5842656, 5829623, 5820628, 5657955, 5694253, 5731926, 5837346, 5793920, 5817114, 5797577, 5936680, 6071510, 6030427, 5871877]
6212E871877j54576l0318J70403p9086j00934J07284j10115J61359O2906j45105
6202E753695L9785J69409j6068J16095J0824J55581K33258J87955L7948J55388
6192F843870J05630K50367J40857L1521J7563J5428J48203J4998j0983Q1756L1072
6181G670282K61009J90440J97967n8866J99940J54182J57083L22886J40880K16401
6171I452204L67876K86899K37290J79694l0353J60761M2029J40996K07475L27716
6161A1372587Q2266K20048K95614J77638L29184J70502L72722M25226M19943M19109
6151A4284839M91256M65503K25411K77053L01661K78475M68592O95092P95771
6142A8283653P44182R80099J062728J283120J421297J442212J803300K063852
$$ y = [5871877, 5717301, 5686983, 5857386, 5778300, 5677366, 5784650, 5674535, 5835894, 5898800, 5753695, 5793480, 5962889, 5946821, 6062916, 6073740, 6229321, 6462579, 6650534, 6688482, 6843870, 6949500, 7199867, 7340724, 7372245, 7389808, 7405236, 7553439, 7568437, 7557454, 7639210, 7670282, 7931291, 8121731, 8319698, 8260832, 8460772, 8614954, 8772037, 9094923, 9235803, 9452204, 9820080, 10106979, 10344269, 10523963, 10493610, 10654371, 10696400, 10837396, 11044871, 11372587, 11454853, 11674901, 11970515, 12148153, 12477337, 12647839, 13020561, 13445787, 13865730, 14284839, 14776095, 15241598, 15467009, 15744062, 16045723, 16324198, 16792790, 17487882, 18283653, 19027835, 20007934, 21070662, 22353782, 23775079, 25217291, 27020591, 29084443]
6134B9084443K447448K790842L380980M012057M465316L662940J464985j052610
6126E0256401k408175k674700k037098j228225m47317J52763Q06298J425547K182793
6117D6028287K643435K212870J054138L8686O8768J002194J939485K392057K113015
6108E9492935O70933j258001k524547k608981j809313n87028L95703R53504L18556
6099E3043761p03463j961292k319722k097628j569722p95282L11184J064377J602362
6090D6574575K498420K665079J286520j647012l750910m806981m784277l817738
6082C4217676k960771k303580j688729j441088j013709j063778r40264j035747
6074B1770010q54493p90655q39305o01364n65608l02364k28346k80846l97047
$$ y = [29084443, 31531891, 34322733, 37703713, 41715770, 46181086, 49844026, 51309011, 50256401, 47848226, 45173526, 43136428, 41908203, 41460886, 41613649, 42419947, 43845494, 46028287, 48671722, 50884592, 51938730, 51977416, 52046184, 53048378, 54987863, 57379920, 59492935, 60163868, 58905867, 56381320, 53772339, 51963026, 51375998, 51771701, 52725205, 53043761, 52340298, 50379006, 48059284, 45961656, 44391934, 43596652, 43907836, 44972213, 46574575, 49072995, 51738074, 53024594, 51377582, 47626672, 42819691, 38035414, 34217676, 31256905, 28953325, 27264596, 25823508, 24809799, 23746021, 22805757, 21770010, 20915517, 20124862, 19285557, 18684193, 18118585, 17816221, 17587875, 17307029, 16909982]
6065A6909982l18923p86868o63665m99883n45022k08682J9503J09891K75451P0383
6055A4362167J41376M3035j1018k80402k15333r0933j75796j54595j53144j93087
6045A3272270n44807n77577n98307p59242l99938k08554r8811j00109n5972k12582
6035I716371l39001k54939j28135j31657r0377J28199K28249M73998J49301K18724
6025I970733l44845n27305o20838p74567n75821l80378m57835m25376k51868j87859
6015E424041k23980j66539j55798k00356j44987j29067l9726j42539j65475p4611
6005C980963k04883J7440L8393P2902j10461j68353l0433j00700p886O7342k07423
5994C346901j4485K2226j98424o4937j9121L563o0051J1243j18678j37687K0845
$$ y = [16909982, 16591059, 15804191, 15140526, 14640643, 14095621, 13886939, 13906442, 14016333, 14291784, 14362167, 14503543, 14546578, 14535560, 14255158, 14039825, 13948892, 13773096, 13618501, 13465357, 13272270, 12727463, 12149886, 11551579, 10792337, 10392399, 10183845, 10085034, 9984925, 9928953, 9716371, 9377370, 9122431, 8994296, 8862639, 8772262, 8900461, 9128710, 9602708, 9752009, 9970733, 9625888, 9098583, 8477745, 7703178, 7127357, 6746979, 6289144, 5863768, 5611900, 5424041, 5200061, 5033522, 4877724, 4677368, 4532381, 4403314, 4363588, 4221049, 4055574, 3980963, 3776080, 3793520, 3831913, 3904815, 3794354, 3626001, 3595568, 3494868, 3486982, 3554324, 3346901, 3332416, 3354642, 3156218, 3091281, 3072160, 3075723, 3015672, 3026915, 2908237, 2770550, 2791395]
5983B791395K5822O2075P277j31008j44313P6851p0877K1552J13106p8356k401
5972B671123m0057r045L869P124q4636m6850O8566N6727k5436m9947n7026p8863
5960B415549J50514j25401n9165N5082R6685m5968j8683r011K7647J09705J68511
5949B765465Q14k97177L6047m5220P310Q2212j0832j1574J30723j57646q8463
5938B411659j46603J02033K18443P957O7105J9931j38202J6070M2312O0522o8990
5927B592237Q1131K32923n1622j48084N8483R5246l7272p6821M4062n0869P874
5916B747288n5135J64751Q2805J39817R893j5285N1800q0801m108J40823p6702
5905C105146j7899J37334J12985P4134k6541Q9530K27197P0924k0121Q0111O4165
$$ y = [2791395, 2817217, 2879292, 2886569, 2755561, 2611248, 2688099, 2617222, 2638774, 2751880, 2673524, 2671123, 2631066, 2622021, 2625890, 2633014, 2548378, 2501528, 2570094, 2626821, 2601385, 2551438, 2494412, 2415549, 2566063, 2440662, 2381497, 2436579, 2533264, 2487296, 2468613, 2459602, 2487249, 2596954, 2765465, 2766279, 2469102, 2505149, 2459929, 2467239, 2549451, 2538619, 2527045, 2657768, 2500122, 2411659, 2265056, 2367089, 2585532, 2593489, 2660594, 2680525, 2542323, 2558393, 2600705, 2661227, 2592237, 2673368, 2906291, 2854669, 2706585, 2765068, 2860314, 2823042, 2746221, 2790283, 2739414, 2747288, 2692153, 2856904, 2939709, 3079526, 3089419, 3074134, 3125934, 3045133, 3041025, 3181848, 3105146, 3087247, 3224581, 3337566, 3411700, 3385159, 3474689, 3701886, 3772810, 3752689, 3832800, 3896965]
5894C896965O9530Q5385J68370P1099J3553P9034M5410J61310J28405J29147O8519
5883D916727J13137J19604Q0135O8963K19987Q2986K42478K05636J88142L25577
5873F563372K3233L27807M27183M47773K58949L02413L29434K04597K76816L49728
5863I511305J77908L27644L84040K81148L89988L25201Q106J43607p5709k3111
5853A1450127k72350n397P5543J10356J57227K87406L61886M28185L86150N16797
5843A3495930N83178P16530N26138P72065O88511N31788N58111Q39599Q27595
5834A9539445Q67296Q85190Q17915K02628k19887l70846m44728k45036k14263
5825B0817714o8077J31849N94382M96552R01379P24251Q76617J198320J328945
$$ y = [3896965, 3966495, 4051880, 4220250, 4291349, 4304902, 4383936, 4429346, 4590656, 4719061, 4848208, 4916727, 5029864, 5149468, 5229603, 5298566, 5518553, 5601539, 5844017, 6049653, 6237795, 6563372, 6586605, 6914412, 7341595, 7789368, 8048317, 8350730, 8680164, 8884761, 9161577, 9511305, 9689213, 10016857, 10400897, 10682045, 11072033, 11397234, 11405340, 11548947, 11473238, 11450127, 11177777, 11172380, 11247923, 11358279, 11515506, 11802912, 12164798, 12592983, 12979133, 13495930, 14079108, 14795638, 15321776, 16093841, 16782352, 17314140, 17872251, 18711850, 19539445, 20406741, 21291931, 22109846, 22312474, 22092587, 21721741, 21277013, 21031977, 20817714, 20749637, 20881486, 21475868, 21972420, 22873799, 23598050, 24474667, 25672987, 27001932]
5816B7001932J404925J691322J874339K264639K299738K588764K793873L189764
5808D5109296L176882K549622J357532m22479j658045k513340k852228k463678
5800D2283562j914051j652767j019287n16008j86009J09824M92201P52355R88646
5791C9338466J233079J513926K053899K547210L192036L645479M167079M540006
5783F2231180M533190L259727R68284j786096m156797n284375n335810m746725
5775D9682578m167998l459088k725140k197157j691853j408174r18947p17724
5767C2396497n51004k10088J3747K59283M03204O03620R86611J235547J156249
5758C6293666J316667Q36879N7031r73895j929742k503472k606845k254173k234108
$$ y = [27001932, 28406857, 30098179, 31972518, 34237157, 36536895, 39125659, 41919532, 45109296, 48286178, 50835800, 52193332, 51770853, 50112808, 47599468, 44747240, 42283562, 40369511, 38716744, 37697457, 37181449, 36995440, 37105264, 37597465, 38349820, 39338466, 40571545, 42085471, 44139370, 46686580, 49878616, 53524095, 57691174, 62231180, 66764370, 70024097, 70992381, 69206285, 65049488, 59765113, 54429303, 49682578, 45514580, 42055492, 39330352, 37133195, 35441342, 34033168, 33114221, 32396497, 31845493, 31635405, 31649152, 31908435, 32311639, 32915259, 33901870, 35137417, 36293666, 37610333, 38447212, 38504243, 37530348, 35600606, 33097134, 30490289, 28236116, 26002008]
5749B6002008j860918j629981j537772j200076j135854r78841j026188p09053
5741A5923325m92028l44729k85595m05914m45495j84380j46087m25531l01553
5732A2892013l52446k98717k45372j86620k13068k28196j79748j59597o5983j360
5722A0960906k29550j68999j03963O0999n4591k8843j99144q9750n6285j01574
5712I989206k3768j02284L7255J9609m5969n0208j63290M757M3202j91432k17749
5701I299329M4682J31321L8159Q3058J54474K44121J89779K74140J72595J99672
5691A0831330j70412j31022k0903J0885l6395p3213M3263N550N5189p156j32277
5680A0374839P1637J08906K7588L9318L1156J46544M18611L32057J81347O47270
$$ y = [26002008, 24141090, 22511109, 20973337, 19773261, 18637407, 17658566, 16632378, 15923325, 15431297, 15086568, 14800973, 14395059, 13949564, 13765184, 13619097, 13193566, 12892013, 12539567, 12240850, 11995478, 11808858, 11595790, 11367594, 11187846, 11028249, 10962266, 10960906, 10731356, 10562357, 10458394, 10519393, 10464802, 10435959, 10236815, 10147065, 10090780, 9989206, 9965438, 9863154, 9900409, 9920018, 9874049, 9823841, 9660551, 9665308, 9708510, 9517078, 9299329, 9344011, 9475332, 9513491, 9596549, 9751023, 9995144, 10184923, 10459063, 10631658, 10831330, 10660918, 10529896, 10508993, 10519878, 10483483, 10410270, 10453533, 10459083, 10514272, 10507116, 10374839, 10446476, 10555382, 10582970, 10622288, 10653444, 10799988, 11218599, 11550656, 11732003, 12379273]
5670A2379273O41474O95237M98018R9716l03131n30647p14962p59405n78379m46843
5660A0980351k85328k88272k07438j11406o3291p6894L9541k5801q483k4031j66136
5649I762812o0691p5387N5510q8993j87391J61818R7868J8022p3527j30856j13987
5638I365198j18473k53630Q826j93576K6146l2362p839l0351Q8969K15711O500
5627I075119P7877n3966N4667O1040j3615r1278M4515l2762P7662J22283m8660
5616I272882R2238O6748Q6021J1261O1559J75920R0051J54455R6303K49725J57859
5605A0515022N5386J65344K18687J95709J71152J96243J62708J18877J18169Q2853
5595A2000150J76847M06183K49241P832K32543J59832J29157N4226J19052J58782
$$ y = [12379273, 13020747, 13715984, 14214002, 14313718, 14010587, 13479940, 12764978, 12005573, 11427194, 10980351, 10695023, 10406751, 10199313, 10087907, 10024616, 9947722, 9987263, 9961462, 9952979, 9928948, 9762812, 9702121, 9626734, 9682244, 9593251, 9405860, 9567678, 9665546, 9683568, 9610041, 9479185, 9365198, 9246725, 8993095, 9001921, 8808345, 8834491, 8802129, 8794290, 8763939, 8852908, 9068619, 9075119, 9152996, 9099030, 9153697, 9214737, 9201122, 9109844, 9154359, 9121597, 9199259, 9321542, 9272882, 9365120, 9431868, 9517889, 9529150, 9590709, 9766629, 9856680, 10011135, 10107438, 10357163, 10515022, 10570408, 10735752, 10954439, 11150148, 11321300, 11517543, 11680251, 11799128, 11917297, 12000150, 12176997, 12583180, 12832421, 12840253, 13072796, 13232628, 13361785, 13416011, 13535063, 13693845]
5585A3693845K11168K76017J93719K08572J99910J88862L40002M75666M86422
5576A6274183N84725M20125L14456L09971M60569J69438K70101L93057M30783
5567A9627408L92544M94975M18869N36701M91848M06417M39802L99941L29031
5558B3537536L91347O06845N94520P53043P04312P66163N14269M87495N08425
5549B8863955M78194M52017O03775Q60933Q88634P23623Q97789J093624Q32987
5540C5695531Q63477Q43515Q01706R99017J000878J027359J056583J017500J181903
5531D4487469J236763J172966J309278J294033J498502J510895J790331J725911
5523E6026148J791788J883406K040316K150925K211559K657695L176223L685023
$$ y = [13693845, 13905013, 14181030, 14374749, 14583321, 14783231, 14972093, 15312095, 15787761, 16274183, 16858908, 17279033, 17593489, 17903460, 18364029, 18533467, 18803568, 19196625, 19627408, 20019952, 20514927, 20933796, 21470497, 21962345, 22368762, 22808564, 23208505, 23537536, 23928883, 24535728, 25130248, 25883291, 26587603, 27353766, 27868035, 28355530, 28863955, 29342149, 29794166, 30397941, 31258874, 32147508, 32871131, 33768920, 34862544, 35695531, 36559008, 37402523, 38204229, 39203246, 40204124, 41231483, 42288066, 43305566, 44487469, 45724232, 46897198, 48206476, 49500509, 50999011, 52509906, 54300237, 56026148, 57817936, 59701342, 61741658, 63892583, 66104142, 68761837, 71938060, 75623083]
5515G5623083M170492M769756N757180O176356N189574K482088j30967r46491
5507A03091071o52395K36077J518318K825699M040090M997162O106320O940424
5499A29102766P207007O519962O115096O725947Q157053R663180J0714887J1762831
5491A95968729J2489526J2273909J0850476Q107042M337213J285921j446120l531883
5483B40334813n823719q288941r986942j0225750r060921o573162l693709j119075
5475A85562594J151326L281284M986610O741545Q034951Q871950R107798J0166423
5467B37904481J2842673J6735686J9895809J6091543M17508j8095027k9272617
5460B56520056l2025271k8185143k2719398j8006056j4745762j2375541j0207502
$$ y = [75623083, 79793575, 84563331, 90320511, 96496867, 101686441, 104168529, 104037562, 103091071, 102438676, 102674753, 104193071, 107018770, 111058860, 116056022, 122162342, 129102766, 136309773, 142829735, 148944831, 155670778, 163827831, 173491011, 184205898, 195968729, 208458255, 220732164, 231582640, 239689682, 244026895, 245312816, 243866696, 240334813, 234511094, 226222153, 216235211, 206009461, 196948540, 190375378, 186681669, 185562594, 186713920, 189995204, 194981814, 201723359, 209758310, 218630260, 227738058, 237904481, 250747154, 267482840, 287378649, 303470192, 303887700, 285792673, 256520056, 224494785, 196309642, 173590244, 155584188, 140838426, 128462885, 118255383]
5453A18255383q592623p613905o818250n880284m892367m259546l611978l492904
5445G3093526l709544l434155l355809k907849k647057k718669k816272k904936
5437D8599235k684014k515081k108866j698597j425012j442264j058599j058776
5429C4608026p89505r60668j001819j146744j508426j304181j067879q15076j011046
5420B5002682r39976p38703p16411r03301q35304o97231n36921o09634o35069
5411A8390132o95891o88374l90974l45447l65455m81365m59746m19109l58814
5402A4184957l59163k98578k51740l14070k35400k56108j85449k65108j03624
5393A1915717k49522k39935k58720k32084k30883k22450k61115r6058k45507j56896
$$ y = [118255383, 109662760, 102048855, 95230605, 89350321, 84457954, 80198408, 76586430, 73093526, 69383982, 65949827, 62594018, 59686169, 57039112, 54320443, 51504171, 48599235, 45915221, 43400140, 41291274, 39592677, 38167665, 36725401, 35666802, 34608026, 33818521, 32857853, 31856034, 30709290, 29200864, 27896683, 26828804, 26013728, 25002682, 24062706, 23324003, 22607592, 21704291, 20868987, 20171756, 19634835, 19025201, 18390132, 17694241, 17005867, 16614893, 16269446, 15903991, 15422626, 14962880, 14543771, 14184957, 13825794, 13527216, 13275476, 12961406, 12726006, 12469898, 12284449, 12019341, 11915717, 11666195, 11426260, 11167540, 10935456, 10704573, 10482123, 10221008, 10124950, 9879443, 9722547]
5383I722547j87822j8116m5090j58180K7218j24365r6410j45879o6572j4957O475
5372H898849j20273n9505J86203M2054j65707J29077l7818J67016N8436M39P1070
5361I169841P0549K63248J52343J43701K06005M4505N9891K23921O7666J51063
5351A0552733K12926J50251l7192r4651l9633r4400K9445j45040p4656j37301
5341A0322482j8379Q5120K7965M7294J27570N7815J90985L01481L22957L75317
5331A1840607L81758M95293M16923K69084L00222K85382J75019L70309N84400
5322A5118997O35096O96303R62046J194229J146912J067320Q80280M67391o3783
5313B2104791l35870k26863l67984m58143l87609k66162k54659l51628o12651
$$ y = [9722547, 9534725, 9516609, 9471519, 9313339, 9340557, 9216192, 9119782, 8973903, 8907331, 8892374, 8898849, 8778576, 8719071, 8905274, 8947328, 8781621, 8910698, 8872880, 9039896, 9098332, 9098771, 9169841, 9240390, 9503638, 9655981, 9799682, 10005687, 10050192, 10110083, 10334004, 10401670, 10552733, 10765659, 10915910, 10878718, 10784067, 10744434, 10650034, 10679479, 10534439, 10459783, 10322482, 10304103, 10389223, 10417188, 10464482, 10592052, 10649867, 10840852, 11142333, 11465290, 11840607, 12222365, 12717658, 13134581, 13403665, 13703887, 13989269, 14164288, 14534597, 15118997, 15754093, 16450396, 17412442, 18606671, 19753583, 20820903, 21701183, 22168574, 22104791, 21768921, 21542058, 21174074, 20715931, 20328322, 20062160, 19807501, 19455873, 18843222]
5304A8843222n99482n56144o04330p41435q04052o06960n85592m84104l63505
5295A3497618l22125j81440Q6550J5534K07658K35381N65210O86491P83958Q87457
5285A6462292Q73815N80268j53522m61004p80096q81269o58591o88504o18346
5276A3675043m73705k94038j33636r3461P0342J54161K99302L28113K01360k42719
5266A3490762o96032p24535q98377q47652o36494m91561n16417n13629k99498
5257G866567j89539p9785q5347K736l6603q3127J5289k37576l42349k89957l55997
5246F184312l24066k43130k55023k11779n2954j82082n7893j14892k6315j32565
5236D583613j51174M4929j59029m8902l8782j47136l03333j25695j30408n9189
$$ y = [18843222, 18243740, 17687596, 17083266, 16341831, 15537779, 14930819, 14345227, 13861123, 13497618, 13175493, 12994053, 13080603, 13096137, 13303795, 13539176, 14104386, 14790877, 15574835, 16462292, 17336107, 17916375, 17762853, 17301849, 16521753, 15640484, 14981893, 14293389, 13675043, 13201338, 12907300, 12773664, 12680203, 12750545, 12904706, 13204008, 13532121, 13733481, 13490762, 12794730, 12070195, 11171818, 10324166, 9687672, 9196111, 8679694, 8166065, 7866567, 7677028, 7597243, 7511896, 7514632, 7478029, 7394902, 7410191, 7172615, 6830266, 6540309, 6184312, 5860246, 5617116, 5362093, 5150314, 5097360, 4915278, 4857385, 4742493, 4716178, 4583613, 4432439, 4477368, 4318339, 4269437, 4230655, 4083519, 3780186, 3654491, 3524083, 3464894]
5226C464894M4224p3740j49331J5963J83402k01372P2095K3518q3453J9031J24687
5215C439918r1479L4681j40325n585O2414K21860J20991n88J52817R1726J09143
5204C995573j11085r1743L6947m2058j09156j37424m8786m0695o8721k2435l9341
5193C321076m6074N4777M2921p5088j48163q2847K06341L1901n8600M7549r3924
5182C199869m9815J40299P6316m9677K9951J82409q3678M1637J75816O3809Q7867
5171C814803N8734J76926J43139j8897M2000Q5144k1495j00097q4681L1832q1321
5160D046087j06005r6356p7586k0477j66424j46807n8444r2097J92357q411l7171
5149C428666p7277J61551O0451N081P099k9445P2204p3850o136l3176J41630O7423
$$ y = [3464894, 3509118, 3435378, 3286047, 3302010, 3485412, 3284040, 3356135, 3379653, 3296200, 3315231, 3439918, 3348439, 3383120, 3242795, 3237210, 3299624, 3521484, 3642475, 3641887, 3794704, 3886430, 3995573, 3884488, 3792745, 3829692, 3787634, 3678478, 3541054, 3492268, 3451573, 3382852, 3360417, 3321076, 3275002, 3329779, 3372700, 3297612, 3149449, 3066602, 3272943, 3304844, 3246244, 3293793, 3199869, 3150054, 3290353, 3366669, 3316992, 3346943, 3529352, 3445674, 3487311, 3663127, 3726936, 3814803, 3873537, 4050463, 4193602, 4174705, 4216705, 4301849, 4280354, 4180257, 4095576, 4127408, 4046087, 3940082, 3843726, 3766140, 3745663, 3579239, 3432432, 3373988, 3281891, 3474248, 3465837, 3428666, 3351389, 3512940, 3573391, 3578472, 3585571, 3556126, 3628330, 3554480, 3548344, 3515168, 3656798, 3724221]
5137C724221Q961q2657J95016q3057J14973O5150j6640K50577Q5786N9334L61833
5126D683497K10767L04141N55466Q5868k92949n16731l25758j36951l51541J2945
5116D228754P4420l383k8880j03668n1705j32304o9438Q6570j36750M4160l7535
5105C870241N6604J30552j76817j48604J56863p5646q1545J2662J3831J03952
5095C862093J2170L9071K82933K16475n1015j39226K84599K05205J28718K46p164
5084D834105k8839J58230J20919J61196K25464N0514J77914K50921k3048K48791
5074F176167K16384L62443J63538r4041J66802K07119L02610J26848L30142O8724
5064H026736J93664K48850L93071M72908L26388J41353L05013N62851L77299L71463
$$ y = [3724221, 3733182, 3650525, 3845541, 3762484, 3877457, 3942607, 3925967, 4176544, 4262330, 4321664, 4683497, 4894264, 5198405, 5753871, 5839739, 5546790, 5030059, 4704301, 4567350, 4215809, 4228754, 4303174, 4299791, 4270911, 4167243, 4115538, 3983234, 3913796, 4000366, 3863616, 3907776, 3870241, 3926845, 4057397, 3880580, 3731976, 3888839, 3813193, 3731648, 3744310, 3758141, 3862093, 3874263, 3913334, 4196267, 4412742, 4361727, 4222501, 4507100, 4712305, 4841023, 4841269, 4834105, 4805266, 4963496, 5084415, 5245611, 5471075, 5521589, 5699503, 5950424, 5927376, 6176167, 6392551, 6754994, 6918532, 6824491, 6991293, 7198412, 7501022, 7627870, 7958012, 8026736, 8220400, 8469250, 8862321, 9335229, 9661617, 9802970, 10107983, 10670834, 11048133, 11419596]
5054A1419596M70719M00434M00385N23710N03472J99707M3221M0731O2726j8479
5044A4046222J82481L04534K00404L16548M11593L23751N62826M26748N75228
5035A7350335P25537Q67313J018543J143527J121152J460863J600554J887421
5027B7175245J032145J5589l54981k56433J10565N65696P68388J292882J660932
5018C2010028K030097K639022L379699L823614M259273M873168N647769O531897
5010F5194567P522974Q443716J0141950J1788347J4179063J7136239K1969389
5003A56376245K8759190K9530023L164953k1515200l1480762l2351444k3585394
4996A08897611j7627746j2653108j0888558q188060o809518n174433m538719m161101
$$ y = [11419596, 11890315, 12290749, 12691134, 13214844, 13718316, 13918023, 13961244, 14001975, 14064701, 14046222, 14228703, 14533237, 14733641, 15050189, 15461782, 15785533, 16348359, 16775107, 17350335, 18075872, 18943185, 19961728, 21105255, 22226407, 23687270, 25287824, 27175245, 28207390, 28222979, 27867998, 27611565, 27722130, 28287826, 29056214, 30349096, 32010028, 34040125, 36679147, 40058846, 43882460, 48141733, 53014901, 58662670, 65194567, 72717541, 81161257, 91303207, 103091554, 117270617, 134406856, 156376245, 185135435, 214665458, 217830411, 196315211, 164834449, 132483005, 108897611, 91269865, 78616757, 67728199, 59540139, 52730621, 47556188, 43017469, 38856368]
4988C8856368l616435k751236k464118j807609j650525j437363j161005p60874
4980B3207203r33798p04463p41717n48854l85440l60872j59980J76944M29884
4971A9978907Q11167K41848r87622j469774j577682j477855j064344p17608p06181
4962A3030856p22989l81477k65251m60623l02977k37576k10477j0567r6800J5645
4952A0357764K42456R3327J15513J62208L15186K95373O09214P82842P61714Q83484
4942A4619081J180786J511978J814427K444361L226341K122572r95258k701792
4934B3222496l644359k833277k020073j566138j273432j087415q01555o54426
4926I341821n23089m98135l84237l23304j62185o1636j60761m9237k23374r7955
$$ y = [38856368, 35239933, 32488697, 30024579, 28216970, 26566445, 25129082, 23968077, 23207203, 22273405, 21568942, 20827225, 20278371, 19892931, 19532059, 19372079, 19549023, 19978907, 20790074, 21031922, 20044300, 18574526, 16996844, 15518989, 14454645, 13737037, 13030856, 12307867, 11926390, 11661139, 11200516, 10897539, 10659963, 10449486, 10438919, 10342119, 10357764, 10600220, 10693547, 10809060, 10971268, 11286454, 11581827, 12191041, 12973883, 13735597, 14619081, 15799867, 17311845, 19126272, 21570633, 24796974, 26919546, 25924288, 23222496, 19578137, 16744860, 14724787, 13158649, 11885217, 10797802, 9996247, 9341821, 8818732, 8320597, 7936360, 7613056, 7450871, 7389235, 7228474, 7179237, 6955863, 6857908]
4916F857908N1305j5736l6313m1327J03465j06270P4610J2174J66359M07886M32566
4905G906627L19951L29506L82516M98331M37233P12090O70830P86467J114884
4896A3158435J476277J757121K480775J553054m26790j405706k114557k101813
4888A4376796j988210j728972j327926j086108q57929p90554n86552l93700m38540
4879E178305k76858j40696m38790l49433j73041p8316p6984k4463k00234j27960
4869C291530o1355j20519N9646j97896k67876j23746P7259Q7470j11118q1893
4859B551502j29274l5956K995L3012q9861J27838L6139p9739m6184j06081q7766
4848B176625M5126M62j61441j2286P3409j05808j7951l8902r8452l2978N7715
$$ y = [6857908, 6909213, 6893477, 6857164, 6815837, 6919302, 6813032, 6887642, 6899816, 7066175, 7474061, 7906627, 8226578, 8556084, 8938600, 9436931, 9874164, 10586254, 11257084, 12043551, 13158435, 14634712, 16391833, 18872608, 20425662, 19998872, 18593166, 16478609, 14376796, 12388586, 10659614, 9331688, 8245580, 7387651, 6597097, 6010545, 5616845, 5178305, 4901447, 4760751, 4321961, 3972528, 3799487, 3721171, 3644187, 3619724, 3419490, 3291530, 3230175, 3109656, 3169302, 2971406, 2703530, 2579784, 2657043, 2744513, 2633395, 2551502, 2422228, 2386272, 2389267, 2422279, 2332418, 2460256, 2496395, 2416656, 2370472, 2264391, 2176625, 2221751, 2222213, 2060772, 2048486, 2121895, 2016087, 1998136, 1959234, 1860782, 1827804, 1885519]
4837A885519R6480K0759j59130J2194J38293j2612q0427J97579l3138j93115J27186
4826A999588N6725R8899J52539n7213l3256L8418P2868Q9510M8147l9397J54225
4815B581053K18951J67623K57269Q075K00988L12559L93830M38036M03707N82664
4805E564755P19770P50378R54572J355618J523048P94687o45160j298936j713582
4796H005150j348190j027901p72462n03604n47909m65731k91553j73738k69353
4787B604709k89594j44710m5890j48647m4903j67751o6658j60379n7315j0034
4777A468828Q2383j01967p8875j60482p5150N0467J71101k4403j27637K4209M3312
4766A271786m7401j73682r9874J57114L9493k853k14871j27487N1539N8591o8326
$$ y = [1885519, 1981999, 2002758, 1843628, 1855822, 1994115, 1981503, 1901076, 2098655, 2065517, 1872402, 1999588, 2056313, 2155212, 2307751, 2250538, 2217282, 2255700, 2328568, 2418078, 2466225, 2426828, 2581053, 2800004, 2967627, 3224896, 3232971, 3433959, 3746518, 4140348, 4578384, 4982091, 5564755, 6284525, 7034903, 7989475, 9345093, 10868141, 11662828, 11017668, 9718732, 8005150, 6656960, 5629059, 4856597, 4352993, 3805084, 3339353, 3047800, 2874062, 2604709, 2315115, 2170405, 2124515, 1975868, 1930965, 1763214, 1696556, 1536177, 1478862, 1468828, 1551211, 1449244, 1370369, 1209887, 1134737, 1185204, 1356305, 1331902, 1204265, 1228474, 1271786, 1224385, 1050703, 950829, 1107943, 1147436, 1144583, 929712, 802225, 853764, 912355, 844029]
4755H44029J03062J85686k8995k7967J4793L7604J12482j3721n4441J48409k8592
4744A292349r1148j57581R42q8908l7766j1849r2737J01829P2838L5907j62204
4733H61672q2446p3608m5565O6644P5628R7586m9586p1767M9292J24084k3277
4722I28657n9614J11420P7395n1981K9446n5118O8794n5550K0593M5799J0338
4711A070179k5862r2088J17530J12136R4634M494k1994l0484L5143J19482J52051
4700A535221K81415J87920N4894j9466K2214q8643j53991m7803k20934r356J37468
4689A678939M4155M0599j38892Q0072J41552j0672l3928k70648k62536m5558j39679
4678A083404J2893q5460k57245k4521K87242j03381j47185o0756n7311O0616p602
$$ y = [844029, 947091, 1132777, 1103782, 1075815, 1090608, 1128212, 1240694, 1226973, 1172532, 1320941, 1292349, 1201201, 1043620, 1044562, 955654, 917888, 906039, 813302, 915131, 987969, 1023876, 861672, 779226, 705618, 660053, 726697, 802325, 899911, 850325, 778558, 827850, 951934, 928657, 869043, 980463, 1057858, 1005877, 1035323, 980205, 1048999, 993449, 1014042, 1059841, 1070179, 1044317, 952229, 1069759, 1181895, 1276529, 1281023, 1259029, 1228545, 1263688, 1383170, 1535221, 1816636, 2004556, 2059450, 2039984, 2062198, 1973555, 1819564, 1771761, 1550827, 1541471, 1678939, 1723094, 1763693, 1624801, 1704873, 1846425, 1835753, 1801825, 1531177, 1268641, 1223083, 1083404, 1096297, 1010837, 753592, 729071, 1016313, 912932, 765747, 704991, 647680, 708296, 700694]
4667G00694N867p7121M2466M3076N4822j22035r7565N5556J06226r1196P7445
4656F98235Q9756m5236M4028l3703j8063J09564l015j36182j03632K0617O44k0251
4644F02762m9954n5268K9715J7877J384r523J34745R5n4786q4554r805j0008Q7660
4631F00340k8069N256j6681P3161J14021p7995q7982r7952J5164M0742J19432
4620F59437J06165j32929L603m5986l0482l4406K0052j5677m530K2405L4499O1921
4608F44072L5244o4362j2881J94882j81888N1070N8312M4099M4105J05766l3792
4597H84627N4854K860j01533l5398j24996n0779O3647j86667M696Q6554j02969
4586D94896N6360n3616q4085j13908J67400J563k7598j4094j8771P7965l9988
$$ y = [700694, 706561, 629440, 671906, 714982, 769804, 647769, 550204, 605760, 711986, 620790, 698235, 787991, 742755, 786783, 753080, 735017, 844581, 841566, 705384, 601752, 622369, 623013, 602762, 552808, 497540, 527255, 545132, 546516, 536993, 671738, 671833, 617047, 532493, 522688, 512680, 600340, 572271, 577527, 560846, 634007, 748028, 670033, 582051, 484099, 499263, 540005, 659437, 765602, 632673, 636276, 590290, 559808, 525402, 545454, 529777, 525247, 547652, 582151, 644072, 679316, 614954, 602073, 796955, 615067, 666137, 724449, 768548, 812653, 918419, 884627, 939481, 942341, 840808, 805410, 680414, 629635, 693282, 506615, 511311, 597865, 494896, 551256, 497640, 413555, 299647, 467047, 468610, 441012, 426918, 408147, 486112, 446124]
4575D46124r2590q9331Q1815O8261m6800M8087M0595m6368q0618J25503L4518
4564D89196j11185r3959K6883Q9863q9552N4204n5631O0532L6572j03236L0509
4553C34196o9527J51783J5023j58845P2626L2475j60938J54402L7961q9602P6561
4542C96115n0550M8750M80J14019j05871j54917l3342M7067J07019j5330K04p0648
4530B82996l650O1724J80247l4575j42352o2206K5836K6848N9428n0838m8595
4519B94863N6518P6517L5684p9791q3496P8862O0009L1065o0292j00811L378m9791
4507B62715Q262l3738n674j00944J50087O6154m0887m5235J5672J13050r0021
4496B99441P7799M0814J0574N6778n5517j14158J9877j2478r9835M6535l0023
$$ y = [446124, 353534, 264203, 346018, 414279, 367479, 415566, 456161, 409793, 329175, 454678, 489196, 378011, 284052, 310935, 400798, 311246, 365450, 309819, 370351, 406923, 303687, 334196, 264669, 416452, 431475, 272630, 345256, 377731, 216793, 371195, 409156, 319554, 396115, 345565, 394315, 394795, 508814, 402943, 248026, 214684, 261751, 368770, 353440, 353644, 282996, 279346, 341070, 521317, 486742, 344390, 282184, 308020, 334868, 394296, 343458, 294863, 351381, 427898, 463582, 383791, 300295, 379157, 439166, 470231, 409939, 309128, 312506, 262715, 270977, 237239, 231565, 130621, 280708, 346862, 305975, 260740, 276412, 389462, 299441, 377240, 418054, 428628, 485406, 429889, 315731, 335608, 323130, 223295, 269830, 239807]
4485B39807K55139O314j5941K511R98J54032k3358k40874l7018P8102L4746J49646
4473F04104j30911m5867N2821o2638K5489p99L6645L8542M626j40447p0510K4961
4461C36016J06260n2685o2527J20708M5880p7363k8574p83l2574N0798J04773
4450E09929j04486J4903J06277j09646P8152J96466p9275o4931J9592J167P8265
4439F46413n4665K5588j11898q940O7368P3840J08338q6950q29l7899n4417Q8614
4427F54563p0567J6392j7194r5530q1376J03448J04922m1830r3022k3300l8026
4416D18480J94836q1641q6569l3159L3993J97472r8557O7576j41167K1038R6469
4405E88771m9243R3020M1141j67220l0706P9755N0456o6008O923L3455N5488j450
$$ y = [239807, 494946, 501260, 485319, 487830, 488828, 642860, 619502, 378628, 341610, 419712, 454458, 604104, 473193, 427326, 480147, 417509, 442998, 442199, 478844, 517386, 522012, 381565, 311055, 336016, 442276, 389591, 327064, 447772, 493652, 416289, 387715, 386932, 354358, 405156, 509929, 405443, 420346, 526623, 416977, 495129, 691595, 612320, 547389, 566981, 568148, 646413, 591748, 617336, 505438, 496498, 563866, 637706, 746044, 659094, 658265, 620366, 565949, 654563, 583996, 600388, 583194, 487664, 406288, 509736, 614658, 572828, 479806, 456506, 418480, 613316, 531675, 445106, 411947, 445940, 643412, 544855, 612431, 471264, 492302, 588771, 539528, 632548, 673689, 506469, 475763, 555518, 605974, 539966, 546889, 580344, 635832, 634382]
4393F34382K4863r7437j52438P9375L4549J55524M3737R58l0862N3900n2348N660
4381F99863k9468r5025Q4978J04779k6393O9869j38274n6766M3246n2882j943
4370F01984R7711Q008j32487j36700J08999J1128n0862j1811J32035M1867P6548
4359G46420L5449j78599l8166L8446j6222J41483M1012N046p0462j28253j5003
4348E61151J547J61711l0973N1943J6072J34693m4322j8309K5623O6568M4481
4337I70185m2010j22332K6086J9533M2344Q4579L5934l0753Q347J5271o5668m6959
4325H94557K8940K30982J60719K1473J0851L5226J66475K60834J27691j7830J85228
4314B105146J48542K05938K90683K70282L80298M53426L77722M51522P19298P87446
$$ y = [634382, 659245, 561808, 409370, 488745, 523294, 678818, 722555, 723513, 692651, 746551, 694203, 699863, 670395, 575370, 660348, 765127, 738734, 808603, 670329, 613563, 656809, 603927, 601984, 699695, 707703, 575216, 438516, 547515, 558643, 507781, 495970, 628005, 669872, 746420, 781869, 603270, 565104, 603550, 587328, 728811, 769823, 774869, 704407, 576154, 561151, 562698, 724409, 693436, 745379, 761451, 896144, 851822, 833513, 859136, 925704, 970185, 928175, 805843, 831929, 851462, 893806, 978385, 1014319, 983566, 991913, 1007184, 941516, 894557, 923497, 1154479, 1315198, 1336671, 1347522, 1382748, 1549223, 1810057, 1937748, 1919918, 2105146, 2253688, 2459626, 2750309, 3020591, 3400889, 3854315, 4232037, 4683559, 5402857, 6190303]
4304F190303J025077J454469N67848o57455j361754j562530j087998p64232l68360
4295C435368m02985n63100j70876q4422k14483k01047j58254l041j87019p3815
4285A376326L1389j25970j63365j25910q2126p2042L5632N8127j83085n8859K3056
4274G13173P8528P3318j34083l6095p0011N5043J449M0905J20338j52434k1852
4263F68279j28567N0071J279j8192j1729k2527r961k4851J15976j51975k5238
4252D42565k5830M6199o336q7100n1700R8866M1177o3046J42505J9690j35164
4241D21826p7939J16168J4930j12738J33858n733j37882o9820j8583J28191O4586
4230D56864J23000m6976j18405O6356k9365j89139j16685Q0981L9261R9081m0301
$$ y = [6190303, 7215380, 8669849, 9237697, 8580242, 7218488, 5655958, 4567960, 3803728, 3435368, 3032383, 2469283, 2298407, 2213985, 1999502, 1798455, 1640201, 1637160, 1450141, 1376326, 1407715, 1281745, 1118380, 992470, 910344, 838302, 873934, 932061, 748976, 690117, 713173, 791701, 865019, 730936, 694841, 624830, 679873, 681322, 722227, 842565, 690131, 668279, 539712, 589783, 591062, 572870, 561141, 538614, 528653, 503802, 619778, 467803, 442565, 416735, 462934, 456598, 369498, 317798, 416664, 457841, 394795, 537300, 556990, 421826, 343887, 460055, 474985, 362247, 496105, 490372, 352490, 282670, 264087, 392278, 456864, 579864, 532888, 414483, 480839, 451474, 262335, 145650, 226631, 265892, 364973, 324672]
4219C24672J14599l7603K871j18932R6176K9354k1320P4421L7803n3050P8691
4208E27682K5205j58684R9667j0437J06968j48435j02622n8704J11659J12073
4198E04372J39880o3809j38613l5037J46524O7447J54019j10253j70690q4637
4188D09203j3821J23810Q0883R8397j8141j44627M6089N1826p3915O5699J42596
4177G67999L2244j03833o5141j47107N7010n0523l2893R8255m965j094J5466p0084
4165D95334N1552M6817l6025Q2953J7006L6142j7786m634Q324o6445N6198j1275
4153F58161M5374j27829J12411n5230j6372M0546L7761j0738j0763J08156q4637
4142F96840M0098K9107K9727n9405R4864j33594N5393R4150n0335M5433J05670
$$ y = [324672, 439271, 401668, 404539, 285607, 381783, 411137, 389817, 464238, 502041, 448991, 527682, 552887, 394203, 493870, 483433, 590401, 441966, 339344, 280640, 392299, 504372, 644252, 580443, 441830, 406793, 553317, 620764, 774783, 664530, 493840, 409203, 395382, 519192, 600075, 698472, 680331, 535704, 581793, 633619, 559704, 625403, 767999, 800243, 696410, 631269, 484162, 541172, 490649, 457756, 556011, 551046, 549952, 565418, 495334, 546886, 593703, 557678, 640631, 657637, 693779, 675993, 671359, 679683, 613238, 669436, 658161, 703535, 575706, 688117, 632887, 616515, 657061, 694822, 684084, 673321, 781477, 696840, 736938, 766045, 795772, 736367, 831231, 697637, 753030, 847180, 796845, 842278, 947948]
4131I47948j23864O3719p0607n7030M1574P5566M1720O5083J7250j21943R5558
4120I74974q6460q2770j0322Q4656P9348L4950N4582j27536P6036L4325l9687
4109I92096J4147r9394o4397O3145l7890j42087M6008J10303Q3922J6048j6771
4098I65130K8088M392M9753l8760O9259R8584P5340l5442k16733K6473J41109
4087A167193J26638L49J531p1880m1745p8111K00740j4048K6795P8293n4544j42801
4075A198410J34041k897k6256Q9801J213n606j69592l6218J96095N1395k0718
4064A409668J16434p7039r7211R3909k7827Q7194J34354J5141J2058M7148L4458
4053A748287p9060M0801J5354j03881j5691p2658J8679o0115l2170J63491r2736
$$ y = [947948, 824084, 887803, 817196, 760166, 801740, 877306, 919026, 984109, 1001359, 879416, 974974, 888514, 805744, 795422, 880078, 959426, 994376, 1048958, 921422, 997458, 1031783, 992096, 1006243, 906849, 842452, 905597, 867707, 725620, 771628, 881931, 965853, 981901, 965130, 993218, 997610, 1047363, 1008603, 1077862, 1176446, 1251786, 1216344, 999611, 1026084, 1167193, 1293831, 1294180, 1295711, 1223831, 1182086, 1103975, 1304715, 1290667, 1317462, 1395755, 1341211, 1198410, 1332451, 1329554, 1303298, 1393099, 1394312, 1388706, 1219114, 1182896, 1378991, 1430386, 1409668, 1526102, 1449063, 1351852, 1445761, 1417934, 1505128, 1639482, 1654623, 1666681, 1713829, 1748287, 1669227, 1710028, 1725382, 1621501, 1605810, 1533152, 1551831, 1491716, 1459546, 1623037, 1530301]
4042A530301q5119K07602j8938J45064n2692j5679O1498p8962J09958l4161n7971
4031A710901J83492J03675P0117J6209m6842m3264q2246M2194m0640J15749K6564
4020B055909k4350r328J57376n005J29484K8084j09206N1049R8021J4384J16021
4009B502439j07144J001J35188J26802J68102K417p2858p9990Q2565o3628n6498
3998B638396R5810J18888N4236J6047Q8793R3105R9276l1770K2961J33806k208
3987C327340O7425J20096J7040J83374J9093P958k1065k2694K49356O7136j02300
3976C912759J54330Q9384K23411J39606J06879J46750J78138M8882R1155K29272
3966E320566Q3326N8943K28096J65430O1641K97496K64084O4174N3549J48250
$$ y = [1530301, 1445182, 1652784, 1633846, 1778910, 1726218, 1710539, 1772037, 1693075, 1803033, 1768872, 1710901, 1894393, 1998068, 2068185, 2084394, 2037552, 1994288, 1912042, 1954236, 1913596, 2029345, 2055909, 2031559, 2022231, 2179607, 2174602, 2304086, 2332170, 2222964, 2274013, 2372034, 2386418, 2502439, 2395295, 2396296, 2531484, 2658286, 2826388, 2828805, 2755947, 2675957, 2758522, 2694894, 2638396, 2734206, 2853094, 2907330, 2923377, 3012170, 3105275, 3204551, 3172781, 3195742, 3329548, 3327340, 3394765, 3514861, 3531901, 3715275, 3734368, 3742326, 3721261, 3698567, 3947923, 4015059, 3912759, 4067089, 4156473, 4379884, 4519490, 4626369, 4773119, 4951257, 5000139, 5091294, 5320566, 5403892, 5462835, 5690931, 5856361, 5918002, 6215498, 6479582, 6543756, 6597305, 6745555]
3956F745555L25037L60174J00456K10738K57963K93011L49972J75565J86912K54651
3946I260034K44678L61834L78053K29150J92128K93515J51040K01534Q3093J30980
3936A1526039K33497J45179m2283n1514M9979J0905O124o4145j29753l60935l43498
3925A0979595p9599k15791l62045k54964k56491k52197j50291k14220k56556j54562
3915H782879j73746k65454k44350k21665k35437k78897j22318j21860j23985l34365
3905F660802k20835j13485j04847n3203k4782k24892J3693m7984k52906n5815
3895E575746o2471j41760q9875q2105L257j55739j24606k6548p2780o3284j46186
3884D613649M4464R264j16600q8054L6028p4388j33292k3538j29440J15317K4084
$$ y = [6745555, 7070592, 7430766, 7531222, 7741960, 7999923, 8292934, 8642906, 8818471, 9005383, 9260034, 9504712, 9866546, 10244599, 10473749, 10665877, 10959392, 11110432, 11311966, 11395059, 11526039, 11759536, 11904715, 11862432, 11810918, 11860897, 11871802, 11877926, 11813781, 11684028, 11323093, 10979595, 10899996, 10684205, 10322160, 10067196, 9810705, 9558508, 9408217, 9193997, 8937441, 8782879, 8609133, 8343679, 8099329, 7877664, 7642227, 7363330, 7241012, 7119152, 6995167, 6660802, 6439967, 6326482, 6221635, 6168432, 6143650, 5918758, 5932451, 5884467, 5631561, 5575746, 5513275, 5371515, 5281640, 5199535, 5202792, 5047053, 4922447, 4895899, 4823119, 4759835, 4613649, 4658113, 4667377, 4550777, 4462723, 4498751, 4424363, 4291071, 4267533, 4138093, 4253410, 4277494]
3873D277494k6310n2256p6194l198q3365M6730j27195l5979J786N1052K9588j11520
3861C890633N0287m7872j7301O7040p0860j02199n0460j2115o6854K13213j06547
3850C746965p4202n2418k5827k5163P3950M0428q3800j18520J3438J63546P813
3839C666210K1669l8588j11706p0115n7360k6773q1736Q5410J40881j1587K2801
3828C539106L122Q7910R527k3652j09472r3881O7296j30423M6430j3571o9556
3817C312836o025R8978N8802l7065r5378q0442k564P1883o749n0353j8013K8876
3805C274786J46810j6506j8327p8827J29312m4391N0083K61959o6322k192r4568
3794C541817K4554q2923j12385J77025J9044p5988n4383M0017J4559J28369N7448
$$ y = [4277494, 4251184, 4198928, 4122734, 4119536, 4036171, 4082901, 3955706, 3919727, 3921513, 3972565, 4002153, 3890633, 3940920, 3893048, 3875747, 3942787, 3871927, 3769728, 3719268, 3707153, 3640299, 3853512, 3746965, 3672763, 3620345, 3594518, 3569355, 3643305, 3683733, 3599933, 3481413, 3494851, 3658397, 3666210, 3687879, 3649291, 3537585, 3467470, 3410110, 3383337, 3301601, 3387011, 3527892, 3516305, 3539106, 3542228, 3630138, 3639665, 3616013, 3506541, 3412660, 3479956, 3349533, 3395963, 3382392, 3312836, 3306811, 3405789, 3464591, 3427526, 3332148, 3251706, 3249142, 3321025, 3314276, 3263923, 3245910, 3274786, 3421596, 3405090, 3386763, 3307936, 3437248, 3392857, 3442940, 3704899, 3638577, 3636385, 3541817, 3566371, 3483448, 3371063, 3548088, 3567132, 3491144, 3436761, 3476778, 3491337, 3619706, 3677154]
3783C677154J05225o3425p0910L4204k0843m651q2716N6508k2038j33646O7893
3772C542755o858K2795P1800o0276J1040J54994J19198O014J3730N158Q8452r3081
3760C875721l4386M1408o8413J12780J53988m8722n8454j45472M1446N9127J20438
3749D049461l1166j09699N8361n7406R7789N6406j33831o0429n3124r0555J11625
3738C837432j09125O999J28340J7365K7558M2756L1483m475p2517O5863N8793
3727D030472j7411p2911O5300P2321m7504q1522p5661L6885J66502k7497l5445
3716D013529m9687R0516K656K3039O7160q3976j09940k2682K7418j60086j08273
3705C689674J11888J14294L6645k1761K1703O651Q5431j08680K9732P5531n7093
$$ y = [3677154, 3782379, 3718954, 3648044, 3682248, 3661405, 3656754, 3574038, 3630546, 3608508, 3474862, 3542755, 3535897, 3558692, 3630492, 3570216, 3581256, 3736250, 3855448, 3861462, 3875192, 3880350, 3968802, 3875721, 3841335, 3882743, 3814330, 3927110, 4081098, 4032376, 3973922, 3828450, 3869896, 3929023, 4049461, 4018295, 3908596, 3966957, 3909551, 4007340, 4063746, 3929915, 3869486, 3816362, 3725807, 3837432, 3728307, 3735306, 3863646, 3881011, 3908569, 3951325, 3982808, 3978333, 3905816, 3971679, 4030472, 4013061, 3940150, 4005450, 4077771, 4030267, 3948745, 3873084, 3909969, 4076471, 4048974, 4013529, 3963842, 4054358, 4057014, 4080053, 4147213, 4063237, 3953297, 3930615, 3958033, 3797947, 3689674, 3801562, 3915856, 3952501, 3930740, 3952443, 3959094, 4044525, 3935845, 3965577, 4041108, 3984015]
3694C984015k246O5920R6266K4898M7488j43267j16400N6357J5106J17423P8942
3683D224502l9445j6083n1536n857J12064m4099k4507J9843K0766P6148j0855
3672D260941N6316m2268r1734K6699Q4296J3216J44645l1864j096p338j0243r4500
3660D307070L7366J29794n9422p9956M8009l6763J06411l2922O8148j09075K7116
3649D405776J42136Q0092K8255j3033R552o2415m2131P9472R8006O4547j3235
3638D777022Q6544R4633l532L4297J7887N7482N803J20160J25828p7628O8998
3627E307494j16757P6546N9697l8474k4305J05942Q4590j00184Q303n2636J62763
3616E472979J67732J00067l5057Q6544K01955j1536k3597R6653R0690l8188O2995
$$ y = [3984015, 3981769, 4047689, 4143955, 4168853, 4216341, 4073074, 3956674, 4013031, 4028137, 4145560, 4224502, 4185057, 4168974, 4117438, 4111581, 4223645, 4179546, 4155039, 4174882, 4195648, 4271796, 4260941, 4317257, 4274989, 4183255, 4209954, 4294250, 4307466, 4452111, 4420247, 4419151, 4411813, 4401570, 4307070, 4344436, 4474230, 4414808, 4334852, 4382861, 4346098, 4452509, 4419587, 4487735, 4378660, 4405776, 4547912, 4628004, 4656259, 4643226, 4652778, 4590363, 4548232, 4627704, 4725710, 4790257, 4777022, 4863566, 4958199, 4954667, 4988964, 5006851, 5064333, 5070136, 5190296, 5316124, 5238496, 5307494, 5190737, 5267283, 5326980, 5288506, 5264201, 5370143, 5454733, 5354549, 5362852, 5310216, 5472979, 5640711, 5740778, 5705721, 5792265, 5994220, 5982684, 5959087, 6055740, 6146430, 6108242, 6171237]
3605F171237J41909J576r0701M0343J94602J71583J05068Q6269q3497m1670Q5187
3594F781906L7004L4801O9715l329J34493M7776m8951M8726M4148J49838K9722
3583G325849R4573n7420M1053K40994K58571K5591R7393O2268J33765J99192O7720
3572H489549m0057K32590J499J63130J78750J3530j4234J59302Q0747J7850J57491
3561I440147K00516J41659K13716Q9274n9085O7871J08439L6168M7170J26977
3551A0412852K98124O5816J72803K67700J05912Q8568J27497L32949J49605K90136
3541A2311962K07443J12101K75714J36202L50376J42221O8075K31285L61609L44378
3531A4541366J53506L72055J99868J52303K78645K66055K94358K33567K08376
$$ y = [6171237, 6313146, 6314722, 6224021, 6264364, 6458966, 6630549, 6735617, 6821886, 6738389, 6696719, 6781906, 6818910, 6853711, 6923426, 6920097, 7054590, 7102366, 7053415, 7102141, 7146289, 7296127, 7325849, 7420422, 7363002, 7404055, 7645049, 7903620, 7929211, 8026604, 8088872, 8222637, 8421829, 8489549, 8449492, 8682082, 8683581, 8846711, 9025461, 9038991, 9024757, 9184059, 9264806, 9282656, 9440147, 9640663, 9782322, 9996038, 10085312, 10026227, 10094098, 10202537, 10238705, 10285875, 10412852, 10710976, 10776792, 10949595, 11217295, 11323207, 11411775, 11539272, 11872221, 12021826, 12311962, 12519405, 12631506, 12907220, 13043422, 13393798, 13536019, 13604094, 13835379, 14196988, 14541366, 14694872, 15066927, 15266795, 15419098, 15697743, 15963798, 16258156, 16491723, 16700099]
3522A6700099M01316L41161K53062J69841L02308L90800L52883J84138L15167
3513A9410775M20794K48068L28894M37283M47983L42574M50957M58167M01877
3504B2947372M52458M63184N11767O12286N82654N99652O06175N08865P47565
3495B8031978O21360P50873O80926Q63934R32483J077577J253649J299407J478652
3486C6990839J597083J310091J281342J254526J412243J634667J778162J727585
3478D8986538J926872K163698K176933K312825K045050J874335J839046J603963
3470F4929260J186240O74492J49924n21554j103845j435491j766601j484289j372232
3461E9255904j118871p11681o27920p74291r23169j033333r12579q48805j392604
$$ y = [16700099, 17101415, 17442576, 17695638, 17865479, 18167787, 18558587, 18911470, 19095608, 19410775, 19831569, 20079637, 20408531, 20845814, 21293797, 21636371, 22087328, 22545495, 22947372, 23399830, 23863014, 24374781, 24987067, 25569721, 26169373, 26775548, 27284413, 28031978, 28653338, 29404211, 30085137, 30949071, 31881554, 32959131, 34212780, 35512187, 36990839, 38587922, 39898013, 41179355, 42433881, 43846124, 45480791, 47258953, 48986538, 50913410, 53077108, 55254041, 57566866, 59611916, 61486251, 63325297, 64929260, 66115500, 66789992, 66939916, 66418362, 65314517, 63879026, 62112425, 60628136, 59255904, 58137033, 57425352, 56797432, 56023141, 55099972, 54066639, 53154060, 52305255, 50912651]
3452E0912651j689691j739771j457598j139271q99677o60435o34534n49437l29925
3443D1812312k06623n5728K7399j39555j6890L89036L73363M10698N20040O00415
3433D3714467M74761P12573Q15007R81589J218591J412233J583610J008769Q525
3424E1930125p02050r74911j181085j602537j799793j613013j663715j433959
3416D0959062j351174r89921j078164r63763p64362p80549p60154p43171p86713
3407C2741091o47412n84202n41272n32416n37436o33943n12355m69539k15945
3398B8066571k03268j29272O972J19118J9302m91389q57528r95644j153219j188258
3388B3193385r62939r57675q30865q10412p19121o27656o56191m68967m69785
$$ y = [50912651, 49222960, 47483189, 46025591, 44886320, 43986643, 43326208, 42691674, 42142237, 41812312, 41605689, 41549961, 41577360, 41437805, 41420915, 41809951, 42183314, 42594012, 43114052, 43714467, 44189228, 44901801, 45716808, 46698397, 47916988, 49329221, 50912831, 51921600, 51930125, 51228075, 50253164, 49072079, 47469542, 45669749, 44056736, 42393021, 40959062, 39607888, 38617967, 37539803, 36576040, 35811678, 35031129, 34270975, 33527804, 32741091, 32093679, 31509477, 30968205, 30435789, 29898353, 29264410, 28752055, 28282516, 28066571, 27863303, 27734031, 27741003, 27860121, 27879423, 27388034, 26530506, 25534862, 24381643, 23193385, 22230446, 21272771, 20441906, 19631494, 18912373, 18284717, 17628526, 17159559, 16689774]
3379A6689774n85430k02765l83646m82348m10194l71310k10164k57609l56023
3370A3430285j95445k54074k17337j31430k80184k97205j69242j92013p8468j21001
3360A1493886j71113k68694l6545k18362l08231r3741k12421k14577j54868m4454
3350I770880j49988q1735j26112K0265r1529k18277j35018j44631j39124n8036
3340H646695J1963j36438j86572j86346l9665n2568j31589p2056O0771r5583j09500
3329G709112r9336j52447J20849j77177J7920K5299p8530r5570n8898J0799j18924
3318G103097k7517j26372r6701J828N2465J2895j42988n7609r533m1360p0332
3307F597873L2382J1834k4263r9490o8514r2936k24874K2800J13884l2607p3601
$$ y = [16689774, 16104344, 15901579, 15517933, 15035585, 14625391, 14254081, 14043917, 13786308, 13430285, 13234840, 12980766, 12763429, 12631999, 12351815, 12054610, 11885368, 11693355, 11614887, 11493886, 11322773, 11054079, 11017534, 10799172, 10490941, 10397200, 10184779, 9970202, 9815334, 9770880, 9620892, 9539157, 9413045, 9433310, 9341781, 9123504, 8988486, 8843855, 8704731, 8646695, 8658658, 8522220, 8335648, 8149302, 8109637, 8057069, 7925480, 7853424, 7914195, 7818612, 7709112, 7609776, 7457329, 7578178, 7401001, 7418921, 7444220, 7365690, 7270120, 7211222, 7222021, 7103097, 7075580, 6949208, 6852507, 6854335, 6906800, 6919695, 6776707, 6719098, 6709565, 6668205, 6597873, 6630255, 6642089, 6617826, 6518336, 6449822, 6356886, 6132012, 6154812, 6268696, 6236089, 6162488]
3296F162488K8278J5904j42555J9633j11521j56217j878k4793P3837p3580r2266
3285E697330j24204R2293P9008j5957j44998j91523Q346l3966l8413O3407J06231
3274E497554o299m8446j68958j00044J08764R7478n1566j28309n4521m8867j19561
3263D977225k5206m0137j55466j8083N2455j4403l0667l5406J06709R5795k8607
3252D884209j07109o9756j3341M7982J12893J17804J2554o3398O8472n8278L2129
3241D964161Q0748q1289m8286J34062J14420O4734m9406K5745M3089q3045j4588
3230E150345Q690J25682K18951N6178J29731q4099J00411j040P4732J73447j7008
3219E936020M6279K15331J79777J50176K04316J76340m3083l5209J07131R997
$$ y = [6162488, 6190766, 6206670, 6064115, 6083748, 5972227, 5816010, 5814132, 5789339, 5863176, 5789596, 5697330, 5573126, 5665419, 5744427, 5728470, 5583472, 5391949, 5400295, 5366329, 5327916, 5391323, 5497554, 5491255, 5442809, 5273851, 5173807, 5282571, 5380049, 5328483, 5200174, 5145653, 5096786, 4977225, 4952019, 4911882, 4756416, 4738333, 4790788, 4776385, 4745718, 4710312, 4817021, 4912816, 4884209, 4777100, 4707344, 4694003, 4741985, 4854878, 4972682, 4985236, 4921838, 4990310, 4932032, 4964161, 5044909, 4963620, 4915334, 5049396, 5163816, 5228550, 5179144, 5204889, 5247978, 5164933, 5150345, 5159035, 5284717, 5503668, 5559846, 5689577, 5605478, 5705889, 5704849, 5779581, 5953028, 5936020, 5982299, 6197630, 6377407, 6527583, 6731899, 6908239, 6865156, 6829947, 6937078, 6947075]
3209F947075Q2651L03J42433L6380J77147K8451L9216O9504j45168j26689p3985
3198G177318R0641J15545M9661M8676Q6079K52673p4257J46148J10415Q2231K64935
3187H350065J99785J79300K91935K75538L56726L10708J52744l3662M3J67639
3177A0250821J57122J56492O5597K02585J51352K60848K43754L03811P3323J38386
3167A2004091P9870J11721J24743J18276J95833J27618K61449K61459K60367P0605
3157A3616032Q9356J88570J87645J52239K00795K49248K11309K10192J89697K81146
3147A5576229J69425J97528L50925L17571M11831M75107M78402M77267N91294
3138A9045579O35499P12937M65505N72077N33487L59914K99858J29518l0854l54650
$$ y = [6947075, 7029726, 7030029, 7172462, 7208842, 7385989, 7414440, 7453656, 7523160, 7377992, 7251303, 7177318, 7267959, 7383504, 7433165, 7481841, 7567920, 7820593, 7746336, 7892484, 8002899, 8085130, 8350065, 8549850, 8729150, 9021085, 9296623, 9653349, 9964057, 10116801, 10083139, 10083182, 10250821, 10407943, 10564435, 10630032, 10832617, 10983969, 11244817, 11488571, 11792382, 11865705, 12004091, 12083961, 12195682, 12320425, 12438701, 12634534, 12762152, 13023601, 13285060, 13545427, 13616032, 13705388, 13893958, 14081603, 14233842, 14434637, 14683885, 14895194, 15105386, 15295083, 15576229, 15745654, 15943182, 16294107, 16611678, 17023509, 17498616, 17977018, 18454285, 19045579, 19681078, 20394015, 20859520, 21431597, 21965084, 22324998, 22624856, 22754374, 22723520, 22368870]
3128B2368870m21672m74268n36151p42138m32603k58544k37472j66258N2630Q3459
3118A9235853J13698J27232K48672L32945L96844L33610K71861N97753L58327
3109B2016795L75933M95194K34680K47431J77289l0039n6850l39062m56946l72258
3099B2292167n73959p34033o73187q26665p85349o42960m19612l59857l61047
3090A6915498j72769j53314k46184k20297N2550L3499o3370o2081o7954j0787
3080A6004791j72768k73292k05034m06749l88539l20009m82020n38868o28284
3071A2589228o21942n51925n01490l58384l73415m42225m25505j49099k53355
3062H911888l55607l27653l17331l01776j10072j10601k36750j1053k13384k11839
$$ y = [22368870, 21947198, 21472930, 20936779, 20194641, 19762038, 19503494, 19266022, 19099764, 19152394, 19235853, 19349551, 19476783, 19725455, 20058400, 20455244, 20788854, 21060715, 21658468, 22016795, 22392728, 22887922, 23122602, 23370033, 23547322, 23517283, 23460433, 23121371, 22664425, 22292167, 21718208, 20984175, 20310988, 19484323, 18698974, 18056014, 17636402, 17276545, 16915498, 16742729, 16589415, 16343231, 16122934, 16175484, 16208983, 16145613, 16083532, 16015578, 16004791, 15832023, 15558731, 15353697, 14946948, 14558409, 14238400, 13756380, 13217512, 12589228, 11967286, 11415361, 10913871, 10555487, 10182072, 9739847, 9314342, 9165243, 8911888, 8556281, 8228628, 7911297, 7609521, 7499449, 7388848, 7152098, 7141045, 6927661, 6715822]
3052F715822j22482p8048k08192j41468k53210j64596j09090k22465k53913j84805
3042D977553p946l6422k49274j70302m6112j42807p9641L3623j27135j24347j39570
3031C887620j70951q263j09930L3879m7860j95269k2099K3720j56716r7674J55772
3020C292229N7906o6115r7314n0597O2372j76325j05339O8668k5372j85080J1764
3009B786797j11128r0539P8532p7496R2736p4191k52820q1985J8688K887l6082
2998B255399j48038k001l5019p6225M3012j02324r5070J47407j5643j47803J03984
2987A927679l6349o1995k8233P5888N8038j58382j50245k4003q1230k4289k5244
2976A471635M9959J8015k18341J6104J0477L2977n4829j3697L2477o6159L8568
$$ y = [6715822, 6593340, 6515292, 6307100, 6165632, 5912422, 5747826, 5638736, 5416271, 5162358, 4977553, 4969607, 4933185, 4683911, 4513609, 4467497, 4324690, 4245049, 4278672, 4151537, 4027190, 3887620, 3716669, 3708406, 3598476, 3632355, 3584495, 3389226, 3367127, 3390847, 3234131, 3136457, 3292229, 3350135, 3284020, 3186706, 3136109, 3198481, 3022156, 2916817, 2985485, 2960113, 2775033, 2786797, 2675669, 2585130, 2663662, 2586166, 2678902, 2604711, 2351891, 2269906, 2288594, 2291481, 2255399, 2107361, 2105360, 2070341, 1994116, 2037128, 1934804, 1839734, 1987141, 1971498, 1823695, 1927679, 1891330, 1829335, 1801102, 1876990, 1935028, 1776646, 1626401, 1602398, 1521168, 1496879, 1471635, 1521594, 1539609, 1321268, 1337372, 1347849, 1380826, 1325997, 1312300, 1344777, 1278618, 1317186]
2965A317186N4018o5561j41426r335M2009p7787N7878k0909J8795K4960j38538
2954A061290k9790J680n9940j01188K3570n7064Q550J34258j29640o8673J32534
2943I15587k2550n7606P9981q2846k0961n8869M0453K3351Q0411Q6364j05377
2932H77938n9475p0727J07319n7669P0971J1888o3575j54119j2690j3703J14544
2921G50702k7527k6115Q808J32044J31297r8289r6644K7971l5062j82349R1845
2910F76681K7570k2114M8186m442j5662p5316j60615R1873M9576K3966p8582P2279
2898F33400M71o9394m4345r2833J63169K1078J01283l796q4236p9163k5592J08637
2886F28679N1327o3359p4841j4591r7300R2647L0148p7391J4814q6341L0855J03203
$$ y = [1317186, 1371204, 1305643, 1164217, 1154882, 1196891, 1119104, 1176982, 1156073, 1174868, 1199828, 1061290, 1031500, 1033180, 973240, 872052, 895622, 838558, 847108, 981366, 851726, 783053, 915587, 893037, 835431, 915412, 832566, 811605, 752736, 793189, 816540, 896951, 983315, 877938, 818463, 747736, 855055, 797386, 868357, 880245, 816670, 662551, 649861, 636158, 750702, 723175, 697060, 705868, 837912, 969209, 870920, 774276, 802247, 767185, 584836, 676681, 704251, 682137, 730323, 725881, 710219, 634903, 474288, 566161, 615737, 639703, 561121, 633400, 633871, 564477, 520132, 427299, 590468, 611546, 712829, 709033, 624797, 545634, 520042, 628679, 680006, 616647, 541806, 527215, 429915, 522562, 552710, 475319, 490133, 403792, 434647, 537850]
2874E37850q3877o203N1375k8946M2014q2713J34083K5756L0281j3848p0567n1342
2862D83863P7839k694l5J56039O9699L263o2016j5551j36806k6446p6566n5907
2850D14682N5229p636n1271J58020q7513o3878J17673O2350o5744k738o6821l1431
2838D30922N6835p8320K6775Q2556o3114L3347r1946O3425J7749J07690N782L1867
2826F23568l1951j76468L3454o3454Q6162n9817k2771J12220O521M1780j41833
2815D07411N4264n1425l0849m9118q502j42542k3070J97113L95K1682l6233o0867
2803B78259O928q2532K5869K25379R4437r7376q6358P9761l8879n3077r5782J5454
2791B72083J13130R0571m8915N2960o0500o7388q4185o4864J02225L348J1110
$$ y = [537850, 453973, 447770, 499145, 470199, 512213, 429500, 563583, 589339, 619620, 605772, 535205, 483863, 561702, 559008, 558973, 715012, 784711, 787974, 725958, 710407, 573601, 547155, 470589, 414682, 469911, 462275, 411004, 569024, 481511, 417633, 535306, 597656, 531912, 529174, 462353, 430922, 487757, 409437, 436212, 518768, 455654, 489001, 397055, 460480, 478229, 585919, 591701, 623568, 591617, 415149, 448603, 385149, 471311, 411494, 388723, 500943, 507464, 549244, 407411, 461675, 410250, 379401, 330283, 321781, 179239, 156169, 353282, 353677, 375359, 339126, 278259, 285187, 202655, 228524, 453903, 548340, 450964, 364606, 444367, 405488, 352411, 256629, 272083, 385213, 475784, 426869, 479829, 419329, 351941, 267756, 202892, 305117, 308465, 319575]
2780C19575n9565N3684q77n5704M611m7747l3601L4870J43884O0933j19139L4747
2768C35671J5694j18480j6504M9752j2397J35480j3842j20478M9980Q173L3808
2757C46857P495n5654j51883K1824N2953N2636j03373P3828k6727R3185m1452
2746B69689l1439q1469j0003J66500R7432o4747j56106N5993O0800k4765p1536
2735B10349j12536L622M1002M6498N9574p4119m4057O3322k0073J0250O0924k0375
2723B24381j37596j8487l4790L7183J50401j3645j13550O9907Q459l8982O0815
2712A94096n0096l7807R2661j5107j66453J05603P3361j38409J4117J05873k3691
2701A54148J18143n55n2328p1178m4317N6588j5543l1508j0872m887O3664K6203
$$ y = [319575, 260010, 313694, 312817, 257113, 261724, 213977, 180376, 215246, 359130, 420063, 300924, 335671, 351365, 232885, 216381, 266133, 253736, 389216, 375374, 254896, 304876, 313049, 346857, 354352, 298698, 146815, 168639, 221592, 274228, 170855, 244683, 217956, 311141, 269689, 238250, 156781, 146778, 313278, 410710, 345963, 189857, 245850, 306650, 281885, 210349, 97813, 101435, 142437, 188935, 248509, 174390, 130333, 193655, 173582, 183832, 244756, 224381, 86785, 68298, 33508, 70691, 221092, 207447, 93897, 163804, 172263, 133281, 194096, 144000, 106193, 198854, 183747, 17294, 122897, 196258, 57849, 71966, 177839, 154148, 272291, 271736, 219408, 148230, 103913, 160501, 144958, 113450, 102578, 97691, 161355, 187558]
2689A87558l4891L5568Q6635j3352p2226j6646l1678Q1203k3102j29370m9061
2678B0638M8842Q3460j3159j56505J30040n2958K7746K3294J8828Q6039l7113
2667A79152L8302j64397J08209r618M5455q4915n0314K274l8931K9899O8536j8810
2655A04842K6159K9485Q5251n7996K740P9690j34374j34965K6095J66760k4503
2644A69184J6798J0298j78561O1302l8149o609L6498j04173J6150N4690P253j11508
2632f6827O524N5114J75740r5474q3053J82761j9447p0666O9862q21q1330l788
2620F8595r0137P333j1148R3445L8220J08182N735n3J9707q4604Q7868J1338r6262
2607A58219P4845p9920k109R8479j9882J5656o9785P7204Q5454j84432q1485k5362
$$ y = [187558, 152667, 188235, 274870, 261518, 189292, 172646, 140968, 222171, 199069, 69699, 20638, 69480, 152940, 139781, -16724, 113316, 60358, 88104, 111398, 130226, 216265, 179152, 217454, 53057, 161266, 151648, 197103, 112188, 61874, 64148, 25217, 55116, 123652, 104842, 131001, 160486, 245737, 187741, 190481, 270171, 135797, 832, 26927, 193687, 169184, 185982, 196280, 17719, 79021, 40872, 34263, 70761, -33412, -17262, 37428, 44681, -66827, -60303, -5189, 170551, 75077, -7976, 174785, 155338, 84672, 154534, 153713, 72383, 68595, -21542, -14209, -25357, 68088, 106308, 214490, 220225, 220172, 239879, 155275, 243143, 254481, 158219, 233064, 153144, 151035, 249514, 229632, 245288, 175503, 252707, 338161, 153729, 72244, 46882]
2595D6882O1150R8402k8127P4632l7260l1198L9578j69541Q8209o1125r7887K17665
2583B01380k4226j8173K474P8457l0219j1872N9260R7707k21445Q2264j6234j07158
2571I2215J9633J19317k587j59224O8967J2826Q0726K4474m0472j49388Q5423
2560A51910J26045j23685q2495L8529j23878k1358R4015l3437k3544J1213J06009
2549A19324j7546M5193M6933j50734N9190O3682l5634m0179j5098P5731q0155
2538G0707p5358N2994k9652O1288J047K4517J36706n785j38427o7592j04394J23817
2526D9868J37900O2677m4216j33708p4552J9876Q2504L5693n07r0621j46693K5781
2514g5998J11438K7747Q2541k8501k0790r4425m5792K8639J38115N3563j5605
$$ y = [46882, 108032, 206434, 178307, 252939, 215679, 184481, 224059, 54518, 142727, 81602, -16285, 201380, 177154, 158981, 161455, 239912, 209693, 197821, 257081, 354788, 133343, 215607, 199373, 92215, 111848, 231165, 228578, 69354, 138321, 151147, 231873, 256347, 215875, 66487, 151910, 277955, 154270, 71775, 110304, -13574, -34932, 59083, 25646, 2102, 13315, 119324, 101778, 146971, 193904, 43170, 102360, 166042, 130408, 90229, 75131, 150862, 70707, -4651, 48343, 18691, 79979, 81026, 105543, 242249, 236464, 98037, 30445, -73949, 49868, 187768, 250445, 206229, 72521, -2031, 17845, 100349, 136042, 135535, 44914, -101779, -75998, 35440, 63187, 145728, 117227, 96437, 2012, -43780, -15141, 122974, 176537, 160932]
2503A60932j30858j88O540o568p3779J21635J5513M8142M6806L0642j43615j8241
2491E6961R8541K1544r6850p4579j8649l1270N3133j9898j1546J50465p5939l3906
2479A8007J46464n4795j0428L4175q7601n7980J86743O7151r226p1687J25271
2468B86094o7070j05793O2108J71771j13199k6895J11551o5587r9907J66325R227
2457C28625r0600j23209j49463J22593J76868K2235m1768o2945l7366Q4519R2196
2446C21685K2084M4852J03488l8648l9130j21163j6909O1942p5084J4791Q4514
2435C62422k1638K0939j2611o8296p2354J59243K77166l2669o3959R7930j79532
2424D66641L0220J9592j2462n7668P0945O3564N3551K4401J54630j9743j14491
$$ y = [160932, 30074, 29886, 36426, 29858, -43921, 77714, 93227, 141369, 188175, 218817, 75202, 56961, 155502, 177046, 80196, 5617, -13032, -44302, 8831, -11067, -22613, 127852, 51913, 18007, 164471, 109676, 99248, 133423, 45822, -12158, 174585, 241736, 232510, 160823, 286094, 219024, 113231, 175339, 347110, 233911, 207016, 318567, 252980, 153073, 319398, 328625, 238025, 114816, -34647, 87946, 264814, 287049, 245281, 182336, 144970, 229489, 321685, 343769, 388621, 492109, 453461, 414331, 293168, 276259, 338201, 263117, 277908, 362422, 340784, 361723, 349112, 280816, 208462, 367705, 644871, 612202, 548243, 646173, 466641, 496861, 516453, 503991, 446323, 517268, 580832, 634383, 658784, 813414, 793671, 679180]
$$ [...]
##END NTUPLES=NMR SPECTRUM
##END=
