##TITLE=1H_EC-3312(V)oc
 DMSO
 8 sc, 
 26.6.2024
##JCAMPDX= 6.0         $$ Bruker NMR JCAMP-DX V2.0
##DATA TYPE= NMR SPECTRUM
##DATA CLASS= NTUPLES
##ORIGIN= UXNMR, Bruker Analytische Messtechnik GmbH
##OWNER= root
$$ XWIN-NMR		Version 3.5
$$ Wed Jun 26 14:23:46 2024 Russian Standard Time (UT+4h)  she@DPX200
##.OBSERVE FREQUENCY= 200.1313
##.OBSERVE NUCLEUS= ^1H
##.ACQUISITION MODE= SIMULTANEOUS
##.ACQUISITION SCHEME= undefined
##.AVERAGES= 8
##.DIGITISER RES= 18
##SPECTROMETER/DATA SYSTEM= spect
##.PULSE SEQUENCE= zg30
##.SOLVENT NAME= DMSO
##.SHIFT REFERENCE= (INTERNAL, DMSO, 0, 15.51)
##AUDIT TRAIL= $$ (NUMBER, WHEN, WHO, WHERE, WHAT)
$$ ##TITLE= Audit trail, XWIN-NMR		Version 3.5
$$ ##JCAMPDX= 5.01
$$ ##ORIGIN= Bruker BioSpin GmbH
$$ ##OWNER= she
$$ F:/spectra/data/she/nmr/H-F/1/pdata/1/auditp.txt
$$ ##AUDIT TRAIL=  $$ (NUMBER, WHEN, WHO, WHERE, WHAT)
(   1,<2024-06-26 14:22:17.81 +0400>,<she>,<DPX200>,
      <created by zg, POWCHK disabled, PULCHK disabled
       configuration hash MD5:
       00 E9 B6 7A A2 85 ED C7 34 08 36 98 17 FE 4E 26
       data hash MD5: 16K
       F3 9F 22 9A B7 F3 0A CB CA CC 17 73 41 15 20 0E>)
(   2,<2024-06-26 14:22:26.32 +0400>,<she>,<DPX200>,
      <Start of raw data processing
       efp BC_mod = 2 LB = 0.24 FT_mod = 6 PKNL = 1 PHC0 = -25230.78 PHC1 = 19.58748 SI = 16K 
       data hash MD5: 16K
       02 7A B9 A2 B4 DD D6 AE DF 0A 80 8C 9D 1A AC 6A>)
(   3,<2024-06-26 14:22:51.89 +0400>,<she>,<DPX200>,
      <pk PHC0 = 0.04000187 PHC1 = -6.799999 
       data hash MD5: 16K
       E2 F4 CA 0E D8 15 DC 45 63 97 97 8F AB 62 65 13>)
(   4,<2024-06-26 14:22:55.28 +0400>,<she>,<DPX200>,
      <abs ABSG = 5 
       data hash MD5: 16K
       BE D4 E8 7A C0 E7 5F 6F 6D 4C 24 DC 2E 57 F9 21>)
$$ ##END=
$$ 
$$ hash MD5
$$ 13 8A 23 AF B4 26 4C 74 5A 50 8B 9E 24 81 3D 85
##$RELAX= 
##$RELAX= 
##$RELAX= 
##$RELAX= 
##$RELAX= 
##$RELAX= 
$$ Bruker specific parameters
$$ --------------------------
##$DU= <F:/spectra>
##$EXPNO= 1
##$NAME= <H-F>
##$PROCNO= 1
##$TYPE= <nmr>
##$USER= <she>
##$AMP= (0..31)
100 100 100 100 100 100 100 100 100 100 100 100 100 100 100 100 100 100 
100 100 100 100 100 100 100 100 100 100 100 100 100 100 
##$AQSEQ= 0
##$AQ_mod= 1
##$AUNM= <au_zg>
##$AUTOPOS= <>
##$BF1= 200.13
##$BF2= 200.13
##$BF3= 200.13
##$BF4= 200.13
##$BF5= 200.13
##$BF6= 200.13
##$BF7= 200.13
##$BF8= 200.13
##$BYTORDA= 1
##$CFDGTYP= 0
##$CFRGTYP= 5
##$CHEMSTR= <none>
##$CNST= (0..31)
1 1 145 1 1 1 1 1 1 1 1 1 1 1 1 1 1 1 1 1 1 1 1 1 1 1 1 1 1 1 1 1 
##$CPDPRG= <>
##$CPDPRG1= <>
##$CPDPRG2= <>
##$CPDPRG3= <>
##$CPDPRG4= <mlev>
##$CPDPRG5= <mlev>
##$CPDPRG6= <mlev>
##$CPDPRG7= <mlev>
##$CPDPRG8= <mlev>
##$CPDPRGB= <>
##$CPDPRGT= <>
##$D= (0..31)
0 1.2 0 0 0 0 0 0 0 0.06 0 0.03 0 0 0 0 0.0002 0 0 0 0 0 0 0 0 0 0 0 0 
0 0 0 
##$DATE= 1719397337
##$DBL= (0..7)
120 120 120 120 120 120 120 120 
##$DBP= (0..7)
150 150 150 150 150 150 150 150 
##$DBP07= 0
##$DBPNAM0= <>
##$DBPNAM1= <>
##$DBPNAM2= <>
##$DBPNAM3= <>
##$DBPNAM4= <>
$$ [...]
##$SUBNAM3= <"">
##$SUBNAM4= <"">
##$SUBNAM5= <"">
##$SUBNAM6= <"">
##$SUBNAM7= <"">
##$SUBNAM8= <"">
##$SUBNAM9= <"">
##$SW= 18.0517328524113
##$SWIBOX= (0..15)
0 0 2 0 0 0 0 0 0 0 0 0 0 0 0 0 
##$SW_h= 3612.71676300578
##$TD= 16384
##$TD0= 1
##$TE= 0
##$TE2= 300
##$TE3= 300
##$TEG= 300
##$TL= (0..7)
0 120 120 120 120 120 120 120 
##$TP= (0..7)
150 150 150 150 150 150 150 150 
##$TP07= 0
##$TPNAME0= <>
##$TPNAME1= <>
##$TPNAME2= <>
##$TPNAME3= <>
##$TPNAME4= <>
##$TPNAME5= <>
##$TPNAME6= <>
##$TPNAME7= <>
##$TPOAL= (0..7)
0.5 0.5 0.5 0.5 0.5 0.5 0.5 0.5 
##$TPOFFS= (0..7)
0 0 0 0 0 0 0 0 
##$TUNHIN= 0
##$TUNHOUT= 0
##$TUNXOUT= 0
##$USERA1= <user>
##$USERA2= <user>
##$USERA3= <user>
##$USERA4= <user>
##$USERA5= <user>
##$V9= 5
##$VALIST= <valist>
##$VCLIST= <CCCCCCCCCCCCCCC>
##$VD= 0
##$VDLIST= <DDDDDDDDDDDDDDD>
##$VPLIST= <PPPPPPPPPPPPPPP>
##$VTLIST= <TTTTTTTTTTTTTTT>
##$WBST= 1024
##$WBSW= 4
##$XGAIN= (0..3)
0 0 0 0 
##$XL= 0
##$YL= 0
##$YMAX_a= 15941
##$YMIN_a= -17249
##$ZGOPTNS= <>
##$ZL1= 120
##$ZL2= 120
##$ZL3= 120
##$ZL4= 120
##$ABSF1= 15.46759
##$ABSF2= -2.584259
##$ABSG= 5
##$ABSL= 3
##$ALPHA= 0
##$AQORDER= 0
##$ASSFAC= 0
##$ASSFACI= 0
##$ASSFACX= 0
##$ASSWID= 0
##$AUNMP= <proc_1d>
##$AZFE= 0.1
##$AZFW= 0.1
##$BCFW= 0
##$BC_mod= 2
##$BYTORDP= 0
##$COROFFS= 0
##$CY= -3
##$DATMOD= 1
##$DC= 0
##$DFILT= <>
##$DTYPP= 0
##$F1P= 0
##$F2P= 0
##$FCOR= 1
##$FTSIZE= 16384
##$FT_mod= 6
##$GAMMA= 0
##$GB= 0
##$INTBC= 1
##$INTSCL= 3.70164e-10
##$ISEN= 128
##$LB= 0.24
##$LEV0= 0
##$LPBIN= 0
##$MAXI= 10000
##$MC2= 0
##$MEAN= 0
##$ME_mod= 0
##$MI= 1.114404
##$NCOEF= 0
##$NC_proc= -9
##$NLEV= 6
##$NOISF1= 3.799351
##$NOISF2= 2.8
##$NSP= 0
##$NTH_PI= 0
##$NZP= 0
##$OFFSET= 15.51
##$PC= 1
##$PHC0= -25230.74
##$PHC1= 12.78748
##$PH_mod= 1
##$PKNL= yes
##$PPARMOD= 0
##$PSCAL= 0
##$PSIGN= 0
##$REVERSE= no
##$SF= 200.130002341274
##$SI= 16384
##$SIGF1= 3
##$SIGF2= 2
##$SINO= 5.538805
##$SIOLD= 16384
##$SREGLST= <1H.CDCl3>
##$SSB= 0
##$STSI= 16384
##$STSR= 0
##$SW_p= 3612.71676300578
##$SYMM= 0
##$S_DEV= 0
##$TDeff= 16384
##$TDoff= 0
##$TI= <>
##$TILT= no
##$TM1= 0
##$TM2= 0
##$TOPLEV= 0
##$USERP1= <user>
##$USERP2= <user>
##$USERP3= <user>
##$USERP4= <user>
##$USERP5= <user>
##$WDW= 1
##$XDIM= 16384
##$YMAX_p= 363542116
##$YMIN_p= -1644491
$$ End of Bruker specific parameters
$$ ---------------------------------
##NTUPLES= NMR SPECTRUM
##VAR_NAME=  FREQUENCY,     SPECTRUM/REAL,   SPECTRUM/IMAG
##SYMBOL=    X,             R,               I
##VAR_TYPE=  INDEPENDENT,   DEPENDENT,       DEPENDENT
##VAR_FORM=  AFFN,          ASDF,            ASDF
##VAR_DIM=   16384,         16384,           16384
##UNITS=     HZ,            ARBITRARY UNITS, ARBITRARY UNITS
##FACTOR=    0.220516191357247, 1,           1
##FIRST=     3104.01638211928, 0,            0
##LAST=      -508.700380886498, 0,           0
##MIN=       -508.700380886498, -1644491,    0
##MAX=       3104.01638211928, 363542116,    0
$$ Real data points
##PAGE= N=1
##DATA TABLE= (X++(R..R)), XYDATA
$$ [...]
8633b18307R8405Q4476n9203l8319J57230n8147k41040J25226J48924N0070j7115
8622C2200r299R1859j06597j37439M0247j0007p6306j7607q8118j0789q3851K14136
8610a61571j4287Q5753M2906j74905J5420M4341J1199O8907J29432k3980j79820
8599a56605O9404N2915R5330O1125q9616Q3267j44725r5821J28227m5930L2802
8588i627L1752k11182L7619Q2594M6489o3493K7909L0835l43066j65385r8240
8577f33795j80140N02798P2101J39521n2021J07825K243J09444r1046p9829j72405
8566b75304J33006J13742m9056P1356j61768J36372Q0042j34758N0724j00732
8556a36376Q2760P5676M0921j6814j43102M5233p1864J40092J39671j03548L316
$$ y = [-218307, -119902, -35426, -94629, -132948, 24282, -33865, -274905, -149679, -755, 49315, 32200, 22901, 114760, 8163, -129276, -89029, -99036, -175342, -192949, -281067, -291856, -375707, -161571, -175858, -90105, -47199, -222104, -206684, -162343, -151144, -82237, 47195, 23215, -156605, -87201, -34286, 61044, 122169, 32553, 115820, -28905, -124726, 3501, -42429, -9627, 22125, -189057, -151438, -68844, -22355, -85848, -57939, -27104, -370170, -535555, -633795, -813935, -311137, -239036, -99515, -151536, -43711, -41468, 67976, -23070, -102899, -275304, -142298, -28556, -77612, -6256, -168024, -31652, 48390, -86368, -35644, -136376, -53616, 22060, 62981, 46167, -96935, -51702, -123566, 16526, 156197, 52649, 55965]
8545E5965M9208q837j20131p193N2502l4813q7834k2327L0535m0570Q2000O7575
8533A6080l7403j02803Q7065J7604j1904j05215Q8543j48924l0544J04994J83840
8522F1333j07517O8798M9066j14194J2684R7854p3874N3187k5713k0341P3119
8511G4402j33648j41724J25017J3421j77776J9931Q2669M5735J06815q4484J36333
8500F6691j13586n4951j89464r937J72053Q1594q0376J53394l3416j95528R734
8489a93792J874n0398L2438J70531R368p6983m0953N1675N4467J27277j52138
8478f6634j1621o271L8514L562Q959n5408q998k712K987M5111R6230j14971p4289
8465a45541l5658R7303M6873r288Q4889l2471l1435Q7201k5497m7219p0903Q6436
$$ y = [55965, 105173, 96336, -23795, -30988, 21514, -13299, -101133, -123460, -92925, -133495, -51495, 16080, -21323, -124126, -37061, -19457, -31361, -136576, -48033, -196957, -227501, -122507, 61333, -46184, 22614, 71680, -42514, -29830, 68024, -5850, 47337, 21624, 1283, 74402, -59246, -200970, -75953, -62532, -240308, -220377, -137708, -91973, 14842, -69642, 66691, -46895, -101846, -291310, -301247, -129194, -47600, -127976, 25418, -7998, -203526, -193792, -191918, -242316, -209878, -39347, -29979, -106962, -147915, -96240, -41773, 85504, -66634, -78255, -84526, -46012, -42450, -33491, -88899, -97897, -100609, -97622, -52511, 43719, -71252, -145541, -181199, -83896, -37023, -46311, 38578, 6107, -25328, 61873, 36376, -10843, -81746, 4690]
8453D690M2638n5688J02373k9559j96094k6563J3855O8801M4851m5779m6215r3979
8441b16669j1314j114N6796J45010l3982n9816j32449J2714N3597J95588l9665
8430c1304q7324j78J80853J4899n4053j78059m377q4406Q2684l6798Q4510N7613
8418e5940N1960J50645k22164J21483n5406R247j9840j10557L8761j605L544L9760
8406e0112q3676J00510J8838j03737O0705R9502q366q2724j7607K20519o4385
8395H9467n3937M2338r2993k5978J7920l5489j5241o9146q4627K41457j478L4581
8383D6874r5840j37909J48131L5095K07394j56733R2552O820j07100j03583m5754
8372a10053r035N1019p1791p566o5991N378o05J46519N7263Q492J95644m2061
$$ y = [4690, 47328, -8360, 94013, 64454, -131640, -158203, -144348, -75547, -30696, -76475, -122690, -216669, -227983, -229097, -172301, -27291, -61273, -121089, -253538, -240824, -187227, 8361, -31304, -118628, -118806, 62047, 76946, 22893, -155166, -159543, -243949, -161265, -198063, -113553, -55940, -3980, 146665, -75499, 45984, -9422, -175, -20015, -130572, -91811, -93416, -89872, -50112, -133788, -33278, -14440, -118177, -57472, 42030, 33664, -49060, -66667, 153852, 89467, 35530, 77868, -15125, -41103, -23183, -58672, -73913, -143059, -227686, 13771, 12293, 46874, -48966, -186875, -38744, -3649, 203745, 47012, 139564, 146384, 39284, -64299, -110053, -119088, -68069, -139860, -147426, -213417, -208039, -208644, -62125, -4862, 3630, 199274, 157213]
8360A57213j30546q0470M9562R457K893p8412N261N6270j8262m4K4800N7799m2122
8347A3399o1087q3561J58983J695j16742q811R8422M4094j32004R7916j32716
8336a20412Q0406J1244j30251m5404P2799O9836q6013R4891L8708L145J13523
8325A02472k21466j62168P3966J64798k0944j00613J45315M464n0789J16583k74462
8314b22844o5832J97431L1979J21829l7444q1410P3776P9328m3145n9332r7894
8303a03558J1784q111n3439J06340m5021j08755J01051J00168L8986l4752K7531
8292C2224O9693l7088p8969Q2615j25219j76244K1143K23037P6291o1270n5682
8281b9469N1119p5986j32696K9770j2403J81243Q6084o5553o2719J07965O660
$$ y = [157213, 26667, -53803, -4241, 5216, 8109, -70303, -65042, -8772, -27034, -27078, -2278, 55521, 13399, -47688, -131249, 27734, 29429, -87313, -96124, 2298, 46392, -85612, 12304, -120412, -40006, -28762, -159013, -204417, -131618, -61782, -147795, -52904, -14196, -11051, 102472, -118994, -281162, -207196, -42398, -63342, -163955, -18640, -14176, -64965, 51618, -222844, -288676, -91245, -59266, 62563, 25119, -56291, 17485, 96813, 53668, -5664, -103558, -91774, -99885, -153324, -46984, -92005, -200760, -99709, 459, 39445, 4693, 32224, 101917, 64829, -14140, 68475, -56744, -232988, -211845, 11192, 87483, 26213, -29469, 21650, -54336, -187032, -157262, -169665, 11578, 97662, 32109, -30610, 77355, 84015]
8270H4015j40020j02502r3253Q0546J15685J7132l3964q4220O9388m8612l1754
8259a67559Q4564L2158o3475Q2028L8644m4486j8802r2677J16874N0406j89588
8248a71913p1898Q34k4818j60899J68337J49593Q9909j58034o8213M01661j25815
8237B8744o6931j9841R6138J28027j11073j81022l2913J22851k0789j10996J34583
8226c3222L267k09925J882J59069L4522k16326J29045j38980j76678k6215K27564
8215b45997K79498o5700j60910J10673k3129j131J10696p1035N6533J45003q6256
8204D8245J33963J81158j21644o43544J28184j77376K00762j45948k8170j99018
8194f23388J83354l78254q26203J761693N570L59531k82533o26683J91527L35626
$$ y = [84015, -56005, -158507, -251760, -171214, -55529, -38397, -72361, -156581, -87193, -135805, -167559, -82995, -50837, -114312, -32284, 6360, -38126, -56928, -149605, -32731, 17675, -171913, -243811, -242977, -267795, -428694, -260357, -110764, -20855, -178889, -247102, 154559, 28744, -38187, -58028, 38110, 166137, 55064, -125958, -158871, -36020, -56809, -167805, -33222, -29955, -239880, -237998, -78929, -44407, -260733, -131688, -270668, -447346, -473561, -245997, 33501, -32199, -193109, -82436, -105565, -106696, 4000, -67035, -10502, 134501, 48245, 182208, 363366, 241722, -401822, -273638, -451014, -250252, -396200, -424370, -623388, -440034, -818288, -1644491, 117202, 122772, 482303, 199770, -426913, -235386, 100240]
8184A00240j16865P5068J51348k33578m223l2437k36602K14906n6454j56141K67461
8173b7277P8648j55257m2176P1302j6257M5952q2999J52906k3158j22990j67707
8162b89013J22242O3933j5407j1416K16323m5117p71J40475p4927j778p1839j03380
8150g0675K82307Q0965k16618j71763n9115p1057O4498M611P919J92949N3899
8139I7920j33888J02485Q3119Q9871q3636j74308j49648l5208J08038j14933J69805
8128d0383J9207k5034n1472o6415l4041P6249J10459L5557j22335n5675m9828
8117b03711J63961L6259j74139j8166N0118Q4868J33632M0315k25559j1871R6585
8106b7708r8302J019l34R2758J56907k1243l2969p6067J23574j49691o2343J26685
$$ y = [100240, -16625, 58443, 209791, -23787, -28010, -60447, -297049, -82143, -138597, -294738, -27277, 51371, -103886, -146062, -74760, -91017, -45065, -128064, 24842, 1684, -121306, -289013, -166771, -102838, -118245, -129661, 86662, 41545, 40774, 181249, 106322, 104544, 32705, -70675, 211632, 292597, 75979, -95784, -154899, -225956, -161458, -156847, -148928, 44021, 97920, -35968, 66517, 149636, 239507, 155871, -18437, -168085, -203293, -95255, -210188, -40383, -21176, -46210, -97682, -164097, -198138, -121889, -11430, 24127, -98208, -153883, -203711, -39750, -3491, -177630, -195796, -145678, -60810, 72822, 113137, -112422, -124293, -27708, -126010, -124991, -125325, -32567, 124340, 103097, 70128, -5939, 117635, -32056, -94399, 32286]
8094C2286j69664J11159l164j20787Q209N6963n8203j65403L5496J01326k6709
8083a98491J9581O6600J11399p6360j3785j31360J09989J9972o3877j2667k3603
8072a92602P444o8448R7587j3802l745O6412R3375N264j63886R2229R7896K3041
8060D0765l2041p4357P7667j3772p2515l274J7713n4394P3096O8377m2992j14281
8048a30008Q2914p6554L147Q7733n062N1200m1789o5568J31285j08270j1385K4969
8036e7388m1796J08977o9625q6331O5694n9027Q2454J02830k2837L501j18556
8025i2104L4838o796k2073J80536j96989N1702O8320O1970r0043Q724P7341O3345
8013A38771r2132l8290k9028o5638K240M202n1675P0672Q7263j06669j17266l0477
$$ y = [32286, -137378, -26219, -29383, -150170, -141961, -84998, -143201, -308604, -273108, -171782, -198491, -178910, -112310, -911, -77271, -91056, -222416, -112427, -92455, -156332, -168999, -192602, -185158, -253606, -156019, -169821, -173566, -107154, -13779, -8515, -172401, -80172, 17724, 40765, 8724, -65633, 12034, -1738, -74253, -77527, -59814, -114208, -41112, 27265, -15727, -130008, -47094, -123648, -120501, -32768, -37830, 13370, -28419, -93987, 37298, -70972, -82357, -57388, -99184, 9793, -59832, -146163, -80469, -139496, -57042, 45788, 22951, 26452, -92104, -57266, -64062, -86135, 94401, -102588, -50886, 17434, 79404, -10639, -1915, 75426, 138771, 46639, 8349, -20679, -86317, -84077, -79875, -131550, -60878, 26385, -80284, -197550, -228027]
8001b28027P050P6250M9394R7858K61r2694R1433l470p9569n9465O7295j48870
7989b22554l6153J05876R5955O7860j46716k9500M6221j54778K66865M6115k35799
7978a96608P1427J65208j01854q2446Q9246l3884L1497J2406r3667J71709J01058
7967A34092k4756n8151J9409j05402j07843q4599J58856n9906j80395K24890j71240
7956b55045N9168n9822p3929J21364R0970J27482j19273J1348j6917l0619J01930
7945d3343J23723O7232j6752k50031J11603P6881m9802m6932p052j06675P6216
7934f4932J10981j82737q1634J12800O9986k8518r2201N4860Q801M5275j6191
7923f3510m7482K2654J55J09651m1223j14238J34146J9828j14494J04953k1596
$$ y = [-228027, -220977, -144727, -95333, 2525, 2786, -89908, 1525, -1945, -81514, -140979, -73684, -222554, -258707, -152831, -56876, 10984, -135732, -165232, -119011, -273789, -6924, 39191, -196608, -125181, 40027, -61827, -144273, -55027, -88911, -57414, -45008, -138675, 33034, 134092, 109336, 51185, 70594, -34808, -142651, -227250, -68394, -128300, -308695, -83805, -255045, -195877, -255699, -329628, -208264, -117294, 10188, -109085, -97737, -114654, -145273, -43343, 80380, 147612, 130860, -119171, -7568, 69313, 19511, -27421, -34473, -141148, -64932, 46049, -136688, -218322, -105522, -35536, -64054, -156255, -101395, -92594, -47319, -63510, -110992, -88338, -88183, 21468, -19755, -133993, 153, 19981, -94513, 10440, -11156]
7912a1156m1639L0919j66273N4773K605r1686J70577J3314j4727n0811O506K7779
7900f9819j1002K9442K2067j13825j79944q6762R0548J38614M415j31740O4047
7889b43959L9947j6689Q9792q4906R1304J32065O5281q801p8925q7090q4917l4235
7877b21133O0710R1837o6230o148Q8507k8312n3116O0929k4125n0477N5824p0873
7865a62607l469Q9137K8376o7680O1971j04468O2335J27135p6452m7819n4050
7854a47591J25105J12768j01676j15276R8727m1782j52714n4484L6335O5493J49036
7843b6059m6887o3510M38q1112J33441K3281n033l8597j00630N3003P9594q5894
7831a57965l4258J7939J17006j3520o1593j00928r178J06149J6939J74138j55499
$$ y = [-11156, -52795, -21876, -188149, -133376, -130771, -222457, -51880, -38566, -53293, -104104, -97598, -69819, -80821, -51379, -29312, -143137, -323081, -409843, -319295, -180681, -176266, -308006, -243959, -204012, -220701, -130909, -215815, -124511, 7554, 72835, 64034, -14891, -101981, -186898, -221133, -160423, -68586, -134816, -140964, -52457, -80769, -133885, -72956, -97081, -147558, -91734, -162607, -166076, -76939, -48563, -116243, -54272, -158740, -96405, 30730, -45722, -93541, -147591, -22486, 90282, -11394, -126670, -27943, -69725, -222439, -276923, -240588, -175095, -26059, -72946, -136456, -136018, -217130, -83689, -60408, -65441, -104038, -204668, -151665, -72071, -157965, -192223, -174284, -57278, -70798, -132391, -233319, -242497, -136348, -119409, 54729, -100770]
7820a00770k9298L3123L8362n7265M5472j53868J04439j66187m001p2722m6693
7809d09408l28061J6466j91463K742211K25824j507889N3942k32713j55979j95890
7799A7040K37604j65353k0293j34586J96203j15406Q2225m0182K81477j70095
7789A68634p1850j3120l7903j91752K84624k016o8896l4119L8752r1174K81R0849
7777G2310J5040r2409k0288J64193L74l2333M6751k02766k6342L6966k1594R8460
7765C8362l0394p1048J56488r6264o7125l9670N7453J41262L730n8176J85255
7754B19873r6090j87165L3103J00770P2571o7690q7886J3717n5486K4998J53403
7743A24118j98627n3618K85798O470p5888R409J7620j02335q849O1508O0356J24099
$$ y = [-100770, -130068, -96945, -58583, -115848, -70376, -224244, -119805, -285992, -289993, -362715, -409408, -737469, -721003, -912466, 1829745, 2055569, 547680, 601622, 368909, 212930, 17040, 254644, 89291, 68998, -65588, 130615, 15209, 97434, 57252, 338729, 168634, 96784, 83664, 45761, -145991, 138633, 136617, 67721, 33602, 72354, -18820, -18539, 72310, 87350, -5059, -25347, 138846, 139220, 106887, 153638, -49128, -75470, -38504, -60098, 38362, 7968, -63080, 93408, -2856, -69981, -109651, -52198, 89064, 92794, 34618, 219873, 123783, -63382, -30279, 70491, 143062, 75372, -12514, 1203, -54283, -29285, 124118, -74509, -128127, 157671, 164141, 88253, 97662, 115282, 12947, 4098, 65606, 125962, 250061]
7731B50061o8035j68145n9360k8618P5346J39639j49559j29718j68744l1262O8661
7720b69734O3469m0337J61004L4380R4477L5399N3064P782n9856R4965Q5619j72843
7708H7389O6919l2490o400m4112n4646l4863K2492r7299K1472N5056o1621O2194
7696a5909o8208o795R8195J22665j39086n4160n8526P0846Q4455r6272j6131M2554
7684c6372j0206R0802j560l2036o7171j410K9713r7099R1877o4344P7814j05425
7672a25417j16260J31983P5932O1736o730o8690Q3620J07157p2201R703p5733
7661E100R2655j65688j73863J26971P9742j50940J11024Q5008j11410L2972Q6255
7650A7826J01887n4781K7381q1150n5963J4894L1061j02814N1382J55977o1394
$$ y = [250061, 182026, 13881, -45479, -74097, 1249, 140888, -8671, -138389, -307133, -338395, -269734, -206265, -246602, -85598, -51218, 43259, 78658, 131722, 139504, 79648, 174613, 260232, 87389, 154308, 121818, 115418, 71306, 16660, -18203, 4289, -93010, -71538, -16482, -78103, -15909, -84117, -90912, 7283, 129948, -9138, -63298, -121824, -50978, 33477, -62795, -78926, -36372, -46578, 44224, 42664, 10628, -56543, -57953, -28240, -125339, -33462, -97806, -19992, -125417, -241677, -109694, -33762, 27974, 21244, -47446, 36174, 143331, 71130, 80833, 5100, 97755, -67933, -241796, -114825, -35083, -186023, -74999, 10009, -101401, -68429, 17826, 119713, 64932, 92313, 11163, -44800, -29906, 1155, -101659, -50277, 105700, 44306]
7639D4306n4576J53728j14018l9009R7623M8533q9612j9314l6072R161Q1597R5947
7627A78294q5195p8080J15798N9180J4643j34000L8333K8230k4399j74479j01381
7616a63056P4308J04089m6255J2584p7386r727P0591j44076M3926J33711K8999
7605B7708j39128j9423L5404J4203R3365Q3666j30477j03033L6377N9083N3722
7594A1467l4267n2411m5439K06035l8818n9424k9548q8006k312J66456o0093N1740
7582B5380j7276r6028o2478q0740n4051J49754L9852K0016J15969n9222k00651
7571b19475j8291K51393j01963k4529J3632k4809J9747R9323Q6824n879n7437
7560A8536j37826Q1613K703j06309K7067J463o8839l740J74764k7558j44554O1583
$$ y = [44306, -10270, 143458, 29440, -9569, 88054, 136587, 46975, 27661, -8411, 750, 82347, 178294, 93099, 15019, 130817, 189997, 204640, 70640, 108973, 137203, 112804, -61675, -163056, -88748, 15341, -30914, -18330, -95716, -105443, -34852, -178928, -135002, -1291, 27708, -111420, -130843, -95439, -81236, 12129, 95795, -34682, -137715, -101338, -42255, 11467, -22800, -75211, -120650, 85385, 46567, -12857, -42405, -130411, -132723, 33733, -26360, 25380, 8104, -87924, -150402, -231142, -285193, -135439, -95587, -75571, 40398, -18824, -219475, -237766, 13627, -88336, -112865, -99233, -124042, -104295, -4972, 81852, 75973, 18536, -119290, -37677, -34974, -141283, -114216, -112753, -181592, -185332, -10568, -38126, -182680, -121097]
7548a21097o8707j4539J11202l5985R5990k0845N6224J13843j18827l7028O4315
7537B4546l995L7663o6162J09184j14617n7426J5132J5919l694j9165l9743P2072
7525c0286j4489n0773p005j62793n591J1986M1862L8299Q6051J1182J31765Q5560
7513A35768k32925r4382j1859J3693J8282J1008J91068J43867j20011k41143O9790
7502a16844N2772m0256j44639K44497Q1209j63003J01338J24669j41709m3906
7492d5872r8663o8090J08233Q5095L5250p716M8186n5082o0650j38812o6936J96479
7480f8578P5400j03175L0567K493N4843n4644M8030N5699o39j57525l1674R7672
7468e1531j37840j24362P7431Q1739N5654Q4094N7497j69272j05352Q5010J28317
$$ y = [-121097, -189804, -204343, -93141, -129126, -33136, -53981, 2243, 116086, -2741, -39769, 24546, 20551, 58214, -7948, 101236, -13381, -70807, -55675, -39756, -43450, -62615, -102358, -30286, -44775, -95548, -102553, -265346, -270937, -258951, -217089, -178790, -92739, -81557, 50208, 135768, -97157, -191539, -203398, -189705, -171423, -160415, 30653, 174520, 54509, -186634, -116844, -64072, -104328, -248967, -4470, 76739, -86264, 15074, 139743, -1966, -45872, -144535, -212625, -104392, -19297, 15953, 8237, 56423, 1341, -59309, -198121, -265057, -68578, 6822, -96353, -65786, -63293, -8450, -63094, -15064, 40635, 39996, -117529, -149203, -51531, -189371, -313733, -236302, -154563, -98909, -14815, 42682, -126590, -231942, -146932, -18615]
7457a8615O9601R471j00937j73277N2036J43458O4970N1563j32717j27781M4710
7446a17518l2261o9704j26990J05378J85027Q2O748J05713q9669M3955n1128n6364
7434i6731l260J30079K8345o9960J15883j28196K3227J28863J7548j9328j48595
7423b2125k7105J37277R6039p7345j39076J29807j57804O8958M2396l9106k077
7412I839p4337L3184l9276J8102J07406J08744q790J028j42112l4150l6658J32810
7400G5790j09781L5406j0714k5981J33225j18310K915J09378k4152m8957o6455
7389d7636k1621Q6952K0017J624r7762M8102k8735K0646K1927q013M2406K7797
7377F5704k06233O2266M2048O1612r1403j27447J80406J8362L4760l5955j01072
$$ y = [-18615, 50986, 60457, -40480, -213757, -161721, -18263, 46707, 98270, -34447, -162228, -117518, -149779, -219483, -346473, -241095, -56068, -55986, -49238, 56475, -33194, 10761, -40367, -96731, -99991, 30088, 58433, -11527, 104356, -23840, -613, 128250, 145798, 126470, -22125, -49230, 88047, 184086, 106741, -32335, 97472, -60332, 8626, 51022, 11916, 9839, -64498, -31314, -70590, -52488, 54918, 163662, 154872, 155900, 13788, -20362, -57020, 75790, -33991, 1415, -9299, -35280, 97945, -20365, -17450, 91928, 67776, 18819, -47636, -69257, 17695, 37712, 39336, -58426, -10324, -39059, -18413, 3514, -4499, 37907, 65704, -140529, -78263, -36215, 25397, -66006, -193453, -13047, 5315, 40075, 4120, -96952]
7366i6952J30943J42188j33092l5941j20753N7095J2797m6862N877j05678K15030
7355B4652P8322J4810n3042j51781j5863K9805O383K6502R686J39991M1556j64101
7343a3080j3195o1293l3205J01279L0094N9914M0515k01485n392j3201M6622M4237
7331a8190Q5935n8224n4439L0906N1351j19732j53807J93863J00457o7323l4493
7320d3696J10759n1011o8532k2887l4324l931j11270J18971L2774p7012n6858
7309b07017R6047J69751l3294l9394m3295P011r7396M0503J19538m9402k1821
7298e8769Q3333Q448Q7090r4017o6032q0095k8638p609J72496K6676q2518O1293
7286B1658J6082N2326j74759j0317R2301j06208k064N1073P594Q7374l4346q4137
$$ y = [-96952, 33991, 176179, 43087, 7146, -113607, -56512, -43715, -90577, -84700, -190378, 24652, 102974, 117784, 64742, -87039, -102902, -73097, -66714, -40212, -30526, 109465, 151021, -13080, -26275, -87568, -120773, -19494, 10600, 70514, 111029, -90456, -95848, -109049, -62427, -18190, 67745, 9521, -44918, -14012, 37339, -82393, -236200, -42337, 58120, -9203, -43696, 67063, 16052, -52480, -75367, -109691, -113622, -224892, -105921, -73147, -150159, -207017, -110970, 58781, 25487, -13907, -57202, -50191, -147587, -107084, 12454, -36948, -58769, 24564, 33012, 120102, 26085, -39947, -120042, -148680, -156289, 16207, 42883, -39635, 21658, 37740, 90066, -84693, -95010, -2709, -108917, -110981, -59908, -52314, 35060, 714, -83423]
7274h3423q7725J12876L83O9598l2565p6066q561J71065j78880q3152J28813J52241
7262H4604p7674n7386K2157k744M7169j33699P6974O1831k7912r7192k82m9882
7250a54036K25631k8762l8464Q288J6312n6160Q0527L9940q7443J04583j02135
7239H281k15713l3852P8060J42782L9621J2727j72146P6802J68649m8598j23637
7228f7024P495k4854L4217m6196K5442N1994m5168j31q4509L3460j0120r8800
7216b24194o8008P9535J42823k7514O5394L6473p470j6261p0456k209o4196K1634
7204a34449n9445l4397J09659J52115p1339j58346J15464J73292k9268j06948
7194d3662m4577r5485J16176K76223j25085K9855p2811m2505K7313N654j33897
$$ y = [-83423, -171148, -58272, -57889, 11709, -20856, -96922, -105483, 65582, -113298, -196450, -67637, 84604, 6930, -50456, -28299, -31043, 16126, -117573, -40599, 21232, -6680, -103872, -104154, -154036, 71595, 42833, 4369, 12657, 28969, -27191, 53336, 93276, 5833, 110416, 8281, -207432, -241284, -163224, -20442, 19179, 31906, -140240, -63438, 105211, 56613, -67024, -59529, -84383, -50166, -96362, -70920, -18926, -64094, -64225, -148734, -115274, -125394, -224194, -292202, -212667, -69844, -97358, -31964, 4509, -2961, -19222, -89678, -91887, -156083, -134449, -193894, -228291, -118632, 33483, -37856, -196202, -80738, 92554, 63286, -43662, -88239, -183724, -67548, 208675, 83590, 113445, 40634, -1871, 25442, 31096, -102801]
7183a02801O0605j19619j3664Q7861m5627q6313K5993j881M6490l2968K7904j22981
7171b77001M7648J41740n8438J15504J834j33727q9167P7719M6350J28189k11
7160D40j55260j40315M0366Q0143R0906n8431p805K31603J881q162P7409j66900
7148a4125k4723P4438J5224R8059j3361m7435p4874j71517J38570M0787m7896
7137b6853j3408J3974O7105j9043k8725Q5193j21831q4291j18611J07013k2149
7126a61626J1476J36020k0838p3146k3769N0478j04733M0591l9297R7873n6481
7115a43452j89665K18982L7688l5022J3113Q5625O4145L7255k3683j43620M2967
7104c5667K5427q7683Q3209Q4740j41489P8394r2153j46424M5470O8282J51166
$$ y = [-102801, -42196, -161815, -175479, -87618, -133245, -219558, -193565, -195446, -148956, -181924, -154020, -277001, -229353, -87613, -146051, -30547, -28713, -162440, -251607, -173888, -127538, 651, 440, -154820, -295135, -254769, -174626, -83720, -142151, -149956, 81647, 83528, 75366, 152775, -14125, -38848, 35590, 50814, 148873, 135512, 88077, 13203, -158314, -19744, 21043, -26853, -40261, -26287, 40818, 21775, -6950, 78243, -43588, -127879, -246490, -139477, -161626, -150150, -14130, -34968, -108114, -131883, -81405, -186138, -145547, -184844, -86971, -143452, -333117, -114135, -76447, -111469, -98356, -12731, 51414, 88669, 64986, -78634, -35667, -10240, -97923, -14714, 70026, -71463, 6931, -85222, -231646, -186176, -117894, 33272]
7093C3272p5278n0251R8952N4943J1988j45176l5575m4968J85494K6180j19531
7082e9950l0921J6687o859k872J30466j08813j4283k4750j3667O1535j01253L8133
7070a16547P030j3890J85985L8461j47247n1651J11371o8578O2355N3660n4780
7059F169m3299l1522O1544o8599j17495N9335J82211M0496j54577M3651l9663
7048f1749l6540J13612J10430o2835j71331j3217k2127J48655J59653k3093n6540
7037H4918j3265J07393k2254q2877j15988m7498K8996r6004m9712R9675J03194
7026c422Q752o4953N1017q6818J16959K8611n8883Q7469j19811l5853M3133k2924
7014e6723o4837J53131j14679j63444K19542J42523j94643o947J31133j41887
$$ y = [33272, -42006, -92257, 6695, 61638, 73626, -71550, -107125, -152093, 33401, 59581, -59950, -90871, -74184, -81043, -83915, 46551, -62262, -76545, -101295, -114962, -53427, -154680, -116547, -109517, -123407, 62578, 101039, -46208, -97859, 13512, -55066, 7289, 60949, 6169, -37130, -68652, -7108, -75707, -193202, -133867, 48344, 88840, -65737, -22086, -61749, -98289, 15323, 125753, 62918, -108413, -121630, -143757, 4898, 164551, 141458, 84918, 71653, 179046, 156792, 73915, -42073, -89571, -60575, -156579, -206291, -106616, -3422, 5330, -59623, -8606, -95424, 21535, 50146, -8737, 78732, -41079, -76932, -33799, -56723, -121560, 31571, -83108, -246552, -27010, 115513, -79130, -86077, 45056, -96831]
7004i6831J26687m5962q5446J1019j0070m471p3435R2675k348L2269n4571Q1573
6992b8911J08979L8968o649l8763j3407N6386j43660R7346J9090N3381r9514j16993
6980g3747j78361J7679J97455P2755j36134L2603M2635j7553K59895L3726q7768
6969A63185o6650m883q6886R6558M0508J0844n3986j55524J22897j4788j77903
6958a26628O7341M0188j481L9167j07228j15627J10789j40986J99665O8830j75636
6947a41606Q2615O289j03549K5849j11433R0621Q0322o2475J5780J9923J082o6528
6935a63110L6047l2731j11277M3472O2512N4590o7402P6740L6922p6009J26016
6924a4230j38597m943k0800K502N5977m4133N9874J18883j45044M6385M9417J7537
$$ y = [-96831, 29856, -16106, -101552, -90533, -100603, -105074, -178509, -85834, -88182, -55913, -110484, -28911, 80068, 119036, 112387, 73624, 60217, 116603, -27057, 70289, 89379, 142760, 43246, -73747, -252108, -234429, -36974, 35781, -100353, -67750, -25115, -42668, 217227, 250953, 163185, 96535, 91652, 4766, 101324, 141832, 152676, 98690, -56834, 66063, 51275, -126628, -59287, -19099, -20580, 18587, -88641, -204268, -93479, -234465, -34800, 34030, -141606, -58991, -52702, -156251, -130402, -241835, -151214, -70892, -133367, -117587, -97664, -96582, -163110, -127063, -159794, -271071, -227599, -165087, -110497, -177899, -101159, -64237, -140246, -14230, -152827, -157770, -178570, -176068, -120091, -164224, -104350, 14533, -130511, -84126, -34709, -17172]
6912a7172p1971m1074N7805K8332J48781M8740r4195P4722j12048r434J27168
6901A39654j09357K8763o1954J5763r7756Q7157K1588J3287j1521k16024J9949
6890a70451n2382J09559M7663L8664J97376m1872j60078L2305r1400r6190Q3821
6879a02985R7040K3699J388J06112j81518N924O8635p0264l8340K34230Q0138
6868B24059k3117j25954j60856l7659K35064j55659k0542N4638K4948K9366j82101
6857a37813J28206O2984k52239r7069P7702O0123J81151j65814R2567K918j19793
6846a67077R0223L8555j3903J3225Q6382J22473j28527m3813r6771j00524k4107
6835b23864o5729O6800N6288o235R5373R2716p2188k6168J9548N2905N283J778
$$ y = [-17172, -89143, -130217, -72412, -44080, 104701, 153441, 59246, 133968, 21920, 12486, 139654, 30297, 59060, -2894, 12869, -84887, 2270, 23858, 37145, 25624, -190400, -170451, -222833, -113274, -65611, -26947, 170429, 128557, -31521, 784, -90616, -186806, -102985, -5945, 17754, 19142, 125254, -56264, -50340, 18295, -51969, -90309, 143921, 224059, 200942, 74988, -85868, -123527, 111537, -44122, -64664, -10026, 14922, 44288, -137813, -9607, 53377, -198862, -295931, -218229, -158106, 23045, -142769, -50202, -47284, -167077, -76854, -38299, -52202, -38977, 47405, 169878, 41351, -2462, -99233, -199757, -223864, -289593, -222793, -166505, -172740, -77367, 15349, -56839, -83007, -63459, -10554, -5271, -3493]
6823c493j4780R9278j20678r9148J08735p7897J4706J17102J11904L3219p7896
6812I1052j95540L3768J0798j05400Q7401J4983O363k1774r6236J13103O3992
6801B510j07390K1325M01n5092L769L5181J18992K3910J1068j05304N8925l6424
6789b8129l8777Q7721k0956n2349K7303N0124j3367o3534o609n5371k3990Q5479
6777e2455j66469n4069J34506N7751N8296R560j9172R5182J05393q5427M6650
6766A29746k6290n3515n3362j39421O877K9745P9609j33245M3164O0501j13389
6755a69580O0999J04797j07277j6427M3701M3480k2740J66887P8261R6959M1423
6744C20483j75584j83210k280R933Q5440o9709j01982J71733P753k0093L2163
$$ y = [-3493, -18273, 81005, -39673, -138821, -30086, -107983, -93277, 23825, 135729, 168948, 91052, -104488, -70720, -59922, -165322, -77921, -62938, -56575, -78349, -174585, -61482, 2510, -104880, -83555, -83154, -138246, -134477, -99296, 19696, 43606, 54674, -50630, 8295, -28129, -66906, 20815, -141, -52490, -25187, 24937, 11570, -51964, -58573, -113944, -137934, -52455, -218924, -272993, -138487, -80736, -22440, -12880, -32052, 63130, 168523, 83096, 129746, 103456, 49941, -3421, -142842, -135965, -106220, -26611, -159856, -116692, -56191, -169580, -108581, -3784, -111061, -127488, -83787, -40307, -63047, 103840, 182101, 279060, 320483, 144899, -38311, -40591, -30658, 54782, -14927, -116909, 54824, 62577, 42484, 74647]
6733G4647j13477M9263P8993l9488k0643P6935l8892o4109l8399P8208k7981L537
6721A8594P6629j16997J48724j67394r533J27614k1603J4444j6976Q3240N3864
6710A90606r4702J6930o4505j31611k5928J28275O9208L5491o2388l5462l8638
6699a2724P6628M429q7044k8956q395Q4520J22473r4937n2707N3504j2331L153
6687D7613R2875k3982j09866L0618K231m0478Q1295J4608j01469o5803l5844L8916
6675f9286l3432J30443J00893q6429J07115o4865J4771M3784j31573j26700p3928
6664a89207J12136m1971k5471J28508J53982Q1142j20179n8008k0389O9914K187
6653I2644n1041j09028q001M3243N5439M1237l5517N0923r0443N3092j4494j2305
$$ y = [74647, -38830, 10433, 89426, 49938, 29295, 106230, 67338, 3229, -35170, 43038, 15057, 18594, 95223, -21774, 126950, -40444, -49977, 77637, 56034, 70478, 53502, 136742, 190606, 95904, 112834, 48329, -83282, -109210, 19065, 88273, 123764, 61376, 25914, -12724, 63904, 68333, -18711, -47667, -56062, 28458, 150931, 55994, 3287, 56791, 44460, 47613, 140488, 116506, 6640, 37258, 39489, -989, 80306, 94914, -6555, -72358, -108202, -69286, -102718, 27725, 128618, 42189, 149304, 84439, 99210, 142994, 11421, -115279, -189207, -77071, -119042, -144513, -16005, 137977, 219119, 98940, 40932, 20543, 90457, 92644, 41603, -67425, -75426, -32183, 23256, 64493, 28976, 79899, -10544, 42548, 28054, 15749]
6641A5749j27205J05254j8898j20477N1154J70301R3052k65068r1410R9398p9877
6630a68027R4833P2764j35534N0826J40464m1763M0956J32547j54856o1061L4753
6619E902k3741l6248P5324n8564j4192l223L7573o3178Q4676p0270p7593J77591
6607C4057K2479l0689L950r503J6519J12195n7263J13298p7055R4497l9271k0410
6595A62804N1473j1652o1654p7106J21702n3824l1677K6084O0761N8635j77431
6584F8115M9885M2205N5158j39936n7090K08235K7035n9688n3463l7131j2384
6573I0941J50567J7834r0534O412O0577J2159j07234m8241M9267M8299K336J28847
6561C21230P839q575m2449o4918n4750L919p5613J82049o3551N022O7281j1483
$$ y = [15749, -111456, -6202, -25100, -145577, -94423, 75878, 168930, -96138, -187548, -88150, -168027, -73194, -430, -135964, -85138, 55326, 13563, 54519, 187066, 32210, -28851, 5902, -17839, -54087, 21237, -37327, -51519, -54742, -17169, -80347, 4329, -65941, -143534, 34057, 56536, 25847, 29797, 20294, 36813, 149008, 91745, 205043, 127988, 222485, 183214, 162804, 214277, 202625, 140971, 63865, 185567, 131743, 100066, 126150, 186911, 245546, 68115, 118000, 160205, 215363, 75427, 18337, 226572, 253607, 193919, 140456, 103325, 90941, 241508, 259342, 168808, 175220, 235797, 247956, 140722, 92481, 141748, 190047, 192383, 321230, 329069, 320494, 278045, 213127, 158377, 162296, 86683, 268732, 205181, 210203, 277484, 266001]
6549B66001k4635j0869L1704K0972N8032m2730n0753r7359K4260M5369J6889j56592
6537H0289K13147M6816M7182o8299J8376Q1811j1453k48227r980J82725j780j66262
6525A64345o6238J32615K7548k9209L5363P9435N395j60009l7757j5812J08273
6514B43949R580k3339J4412o8382R8488O6040q9833n3753p5924J65599J25698
6503D12535J10091l9634r2361L8384P3100j01369R173j5153J1241M1861K5718
6492D73586p2961p0963J26421J12969Q6073p2751p7626j47430o025J73890J18280
6481F43463j49490j3034O0311N9902J80512J4552j35739j9090J8080M1420O068
6470G06955J3659r6059N134J84889P35J185p2308J05647m2904L0160M7117J55487
$$ y = [266001, 241366, 230497, 262201, 283173, 341205, 298475, 247722, 150363, 174623, 219992, 236881, 80289, 293436, 340252, 387434, 319135, 337511, 419322, 407869, 159642, 149662, 332387, 330607, 164345, 98107, 230722, 258270, 229061, 264424, 343859, 349254, 189245, 151488, 135676, 243949, 253529, 230190, 244602, 176220, 274708, 340748, 250915, 197162, 121238, 286837, 412535, 522626, 482992, 390631, 429015, 502115, 400746, 409919, 394766, 406007, 447868, 473586, 400625, 329662, 456083, 569052, 655125, 582374, 504748, 357318, 351293, 525183, 643463, 493973, 480939, 541250, 601152, 781664, 796216, 660477, 641387, 659467, 700887, 706955, 720614, 624555, 629689, 814578, 815313, 816498, 744190, 849837, 806933, 837093, 884210, 1039697]
6458A039697O8696k6390j47994l2923O9266N525Q0440p6372J87262n4136o988
6447A106083j1776J6709O2301r0799j354n4336n1154J56289j9967J9817k4351
6436A107462n7927l8161m8796j05713J30306J66728R4249n7824r7640P2213O802
6425A171699k28354K37059q1252q2808p7532p3267K62881M5670j76631j450J29809
6414A125824m2264j48704q4078K2908j00315p7054R7381K541j09007J04010P6812
6403H68054J7913J3481P852O3570p4813j16466K3609K7045r4512o8900p2952J79889
6391G73770k0538p8208M5868j12720j22451J22516J13479K3899M3918m4773j2135
6380G32625l1126M1185o1309O2586J74915j66799L9113O7813N8939r4329j12422
$$ y = [1039697, 1108393, 1082003, 934009, 901086, 970352, 975877, 1056317, 979945, 1167207, 1113071, 1106083, 1094307, 1111016, 1173317, 1082518, 1081164, 1026828, 975674, 1131963, 1111996, 1131813, 1107462, 1049535, 1011374, 962578, 856865, 987171, 1153899, 1248148, 1190324, 1092684, 1164897, 1171699, 943345, 1180404, 1099152, 1016344, 938812, 865545, 1128426, 1174096, 997465, 996015, 1125824, 1083560, 934856, 850778, 873686, 773371, 696317, 793698, 796239, 687232, 791242, 868054, 885967, 899448, 907300, 970870, 896057, 779591, 803200, 830245, 735733, 666833, 593881, 773770, 753232, 675024, 720892, 608172, 485721, 608237, 721716, 745615, 789533, 744760, 732625, 701499, 742684, 681375, 743961, 918876, 752077, 791190, 859003, 917942, 823613, 711191]
6369G11191O8424J2082l6438l953J07603M4230M3876o0195Q144j238R1327l00061
6357F84992J03963k0447k3420K3660O6204n970j09885j0957R7014N7476m4460
6346H18170P3648L6994n4339j43961J64883K37388l9339j57704m8326j15499L1551
6335H03466K35827q2632K7228N3804m1517O1568J83224r6940O026J56804N4961
6324A361819m4001j61936O7736J43188l1115j0219J47408Q8364j14527l7216J15016
6313A524517N3488J06376K8669M6275K3268J12034P4832N4519M6141M6829j9874
6302B097074N4990J8034Q9566K7064R6161L6405J10178J83529n1482J47344J18938
6291B927801J38332L5089J51026N7745J58406K05317K17651J22683K05395J99093
$$ y = [711191, 779615, 791697, 755259, 751306, 858909, 903139, 947015, 886820, 894964, 893726, 985053, 684992, 788955, 768508, 745088, 768748, 834952, 828982, 719097, 708140, 805154, 862630, 818170, 891818, 928812, 874473, 730512, 895395, 1132783, 1093444, 935740, 887414, 771915, 803466, 1039293, 956661, 983889, 1037693, 996176, 1057744, 1240968, 1144028, 1150054, 1306858, 1361819, 1317818, 1155882, 1223618, 1366806, 1335691, 1325472, 1472880, 1561244, 1446717, 1409501, 1524517, 1578005, 1684381, 1713050, 1759325, 1782593, 1894627, 1969459, 2023978, 2070119, 2116948, 2097074, 2152064, 2170098, 2259664, 2286728, 2382889, 2419294, 2529472, 2713001, 2661519, 2808863, 2927801, 3066133, 3101222, 3252248, 3309993, 3468399, 3673716, 3891367, 4014050, 4219445, 4418538]
6281D418538K17595J81796J77084J33438J88041K73985L42248M76246J16089K15136
6271F740196L25461J54978J64882J30707K7149K01279J90546R3945J22066Q1537
6261H232746N0570J89712J81313J45983P6628L26610L84617K71378L45068J92989
6251A0397614K40898K17112K12918J70064l5657M2011O324j32059j10053k52416
6241A0756756k15827j75761k99600l32839l77137j28322j52187k30459k77152
6232H567472j65655m1033K3728j44640p3548j33980k15642j58089k3424j22186
6222G513003j09020j07285k32640m72682k35733k90854l49329l94775k33130j72730
6212D914825k05980l40727j03786m2588l71263l94898j74845r8722k27695q7623
$$ y = [4418538, 4636133, 4817929, 4995013, 5128451, 5316492, 5590477, 5932725, 6408971, 6525060, 6740196, 7065657, 7220635, 7385517, 7516224, 7543373, 7744652, 7935198, 8029143, 8151209, 8232746, 8283316, 8473028, 8654341, 8800324, 8876952, 9203562, 9588179, 9859557, 10204625, 10397614, 10638512, 10855624, 11068542, 11238606, 11202949, 11244960, 11251284, 11119225, 11009172, 10756756, 10540929, 10365168, 10065568, 9732729, 9355592, 9227270, 9075083, 8844624, 8567472, 8401817, 8360784, 8384512, 8239872, 8166324, 8032344, 7816702, 7658613, 7635189, 7513003, 7403983, 7296698, 7064058, 6591376, 6355643, 6064789, 5715460, 5320685, 5087555, 4914825, 4708845, 4368118, 4264332, 4221744, 3850481, 3455583, 3280738, 3182016, 2954321, 2866698]
6202B866698k33010q1972r9967r1752p5574j97280j0560M0842r3938j14432j78860
6191A730195o6595R426K9035j25338j43260k7267R0157k17239j65742n431J6428
6180A124369L8833R1704r8844l460m7199L22j88301R8911n0021o5330r78L9661
6168I39667r9258j9273M9214L3412m7461q9530P7025k4835p8969j23293J21769
6157G38468j2721K9379j21633J9146K42061J07148k34426p8373j40459p2574J02170
6146E78186j2905L5052J01386m6230q1594K4580J17496K0375j48802j0524n4543
6135E22477K42886q8713q1301n6240j51182R0282j30720J48654L2876o0105Q6302
6124E55216P5565j55209n5708P4233M2320q6453M2383J17099P6582r017j7311
$$ y = [2866698, 2633688, 2551716, 2451749, 2359997, 2284423, 2087143, 2076583, 2117425, 2023487, 1909055, 1730195, 1663600, 1673026, 1702061, 1576723, 1433463, 1406196, 1496353, 1279114, 1113372, 1107941, 1124369, 1163202, 1254906, 1156062, 1152602, 1105403, 1105725, 917424, 1016335, 966314, 900984, 900006, 939667, 840409, 821136, 870350, 903762, 856301, 766771, 843796, 818961, 739992, 616699, 738468, 725747, 755126, 633493, 652639, 894700, 1001848, 767422, 689049, 548590, 476016, 578186, 565281, 600333, 701719, 655489, 573895, 598475, 715971, 736346, 587544, 577020, 522477, 765363, 676650, 595349, 539109, 387927, 478209, 347489, 496143, 529019, 468914, 555216, 630781, 475572, 419864, 494097, 536417, 449964, 492347, 609446, 686028, 677011, 659700]
6113F59700m7994Q2526o092P4573J08162j00167J9315M878j06774R06L0233O386
6101G25652l3537L6201J14000n8953J00910j1958p7983l1488R0869r1358J5601
6090G77956M0158J6833N9235q5380j5055k9969p4893j3302P6083P5137j65927
6079F60876q4698J75675m1054R8720k2802P640p3181q4865l1471Q8414N3767N3657
6067H00678p7839p8898l5308k8354j28470o1963K7771P6216l0666J1338n0674
6056D23831j44945L1653R6170j3988q5022k0790k2281L1385q0785q2816q2336
6045E0076K00676N7374Q0659p6982m6702r477P9550j56280j24361o9860J66052
6034A50725n3486M2898L3141o2062J18055N9156j31785p3972J45244M3088K847
$$ y = [659700, 611706, 694232, 688140, 762713, 870875, 770708, 790023, 794901, 688127, 689033, 719266, 725652, 692115, 728316, 842316, 783363, 884273, 872315, 794332, 762844, 853713, 762355, 777956, 818114, 834947, 894182, 808802, 793747, 763778, 688885, 675583, 751666, 826803, 660876, 576178, 751853, 710799, 809519, 786717, 794357, 721176, 636311, 604840, 693254, 747021, 800678, 722839, 643941, 608633, 580279, 451809, 389846, 417617, 493833, 463167, 474505, 423831, 278886, 310539, 406709, 392721, 307699, 286909, 264628, 296013, 215228, 132412, 50076, 250752, 308126, 388785, 311803, 265101, 255624, 335174, 178894, 54533, -15327, 150725, 97239, 140137, 173278, 111216, 229271, 288427, 156642, 82670, 227914, 271002, 273849]
6023B73849m8906P5246p3883o0770J11267J33085p8760j19977K157l6936J28825
6012C05197p7459j46671M4053j8973L4892J44550j08599n3411Q6663k1865j26473
6001F1904q096K3798n5990J13915P3107l4015j63165J57754o4793l8490m7479
5990A8450J32141K58337j21190k7317n5760M2449n4442j8088o2528R9405M9362
5979B60819j31810n5301J52234l091m999L3635k09602j084R9526J6045q3228q6101
5967a2957K1932J80572J5456j05446J12112m3984k16532k7678P9745o6950l2432
5956i6162J35977K4808Q3346j0454k0262q332O0620K2744r1743q0473K7306Q5033
5944A32408p214p0996J14889o7073n5343M5786l6516O2750L4590M52J87770K8954
$$ y = [273849, 224943, 300189, 226306, 165536, 276803, 409888, 331128, 211151, 213308, 176372, 305197, 227738, 81067, 125120, 106147, 141039, 285589, 176990, 123579, 210242, 188377, 61904, 53808, 77606, 21616, 135531, 208638, 174623, 11458, 169212, 104419, 65929, 18450, 150591, 408928, 287738, 260421, 204661, 247110, 192668, 174580, 112052, 211457, 260819, 129009, 73708, 225942, 222851, 217852, 251487, 41885, 40801, 140327, 156372, 73144, -12957, 8975, 189547, 205003, 99557, 211669, 167685, -48847, -76525, 3220, -63730, -96162, 39815, 64623, 147969, 137515, 117253, 108921, 169541, 192285, 100542, 20069, 47375, 132408, 125194, 54198, 169087, 102014, 46671, 92457, 55941, 118691, 153281, 153733, 341503, 370457]
5932C70457r2433p1633m697L9060O1154j81355J16312J04883j49479k8102J46046
5921C10213j32129m4619k3077k5634L0392L9695J35454m371k8776q9149j33332
5910C4667L6466J46395j47461P2204J7211j01378j184K7972N6977N6542k3951
5899A74460p6108L6715j94190L6586K36106Q527L8138j740J9737k802N4465o6782
5887B63112j29091l6185j44184J03655n6226N2962N006L4948K25666j29481J04617
5876B94799j0850o8226J7885m3673L3492o1034m7142O260p1646J32044Q4812o3644
5864B03077M2665j6161p0848k0114L87L9857p517K8426r359j48112J33080P3681
5852B49062M1508J8430q4208L9884j36446J2535o4085J31033m80L3364k1766p5781
$$ y = [370457, 278024, 206391, 201694, 240754, 301908, 120553, 236865, 341748, 192269, 164167, 310213, 178084, 133465, 110388, 84754, 115146, 154841, 290295, 285924, 257148, 167999, 34667, 71133, 217528, 70067, 142271, 159482, 58104, 56920, 84892, 141869, 198411, 174460, 98352, 135067, -59123, -22537, 213569, 222096, 260234, 258494, 278231, 275429, 329894, 263112, 134021, 97836, -46348, 57307, 1081, 54043, 59049, 93997, 319663, 190182, 294799, 283949, 215723, 233608, 189935, 223427, 162393, 115251, 121511, 49865, 181909, 266721, 203077, 245742, 229581, 158733, 138619, 139006, 178863, 171346, 199772, 190413, 42301, 175381, 249062, 290570, 309000, 224792, 264676, 128230, 140765, 76680, 207713, 207233, 240597, 218831, 143050]
5840A43050j8957M4847Q1254j042q364P8769n6451j50247o447J41015J2373l4578
5828B25222j6043R8713j5778j267l4697j83819K0243q3535J51499J09154O5304
5817C34996j6014j3835j6182m4843n5734l2072R3457J70299j861j02138j38866
5806A77207J83795M6077k2036R1638j53694J32959p46j2547j13139l2713J1433
5795C08234P5178k8791J19351M2950j0562J858j49263r2546j571J3662M8594O2615
5783C89709K4021o614o8627k9476L4509J03314N1146j38449P4345L285L084O3106
5771E03353J2059j16276R9757J28479L490j1723K468O2052n3742Q8617o3440J4313
5759F69407J69752o5667l7457M294k7243J92469l06391N3123K22631J96794k5144
$$ y = [143050, 124093, 168940, 250194, 249152, 240788, 319557, 263106, 112859, 106412, 247427, 259800, 225222, 209179, 307892, 292114, 290847, 256150, 72331, 92574, 9039, 160538, 269692, 334996, 318982, 305147, 288965, 244122, 188388, 156316, 249773, 420072, 418211, 316073, 177207, 361002, 407079, 385043, 476681, 322987, 455946, 455200, 442653, 329514, 296801, 308234, 383412, 354621, 473972, 516922, 506360, 508218, 358955, 266409, 264838, 278500, 327094, 389709, 413730, 407116, 338489, 309013, 343522, 446836, 497982, 359533, 433878, 437163, 440247, 503353, 515412, 399136, 498893, 627372, 630862, 619139, 621607, 683659, 629917, 718534, 655094, 669407, 839159, 773492, 736035, 740329, 713086, 905555, 599164, 652287, 874918, 1071712, 1046568]
5748A046568j6633Q8934j38091M4800j59752o6181P1425K26008J8040j21771r753
5737I83594k4869N6691N6993Q5479r2077J85110J2208J19714j27131P266J12755
5726A375733j3162L707N5762L1981j39505L6723N0256J4566L3924j0767j27020
5715A312198l3349N9776J28508q8050M928J06534j76888Q8041M3070j91129p268
5704A246371J35289m5912J01190N6329k408L14130R1190l32961O608n4624n4678
5693A460524j16894j24274n0395J80340j11579j3942J63035J1758l4348j74005
5683A190220j8511k9590Q8611q0889l7428N4787J35849M0299l3936k6238j04380
5672A178794r243J5256Q4319N7339l2799q944P9426p341k5408j86134N67K7492
$$ y = [1046568, 1029935, 1118869, 980778, 1025578, 865826, 799645, 871070, 1097078, 1115118, 993347, 983594, 958725, 1015416, 1072409, 1157888, 1065811, 1250921, 1263129, 1382843, 1255712, 1262978, 1375733, 1362571, 1366278, 1422040, 1454021, 1314516, 1351239, 1401495, 1416061, 1449985, 1439218, 1312198, 1278849, 1338625, 1467133, 1379083, 1384011, 1490545, 1313657, 1401698, 1444768, 1253639, 1246371, 1381660, 1335748, 1436938, 1493267, 1490859, 1804989, 1896179, 1563218, 1569826, 1515202, 1460524, 1343630, 1219356, 1168961, 1349301, 1237722, 1223780, 1386815, 1398573, 1364225, 1190220, 1171709, 1142119, 1230730, 1149841, 1112413, 1167200, 1303049, 1343348, 1309412, 1283174, 1178794, 1169551, 1184807, 1269126, 1326465, 1293666, 1284722, 1364148, 1356807, 1331399, 1145265, 1145832, 1173324]
5660A173324J33932J55465j64203J5149q828O1257o8135P9635j00828p3502L5123
5649A238389l9736m2762l6603K11961L0725q5047N2662q4748n1115K9964P6234
5638A299924N5829J81038j38130l9942R78j12138j1514K32296m0649L1264j18451
5627A340505L6252J566M7718R452K6532N456q4577O6453N1919J6141j2072L4024
5615A539369P7422k0225J0704J7108p0875o859j4761J60708L0143p1927J840L4350
5603A686997J5792J26940N8420P7630o7028N7014l8244m1614J05383J12210N9222
5592B152722m6354p8426K9889L1886J12012L2634j60491J47075j22897J0641K2517
5581B131208J10680J14618n045j14198O8827M9012R4573J22218k7434L6583J0028
$$ y = [1173324, 1307256, 1462721, 1298518, 1313667, 1304839, 1366096, 1297961, 1377596, 1276768, 1203266, 1238389, 1198653, 1155891, 1119288, 1331249, 1361974, 1276927, 1329589, 1244841, 1193726, 1223690, 1299924, 1355753, 1536791, 1398661, 1358719, 1359697, 1247559, 1236045, 1468341, 1427692, 1458956, 1340505, 1376757, 1378323, 1426041, 1435493, 1462025, 1467481, 1382904, 1449357, 1501276, 1517417, 1505345, 1539369, 1616791, 1596566, 1607270, 1624378, 1553503, 1546644, 1531883, 1692591, 1722734, 1650807, 1652647, 1686997, 1702789, 1829729, 1888149, 1965779, 1898751, 1955765, 1917521, 1875907, 1981290, 2093500, 2152722, 2106368, 2027942, 2057831, 2089717, 2201729, 2234363, 2073872, 2220947, 2098050, 2108691, 2131208, 2241888, 2356506, 2351461, 2237263, 2306090, 2355102, 2449675, 2571893, 2544459, 2581042, 2591070]
5570B591070k2979J49592J23132o3634o3667m7774Q4911p896m651M0923J8066
5559B797093n851q7489K7281K23795J56697K9929j3092K78062k6393J70052K25011
5548C775095j6087K08253O3200O321J10015M5385j06932K38977L09934K19598
5538D853759o5116j9894K67848J28111K61740J88519K44577N2010J34450K23741
5528F269745L07669K63923L91054K29782K71982K13378M82131L99614K74276M39213
5518I542767K76732K76192M39758K01620K69406K86094K29344K85575K77201J82316
5508A2267005J53713J48763R5676J35301R9083J03316K72779K56689K87515K22619
5498A4042459L71380L93521K77323N89388M91530M48636L70012M44373L08493
$$ y = [2591070, 2568091, 2717683, 2840815, 2777181, 2713514, 2665740, 2750651, 2742755, 2738104, 2779027, 2797093, 2791242, 2703753, 2731034, 2954829, 3111526, 3141455, 3128363, 3406425, 3380032, 3550084, 3775095, 3759008, 3967261, 4030461, 4036782, 4146797, 4192182, 4085250, 4324227, 4634161, 4853759, 4788643, 4768749, 5036597, 5164708, 5426448, 5614967, 5859544, 5911554, 6046004, 6269745, 6577414, 6841337, 7232391, 7462173, 7734155, 7947533, 8429664, 8829278, 9103554, 9542767, 9819499, 10095691, 10535449, 10737069, 11006475, 11292569, 11521913, 11807488, 12084689, 12267005, 12420718, 12569481, 12665157, 12800458, 12899541, 13002857, 13275636, 13532325, 13819840, 14042459, 14413839, 14807360, 15084683, 15674071, 16165601, 16614237, 16984249, 17428622, 17737115]
5489A7737115J34202Q1062j14704N5684j82355j91906k44404l23756l40624k87164
5479A6323150k58071q6619q2415j19167K6950r4940M3142Q8680J56063J29059
5469A6125832r4591k1574K12783M6236m1997M0150j10636l254j09347j41095m81
5458A5902026N2652L416j3191O9562N8797K61610K16592K61136L34986M14553
5448A7562139L84840M09114J89139L40687L13602L29078K83678M83854L16472
5439B0612603M01139L84213N72065O44384M22158P12288M83220M65439Q78607
5430B5576116Q21445R46600Q48661Q52334R57029R09862J151368J111251R08572
5421C4083238J059135Q67217J154822J267766J101466J342284J398094J479958
$$ y = [17737115, 17871317, 17952379, 17837675, 17893359, 17711004, 17519098, 17274694, 16950938, 16610314, 16323150, 16065079, 15978460, 15896045, 15776878, 15803828, 15708888, 15752030, 15840710, 15996773, 16125832, 16031241, 16009667, 16222450, 16268686, 16226689, 16266839, 16156203, 16152949, 16043602, 15902507, 15902026, 15954678, 15958094, 15944903, 16014465, 16073262, 16334872, 16551464, 16812600, 17147586, 17562139, 17946979, 18356093, 18545232, 18885919, 19199521, 19528599, 19812277, 20296131, 20612603, 21013742, 21397955, 21970020, 22614404, 23036562, 23748850, 24232070, 24697509, 25576116, 26397561, 27344161, 28192822, 29045156, 30002185, 30912047, 32063415, 33174666, 34083238, 35142373, 36009590, 37164412, 38432178, 39533644, 40875928, 42274022, 43753980]
5413D3753980J506864J556440J736336J989499K179055K342688K428108K752503
5405F0245473L254418L653542M009248M727401N423678O072248P242138Q347961
5397A02976107R521010J0835654J1898398J3241325J5395712J8127828K0454975
5390B02451009K3073998K5783397K8180729K9979647K8855300K0795073M422963
5383C63542116j3850504k5916412l0262303l0079029k7735511k5370113k2637650
5376A87690594j9758974j7056030j4756283j2923517j1317605r885527q417913
5369I3574745p398142o510937n635405m862577m246098l830954l409841l126818
5361E4553973k916623k648924k181935k159246k124936j994021j827648j758957
$$ y = [43753980, 45260844, 46817284, 48553620, 50543119, 52722174, 55064862, 57492970, 60245473, 63499891, 67153433, 71162681, 75890082, 81313760, 87386008, 94628146, 102976107, 112497117, 123332771, 135231169, 148472494, 163868206, 181996034, 202451009, 225525007, 251308404, 279489133, 309468780, 338324080, 359119153, 363542116, 349691612, 323775200, 293512897, 263433868, 235698357, 210328244, 187690594, 167931620, 150875590, 136119307, 123195790, 111878185, 101992658, 93574745, 86176603, 79665666, 74030261, 69167684, 64921586, 61090632, 57680791, 54553973, 51637350, 48988426, 46806491, 44647245, 42522309, 40528288, 38700640, 36941683]
5353C6941683j756128j557335j414460j314588j225912j226420j212767r66546
5345B6267527r43463q40581p70590o22897n74926o45430q78859o43109o26530
5336A9721142n84825m16643l95152n31275m54604l07418l89725m42067m47565
5327A5751868m35281l00789l22435l69734l85144j36772l84298l05271k71056
5318A2841088l20385l25195j50637j93931l82506j28048k01938k76371k11536
5309A0650541l23742q6007q4605l10918k89245j45205j39048k78962j98925k06774
5299H587110k58541o9365j97021q7996j41417j26456j24834j42100Q718p8849
5289G369249j31115j65871O308q452q9264j65688n870P1589j37013r2693J65223
$$ y = [36941683, 35185555, 33628220, 32213760, 30899172, 29673260, 28446840, 27234073, 26267527, 25324064, 24483483, 23712893, 23089996, 22515070, 21869640, 20990781, 20347672, 19721142, 19136317, 18719674, 18324522, 17793247, 17338643, 17031225, 16641500, 16199433, 15751868, 15316587, 15015798, 14693363, 14323629, 13938485, 13801713, 13417415, 13112144, 12841088, 12520703, 12195508, 12044871, 11850940, 11468434, 11340386, 11138448, 10862077, 10650541, 10326799, 10240792, 10156187, 9845269, 9556024, 9410819, 9271771, 8992809, 8793884, 8587110, 8328569, 8259204, 8062183, 7974187, 7832770, 7706314, 7581480, 7439380, 7448098, 7369249, 7238134, 7072263, 7078571, 7070119, 6980855, 6815167, 6809297, 6880886, 6743873, 6651180, 6816403]
5278F816403j04721p2819M3901J15606k31805p2768J68468P611K185r0237r201
5267F572623P6717o5825j37113k896J61415k6607l5870o5778K66638J45322n8478
5256F830148K4767k0733K16861J63271O0777M4348K26994P0490J79294J59349
5246G955566M15421L01385K98505K59084Q0406N18479L08986J63467K17765L05666
5236A0824730L49981M65443M37557M94705O22940P36903P26495R74393Q58237
5227A6491384R88765J386786J112142J078113J081456R39656Q07921K77513m49483
5218B3714253n30870r29462j219895j366533j225801j403592j271262j050484
5210A4716354o70277r05370j053144p56220p20190n45787o78775m44738n09496
$$ y = [6816403, 6711682, 6638863, 6682764, 6798370, 6566565, 6493797, 6662265, 6669876, 6672061, 6581824, 6572623, 6649340, 6583515, 6446402, 6443506, 6604921, 6578314, 6542444, 6476666, 6743304, 6888626, 6830148, 6854915, 6834182, 7051043, 7214314, 7275091, 7319439, 7546433, 7616923, 7796217, 7955566, 8370987, 8672372, 8970877, 9229961, 9310367, 9828846, 10137832, 10301299, 10519064, 10824730, 11174711, 11640154, 12077711, 12572416, 13195356, 13932259, 14658754, 15633147, 16491384, 17480149, 18866935, 19979077, 21057190, 22138646, 23078302, 23886223, 24163736, 23714253, 23183383, 22253921, 21034026, 19667493, 18441692, 17038100, 15766838, 14716354, 14046077, 13140707, 12087563, 11331343, 10611153, 10065366, 9386591, 8941853, 8432357]
5201H432357m98307m09802m17101l35291k09288j15670j90969k93535k73220j67154
5191E522020k31820k15589q6011j53102k41624j11818J886j53699l08304j16366
5181C905573K1907k9119p7027j78149J05749k28970j4584j07702q1650J9803J9828
5170C355659n816j44453r093j0598j42096J55247L4192K5262q8815L8876R4666
5159C303031J95215M3399J4622K00419J32053J19178J56001K00656K3203j10523
5149D277254l53753l54092j55078j59237j86848k20503r1836j25494r9741o9507
5139B461165o7969r627j43776j10048l281P9767l1327k2164l04225j38572o8249
5128A641694k37L8355J41576j52146m175O7932l1161k7729n3534M411k4794p0251
$$ y = [8432357, 7934050, 7524248, 7107147, 6771856, 6562568, 6446898, 6255929, 5962394, 5689174, 5522020, 5290200, 5074611, 4988600, 4835498, 4593874, 4482056, 4483942, 4330243, 4021939, 3905573, 3927480, 3898361, 3821334, 3643185, 3748934, 3519964, 3505380, 3397678, 3316028, 3335831, 3355659, 3349843, 3205390, 3196297, 3185699, 3043603, 3198850, 3233042, 3258304, 3169489, 3208365, 3303031, 3498246, 3541645, 3556267, 3756686, 3888739, 4007917, 4163918, 4364574, 4387777, 4277254, 3923501, 3569409, 3414331, 3255094, 3068246, 2847743, 2755907, 2630413, 2530672, 2461165, 2393196, 2383569, 2239793, 2129745, 2126464, 2206231, 2174904, 2152740, 1848515, 1709943, 1641694, 1641457, 1679812, 1821388, 1669242, 1665067, 1732999, 1701838, 1674109, 1620575, 1624986, 1600192, 1529941]
5116A529941q6213m9486j3443j0898O9747r7123K8504m3928k9003J6429j00881
5105A213646l0727j2070l321j44364L5518J3380r3043J54149n7000j58081J1596
5094I29683J74956n2425j14317n7210M4719Q0961l8394N8131J6821j50423j72724
5083G19778J04949M0649J87023l2164j74906l7162O9545q7381O2507N0288q4100
5072H19026J5416j04576n5425M9787J7586L1931k2981J00556l331l0878M1134
5061H58245j2833Q1550k75397K09588J39278n771M0993j5628n2453P1005p3143
5050I65434L0493N4188L6878O921j74183o1119o6070n5787k0210j39223o9425
5039E07897J37890J48983j4438N586N9699k6336p5593j20605j23436J30452n5528
$$ y = [1529941, 1443728, 1394242, 1380799, 1369901, 1439648, 1342525, 1371029, 1327101, 1298098, 1314527, 1213646, 1182919, 1170849, 1167528, 1023164, 1058682, 1072062, 979019, 1133168, 1076168, 918087, 929683, 1104639, 1052214, 937897, 880687, 925406, 1006367, 967973, 1026104, 1042925, 892502, 719778, 824727, 865376, 1052399, 1020235, 845329, 808167, 877712, 790331, 852838, 903126, 819026, 834442, 729866, 674441, 724228, 741814, 773745, 750764, 851320, 847989, 817111, 858245, 845412, 926962, 651565, 861153, 1000431, 994660, 1035653, 1020025, 967572, 1038577, 965434, 995927, 1050115, 1086993, 1093914, 919731, 858612, 792542, 736755, 716545, 577322, 507897, 645787, 794770, 780332, 785918, 845617, 819281, 743688, 623083, 499647, 630099, 574571]
5028E74571j4917K3428j0810Q5664j40150L6794J3951k5915J34495o9489p7697
5017E29925p5753j40224O9619M3004N7454r2314j06953R6378P9148n9891L6322
5006D36715j90885P8858N0182Q9124q9575l955K1451N8566L1167K7566l796P4700
4994E80118r9256K6486o3177L3869K10744m9976N2207o9644r9090o7951K2533
4983D76863j73874J04419O3747j03935R8676J9925K02n4616l3545Q9109o385j20443
4971C60143l3212J28884J06553L1162j81761N5675k1116j09055J18075J01080
4961E56428J55893q6302r0935R985K1625o9233p8576J13120k0974j07157M5521
4950D49395O6581j19569q8293J58449p9961N9892R1792j7898l9572j31921L9349
$$ y = [574571, 559654, 583082, 572272, 657936, 517786, 554580, 568531, 542616, 677111, 607622, 529925, 454172, 313948, 383567, 426571, 484025, 391711, 284758, 381136, 460284, 400393, 436715, 245830, 324688, 374870, 463994, 374419, 370464, 391915, 450481, 481648, 509214, 505418, 580118, 480862, 507348, 444171, 478040, 688784, 638808, 691015, 621371, 522281, 454330, 476863, 302989, 407408, 471155, 367220, 465896, 485821, 486023, 431407, 397862, 486971, 480586, 360143, 326931, 455815, 562368, 593530, 411769, 467444, 446328, 337273, 455348, 556428, 712321, 626019, 535084, 545069, 566694, 497461, 418885, 532005, 511031, 403874, 449395, 515976, 396407, 308114, 466563, 386602, 446494, 538286, 520388, 480816, 348895, 388244]
4939C88244L180n5446r346Q2744l7592j1541O0505K7740K9690J7399p2253k7344
4927C95980Q1590P1773j06291K4304k9368j82940N2898J12886o2801J73858K9126
4916E61015q2499K5592R6577K6390q8803O4957j25523J5671J21855J5130J8385
4905F48747J59613j09336q6947j36854L6847K91615J00900L3643n4085j53617
4895G30526j06107L6199O3790q1095M7475m9367o5887M0034l8572Q5533O53n3882
4883F09300q5945j00896J31007l9383N211J05749j17653J13657P6760J1549o6509
4872F42847j21268j24653j14382o2394Q2703K5395r5001P2562N3748r0232K43468
4861E12793n0801n6060J25091r1758j00094N4160J8403K7539j08060Q3877M28
$$ y = [388244, 391424, 335978, 326632, 409376, 371784, 360243, 420748, 448488, 478178, 495577, 423324, 395980, 477570, 549343, 443052, 467356, 437988, 255048, 307946, 420832, 358031, 531889, 561015, 478516, 504108, 600685, 627075, 538272, 603229, 477706, 493377, 615232, 630362, 648747, 808360, 699024, 612077, 475223, 512070, 803685, 904585, 938228, 884143, 730526, 624419, 660618, 724408, 643313, 690788, 641421, 575534, 615568, 576996, 662529, 663182, 609300, 523355, 422459, 553466, 514083, 519294, 625043, 507390, 621047, 697807, 709356, 642847, 521579, 396926, 282544, 220150, 302853, 328248, 233247, 305809, 359557, 269325, 512793, 461992, 405932, 531023, 439265, 339171, 393331, 411734, 439273, 331213, 415090, 415518]
4850D15518l5749P5311P3502n4093j13996R5048j94570K1446J00108q2535J17487
4839D17477L5301j50930k0920O749O4999l1021K3229n421M9315Q5098j45193Q471
4827C37154q7167J026O0637J05376j01017J899q2741p3400l0156o0105J23266
4816A94772L4470k1707N8040M3511J17729L8803k9131j38577J55049N5332k6450
4805D81841l6382j90653J30451J8054k8628o1371p6684R6859O1666O9377O8372
4794E32902j94047N7506J37237l1675J37292L0313q3087P4261j50409p3168k0642
4783D16483Q7261j14166P7472K9134J85739n520j14561n1079m9097j76172L3201
4772C18695K3904J08676J12446n1883j3974J00331L1034K0864j20094k88339P2774
$$ y = [415518, 379769, 455080, 528582, 474489, 360493, 455541, 260971, 282417, 382525, 299990, 417477, 452778, 301848, 280928, 287677, 352676, 321655, 344884, 339463, 388778, 473876, 328683, 337154, 249987, 251013, 311650, 417026, 316009, 317908, 235167, 161767, 131611, 71506, 194772, 229242, 207535, 265575, 309086, 426815, 465618, 436487, 297910, 452959, 508291, 481841, 445459, 254806, 385257, 403311, 374683, 313312, 236628, 333487, 395153, 464530, 532902, 338855, 396361, 533598, 501923, 639215, 669528, 586441, 660702, 510293, 437125, 416483, 503744, 389578, 467050, 496184, 681923, 676403, 561842, 510763, 461666, 285494, 318695, 342599, 451275, 563721, 511838, 497864, 598195, 629229, 650093, 529999, 241660, 314434]
4761C14434J70032r2655l7730O8708M1305K4751N7175l7200j90253J15376Q1410
4750E15353J35316J16450j44683j10183j14207K426J43849K03495o7311l12938
4740C67567J22486J82227q121p557j5130j14793J4445J02382K9021j0261L8647
4729G00913P0645o153j14033J2586N2004O0393j04501J10643N7591o8725J05468
4718H76831J40628j14084n5030l6423J07219P560L4874n9981m2568J36211R3239
4707A088476q6311j10574p8659Q4566O6885q0391R7398J11977M7983N4495j6772
4696A179073j07459P5669N9412N3770l7191m6408r3247K28353r024J13358K32381
4685A648687j71010r5942L7336K7239O0780M8490R0109j26710K09029k5168p7206
$$ y = [314434, 484466, 391811, 354081, 422789, 464094, 488845, 546020, 508820, 318567, 433943, 515353, 650669, 767119, 622436, 512253, 398046, 400472, 544321, 747816, 680505, 367567, 490053, 672280, 664159, 656602, 641472, 526679, 541124, 643506, 672527, 662266, 700913, 771558, 765405, 651372, 663958, 715962, 776355, 671854, 782497, 840088, 771363, 876831, 1017459, 903375, 848345, 811922, 919141, 926701, 961575, 901594, 859026, 995237, 1088476, 1002165, 891591, 812932, 897498, 964383, 883992, 981390, 1093367, 1141350, 1195845, 1179073, 1071614, 1147283, 1206695, 1260465, 1223274, 1176866, 1083619, 1311972, 1302948, 1416306, 1648687, 1477677, 1381735, 1419071, 1446310, 1507090, 1555580, 1645689, 1518979, 1728008, 1702840, 1625634]
4674A625634K18151P4687O1959N5969o9755J9346J22093O3263J78168Q0525J80894
4663B610934n1426n8047O2455J09280R8933J14715J36611J76367R0780j65443
4653C125159J53926K17219K43831M6428O1640M35297M1439K06737J67103O9659
4643D768438J17796K38371J89368J19001M3432K25589K67300K08391L01493K93967
4633F773146J94704J27192L09308J66108K01243L95956K98256K48857M41923L20871
4623I477564M18757M16928J96250N12283M38049M23364L36004P95538P81486O84761
4613A4480984Q53720R29931J105598J213672J262038J546416J866582J848019
4605B5106960K209220K434616K598716K745607K363544K259559K117552K047511
$$ y = [1625634, 1843785, 1918472, 1980431, 2036400, 1966645, 1985991, 2108084, 2171347, 2349515, 2430040, 2610934, 2559508, 2501461, 2563916, 2673196, 2772129, 2886844, 3023455, 3199822, 3290602, 3125159, 3279085, 3496304, 3740135, 3786563, 3848203, 4283500, 4324939, 4531676, 4698779, 4768438, 4886234, 5124605, 5313973, 5432974, 5476406, 5701995, 5969295, 6177686, 6479179, 6773146, 6967850, 7095042, 7404350, 7570458, 7771701, 8167657, 8465913, 8714770, 9156693, 9477564, 9896321, 10313249, 10509499, 11021782, 11459831, 11883195, 12219199, 13014737, 13796223, 14480984, 15334704, 16264635, 17370233, 18583905, 19845943, 21392359, 23258941, 25106960, 27316180, 29750796, 32349512, 35095119, 37458663, 39718222, 41835774, 43883285]
4597D3883285K572915K966349L201870L214762K715368J902586J432786R30871
4589F2820792J004869J543014J952102J827337J591531L78801j131217j999722
4581F7987507j953533j708844j508103j171195j054875j590178k489025l068434
4573E3443320l291286l222811k833710k355687k223684k193092k304775k691790
4565C2326485k674104k556759k207434k085421k001076j707915j394621j155569
4557A6543586j116763j017887j017054p21576o24111p35952o52007m20502m95361
4548I742373m90094l20230l22186l49256k79007l49449l62485m33625j52344m6162
4538F637535l20112k78272k24641j97088j71408q5793k70627j44351j78678j89916
$$ y = [43883285, 46456200, 49422549, 52624419, 55839181, 58554549, 60457135, 61889921, 62820792, 63825661, 65368675, 67320777, 69148114, 70739645, 71118446, 69987229, 67987507, 66033974, 64325130, 62817027, 61645832, 60590957, 59000779, 56511754, 53443320, 50152034, 46929223, 44095513, 41739826, 39516142, 37323050, 35018275, 32326485, 29652381, 27095622, 24888188, 22802767, 20801691, 19093776, 17699155, 16543586, 15426823, 14408936, 13391882, 12670306, 12046195, 11310243, 10658236, 10237734, 9742373, 9252279, 8932049, 8609863, 8260607, 7981600, 7632151, 7269666, 6836041, 6683697, 6637535, 6317423, 6039151, 5814510, 5617422, 5446014, 5360221, 5089594, 4945243, 4766565, 4576649]
4528D576649o6065j72030k19831M2749m0487j44436j34831l902j43916j55696
4518C538204L4753l10170k19089L9991O8605j35339r3355m0687r1517j59267j1128
4507B621001K3767j00884m3091o7805r6783j03402n1558j96508n0059L8917J3045
4496A986640j05901r1198Q4708k4170L5374J1024j63969k23684K8711K3479N5956
4485A616970j3187O2677p8785m1083p7185r3980k2953j21195j3028J41943m9587
4474A310607N3060K6879r5209j91141k758k22N7805j19436l1233O5391j3375k6701
4462A033667k25639R8402n579O2359j25860J0176L4139o6184L4384p8685M8331
4451H19511K30702L493q7541j07688k6160n3266m2538J1818J28128P9960n2122
$$ y = [4576649, 4510584, 4338554, 4118723, 4161472, 4120985, 3976549, 3841718, 3837816, 3693900, 3538204, 3572957, 3262787, 3043698, 3083689, 3152294, 3016955, 2923600, 2882913, 2791396, 2632129, 2621001, 2644768, 2543884, 2500793, 2432988, 2336205, 2232803, 2181245, 1984737, 1934678, 1973595, 1986640, 1880739, 1789541, 1874249, 1850079, 1885453, 1896477, 1732508, 1508824, 1537535, 1561014, 1616970, 1603783, 1666460, 1587675, 1546592, 1469407, 1375427, 1352474, 1231279, 1218251, 1360194, 1310607, 1363667, 1390546, 1295337, 1104196, 1101438, 1101216, 1159021, 1039585, 1008352, 1073743, 1060368, 1033667, 808028, 906430, 900851, 963210, 837350, 847526, 881665, 815481, 849865, 771180, 819511, 1050213, 1053706, 966165, 858477, 832317, 779051, 736513, 748331, 876459, 956419, 904297]
4440I04297J03957j36645n6931J3389j58294N0058o1659j5492P0356J20943r4429
4429G39550j51086J28197Q0596m9855M8092o6580J9286r3185o3356P3307Q7074
4418G52040K6033j29643j5037j21756j9998N3533J34205P4396L0241o3362m5690
4407F74962j08466m7748o0150O5069r071P1673N2933K4348o6457K8702J04839
4396G30634k8260j26237r9155J34755M3452J6995l4319P759p8592q8834M0625
4385E18823n0649n0014N8204l1449j4684l5417o6738n1775J29511r612m2950j82485
4373A70765Q1900J9183l2039o6935P8300J21836M3208m9557J9346o3832q8910
4362B33265J24547r4182k7276Q283Q0240j43377j1274R8425r419L2725O7189j58259
$$ y = [904297, 1008254, 871609, 814678, 828067, 669773, 719831, 658172, 642680, 713036, 833979, 739550, 588464, 716661, 797257, 747402, 795494, 728914, 748200, 655015, 591659, 664966, 752040, 778073, 648430, 633393, 511637, 491639, 545172, 679377, 753773, 784014, 720652, 674962, 566496, 518748, 458598, 523667, 514596, 586269, 639202, 663550, 597093, 625795, 730634, 702374, 576137, 476982, 611737, 655189, 672184, 637865, 645624, 567032, 478198, 518823, 468174, 418160, 476364, 444915, 430231, 394814, 328076, 276301, 405812, 396200, 353250, 170765, 252665, 271848, 239809, 172874, 251174, 373010, 416218, 366661, 386007, 322175, 233265, 357812, 263630, 236354, 244637, 324877, 181500, 170226, 268651, 259232, 291957, 359146, 200887]
4350B00887n0277M5642n8209Q9990o9323J6503O5406n3039l5514j4285J25673
4339B63454J34609K06526p692j64217k28313j6363o08K1561j13520J04583J14440
4328C14460j33193j11999N0033M5953J02757R7556K4297m4455J7741J00856j24872
4317C39134n2377j52087Q233J79022J44823o5334j18159O9796L0377l3582M394
4306C54240M8509j18760L1858J6014p682k1056j28619R8386L4317r9979K3057
4295B30285k1082M6214J36280j88944J14116n7280J6856P3581J16371K9359j11499
4284C84257L0443O4072P1554m4257r1534q9002n581q9914J40267J51226j0610
4273E10921l4727p5299N4857L5096Q3070j080r4436m9336J55557J6886K5759k7440
$$ y = [200887, 150610, 196252, 138043, 228033, 158710, 175213, 240619, 187580, 152066, 137781, 263454, 398063, 604589, 596897, 432680, 204367, 188004, 187396, 208957, 95437, 200020, 314460, 181267, 69268, 119301, 165254, 268011, 365567, 389864, 345409, 363150, 464006, 339134, 286757, 134670, 142903, 321925, 466748, 401414, 283255, 353051, 383428, 349846, 354240, 402749, 283989, 315847, 331861, 324179, 303123, 174504, 272890, 307207, 207228, 230285, 209203, 255417, 391697, 202753, 316869, 259589, 276445, 350026, 466397, 495756, 384257, 414700, 478772, 550326, 506069, 414535, 325533, 319952, 230038, 370305, 521531, 510921, 476194, 400895, 455752, 490848, 573918, 572838, 478402, 429066, 584623, 601509, 627268, 599828]
4261E99828j33109N5150o6236j26j21010j2517j9517p4173Q281J4282P2274O0719
4249C83846l5269P0307r0832k1752q5419j4530K8757m6016Q1954j01453n5156
4238A14437P4726L0858l8797n2477j38169j07680K06018L6340j11158M7652O3900
4227A25650O0423k2299J7062l235N5j12323N4328k4120o8069K1717j8760N0854
4215H1283M8838J9102P0939o4086J9651J88312N1846l4873j63443n7789J17534
4204B77314J65696j7512j23181L5288r7538r0063J01849J56301j83597j48540
4194G6017j3198M7960L9212J9610J27707k1577P516k1749M5983P9579q9651j12147
4182A85262o2876J68510l1228o1157n7209n1099p6372P6372Q8347K1135J98511
$$ y = [599828, 466719, 521869, 455633, 455507, 334497, 321980, 302463, 228290, 236571, 250853, 323127, 383846, 348577, 418884, 328052, 306300, 220881, 206351, 235108, 189092, 271046, 169593, 114437, 189163, 220021, 181224, 128747, -9422, -117102, 88916, 125256, 14098, 61750, 125650, 186073, 163774, 180836, 177601, 177656, 65333, 119661, 95541, 27472, 49189, 30429, 81283, 130121, 149223, 220162, 156076, 175727, 364039, 415885, 381012, 217569, 159780, 277314, 443010, 425498, 302317, 337605, 240067, 150004, 251853, 408154, 224557, 76017, 62819, 110779, 149991, 169601, 297308, 275731, 283247, 261498, 307481, 387060, 297409, 185262, 122386, 290896, 259668, 198511, 141302, 90203, 13831, 90203, 178550, 199685, 398196]
4171C98196j37123m1497K9580M6405O8798j55385j09274k8057n0280P1195p6725
4160A5833j1101r0218J15715K23912j03371j51839Q339K7076k7825M1372o8673
4149b0780R5795M3884m9698o18n578p6549q248J36362j19292M836Q3012J09354
4137A92480k7727j23715l129P1537L7836o9047j42286N5027L3714J18834J20356
4126B63880m7783j29411r3506J11330M4386p0804n2384J55238K22936j33141j86043
4115H4698Q9236Q2596p2607m0497j71484L1620J40469l8165P4864k7057j37258
4104A6415r9776J61492J70502j29912j39428J30337Q88L595m9975r1325P2478
4093D5291L4184J5385O7362k2212o376M7758j34623j07133J66259J1601k6795
$$ y = [398196, 261073, 219576, 249156, 295561, 364359, 208974, 99700, 71643, 21363, 92558, 15833, 4732, -85486, 30229, 254141, 150770, -1069, 7270, 34346, 6521, 47893, -20780, 75015, 118899, 69201, 68583, 63005, -13544, -21792, 114570, -4722, 114, 83126, 192480, 164753, 41038, 37909, 109446, 147282, 78235, -64051, -9024, 24690, 143524, 263880, 216097, 86686, -6820, 104510, 148896, 78092, 25708, 180946, 403882, 270741, 84698, 173934, 256530, 183923, 143426, -28058, 3562, 144031, 105866, 180730, 153673, 16415, -83361, 78131, 248633, 118721, -20707, 109630, 110518, 114113, 64138, -27187, 45291, 79475, 94860, 162222, 140010, 133634, 181392, 46769, -60364, 105895, 117496, 90701]
4082I0701r6819p0416R2206N4298M4609o4539n7075J85617L2786J19647q4673
4071B46342k45589J47539l5997K6276m9241K3961J69582N5937j62850j42489O9274
4060A02745R3673q0170j26672M0931L868l9299j5372P2456j06034R1488K9037
4049F6651P5268J53928n8665o2427j36057J04196P3104j48080k3652J92192k15798
4038B0660p9478J23790Q6711k6225M2916q2596Q800n5737j04522p4923J5832R8606
4026b6166r2995M6122O5693J05538m1877M171r6727P9914L1288r720n1062m7N8749
4013G2881J00223N8081q2060j74793r6624R0909P3267p4237M3062O4992j10210
4002c4509L7652K4762o1878R3023N5471o9359j14350L1835p3335o4617O6443p024
$$ y = [90701, -6118, -76534, 15672, 69970, 114579, 50040, -7035, 178582, 211368, 331015, 246342, 753, 148292, 112295, 138571, 89330, 113291, 282873, 338810, 175960, 33471, 102745, 196418, 116248, -10424, 30507, 34375, -4924, -20296, 52160, -53874, 37614, 66651, 141919, 295847, 237182, 174755, 38698, 142894, 215998, 67918, 44266, 236458, 20660, -58818, 64972, 151683, 125458, 168374, 85778, 94578, 38841, -65681, -140604, -124772, -26166, -119161, -73039, -7346, 98192, 56315, 60486, -36241, 43673, 74961, 65241, 14179, 14132, 72881, 173104, 231185, 149125, -25668, -122292, -31383, 41884, -32353, 10709, 75701, -34509, 3143, 27905, -33973, 59050, 114521, 45162, -69188, -37353, -110688, -175305, -108862, -115886]
3990a15886L2406K0846K6566J57124r1177j802q8713k488L9545O5906O7053p5342
3978C4038L2147L7844J2101j6698J4281k3150M0792K5394o9890L5024k3681M1128
3966A39330j45183j31231J37038k697p9216O3047j4334q3918P1430k8194N6484
3955a7444K2792K9464M6383p8387j44496M7836R5822Q8046l4933P6041k12082
3944h0958q4418N2034L2689O0638M0157R7150j3010j58219N1628o5949J6277k1899
3932g3880R4697J7292l3171k0077K5887P1493R896L6731j68897K8533M9449N1446
3920H9399R5520K6366k03003l329J63018k35172K6027K623J28380J12045k5422
3909A76452n600N300o3419j7225Q834M053L6944K7761m566j30700q1471K2235
$$ y = [-115886, -83480, -62634, -36068, 121056, 29879, 28077, -60636, -63124, -23579, 42327, 109380, 34038, 66185, 104029, 116130, 99432, 113713, 90563, 131355, 156749, 86859, 121883, 98202, 139330, -5853, -137084, -46, -2743, -81959, -18912, -33246, -117164, -45734, -73928, -17444, 5348, 34812, 81195, 2808, -141688, -93852, 1970, 90016, 55083, 131124, -80958, -165376, -113342, -80653, -20015, 20142, 117292, 104282, -53937, -2309, -68258, -51981, -73880, 20817, 38109, 4938, -15139, 10748, 82241, 92137, 128868, -40029, -11496, 37953, 89399, 184919, 211285, 8282, 4953, 167971, -67201, -41174, -38551, 89829, 201874, 176452, 170852, 176152, 112733, 95508, 104342, 108395, 145339, 173100, 168534, 37834, -43637, -21402]
3897b1402J30885j49274k0287K26944j06510j00554j5773n0278R4837P6848K1353
3886H6789r1122J55071j20290q1374o3391P1408j9486K8575l6161q9350Q9510
3875f9821J78348j25333p0633L0759O5089L0670k5514N5105o9905o8421N2848
3864a6808K0771p4325k2284O177K2996M3558p1344L7738O8624j07865m1499j47399
3852b81660K33052K2635j13240k2700J41456K256R695L9281j00646N7867O2052
3841E0048k7289j50551R9300K482L6532J4406J17274j8747q0799m7755p4191p1984
3829a51274P6744L8954N793J45389j2045L4442J7085o5805P8415l9497N3361J2618
3817A94180j8250R123j71762L1561n1822L6465K9171o6339n155j5146J22924p8076
$$ y = [-21402, 109483, -39791, -60078, 166866, 60356, -40198, -55971, -106249, -11412, 65436, 86789, -4333, 150738, 30448, -50926, -114317, -42909, -62395, -33820, -69981, -159331, -69821, 108527, -16806, -87439, -56680, 8409, 39079, 13565, 68670, -1235, -69656, -16808, 3963, -70362, -92646, -86469, -63473, -19915, -91259, -53521, 15103, -92762, -134261, -281660, -48608, -25973, -139213, -161913, -20457, -18201, -8506, 30775, -69871, -12004, 50048, 22759, -127792, -28492, -26010, 10522, 24928, 142202, 123455, 42656, -5099, -79290, -151274, -74530, -35576, -29783, 115606, 103561, 138003, 155088, 89283, 167698, 128201, 181562, 194180, 175930, 185053, 13291, 44852, -6970, 29495, 58666, -7673, -12828, -27974, 94950, 16874]
3805A6874k4671P617L9604J84972l4172P2072q9121j83405r555o8334k9741O8615
3793d9245M334M8727P32n5646K01090P2482k04935Q2836l8853j59356k2512L8143
3781h2203J67732o5648p3900P2331J17366R3608j08099q2425j2319q5208j31551
3770a90316J40651l2127m7357J39054Q6727o464j06475l2249K39721L5001n4903
3759A71263j9470K3026j09086k877p9195k0311P8074j2706q5012J23397j0654
3748E6449n6807O5159p3260J09107j8134r480P1389J909j2859l7132n8j79456
3736h3173N264J34249q5701p0525K56302k3650p6288q591q6442N8105L1335K6162
3724G7047k78058N4119N5933j6662o103j5802N9697R2898n0006r6374j53240J83599
$$ y = [16874, -7797, -180, 39424, 224396, 190224, 262296, 173175, -10230, -19785, -88119, -117860, -49245, -44911, 3816, 4548, -51098, 149992, 222474, 17539, 100375, 61522, -97834, -120346, -82203, 85529, 19881, -54019, 18312, 135678, 229286, 121187, 38762, 26443, -58765, -190316, -49665, -81792, -129149, 9905, 96632, 90168, -16307, -48556, 191165, 226166, 171263, 151793, 174819, 65733, 62856, -16339, -36650, 41424, 28718, -56294, 67103, 56449, -358, 64801, -8459, 100648, 82514, 73034, 144423, 146332, 133473, 96341, 96283, -83173, -77909, 56340, -29361, -99886, 156416, 132766, 56478, 47887, -38555, 19550, 50885, 77047, -201011, -146892, -90959, -107621, -113724, -129526, -69829, 23069, -26937, -123311, -276551, -92952]
3712i2952J32132q1241o2206K26139o9305j54323K3240R3747J30643j02792j27806
3701h4724J80436q8531l745Q1209L8017j14792K8082q9216j22827J20251J16550
3690F0710j6886O2109K861q1392o5851j334J76511l6766p8095n7798J80253r8127
3678D6195n3833P8254L8096K1964m3979r6329P0358j74584P3419P7265j5160r2135
3666g0469L5n2341J51365J0301P384l0969j14842J782R9589J32321j02582P147
3654C8721R4937j1944k8489M0110O116r1965k0249Q9374j75305O588J12941J01189
3642A62024P321j75461m0830Q4876l3914o7073P640K5880L3001J8162j0161M0456
3630E1921K5779P2092r5891q8498l8130J49009J00164r3080o3484N2569K5241
$$ y = [-92952, 39180, -42061, -104267, 121872, 52567, -101756, -78516, 15231, 145874, 43082, -84724, 95712, 7181, 3436, 84645, 122662, 7870, 35952, -53264, -176091, -55840, 60710, 43824, 105933, 108794, 27402, -38449, -39783, 136728, 99962, 21867, -35931, 144322, 46195, -7638, 70616, 108712, 130676, 86697, -9632, 60726, -113858, -40439, 36826, 21666, -70469, -70434, -122775, 28590, 38891, 46275, 15306, -99536, -97754, 1835, 134156, 31574, 38721, 133658, 121714, 93225, 133335, 139451, 47486, 27237, 116611, -58694, -52106, 60835, 162024, 169345, -6116, -46946, 37930, 4016, -63057, -55417, -29537, 3464, 21626, 11465, 51921, 77700, 149792, 53901, -34597, -72727, 76282, 176446, 83366, 19882, 72451, 97692]
3619I7692l4424o7174J19176R9566k20153p5452Q3285N5613k9477J785j3577O3900
3607H0760n1912N9283N1503J767L1320q4720m9233j24382K2894K4062J4631R7060
3595G3033J25180R4678j15667j2417L4055j49328n2780o9624N7213N3605l2169
3584E779J02913O7593K0256J69622m3189k31042N5232P4766R5546n4732r7900
3573A64844j18112r1206J34406R0533K2290j31301M067N0639L5017p548m2800
3562A10829j55764j4859J11344J37160o906j21079K8585J40468p0035n7445j2871
3551H9427o340R5356k1366o0478j37162J14686p3059M2903l3277K8027k3390J1432
3539B6759M9332J4643Q406J30078q3349k3915R8131p6643l7233J06289K670o2540
$$ y = [97692, 63268, -3906, 115270, 214836, -5317, -80769, 2516, 58129, 28652, 30437, 16860, 80760, 28848, 88131, 139634, 141401, 172721, 88001, 38768, -85614, -62720, -38658, -24027, 73033, 198213, 292891, 177224, 164807, 198862, 49534, -3246, -72870, -15657, 37948, 5779, 108692, 176285, 196541, 366163, 322974, 91932, 147164, 221930, 317476, 262744, 164844, 46732, -44474, 89932, 180465, 202755, 71454, 75521, 126160, 161177, 153629, 110829, -44935, -59794, 51550, 188710, 181804, 60725, 89310, 229778, 159743, 102298, 89427, 83087, 178443, 157077, 96599, -40563, 74123, 1064, 43967, 10690, 38717, 15327, 26759, 76091, 90734, 99140, 229218, 145869, 121954, 220085, 143442, 106209, 212498, 215168, 152628]
3527A52628Q132j05713P055O3725m1806O4646N1841q2406L2158P1925o8803q7506
3515F5876J44579Q8069j7411o2721p2081j45571K0084J6892O0830j367R4546k4816
3503A66909J07117k0701j83833Q4950K14957k5237q0345k9574n3288j02213K02638
3492B81380M8552N6568R7922j37355P3748J6493J9186o1192m8610k4289J20287
3481D42690O2077p4638M095K7436p2493J98573k4423j36414P5431n6607n3076
3470C92651L3649R3777M0780j5721j5243p5738R204J03913J26243o9562J121Q2804
3458G07878j66755O6314L5316K6483J57253Q1822k7133r1760J2788J55074J06243
3447A063523L5813K1985J85781j01557p7705l9887Q9617L2676J66061J21632q7406
$$ y = [152628, 160760, 55047, 62102, 125827, 84021, 148667, 200508, 118102, 150260, 222185, 153382, 65876, 210455, 298524, 281113, 218392, 146311, 740, 20824, 37716, 98546, 97179, 191725, 166909, 274026, 253325, 69492, 154442, 369399, 344162, 263817, 234243, 180955, 78742, 281380, 329932, 386500, 484422, 347067, 420815, 437308, 456494, 395302, 346692, 322403, 442690, 504767, 430129, 434224, 461660, 389167, 587740, 563317, 426903, 502334, 445727, 392651, 426300, 520077, 560857, 545136, 529893, 454155, 463359, 567272, 693515, 623953, 625074, 707878, 541123, 607437, 642753, 669236, 826489, 908311, 881178, 789418, 802206, 957280, 1063523, 1099336, 1121321, 1307102, 1205545, 1127840, 1087953, 1177570, 1210246, 1376307, 1497939, 1410533]
3436A410533J41806O2087J10473o1654J67537j07991J41746J80457J17256J12079
3426B274329o270m2066M6762K83811J58937R0010j3712R6773j7062j09757o3681
3415B698074J5927j37814j63625p1495k44060j91866j97356j11398O8569l2366
3405A632590j029j51057k53459j32164M7749O378k78660k4215l4r8917J4504J27046
3393H88732l953r0150r9763k020r4114o0071m914N7549Q3131k18180k0468k1378
3381D14401J9713J21864K3449o5027P2682P6896r8173j29288n2307N8725K0966
3370D63901n1028R9293K48189j21719k19056k9532O4176l3773L2062J02700m2503
3359E12710r8922L0535N2591o3370k7928N8684K2926j5387N8325j5960K7518M3936
$$ y = [1410533, 1552339, 1614426, 1724899, 1663245, 1830782, 1722791, 1864537, 2044994, 2162250, 2274329, 2268059, 2225993, 2272755, 2556566, 2715503, 2805513, 2791801, 2888574, 2871512, 2761755, 2698074, 2714001, 2576187, 2412562, 2341067, 2097007, 1905141, 1707785, 1596387, 1664956, 1632590, 1631561, 1480504, 1227045, 1094881, 1142630, 1149008, 870348, 846133, 846099, 747182, 761686, 888732, 884779, 794629, 694866, 692846, 598732, 538661, 533747, 591296, 674427, 456247, 435779, 414401, 434114, 555978, 579427, 514400, 587082, 663978, 565805, 436517, 384210, 442935, 463901, 412873, 512166, 760355, 638636, 419580, 390048, 454224, 420451, 452513, 555213, 512710, 413788, 444323, 496914, 433544, 405616, 464300, 487226, 471839, 530164, 514204, 541722, 585658]
3347E85658L2668j19324q8927R8136n1897j74709j10361Q2884Q5074p718k2487
3336C08997p7708L8347L3868m8161N6974q205q7495r114q220K9515J00916L6579
3324C66293l6850P1574j10444q6170O6636k3561J3816m548p7221m8624N5725M2928
3312B29554o428j118R6859j53433N5279N2912k2716N3430q1964Q8486K6002Q0674
3300D17537K05741J8109j18017o980p9868Q227J19815o5251k69809N1038k4489
3289B56053n5515J5449j65167k80r753J36782J69298m5971P3560L4149j2387j3953
3277C82265K5587J98004k14550q8745m1125M2639K87129m9065J69363J95587L3061
3266I40150k20656j64771j41100k8931J12990j1988n100o9299m8914j83152J07443
$$ y = [585658, 618326, 499002, 410075, 508211, 456314, 281605, 171244, 254128, 339202, 331484, 308997, 231289, 269636, 303504, 255343, 312317, 304112, 216617, 207503, 199283, 228798, 329714, 366293, 329443, 401017, 290573, 204403, 271039, 247478, 261294, 256746, 179525, 130901, 186626, 229554, 223126, 222008, 318867, 165434, 220713, 273625, 250909, 304339, 222375, 310861, 336863, 417537, 623278, 641387, 523370, 516390, 436522, 444749, 564564, 499313, 229504, 280542, 256053, 200538, 215987, 50820, 50540, 40787, 177569, 346867, 300896, 374456, 408605, 396218, 382265, 407852, 605856, 391306, 302561, 261436, 304075, 591204, 542139, 711502, 907089, 940150, 719494, 554723, 413623, 384692, 497682, 485694, 480594, 411295, 362381, 179229, 286672]
3255B86672p3662n8102j216l7598K60745M9278r7917q5394o3342o0701N3476n3732
3243A18507o2194J15737J49866j39286R4009M4077K04095N2276j19042m9180l842
3232D05023L2190k7083j44461m1587J76210m104j37588m3994l9515r2033L0549
3221A13607L4319O8085r051Q229k1882l7791p6835n1930J10823N2641o6469L5613
3209A59359l3305M8846l8893p314m1016j59053j01556N130J84631J60562r8448
3198G8943P6998n0499j05090m923l9688R5562J2072o8320j31738J02003K06658
3187A71978m7498j7376R149P1610K0258K7489q5798l168K3530p9060p7169K36836
3175B50781k9208O7974m843q1090K6879o9013K4794N184n1396k1548j8042R713
$$ y = [286672, 213010, 154908, 153692, 116094, 376839, 426117, 328200, 242806, 179464, 118763, 172239, 118507, 56313, 172050, 321916, 182630, 276639, 320716, 524811, 577087, 458045, 408865, 405023, 437213, 410130, 265669, 224082, 400292, 396188, 258600, 214606, 175091, 83058, 113607, 147926, 216011, 206960, 215189, 193307, 155516, 78681, 26751, 137574, 190215, 123746, 159359, 126054, 174900, 136007, 128693, 87677, -71376, -172932, -167802, 16829, 177391, 78943, 155941, 105442, 352, -4571, -44259, 51303, 63375, -4945, -136683, -34680, 171978, 124480, 107104, 116253, 187863, 208121, 235610, 149812, 146644, 170174, 91114, 13945, 250781, 221573, 289547, 284704, 203614, 230493, 161480, 186274, 191458, 140062, 118514, 100472, 110185]
3163A10185N8990n5707K299l4749N6050m9517N6055r132N7433J79134r7036m0810
3151B33195M6476Q151m6639p5270K9470K8345J69055j5701L365o9943o1518J851
3139B50837q6938J0096J69896j60394p8605J20817K4384j28737J3513K6137j60374
3128F32K8283q1225K11224R6391o9633M7237J23345j0671p3869N4163J25118r805
3116D41190L1405j6982j56455J04604P2990j45763j23987J63131o2327n9335J14325
3105C62796j44132Q2386J93637N5283j21960J20517p0507p4303p195j43358J70063
3094D23227k4229K1583J98955O5244j36121j31783M6709P0614j7444L1337J2802
3083E60894J10872o5915j4704N6062q5902p2079n0051p5281L0023P213j17961
$$ y = [110185, 169175, 113468, 115767, 81018, 137068, 87551, 143606, 134474, 191907, 371041, 274005, 233195, 279671, 287822, 241183, 165913, 195383, 223728, 392783, 377082, 380447, 310504, 248986, 250837, 163899, 173995, 343891, 183497, 104892, 225709, 250093, 121356, 134869, 161006, 632, 28915, -52310, 158914, 255305, 185672, 232909, 356254, 345583, 271714, 325877, 450995, 441190, 472595, 455613, 299158, 403762, 476752, 330989, 207002, 370133, 307806, 248471, 362796, 218664, 301050, 494687, 549970, 428010, 548527, 478020, 403717, 396522, 253164, 423227, 398998, 420581, 619536, 684780, 548659, 416876, 463585, 534199, 516755, 548092, 560894, 671766, 605851, 591147, 647209, 561307, 489228, 439177, 363896, 393919, 401132, 283171]
3072B83171J47126Q8455Q505l7914k22031R4040n1861P4486J16301j8811j52706
3061C28761K2299J50533j9455r2791l8494J3949O8170q7456l4071N9183J1197
3050C81825L3647O7641k23153n1720P7666Q0977o2166O75R4245k26254n9490R8438
3038B12331j5269n1161k7624l3563j3297J17011M9180j96897L3663R8973l7199
3027A36148k22212P3161L171Q2858K61707J444j59298j59395k4204J19399j02178
3016A0601O2699K3304j22442l8122J49791Q6946P2526n1450M3741p5981o3228
3005I8385P0152j35670J2475r5108j0625K51852q8161j54250J4791O9618m9347
2994a5888q15p8635M6391M4513r7885L9420l5824m9929R4262O6467k0799O1626
$$ y = [283171, 430297, 518752, 527257, 489343, 267312, 361352, 309491, 383977, 500278, 481467, 328761, 351060, 501593, 482138, 389347, 350853, 364802, 432972, 345516, 311445, 370628, 381825, 415472, 483113, 259960, 208240, 285906, 366883, 304717, 305392, 399637, 173383, 113893, 212331, 197062, 145901, 118277, 84714, 71417, 188428, 237608, 40711, 74374, 173347, 136148, -86064, -12903, -9732, 73126, 334833, 336277, 176979, 17584, -6620, 112779, 10601, 73300, 96604, -25838, -63960, 85831, 172777, 245303, 193853, 237594, 161613, 98385, 168537, 32867, 45342, -49766, -60391, 191461, 103300, -50950, -36159, 33459, -15888, -16703, -95338, -48947, -4434, -102319, -62899, -98723, -148652, -54390, 12077, -8722, 52904]
2982E2904j2052j54721M5745L5703L1931O777l55m1505J84739M9288j16179M361
2970H6636p1694r0499o9750L7094o9658O8629p5566J6455Q5845J9776L3695J02542
2958G3505K3638J19642m5269j20960j39147l5465J67664J23516m3276L4472j22259
2947C6061p3872O1221j03067J574j35354N0087R2432m8671K3564J12115j44534
2936a28444l2978J52918R3267K4516K7467k06412j89928O5503K00690J10348q2539
2925C4408L5689k9536n3882k4645Q8001L6601j44684j33541J6123J24020K00711
2914A49265n7150p8840O5494l2644j82716n2936J95479j01946j0756J18596n0181
2903c8335J30909J48384j3810k43127o2331N2591J6319l8219J0578o2230K9346
$$ y = [52904, 40852, -113869, -68124, -32421, -490, 6287, 5932, -35573, 149166, 198454, 82275, 86636, 14942, -75557, -145307, -108213, -177871, -109242, -184808, -168353, -82508, -62732, -29037, 73505, 97143, 216785, 171516, 50556, -88591, -124056, 43608, 167124, 123848, 158320, 36061, -37811, 23410, -79657, -78083, -213437, -163350, -70918, -119589, -96025, 16090, -128444, -161422, -8504, 84763, 109279, 136746, -69666, -259594, -194091, 6599, 116947, 34408, 70097, 40561, -13321, -37966, 50035, 86636, -58048, -191589, -175466, -51446, 149265, 92115, 13275, 78769, 46125, -136591, -189527, 5952, -95994, -106750, 11846, -38335, 92574, 240958, 227148, -15979, -78310, -25719, -9400, -47619, -37041, -99271, -69925]
2892f9925M0234l5645P4890M1754K1748M604k4161n9157r3491R8821J02437K1487
2880A23596k4864k00365M2874J23691r6835P8939K4510p8086r2186J14347l3071
2869a7450j95312j28082K3007K11171r6902L5301P6436o3791J61642J03389j45973
2858c6564J753J2261j25901R2176N4416N0210P0776j38926j45246J69581K0359
2847B4895o4259j04521K2181J3387O2897M1292j2637l3638j48149N4732n2882
2836a96702K01569M8878j10964j42312J55842l8386L1310j4329R3171J8123r2257
2825d6057R7228J480o4423j49056J39224K3098j05753m5502J8615k9979N4656
2814a06469M6323K4856N0250P0763j24090L058O7581o2378J3140n1089L2727q2914
$$ y = [-69925, -29691, -65336, 9554, 51308, 73056, 77660, 53499, -5658, -99149, -328, 102109, 123596, 98732, -101633, -58759, 64932, -31903, 47036, 71546, -6540, -98726, 15621, -17450, -212762, -340844, -317837, -106666, -203568, -168267, -91831, -155622, 6020, 109409, -36564, -34811, -22550, -148451, -56275, -1859, 48351, 119127, -19799, -165045, 4536, 24895, -39364, -143885, -121704, -108317, -45420, -4128, -16765, -50403, -198552, -143820, -196702, 4867, 53745, -57219, -199531, -43689, -82075, -50765, -65094, 28077, 46200, -46057, 51171, 52651, -11772, -160828, -21604, 1494, -104259, -149761, -131146, -161125, -106469, -60146, -35290, 14960, 85723, -38367, -35309, 32272, -30106, -16966, -68055, -35328, -118242]
2802a18242p9190R6908R2128P8871j52296n9112J02820q8017n3571N0264J03480
2791b5957p7222j2179Q3824J9183r2448k2018M9482j11844j65672J01260K25738
2780b7853J76102j82205j27365L6057N2369J37295n9802n0501P6234k493j15533
2769h7695M3789N0082j09227J49125r8509r5537K5607K3292o1974J23730l5464
2758g2781M6702p5424p6638R9935o8951J7359m98N1178O8602k5249p7051N5412
2746e7404J305L6366j24580J55027j53875j00790J84823L5429m8568J0355Q7624
2735B5712K1662j07405J8494J00532k8353l118P7833n0076j40617R2449j23938
2724a16825o1246J40668n4376n082J3135O8635p1796N5113j56472J07139J21686
$$ y = [-118242, -197432, -100524, -8396, 70475, -81821, -140933, -38113, -126130, -179701, -129437, -25957, -103179, -115358, -31534, -12351, -104799, -126817, -77335, -189179, -354851, -253591, -27853, 148249, -33956, -161321, -125264, -72895, 64400, 4598, -45903, 30331, 27838, -87695, -43906, 6176, -103051, 46074, -52435, -147972, -122365, -99073, -161047, -37317, -72781, -26079, -101503, -178141, -78206, -147157, -129798, -130296, -79118, -10516, -35765, -112816, -57404, -56099, -19733, -144313, 10714, -143161, -243951, -59128, -23699, -72267, -61912, 25712, 47374, -60031, -41537, 58995, 30642, 27524, 105357, 55281, -85336, 7113, -116825, -178071, -37403, -91779, -96861, -83726, -15091, -86887, -31774, -188246, -81107, 40579]
2713D0579L8970k9487j53129Q4321j1789o5173L4381o5216M6205K96033r1102
2702A24593l71697O6053j08867J6865K47833l6717k7774j661k903J51553O1396
2691A18674n1254k0825K6794m8816j3806m0459J13687j22856n145l0495o0053
2680a34554Q9702O2419o0730K419P6841r5586J10659P1238N1726k65032r1802
2669a82700L0898J00321q1093n7314N5761J57679N7493J18407j24204j38175j24472
2658a87399m3251M8566J39453Q083j06459q3729J41130J51013q8260J1279P4833
2647F5259k8918L254q9530l5161K2343P7850m751n0772Q038M6846l1957K8711
2635A1212N1702o2100N1303p7879n6248o6990J05285P5386j42314N5116q6603
$$ y = [40579, 79549, 50062, -103067, -18746, -30535, -95708, -61327, -126543, -80338, 215695, 124593, -247104, -181051, -289918, -273053, -25220, -61937, -89711, -91372, -94275, 57278, 118674, 67420, 46595, 73389, 24573, 10767, -29692, 83995, -38861, -44006, -74501, -134554, -44852, 17567, -43163, -40744, 36097, -59489, 51170, 122408, 174134, -90898, -182700, -151802, -51481, -132574, -189888, -134127, 23552, 81045, 199452, 75248, -62927, -187399, -230650, -182084, -42631, -34548, -141007, -224736, -83606, 67407, -20853, -9574, 65259, 36341, 39595, -49935, -85096, -62753, 15097, 10346, -40426, -32388, 14458, -17499, 11212, 62914, 814, 52117, -25762, -82010, -149000, -43715, 31671, -110643, -55527, -142130]
2624a42130J81401n402j31468j6753K8664j05785k9718K64084N953j289p396M6704
2612H6865j38164J04784k2552j33754K8924P8274r2619r0587P2198J25453j0457
2601H365k5296l8387n0998R4066O870j89774m1813K06940J48360j62429k5883
2590f9979N8939Q1203K9240l7867M2522j22017j52888p0465j18910J57494R6432
2579a06296J67654o6723o2189Q1647R8485L1198l01415J18627J38518p2741p4130
2568d7365L0774k1748J0224J59830p99j88435m0044M5492k9968L3492J14124o3087
2556B490K5188l4223n2878P1069L2691R279J27030q4791o3348P1156k11652J8678
2544h9311k8127o6966Q9431j753R392L4671p5077N211p4430J35878r5851R1575
$$ y = [-142130, 39271, 33869, -97599, -114352, -85688, -191473, -221191, 42893, 48846, 47557, 40161, 86865, -51299, 53485, 30933, -102821, -73897, 4377, -88242, -178829, -106631, 18822, 8365, -16931, -55318, -106316, -12250, -5380, -195154, -236967, -30027, 118333, -44096, -69979, -11040, 70163, 99403, 61536, 104058, -17959, -170847, -241312, -360222, -202728, -106296, 61358, -5365, -67554, 14093, 112578, 143776, -157639, -39012, 99506, 26765, -47365, -16591, -38339, -28115, 131715, 130916, -57519, -97563, -52071, -82039, -48547, 65577, 2490, 27678, -6545, -59423, 11646, 44337, 53616, 180646, 95855, 32507, 103663, -107989, -89311, -117438, -184404, -94973, -96726, -87334, -52663, -127740, -122529, -196959, -61081, -156932, -65357]
2532f5357l4588j64114R7919N1464K1487O8331o019K6798j3289j54843M7360K8765
2520i6086J7912n0506J99948o0834N5919J9140j3595j55227l3270J72026j62995
2509a07568K2499O6176O4350j17779N3427q5233j06472K9387n9917O5803R3963
2498h1364M2878k2496K0267j73645o7523J29578J23008o2162J63933q3274J64547
2487A53747J14423j24000j38145K5696Q6026o3194k3632K6035k8543K0078m071
2476D4420Q2873q112k06039K1509Q3814l0007O0367k2669k13473J9800K38225
2465G0708R3491o3914j27753K050m344L4857K08888n9484j13131m2107k9744j4343
2453d4826J47585r0077J5746m571R131j7551q1947J0152N1918q0884m0579l4332
$$ y = [-65357, -99945, -264059, -166140, -114676, -93189, -24858, -30877, -4079, -17368, -172211, -124851, -96086, -78174, -128680, 71268, 10434, 66353, 85493, 71898, -83329, -116599, 55427, -107568, -85069, -18893, 45457, -72322, -18895, -104128, -210600, -181213, -241130, -175327, -81364, -38486, -60982, -40715, -214360, -281883, -152305, -29297, -91459, 72474, -10800, 153747, 268170, 144170, 6025, 31721, 117747, 54553, 30921, 56956, 28413, 48491, 44420, 127293, 119181, -86858, -65349, 18465, -11542, 48825, 26156, -187317, -167517, 70708, 164199, 100285, -27468, -25418, -29762, 5095, 213983, 154499, 41368, -739, -30483, -44826, 102759, 12682, 28428, 23857, 32988, 15437, -66510, -56358, -4440, -85324, -125903, -160235]
2441a60235P344J46908P1473l4772o8126l1978R6323j3228m9206o5870P2202N9368
2429C0203K0561q3866O7823j14998n9922N6392K266P5234J1277n9323l3724j44474
2417b32551J8087K14678L2115m7257q6930J09608m7173M601K0508l6957j16134
2406a67405J2514Q3332k640k0549J11769O2920N7760j03986M4405J1501r9502
2395i881J10251o0809k7463R1721p6108j02508k05126O5155J56353K28432k5451
2384A44566j40457Q238p8801L2822p241N085O0395P2903l3410j04164p8880P4159
2372d4785k7242J24955J5694j12484j7556Q9803J8139J90832J7270j80420M0201
2361A14407p7982J25026j18651m9866K2158Q7701Q6551o9989l0407J04904j86200
$$ y = [-160235, -152891, -5983, 65490, 30718, -37408, -69386, 26937, 13709, -35497, -101367, -29165, 30203, 50764, -33102, 34721, -80277, -140199, -83807, -81541, -6307, 4970, -54353, -88077, -232551, -214464, 214, 32329, -14928, -101858, 7750, -39423, -34822, -14314, -51271, -167405, -154891, -71559, -74199, -94748, 17021, 79941, 137701, 33715, 78120, 89621, -9881, 100370, 39561, 12098, 103819, 27711, -74797, -279923, -214768, -58415, 170017, 144566, 4109, 12347, -66454, -33632, -40873, -35788, 24607, 97510, 64100, -40064, -118944, -44785, -72027, 52928, 68622, -43862, -61418, 28385, 46524, 237356, 254626, 74206, 114407, 36425, 161451, 42800, -7066, 15092, 102793, 189344, 119355, 88948, 193852, 7652]
2350G652J17758J23553j11151K1472k2116o9482J58211J14658n6451K15690j0181
2339D89613j27823j82978J28472J15675J3061O1856J3448k27797N7912J23709
2329D65148M7261n3351J05772Q7214J08840M5704Q6628M5734L2410J55540Q4567
2318A211467M6752K28482K89690J02059K44679L47031K61478M51234M51833K75657
2308C910362J14047k07046k97085m31060n52698l18276j56192k59915k91258j51885
2298A358994o2141k36725o3888k03518M984P1315m5680k429j44553Q2325n3110
2287G05574k57087J2708P6305M0131j74285L5709O3904r4562j31969r145o6542
2276B00741J3749P8902N2977O757n4263n800K6949p0071j01220K2789j8373J22950
$$ y = [7652, 125410, 248963, 137812, 159284, 137168, 67686, 225897, 340555, 284104, 499794, 489613, 361790, 178812, 307284, 422959, 436020, 497876, 511324, 283527, 341439, 465148, 512409, 459058, 564830, 652044, 760884, 806588, 893216, 938950, 971360, 1126900, 1211467, 1258219, 1486701, 1776391, 1878450, 2123129, 2470160, 2731638, 3182872, 3634705, 3910362, 4024409, 3817363, 3520278, 3089218, 2536520, 2218244, 2062052, 1802137, 1510879, 1358994, 1296853, 1060128, 996240, 792722, 797706, 869021, 823341, 820912, 676359, 758684, 705574, 448487, 461195, 537500, 577631, 403346, 439055, 502959, 408397, 276428, 267283, 200741, 214490, 293392, 346369, 353126, 298863, 293063, 320012, 249941, 148721, 171510, 153137, 276087]
2264B76087k09202p4795N5261l0664k8252Q0237k5831j8196K7927p9211K6548
2253i1K8329J91767l3355J63859k1407j48178j65963q5967R5447R4926J02536
2242B21903Q832k28169n3105N304Q2771n1044j6286N0840L6248M7281k9681m9464
2230B5430l194j48620j25560J10148Q2162J41749j73777O9546K5297O5044J12744
2219A80969L866r3199r7748j13322N3092P9608j24929r6112L7798R0955M618P304
2207f7100J35815J26495j54120k55148M4457M1737P5277p046k6471J21609J4695
2196E0200q1700O0601n2426l7987J7581l3770l2278J39234L0795l1053k21009
2185a91812P4700J17314K6519J50068n1295r9903N0139R864m1976L4810P9343
$$ y = [276087, 66885, -7910, 47351, 16687, -11565, 68672, 42841, 24645, 52572, -26639, -91, 28238, 220005, 186650, 350509, 329102, 180924, 14961, -71006, 24441, 119367, 221903, 230735, 2566, -50539, -45235, 37536, -13508, -29794, 21046, 57294, 104575, 74894, 25430, 22236, -126384, -251944, -141796, -59634, 82115, -91662, -22116, 3181, 68225, 180969, 184835, 91636, -6112, -119434, -66342, 13266, -111663, -207775, -169977, -79022, -74404, -67100, 68715, 195210, 41090, -214058, -169601, -127864, -52587, -59633, -86104, 35505, 50200, -31500, 29101, -23325, -61312, -43731, -77501, -109779, 29455, 60250, 29197, -191812, -117112, 202, 26721, 176789, 125494, 25591, 75730, 85594, 43618, 78428, 157771]
2174A57771l02q9608j37776P9741m5535P8797Q686j81087K19001o3907k7040O978
2162E719Q9693k3374p2434O7531K1993j60277R0437Q8959L2690j9665j1294m8829
$$ y = [157771, 157469, 67861, -69915, 9826, -35709, 43088, 51774, -129313, 89688, 25781, -1259, 5719, 95412, 72038, -396, 67135, 89128, -71149, 19288, 108247, 140937, 121272, 109978, 61149]
$$ [...]
##END NTUPLES=NMR SPECTRUM
##END=
