##TITLE=1H_EC-3312(V)
 CDCl3
 8 sc, 
 26.6.2024
##JCAMPDX= 6.0         $$ Bruker NMR JCAMP-DX V2.0
##DATA TYPE= NMR SPECTRUM
##DATA CLASS= NTUPLES
##ORIGIN= UXNMR, Bruker Analytische Messtechnik GmbH
##OWNER= root
$$ XWIN-NMR		Version 3.5
$$ Wed Jun 26 14:15:33 2024 Russian Standard Time (UT+4h)  she@DPX200
##.OBSERVE FREQUENCY= 200.1312
##.OBSERVE NUCLEUS= ^1H
##.ACQUISITION MODE= SIMULTANEOUS
##.ACQUISITION SCHEME= undefined
##.AVERAGES= 8
##.DIGITISER RES= 18
##SPECTROMETER/DATA SYSTEM= spect
##.PULSE SEQUENCE= zg30
##.SOLVENT NAME= CDCl3
##.SHIFT REFERENCE= (INTERNAL, CDCl3, 0, 14.9679)
##AUDIT TRAIL= $$ (NUMBER, WHEN, WHO, WHERE, WHAT)
$$ ##TITLE= Audit trail, XWIN-NMR		Version 3.5
$$ ##JCAMPDX= 5.01
$$ ##ORIGIN= Bruker BioSpin GmbH
$$ ##OWNER= she
$$ F:/spectra/data/she/nmr/H-F/1/pdata/1/auditp.txt
$$ ##AUDIT TRAIL=  $$ (NUMBER, WHEN, WHO, WHERE, WHAT)
(   1,<2024-06-26 14:14:10.28 +0400>,<she>,<DPX200>,
      <created by zg, POWCHK disabled, PULCHK disabled
       configuration hash MD5:
       00 E9 B6 7A A2 85 ED C7 34 08 36 98 17 FE 4E 26
       data hash MD5: 16K
       14 28 78 AC B1 2B E2 BA F7 C2 13 2E CF 30 2A B9>)
(   2,<2024-06-26 14:14:12.42 +0400>,<she>,<DPX200>,
      <Start of raw data processing
       efp BC_mod = 2 LB = 0.24 FT_mod = 6 PKNL = 1 PHC0 = -25228.69 PHC1 = 11.98748 SI = 16K 
       data hash MD5: 16K
       FA DC 42 D4 CB 14 09 40 57 67 D2 01 B1 54 F5 F7>)
(   3,<2024-06-26 14:14:46.59 +0400>,<she>,<DPX200>,
      <pk PHC0 = -2.087212 PHC1 = 7.600002 
       data hash MD5: 16K
       88 83 1A 45 79 2B 63 00 A7 6E 2D 60 DE AB 68 4B>)
(   4,<2024-06-26 14:14:49.79 +0400>,<she>,<DPX200>,
      <abs ABSG = 5 
       data hash MD5: 16K
       92 B2 D8 77 53 20 70 79 22 75 CA 48 53 37 15 5E>)
$$ ##END=
$$ 
$$ hash MD5
$$ 33 4A F9 8C FF F0 89 46 B7 D7 33 30 9B 5B 34 64
##$RELAX= 
##$RELAX= 
##$RELAX= 
##$RELAX= 
##$RELAX= 
##$RELAX= 
$$ Bruker specific parameters
$$ --------------------------
##$DU= <F:/spectra>
##$EXPNO= 1
##$NAME= <H-F>
##$PROCNO= 1
##$TYPE= <nmr>
##$USER= <she>
##$AMP= (0..31)
100 100 100 100 100 100 100 100 100 100 100 100 100 100 100 100 100 100 
100 100 100 100 100 100 100 100 100 100 100 100 100 100 
##$AQSEQ= 0
##$AQ_mod= 1
##$AUNM= <au_zg>
##$AUTOPOS= <>
##$BF1= 200.13
##$BF2= 200.13
##$BF3= 200.13
##$BF4= 200.13
##$BF5= 200.13
##$BF6= 200.13
##$BF7= 200.13
##$BF8= 200.13
##$BYTORDA= 1
##$CFDGTYP= 0
##$CFRGTYP= 5
##$CHEMSTR= <none>
##$CNST= (0..31)
1 1 145 1 1 1 1 1 1 1 1 1 1 1 1 1 1 1 1 1 1 1 1 1 1 1 1 1 1 1 1 1 
##$CPDPRG= <>
##$CPDPRG1= <>
##$CPDPRG2= <>
##$CPDPRG3= <>
##$CPDPRG4= <mlev>
##$CPDPRG5= <mlev>
##$CPDPRG6= <mlev>
##$CPDPRG7= <mlev>
##$CPDPRG8= <mlev>
##$CPDPRGB= <>
##$CPDPRGT= <>
##$D= (0..31)
0 1.2 0 0 0 0 0 0 0 0.06 0 0.03 0 0 0 0 0.0002 0 0 0 0 0 0 0 0 0 0 0 0 
0 0 0 
##$DATE= 1719396849
##$DBL= (0..7)
120 120 120 120 120 120 120 120 
##$DBP= (0..7)
150 150 150 150 150 150 150 150 
##$DBP07= 0
##$DBPNAM0= <>
##$DBPNAM1= <>
##$DBPNAM2= <>
##$DBPNAM3= <>
##$DBPNAM4= <>
$$ [...]
##$SUBNAM3= <"">
##$SUBNAM4= <"">
##$SUBNAM5= <"">
##$SUBNAM6= <"">
##$SUBNAM7= <"">
##$SUBNAM8= <"">
##$SUBNAM9= <"">
##$SW= 18.0517418723606
##$SWIBOX= (0..15)
0 0 2 0 0 0 0 0 0 0 0 0 0 0 0 0 
##$SW_h= 3612.71676300578
##$TD= 16384
##$TD0= 1
##$TE= 0
##$TE2= 300
##$TE3= 300
##$TEG= 300
##$TL= (0..7)
0 120 120 120 120 120 120 120 
##$TP= (0..7)
150 150 150 150 150 150 150 150 
##$TP07= 0
##$TPNAME0= <>
##$TPNAME1= <>
##$TPNAME2= <>
##$TPNAME3= <>
##$TPNAME4= <>
##$TPNAME5= <>
##$TPNAME6= <>
##$TPNAME7= <>
##$TPOAL= (0..7)
0.5 0.5 0.5 0.5 0.5 0.5 0.5 0.5 
##$TPOFFS= (0..7)
0 0 0 0 0 0 0 0 
##$TUNHIN= 0
##$TUNHOUT= 0
##$TUNXOUT= 0
##$USERA1= <user>
##$USERA2= <user>
##$USERA3= <user>
##$USERA4= <user>
##$USERA5= <user>
##$V9= 5
##$VALIST= <valist>
##$VCLIST= <CCCCCCCCCCCCCCC>
##$VD= 0
##$VDLIST= <DDDDDDDDDDDDDDD>
##$VPLIST= <PPPPPPPPPPPPPPP>
##$VTLIST= <TTTTTTTTTTTTTTT>
##$WBST= 1024
##$WBSW= 4
##$XGAIN= (0..3)
0 0 0 0 
##$XL= 0
##$YL= 0
##$YMAX_a= 72392
##$YMIN_a= -78276
##$ZGOPTNS= <>
##$ZL1= 120
##$ZL2= 120
##$ZL3= 120
##$ZL4= 120
##$ABSF1= 15.00869
##$ABSF2= -3.043159
##$ABSG= 5
##$ABSL= 3
##$ALPHA= 0
##$AQORDER= 0
##$ASSFAC= 0
##$ASSFACI= 0
##$ASSFACX= 0
##$ASSWID= 0
##$AUNMP= <proc_1d>
##$AZFE= 0.1
##$AZFW= 0.1
##$BCFW= 0
##$BC_mod= 2
##$BYTORDP= 0
##$COROFFS= 0
##$CY= -3
##$DATMOD= 1
##$DC= 0
##$DFILT= <>
##$DTYPP= 0
##$F1P= 0
##$F2P= 0
##$FCOR= 1
##$FTSIZE= 16384
##$FT_mod= 6
##$GAMMA= 0
##$GB= 0
##$INTBC= 1
##$INTSCL= 3.70164e-10
##$ISEN= 128
##$LB= 0.24
##$LEV0= 0
##$LPBIN= 0
##$MAXI= 10000
##$MC2= 0
##$MEAN= 0
##$ME_mod= 0
##$MI= 1.114404
##$NCOEF= 0
##$NC_proc= -9
##$NLEV= 6
##$NOISF1= 3.799351
##$NOISF2= 2.8
##$NSP= 0
##$NTH_PI= 0
##$NZP= 0
##$OFFSET= 14.96792
##$PC= 1
##$PHC0= -25230.78
##$PHC1= 19.58748
##$PH_mod= 1
##$PKNL= yes
##$PPARMOD= 0
##$PSCAL= 0
##$PSIGN= 0
##$REVERSE= no
##$SF= 200.130010829213
##$SI= 16384
##$SIGF1= 3
##$SIGF2= 2
##$SINO= 5.538805
##$SIOLD= 16384
##$SREGLST= <1H.CDCl3>
##$SSB= 0
##$STSI= 16384
##$STSR= 0
##$SW_p= 3612.71676300577
##$SYMM= 0
##$S_DEV= 0
##$TDeff= 16384
##$TDoff= 0
##$TI= <>
##$TILT= no
##$TM1= 0
##$TM2= 0
##$TOPLEV= 0
##$USERP1= <user>
##$USERP2= <user>
##$USERP3= <user>
##$USERP4= <user>
##$USERP5= <user>
##$WDW= 1
##$XDIM= 16384
##$YMAX_p= 314259028
##$YMIN_p= -2745543
$$ End of Bruker specific parameters
$$ ---------------------------------
##NTUPLES= NMR SPECTRUM
##VAR_NAME=  FREQUENCY,     SPECTRUM/REAL,   SPECTRUM/IMAG
##SYMBOL=    X,             R,               I
##VAR_TYPE=  INDEPENDENT,   DEPENDENT,       DEPENDENT
##VAR_FORM=  AFFN,          ASDF,            ASDF
##VAR_DIM=   16384,         16384,           16384
##UNITS=     HZ,            ARBITRARY UNITS, ARBITRARY UNITS
##FACTOR=    0.220516191357247, 1,           1
##FIRST=     2995.53005239918, 0,            0
##LAST=      -617.186710606593, 0,           0
##MIN=       -617.186710606593, -2745543,    0
##MAX=       2995.53005239918, 314259028,    0
$$ Real data points
##PAGE= N=1
##DATA TABLE= (X++(R..R)), XYDATA
$$ [...]
8836A29956L8449R2044o0239O8040R618l1077M7637m40j72194o9987J19643n4464
8824A16986j6658K2840O806R3744r9817l9182R7144j2694J3359M4387Q3620p3155
8812B37380K2346L0472k2374k285Q5962m7955k8233K7572O0015M4251J7706P702
8800D32559P4798J6986J1327P4315J08081q1857k8064l091M6234Q5065l3046J1990
8788G15297j61257j33446r8605j00530j8848O6870Q5964m8444j5602o8696K2227
8777B44930O8387Q8356j12902n5314J47784j08248P3909m4810N9632p7849q809
8766B75066M2904O9715k1943j56355K80925R637j18217q9970P8765J13170Q2253
8755E65950J03477p9790l1596N2602p7342m3849j31226l6168q4463j03177J1121
$$ y = [129956, 168405, 260449, 200210, 268250, 277868, 246791, 294428, 293988, 121794, 51807, 171450, 116986, 100328, 123168, 129974, 223718, 123901, 84719, 181863, 169169, 182528, 226915, 310535, 237380, 259726, 290198, 267824, 265539, 351501, 303546, 275313, 302885, 362900, 407151, 424857, 432559, 507357, 524343, 535670, 609985, 718066, 636209, 608145, 605054, 651288, 736353, 703307, 715297, 554040, 420594, 321989, 221459, 202611, 269481, 355445, 307001, 291399, 222703, 244930, 313317, 401673, 288771, 233457, 381241, 272993, 346902, 302092, 361724, 283875, 275066, 317970, 387685, 365742, 209387, 490312, 499949, 381732, 291762, 370527, 483697, 565950, 669427, 589637, 558041, 610643, 533301, 489452, 358226, 322058, 237595, 134418, 145539]
8744A45539k8938n167M842j2468n7963p8567O3082l3862j0424L9185m069P6023
8732I7213r5194J0651J31653M8227r1033J9589l6684L5824j35487j3394J00896
8721G2261m2229M1774R7743Q6176J3797p4247k50672Q6605P7705o5649J19376
8710A62640J5328j91123m4843O455m5076J18580K7271k86O2114p0990R0165r3304
8698C6931K9427K3088o620K7793j83303J13372M8026P9032j66095j14861J04378
8687h832R5235K9393p6059L3140K1957N9254j89123j00634J73348J03841j3864
8676A27656j09899j15457J14912J2675N8074J55930p4959K0636p1767k2979K5868
8665A20690o9152O1557J31176o6495P661Q13R0205l485j30028K0954P4191K5544
$$ y = [145539, 116601, 111434, 116276, 103808, 45845, -32722, 30360, -3502, -13926, 25259, 21190, 97213, 2019, 12670, 144323, 192550, 101517, 121106, 84422, 120246, -15241, -28635, 72261, 30032, 71806, 169549, 255725, 269522, 195275, -55397, 31208, 108913, 43264, 162640, 177968, -13155, -57998, -51543, -96619, 21961, 49232, 48946, 111060, 40070, 130235, 36931, 66358, 89446, 82826, 110619, -72684, 40688, 88714, 167746, 1651, -113210, -8832, 86403, 115796, 39737, 72877, 94834, 154088, -35035, -135669, 37679, 141520, 127656, 17757, -97700, 17212, 29887, 87961, 243891, 168932, 189568, 117801, 94822, 120690, 51538, 113095, 244271, 177776, 185437, 186250, 276455, 272970, 142942, 163896, 238087, 263631]
8653B63631k4646L3546M4989k7435J02603K1812n6112q2144M953k7528L8303J17856
8641D09828O2479K1321q9018j9168K7623j01260J8027J80575L3574N9931j8988
8630E84924r4639J3501P1330J09280j0883L3545M403o7639j40703K3976Q6714
8619F13809j83425N4141p3927J37274J8823j12270J9510o9292j9209J49185O2800
8608E97419j95856q3774j5240k19096P0398J45033j28267P0981L0098R4999j91758
8597A74937J00266L5604Q5264O4309P06q4278j93592Q4123K1964j11611N8618
8586B36310m549M4452L9253j77641j29468P2032n09923j046132J648582P14745
8576H87661m04450K2364j62563N8799L0670J1129p2307m6084j00696q1897r0877
$$ y = [263631, 238985, 272531, 317520, 290085, 392688, 414500, 358388, 276244, 281197, 253669, 291972, 409828, 472307, 493628, 404610, 385442, 413065, 311805, 329832, 510407, 543981, 603912, 584924, 490285, 503786, 575116, 684396, 673513, 707058, 711461, 643822, 503119, 527095, 613809, 430384, 484525, 410598, 547872, 566695, 454425, 473935, 404643, 385434, 534619, 597419, 401563, 317789, 302549, 83453, 153851, 298884, 170617, 241598, 271696, 366695, 174937, 275203, 310807, 396071, 460380, 461086, 376808, 183216, 267339, 289303, 177692, 236310, 231761, 276213, 315466, 137825, 8357, 80389, -429534, -1475666, 172916, 887661, 483211, 505575, 343012, 401811, 432481, 443610, 371303, 325219, 224523, 142626, 51749]
8565E1749l9619R5319l444o8470O1988L163j67512j08912J37087K9816O5211l256
8553E3120l399L656N1299j53345J08224k300q6121M9880o3525J29539P4262N6297
8541B17587M4845j42602j39508p1617M6302N5529l7513J13710P651n2288j15106
8530g3010J316l911r4550J60744q1972m4597m405N5425K48612r9019n3475q098
8518C060P003M2802k4658K55k7726k33701N8523J06845r9857J06243L0138p6265
8506a07338m1522o4984J2956L7648N3962R7617O4004j75665o0059K9332k2655
8495a76704J21994l3202K4382j90458M4790j3889Q4845k6076J08604l5581m8260
8484a39555L1236k29882m2850l0900R2409R3635M6761j7178O3199j3250R373j8610
$$ y = [51749, 12130, 107449, 104005, 35535, 97523, 100686, -66826, -175738, -38651, -8835, 56376, 53120, 49721, 53377, 104676, -48669, 59555, 57255, -28866, 21014, -42511, 87028, 161290, 217587, 262432, 119830, -19678, -91295, -44993, 10536, -26977, 86733, 94384, 42096, -73010, -71694, -75605, -170155, -9411, -91383, -135980, -140385, -84960, 163652, 64633, 11158, 3060, 10063, 52865, 28207, 28462, 736, -232965, -174442, -67597, -167454, -61211, -31073, -107338, -148860, -213844, -200888, -163240, -109278, -11661, 52343, -123322, -183381, -154049, -176704, -54710, -87912, -63530, -253988, -209198, -223087, -138242, -164318, -55714, -91295, -139555, -108319, -338201, -381051, -411951, -319542, -225907, -179146, -196324, -133125, -146375, -137002, -155612]
8472a55612j20375N4821r930q4765K9774J66280p1412J46208M6909j10778M4558
8461f4322m6370m8815m0887M174J30581j95517l6570R1522k2165k2169j8722q211
8449b77471j7121K4458J28834J41855j644L0263j85790q9286n6324J3315J20349
8438a68562M3553p545q5657J08639j2580j56267k6139K9885j2507r2694J63129
8427b16745j0468n1067Q2132K4825j72341Q1067q1988R1420N6272m5897J55237
8416h7553j00672L7975J1292j65516M5046P8163P6198p4200J8131p528O3954k6354
8404a31064K9083l2445r814j2139k5877l4545j55449J57616m082P516o5668K8563
8392b48305J46603k07043r028J728J303J18488J2063O808k7957Q575J18653J845
$$ y = [-155612, -275987, -221166, -231096, -315861, -286087, -119807, -191219, -45011, 1898, -108880, -64322, -110692, -159507, -200394, -196220, -65639, -261156, -297726, -206204, -228369, -250538, -269260, -277471, -294592, -270134, -141300, 555, -1089, 29174, -156616, -245902, -302226, -288911, -168562, -125009, -132554, -218211, -109572, -122152, -278419, -304558, -274673, -287180, -379874, -216745, -227213, -278280, -196148, -171323, -343664, -262597, -344585, -253165, -196893, -242790, -87553, -188225, -150250, -138958, -304474, -259428, -181265, -105067, -179267, -161136, -168664, -104710, -131064, -101981, -134426, -144240, -156379, -182256, -216801, -372250, -214634, -218716, -211200, -276868, -248305, -101702, -308745, -317773, -316045, -314742, -196254, -184191, -177383, -205340, -196765, -78112, -76267]
8380g6267q2193R0382K2401j19089r6315M9898K8302r655j7335O0305J36424N2794
8368C9652k20050L7036N893n1297k6884K0P060l3266J02818j41275n0817J30756
8356b00354j00308L6958o799k1819J26783O4850l8310j0667Q5667N4520j85154
8345a94633P9447j7533j05061m94j67857Q4248J24015J280l5658j49966M4411
8334c37801L00422P7995m3893J8276r5757n874J00927j41520j45790J84124Q7353
8323a538q9780l9548r3792j6377K29027m2009l8085O12j28939L9176o0313k8923
8311b70489N2801J2474j9831j7279o4971L0516K6169k0394k5372J0022N5447M7320
8299a83587p7789M2246o784o9104q4137N9279J46462l890n9723K34985j07530
$$ y = [-76267, -158460, -68078, -45677, -164766, -261081, -211183, -182881, -192536, -209871, -149566, -13142, 39652, -180398, -143362, -137469, -188766, -215650, -215630, -208570, -241836, -139018, -280293, -331110, -200354, -300662, -263704, -270503, -292322, -165539, -100689, -138999, -149666, -63999, -9479, -194633, -115186, -132719, -237780, -238274, -406131, -321883, -197868, -196588, -232246, -382212, -337801, -37379, 40616, -3277, 14999, -80758, -86632, 14295, -127225, -273015, -88891, -1538, -91318, -130866, -224658, -241035, -12008, -54017, -92102, -91490, -220429, -181253, -241566, -270489, -217688, -205214, -225045, -242324, -307295, -276779, -250610, -271004, -296376, -286354, -230907, -183587, -261376, -219130, -225914, -295018, -379155, -319876, -173414, -177304, -237027, -2042, -109572]
8288a09572j75693K35898M4498k24847J08008r992o7171N1839l7037k7475k3552
8277b35096q8935Q6567L7932J5043k4188J00027K5837k482j44146j91361O859
8266d13943K1834K53256n2277O616q3865O3519L0275R953p65p4390J07790Q6048
8254d5949m1386R635R9119p4903j95514K21309q65j16533j08236J49442r4751
8243a98632n6063m3025K5778k570J62346J45468j13765m4435p1323m7667L2394
8232b11494n40J1947M5987K236j46040K6822p0802J9137K84145J13246m8932j20294
8220i4582m2377l6027k2610k2284q5101k6424P3479Q7759J10730j55061Q0282
8209a32216K22730k06320k33879J40005o554O8055L1418j9917j64886R3807j25971
$$ y = [-109572, -285265, -49367, -4869, -229716, -121708, -131700, -198871, -147032, -184069, -211544, -235096, -324031, -237464, -199532, -184489, -208677, -108650, -82813, -85295, -229441, -420802, -413943, -392109, -138853, -191130, -184514, -268379, -204860, -174585, -164632, -165397, -239787, -131997, -45949, -87335, -77700, 21419, -53484, -248998, -27689, -28554, -145087, -253323, -103881, -198632, -254695, -297720, -271942, -274512, -112166, 33302, -80463, -124898, -196221, -243888, -211494, -212034, -200087, -154100, -151864, -297904, -271082, -341884, -322747, -38602, 74644, 25712, -94582, -136959, -172986, -195596, -217880, -302981, -329405, -255926, -168167, -57437, -212498, -132216, 90514, -115806, -349685, -209680, -216234, -148179, -116761, -136678, -301564, -207757, -333728]
8198c33728l79805l27421J73474l01809m39602j136652J728304K192344l49879
8189H25226o00422l85699K24968r0116j2819k77301K78700J43187j24016o7772
8179h6064j00816j5757K7428n0865M752O1983q8190K27287J7995j85742N5652
8168a32337J3404J30066j11249J6308j18488Q4945l7214J49160L6601m17618n5460
8157d41882L68794K54201j68281j70026k09547P1395K24768p9703o5408L5773
8147a79916l2525J11029r0591j0966K88575j10068j25741j72886P9686O4025O9772
8136a09606r5697q9513J70415K3939l9981k7628N7548j2319j30775J1821K24790
8125a7006j9239o2364J21829j32407r4636J63961K5057O7354K476M2515k6564
$$ y = [-333728, -713533, -1040954, -867480, -1169289, -1608891, -2745543, -1017239, 1175105, 825226, 224804, -160895, 64073, -26043, -38862, -316163, -37463, 105724, -18292, -86064, -186880, -202637, -175209, -226074, -221322, -159339, -247529, -20242, -2247, -187989, -132337, -118933, 11133, -100116, -83808, -202296, -117351, -154565, -5405, 31196, -386422, -441882, -73088, 181113, 12832, -157194, -366741, -295346, -70578, -150281, -215689, -179916, -212441, -101412, -192003, -202969, 85606, -24462, -150203, -323089, -243403, -179378, -109606, -205303, -294816, -124401, -100462, -140443, -168071, -110523, -122842, -253617, -241796, -17006, -36245, -98609, 23220, -109187, -203823, -39862, -14805, 52549, 55025, 97540, 70976]
8114G0976j30347J6144Q975o5553o6928L2087L5012l8787J46808r8551L0246n6301
8102a16219j51394R2280J07999j03851N0502J45651j10196r5724l998K416Q8193
8091i4341P5282j65837j7541J60623O52K7696o6442n105J4170o4430L4531m0627
8079a41369P5721j8809j72190N6647J5292j16657P8573J86451N0419L6533j74725
8068a24114k81513R3395J88503Q5579l277k2901j1822m0996L7789j75691K3920
8057b31128M5287J8206l2924N3736L6453m7203J880o5949N3354n0784j34694l9166
8045c92932K5289J09752K15551m6099j18216j15696J48149K10810k13149l100
8035a79641O2668L77J84254p5668j39516k4483o421r1750L2728L9036J1203J53955
$$ y = [70976, -59371, -43227, -34252, -99805, -166733, -134646, -99634, -138421, 8387, -90164, -59918, -116219, -267613, -175333, -67334, -171185, -120683, 24968, -85228, -180952, -184950, -182534, -94341, -19059, -184896, -202437, -41814, -41162, -13466, -79908, -85013, -70843, -135273, -100742, -141369, -65648, -84457, -256647, -200000, -184708, -301365, -222792, -36341, 14078, 50611, -124114, -405627, -312232, -123729, -38150, -41427, -64328, -76150, -117146, -79357, -255048, -231128, -185841, -167635, -200559, -146823, -110370, -157573, -155693, -221642, -168288, -219072, -353766, -392932, -367643, -257891, -42340, -88439, -206655, -322351, -174202, 36608, -176541, -179641, -116973, -116596, 67658, -8010, -147526, -172009, -178430, -270180, -237452, -198416, -187213, -33258]
8023c3258l3670j31213J61373J4071k5608j22130K3066L19p5394j00601r6563
8012d19608Q848J56138K968N1481K9864j12721R5180J92599O0692J6226p5129
8001F538j01539j43202J21306n8442m5360K14039L1470j01335k6066J42823k2736
7990A7496j44379j02784j7247J12070O424j45520O7988J01256K552r8545n493
7979b06182l5416l7027L3916J05717j36487J73179J67436n2717j42162j34295
7969b64038O0597k8936J36916M3428o7455J39478j32188k9120J79916n1245K8983
7958A6336O3396m7346k6313l9906k2261R263p3848j70552Q5201J07215L4707j5935
7946h0043j18217m1425R9637Q2626P606J0014o7727l1076n0395p870N9808j20385
$$ y = [-33258, -66928, -198141, -36768, -22697, -48305, -170435, -147369, -147050, -222444, -323045, -419608, -410760, -254622, -251654, -200173, -170309, -283030, -187850, 4749, 65441, 81667, 6538, -95001, -238203, -116897, -175339, -220699, -6660, 24810, -76525, -102591, 40232, 17496, -126883, -229667, -246914, -134844, -128420, -273940, -205952, -104696, -102144, -200689, -206182, -241598, -278625, -244709, -138992, -275479, -102300, 65136, 12419, -129743, -264038, -203441, -232377, -95461, -52033, -119488, 19990, -112198, -141318, 38598, -12647, 16336, 79732, 32386, 6073, -33833, -56094, -46831, -120679, -291231, -206030, -98815, -64108, -80043, -198260, -239685, -140048, -57422, -49816, -39802, -107529, -138605, -189000, -196870, -137062, -257447]
7934b57447j10189J54265J42901O2688j08474j58315M7749K30790l406j61405
7924a60843K4456K9082N0346j5616Q8864J7353q029o6500M5472l0581j66413J8869
7912a73540l761k2669K34547L0700r0506j774n7220j29534J59800J18512j44024
7901g9469n2112l2442J97547p367j98078J22394J4099j13164J4922j1256L5725
7890a09201J00483O0712J03013q2368j14246q4262j00995P1244O0019j11648j01783
7879c09032N5569j5003P8627k1153R9959p099m3435M0115O944k8829j50359L3528
7867b60168M4108K9110O630Q3727n7029K7251M8837j63171J2404J78552l857J6700
7855c6906j6756n3847j09480p6695J81561J72210j1466j84559J7544j61k4674
$$ y = [-257447, -367636, -213371, -70470, -7782, -116256, -274571, -226822, 3968, 562, -160843, -136387, -107305, -56959, -72575, 16289, 33642, 25613, -40887, 4585, -25996, -192409, -173540, -177301, -199970, 34577, 65277, -25229, -27003, -84223, -213757, -53957, 64555, -79469, -131581, -164023, 33524, 26157, -171921, -49527, -35428, -148592, -133670, -144926, -109201, -8718, 51994, 155007, 72639, -41607, -125869, -226864, -155620, -95601, -207249, -309032, -253463, -268466, -189839, -210992, -111033, -118132, -161567, -121452, -114508, -143337, -293696, -260168, -216060, -186950, -180320, -96593, -153622, -126371, -77534, -240705, -228301, -49749, -53606, -36906, -53662, -107509, -216989, -293684, -112123, 60087, 48621, -135938, -118394, -118555, -143229]
7844a43229N737L3972j93425Q9650J45968p475o0968J10066k37299r9251j5460
7833c71714J31314J61129j51156K1374o544J9647N1001J17686j2536P568J92529
7822A60298m1385k9540p4386r8603O2392k9702o4932j35642P4379N4813k8396
7811a50704Q0581N0205o4842J72024J08936l04693m98473J6457M15959l4950R4116
7800a15384R399o896R1817J56087K6453r2227j25540n463r7497R9364J14515J39709
7788A94337N2226j42749o7467q5727J83182K2783o2682L2183j3573m1682n4654
7777A6177m4259M265j5183M7272j3410J69178p7906N4823K5680r7769N2434J08363
7765B29665j9884o3075q1374M109J60201J28756j0677L7759N245k2325j44081
$$ y = [-143229, -137492, -103520, -296945, -207295, -61327, -68802, -129770, -19704, -257003, -356254, -371714, -240400, -79271, -230427, -209053, -215597, -195950, -144949, -27263, -39799, -32231, 160298, 118913, 89373, 14987, -83616, -21224, -50926, -115858, -251500, -177121, -122308, -150704, -70123, -19918, -84760, 87264, 196200, -108493, -606966, -590509, -174550, -209500, -115384, -105985, -112881, -21064, 135023, 161476, 69249, -56291, -61754, -159251, -59887, 54628, 194337, 246563, 103814, 36347, -49380, 133802, 156585, 93903, 126086, 112513, 70831, 16177, -28082, -23817, -39000, 8272, -5138, 164040, 86134, 140957, 166637, 68868, 121302, 229665, 209781, 146706, 65332, 69441, 229642, 358398, 347721, 385480, 390725, 368400, 224319]
7754B24319R453p121m3060l755j5391j7414J16550n5885k2296j24608q0526q5574
7742a05308O3271J64377L0228m5654n9527J8326J8863l5399k027M7796m4425r6696
7730d6175J0849j05216j16842M3121J40710j4314N1368J85453Q4765j74430n8078
7719A211K0829M9267N1785m1215J4027j35970J41314l4318p4353l1036N9977O2123
7707H3641j5141Q7374j0824J02919J20842j29724p3559P9235K8831p9399j4726
7696A79469j26876Q5783j03033J23410J05773J46158j48653k2109O8253l1555
7686B76620n9394J09625r5433j67792N0493L9097l8780p6755n9464J3400j43610
7675a51993r4067Q4491J12494J25516m5763Q949n3358R1273L3041k5270m6613
$$ y = [224319, 233772, 226651, 183591, 179836, 164445, 147031, 263581, 207696, 185400, 60792, -19734, -105308, -42037, 122340, 152568, 106914, 47387, 65713, 84576, 49177, 47150, 94946, 50521, -46175, -35326, -140542, -257384, -214263, -73553, -87867, -36499, 148954, 233719, 59289, 1211, 22040, 71307, 123092, 81877, 95904, -40066, 101248, 66930, -7423, -38459, 21518, 83641, 68500, 155874, 145050, 247969, 368811, 239087, 165528, 244763, 273594, 194195, 179469, 52593, 138376, 35343, 158753, 264526, 410684, 262031, 239922, 308175, 276620, 217226, 326851, 231418, 63626, 114119, 153216, 114436, 37681, -21783, -8383, -151993, -246060, -161569, -49075, 76441, 30678, 39627, -13731, 77542, 110583, 85313, 38700]
7664C8700k2016n185P0112O4680j3192o2369l9736j03102r889m1082R6627J90238
7652A63786j3996N7359j87464p2996p9718J98199k4382l9798P9029l4077K19049
7641B64991r6241J0705q8114j81743N6954J1380Q5097L2511J55281j8263j42857
7630H9701L9207l6095n7282j28951J69709M2961p9950p7856L4122K24009L3261
7619B52836k7356k779m4132K08420m7454L815J5893L881j85278N1395O8647Q7919
7607C85807n31j39322J00580N7039o0270L8959O4049K914M7929J29497j03597
7596E23054k5056R2837n5788p5207k1776L5116N841j36839J1363m4418m5297J02981
7584C66811K2254L4544P5409K12499K4452j30385K7798L4387n9309M1308q1616
$$ y = [38700, 16684, 11499, 81611, 146291, 133099, 70730, 30994, -72108, -81997, -123079, -26452, 163786, 149790, 207149, 19685, -53311, -133029, 65170, 40788, 990, 80019, 45942, 264991, 168750, 179455, 91341, -90402, -33448, -22068, 63029, 95540, 250821, 232558, 89701, 128908, 92813, 35531, -93420, 76289, 119250, 39300, -38556, -4434, 219575, 252836, 225480, 222701, 178569, 386989, 339535, 343350, 359243, 363124, 177846, 229241, 297888, 385807, 385276, 245954, 346534, 403573, 343303, 382262, 446311, 449225, 497154, 626651, 523054, 497998, 590835, 535047, 459840, 438064, 473180, 479021, 342182, 353545, 309127, 263830, 366811, 389065, 423609, 499018, 711517, 735969, 605584, 633382, 667769, 608460, 649768, 568152]
7573E68152l7543J00103K2563j96945N1519N6102n1027N7504l8323j46730l4942
7562C50433m2854J22021M5302o7710l0952J1559l4721j33330M1594O5556k7285
7551B99613P7137M2188p898L0900K8154l0808M1543J81340j08898j23598Q1459
7540E11132R40m467n6783n7423r1461P9521J21649k32683j8916J62077l0513J316
7528C84389L1302K6805n5149O3572k0307M7040m3331k4078J74355o2973j21941
7517C99684n4146J5169l8487j40283k7372J3973K74219q3502r4748J5122j3826
7506B65803m5038j5725K6340J3517O5023j03258J0009K6851q1644j02893J72443
7495B31428K3807J64757N5532l0659n4112M4988Q3822n7666L2632q6401O5152
$$ y = [568152, 530609, 630712, 653275, 456330, 507849, 563951, 512924, 570428, 532105, 385375, 350433, 307579, 429600, 474902, 407192, 376240, 387799, 353078, 219748, 261342, 326898, 299613, 376750, 418938, 411040, 441940, 470094, 439286, 480829, 662169, 553271, 429673, 511132, 512072, 507605, 450822, 393399, 301938, 381459, 503108, 270425, 251509, 413586, 383073, 384389, 415691, 442496, 387347, 450919, 430612, 477652, 434321, 410243, 584598, 521625, 399684, 345538, 360707, 322220, 181937, 154565, 168538, 442757, 359255, 264507, 279629, 265803, 220765, 205040, 231380, 244897, 309920, 206662, 216671, 243522, 161878, 58985, 231428, 255235, 419992, 475524, 444865, 390753, 435741, 519563, 461897, 494529, 408128, 473280]
7484D73280p2711P2550K8764M8199J78093j13872r1574j08964O1911j47295l1184
7473B97197j7584o5270Q0092L4683q5926Q4890P9934j1776k5420o0666J00882
7462D11036R0598k4866L4657n3816j9964l5552K2926p0532k6742J26474n8864
7451C95355N6510L8279j65056L0265J58058m3065r1217o9183M5821L8425l2032
7440C62160j10343l6569N0258q3935J15535J47928p3877L4460p0725M0859j20710
7429B55041N1799J3707P7033j48849q0900J00057p282M0814J9840N7560r7769
7418B81051L7698j37235j8192k2045P1555K55783j48592M759P2114k12153k2231
7407A62512M4666L1494R4191L6431j16689m273L8528L854l2281J0539j30148n5558
$$ y = [473280, 400569, 473119, 501883, 550082, 728175, 614303, 522729, 413765, 475676, 328381, 297197, 279613, 214343, 294435, 329118, 243192, 328082, 408016, 396240, 370820, 310154, 411036, 501634, 476768, 511425, 457609, 437645, 402093, 425019, 354487, 327745, 454219, 395355, 451865, 490144, 325088, 355353, 513411, 470346, 379129, 309946, 355767, 394192, 362160, 251817, 215248, 265506, 181571, 297106, 445034, 371157, 405617, 334892, 375751, 255041, 306840, 320547, 397580, 248731, 167831, 267888, 260606, 301420, 321260, 378820, 281051, 318749, 181514, 163322, 141277, 212832, 468615, 320023, 324782, 396896, 184743, 162512, 207178, 238672, 332863, 369294, 252605, 248332, 286860, 290714, 258433, 268972, 138824, 83266]
7395H3266J68972M340R7862n284n5398O12j31586J57524N3732j06401J16172M8915
7383D32726J44401j68420k4571J61181j19886J5039l6055O0393j1794n5760R3206
7372D90460p4043j53830J26933O7741l431n0093j15487m8409n8227M9426K25607
7361D56647m0811O2150J79730j08126j21171K05230q233K9524r4991j97805R0333
7350D52477q9032j24714O8178J15877Q2641m3708M6687o0953J00156K13654j82212
7339E79051M7917J6669J01276j59939J04800Q4489P5692n9818o0571N1160n7225
7328G23501M4034q1286M5490j11079j81256R0254J44983j09928r7421P8778L559
7317E49629q2585M469J08843K181r8824k985O5782n0262J198Q8373J3012q9972
$$ y = [83266, 252238, 256578, 354440, 349156, 293758, 294370, 162784, 320308, 374040, 267639, 383811, 432726, 577127, 408707, 384136, 545317, 425431, 440470, 404415, 464808, 453014, 397254, 490460, 416417, 262587, 389520, 457261, 453830, 403737, 288250, 239841, 181614, 231040, 456647, 415836, 477986, 657716, 549590, 428419, 633649, 625416, 654940, 559949, 362144, 452477, 363445, 238731, 306909, 422786, 505427, 461719, 508406, 447453, 547609, 761263, 579051, 626968, 643637, 744913, 584974, 689774, 774263, 849955, 790137, 729566, 780726, 723501, 767535, 686249, 731739, 620660, 439404, 529658, 674641, 564713, 467292, 546070, 549629, 467044, 471513, 580356, 582537, 483713, 480728, 546510, 496248, 497446, 585819, 598831, 508859]
7305E08859K0320J45170P1567j17902j087J9612r2453p0893m19j15279l7363J44712
7293D74844J23298n7339M3016J3296j32646K0290L7868n2044q413p3782j4848
7282C73540k9189O7834N325j49123j9095J28398J5832r9471J84301L6610j27414
7271C87548q1726P9413K5899M1369n4470O7470j25548O5452j9777J87296J8655
7260E91581l1496L0176r067O9549q6193k6034M7267k9960L3369J32923j12818
7249F09297M6375J07268r9984j530l3064l5998k702q512J26804M030p5817O3887
7237G00054n8602j64498J26865l1543Q0831J1604l6416L7908M4014p3193L999
7226F41023l1900k4461J65031O3475o1744k5091m626j18993k236M4939Q8000K7731
$$ y = [508859, 529179, 674349, 745916, 628014, 626927, 646539, 554086, 483193, 482774, 367495, 330132, 474844, 598142, 540803, 583819, 597115, 464469, 484759, 522627, 470583, 462170, 388388, 373540, 344351, 412185, 417510, 268387, 249292, 377690, 393522, 294051, 478352, 514962, 387548, 305822, 385235, 411134, 452503, 398033, 465503, 339955, 405407, 385630, 572926, 591581, 560085, 590261, 581194, 650743, 564550, 538516, 585783, 555823, 589192, 722115, 609297, 655672, 762940, 662956, 661426, 628362, 592364, 589662, 581150, 707954, 711984, 636167, 700054, 641452, 476954, 603819, 572276, 653107, 664711, 628295, 666203, 710217, 637024, 641023, 609123, 584662, 749693, 813168, 751424, 726333, 721707, 602714, 600478, 645417, 733417, 761148]
7214G61148q7537Q1366N8077J3866J37023L7853o0717l4043Q798M6895J8102L4044
7202A014875Q3611m8184n4491Q4400Q2874J4286N0357o8488j13684o869R3335
7191A132022j628o1188q5021k0112m6754M1397K5026P0681J24969o6009K8256
7180A141639m8103Q2985k4293j29122Q1189L0585L2895N8795L0736j14951r264
7169A133091K15J13757J50150j46552l1221j2281J18427J07471J67174O039Q2807
7158A689077K0570R6033j93553J7186J20640q0131k1285Q1897J7052m8354Q471
7147A707603P639J0300m700K96743m9646k6272J97699p5846Q7402K4164L3361
7136B208447k2684P3848J62746k1909O4936k8352o8597J43260K61181j13442J88023
$$ y = [761148, 673611, 754977, 813054, 826920, 963943, 1001796, 941079, 907036, 915834, 962729, 980831, 1014875, 1098486, 1050302, 995811, 1080211, 1163085, 1177371, 1227728, 1159240, 1045556, 1038687, 1132022, 1130394, 1069206, 984185, 964073, 917319, 958716, 983742, 1054423, 1179392, 1113383, 1141639, 1093536, 1176521, 1152228, 1023106, 1104295, 1134880, 1167775, 1226570, 1257306, 1142355, 1133091, 1133306, 1247063, 1397213, 1250661, 1219440, 1207159, 1325586, 1433057, 1600231, 1606270, 1689077, 1709647, 1805680, 1612127, 1629313, 1749953, 1669822, 1648537, 1730434, 1747486, 1699132, 1707603, 1715242, 1725542, 1720842, 2017585, 1967939, 1941667, 2139366, 2063520, 2150922, 2175086, 2208447, 2185763, 2259611, 2422357, 2400448, 2465384, 2437032, 2368435, 2511695, 2772876, 2659434, 2847457]
7125B847457J04041R8136m5816l7923j18658J9849l5590j09361J24427J16520
7115B963082L0118o0002j08564J44626M9080m953M4638n0716K00315J02165Q6715
7104C396504q114N6441J98798J96971P3389o6639R2578r6639l7793p0649N2460
7093C787307j41290k09506J2824J0293p2115k20521j40294J8259l6094j17680
7083B891183l0066N5723L2535N0620P4089l731K991N9345O0762J0004P9265m1358
7071C241362j1291r3613J55802r8007j29347M0322P7859j17126O5669j73354j55170
7060B803106P13L26623k90272l77539J64757o2528O5025L9507j06756n9987j0926
7049B491723M2866J26650R4035k8814m6510J42466j665m8838o9707J08358J915
$$ y = [2847457, 2951498, 3049634, 3003818, 2965895, 2847237, 2867086, 2831496, 2722135, 2846562, 2963082, 2993200, 2933198, 2824634, 2969260, 3018340, 3013387, 3058025, 3007309, 3207624, 3309789, 3396504, 3388390, 3444831, 3643629, 3840600, 3913989, 3847350, 3939928, 3843289, 3805496, 3734847, 3787307, 3646017, 3436511, 3449335, 3459628, 3387513, 3166992, 3026698, 3044957, 3008863, 2891183, 2861117, 2916840, 2949375, 2999995, 3074084, 3070353, 3073344, 3132689, 3193451, 3203455, 3282720, 3241362, 3230071, 3136458, 3292260, 3194253, 3064906, 3105228, 3183087, 3065961, 3131630, 2958276, 2803106, 2803819, 3130442, 2840170, 2462631, 2627388, 2564860, 2629885, 2669392, 2562636, 2502649, 2491723, 2534589, 2661239, 2755274, 2726460, 2679950, 2822416, 2820751, 2771913, 2702206, 2810564, 2812479]
7038B812479m2705Q259J19577J79476J00187m4819p1323r6435Q4221m199m2567
7027C002151k9244J91314N1705n8960p4242j727M8942o449K59770P7856k4550
7016C436566K3583j77091J86684K56531p4992P8342j03066k1829P3879o1781N5054
7005C671880q011j02229n9199j73402l8044L3013m521J0746j04042P8662L3418
6994C338271o3815J43979R630j09144L9008K52001J46013j14862J17444q181j3319
6983C737025J11488q6272j4343K1315J11933j7499N8188Q6959J4100J21975j10135
6972D034734N8917Q0360N0118P3156m167J8023J08774O6443P1894J19512j16833
6961D560931O5892m0449j1094K89175J20278p1783R7334J89888K78437k7401j4137
$$ y = [2812479, 2769774, 2778033, 2897610, 3077086, 3177273, 3132454, 3061131, 2964696, 3048917, 3044718, 3002151, 2972907, 3164221, 3215926, 3156966, 3082724, 3080997, 3129939, 3123490, 3383260, 3461116, 3436566, 3460149, 3283058, 3469742, 3726273, 3651281, 3729623, 3626557, 3604728, 3678607, 3616826, 3671880, 3663869, 3561640, 3502441, 3329039, 3290995, 3324008, 3319487, 3330233, 3226191, 3304853, 3338271, 3274456, 3418435, 3428065, 3318921, 3357929, 3609930, 3755943, 3641081, 3758525, 3750344, 3737025, 3848513, 3762241, 3747898, 3769213, 3881146, 3863647, 3921835, 4008794, 4022894, 4144869, 4034734, 4093651, 4174011, 4224129, 4297285, 4293118, 4311141, 4419915, 4486358, 4558252, 4677764, 4560931, 4626823, 4586374, 4575280, 4864455, 4984733, 4912950, 5010284, 5200172, 5478609, 5451208, 5437071]
6950E437071J47942L1763J02262L4502J66572J18625K79452j5654Q6521K35199
6940F624255M8979N7059P1833l0119j51958J83089J0129K14252J97460p974m4160
6929G172845J6090J59174N9625Q8978J77004N7856K8929P6573J68438J19342J51504
6918H276358J75582J46160J63348J8874m2731J3111L5150k980N6976p7657j7879
6907H744312l655N3182j0862J9165M0412J33069J35560r3781J65766J22048P0444
6896I375660j81432J8801K17417J08933J11625J79138J47900L2510M3935K8156
6886A0082643O9597M6703J20125P2344J21064M0902M1901O3518J83032J06102
6876A0947931Q3160J75211M6732N5611K06574N3166K44869J51355J01276J87829
$$ y = [5437071, 5585013, 5616776, 5719038, 5753540, 5920112, 6038737, 6318189, 6302535, 6389056, 6624255, 6673234, 6730293, 6802126, 6772007, 6620049, 6803138, 6813267, 7027519, 7224979, 7217005, 7172845, 7188935, 7348109, 7407734, 7496712, 7673716, 7731572, 7760501, 7837074, 8005512, 8124854, 8276358, 8451940, 8598100, 8761448, 8780322, 8737591, 8750702, 8785852, 8782872, 8839848, 8762191, 8744312, 8740657, 8793839, 8782977, 8802142, 8842554, 8975623, 9111183, 9017402, 9183168, 9305216, 9375660, 9194228, 9213029, 9430446, 9539379, 9651004, 9830142, 9978042, 10010552, 10054487, 10082643, 10152240, 10198943, 10319068, 10391412, 10512476, 10553378, 10595279, 10658797, 10841829, 10947931, 11031091, 11206302, 11253034, 11308645, 11515219, 11568385, 11813254, 11964609, 12065885, 12253714]
6866A2253714K59954K68876L27486K47909R1751L92213K80721L11659M57167M04659
6856A5296109K82482J78556N172J01647Q9625O1407J8725j11937Q246P3846J57392
6845A6161270J40200J80440K29903N8499J74245K01635J61329M30426K60039M90556
6835A8488542M83101K39565N21546O18558M95654M14886M25550J74790m3023j72618
6825B1646551p2848l49824l29879k84242j98131k04524j6763k01520n5450K2532
6815A9955902l5619O5510Q9541K31887K17895K49896K77964L91247K57740L19069
6805B2021032M50315M78786J21690K57056l1665q9812q9915k7159p9338k5418
6795B2985572N1683J9043Q8025O2916L94719L50486N0435J26816L45326N69500
$$ y = [12253714, 12513668, 12782544, 13110030, 13357939, 13449690, 13841903, 14122624, 14434283, 14891450, 15296109, 15578591, 15757147, 15762319, 15863966, 15953591, 16014998, 16033723, 15921786, 15930032, 16003878, 16161270, 16301470, 16481910, 16711813, 16770312, 16944557, 17146192, 17307521, 17737947, 17997986, 18488542, 18971643, 19211208, 19732754, 20351312, 20846966, 21261852, 21687402, 21862192, 21819169, 21646551, 21573703, 21223879, 20894000, 20609758, 20411627, 20207103, 20190340, 19988820, 19933370, 19955902, 19920283, 19985793, 20075334, 20307221, 20525116, 20775012, 21052976, 21444223, 21701963, 22021032, 22471347, 22950133, 23071823, 23328879, 23297214, 23207402, 23117487, 23090328, 23010990, 22985572, 23037255, 23056298, 23144323, 23207239, 23601958, 23952444, 24002879, 24129695, 24475021, 25044521]
6785B5044521K72232M91775M85575L61447N65876M93341O87675O09723N97554
6776B9609719L44036M37010N87130N72543L66172M83827M73896M41048M36595
6767C3751976O14908P48804P96845Q12972R73699J158567J122916J201146J431608
6758D2613441J467778J426886J678416J752437J753951K015550K047903J993591
6750E6749953J825602J445309J062439P44519L43624m6534k03810m10413n37192
6741F0973497m61565l12408k4115J44544L32687O13014Q43838J179367J406698
6732F4695557J585053J894511K168106K476405K761551K892799K990098K506415
6724H3970495J699259Q04953l8125p99330j790288k576254k868614l206032l138442
$$ y = [25044521, 25316753, 25808528, 26294103, 26655550, 27221426, 27714767, 28402442, 29012165, 29609719, 29953755, 30390765, 30977895, 31550438, 31916610, 32400437, 32874333, 33315381, 33751976, 34366884, 35115688, 35912533, 36725505, 37699204, 38857771, 39980687, 41181833, 42613441, 44081219, 45508105, 47186521, 48938958, 50692909, 52708459, 54756362, 56749953, 58575555, 60020864, 61083303, 61827822, 62171446, 62124912, 61921102, 61510689, 60973497, 60511932, 60199524, 60175409, 60319953, 60652640, 61265654, 62109492, 63288859, 64695557, 66280610, 68175121, 70343227, 72819632, 75581183, 78473982, 81464080, 83970495, 85669754, 86474707, 86436582, 85637252, 83846964, 81270710, 78402096, 75196064, 72057622]
6715G2057622l284159k854809k541936k156701j790124j445776r13872q91921
6707E6178324m90109R2601L14128M74318N56454R67086P86269N44560K23102l58095
6697E9288638q53544j328821j744488k065358k306442k630350k573924k400598
6689D3385113k272225k030972j951614j799247j479062j243056j217583j029962
6681C0361392p19612q69060p26337m60953k40794m13989m76026n27856l79619
6672B5547146m71015m66049l97113l19423l47786j50299n48895m54626l03954
6663B2087986k85013j73182k05659K9464j5224k27934k41009m1681K0876K7884
6653B0976508j30677J2191J9565L8005l2821K4181J54101P4652N8702J3576J1
$$ y = [72057622, 68773463, 65918654, 63376718, 61220017, 59429893, 57984117, 57070245, 56178324, 55688215, 55780816, 56094944, 56569262, 57125716, 58092802, 58879071, 59423631, 59646733, 59288638, 58435094, 57106273, 55361785, 53296427, 50989985, 48359635, 45785711, 43385113, 41112888, 39081916, 37130302, 35331055, 33851993, 32608937, 31391354, 30361392, 29641780, 28772720, 28046383, 27585430, 27344636, 26930647, 26454621, 25926765, 25547146, 25076131, 24610082, 24212969, 23893546, 23545760, 23395461, 22846566, 22391940, 22087986, 21802973, 21629791, 21424132, 21453596, 21438372, 21210438, 20969429, 20927748, 20948624, 20976508, 20845831, 20858022, 20877587, 20915592, 20882771, 20906952, 21061053, 21135705, 21194407, 21207983, 21207994]
6642B1207994J89272J61218J53135J91470J92159J36207J77817K13547Q4257P3405
6632B2780481J58607J78709K10428K18275K82828L48388K24198P6570K29822K62143
6622B4970449N07246L54697K32150M48245N09825M19308L98123M08258M26521
6613B8674822L16073K87377L44297L06301M49614M52705L18512L28374L74142
6604C1852217L79755N80458O64685P69997P00667P57933O02324N65268M66601
6595C7339905N29956N13049O68782O20636P51554Q64721J052908J119096J036423
6586D4497030J059451J227268J483143J624832J705132J821272K084905K162194
6578E7665227K833014L311465L497144L138310K123897R11136M36037J74365k42911
$$ y = [21207994, 21397266, 21558484, 21711619, 21903089, 22095248, 22231455, 22409272, 22622819, 22707076, 22780481, 22939088, 23117797, 23328225, 23546500, 23829328, 24177716, 24401914, 24478484, 24708306, 24970449, 25477695, 25832392, 26064542, 26512787, 27022612, 27441920, 27840043, 28248301, 28674822, 28990895, 29278272, 29622569, 29928870, 30378484, 30831189, 31149701, 31478075, 31852217, 32231972, 32812430, 33477115, 34247112, 34947779, 35705712, 36308036, 36873304, 37339905, 37869861, 38382910, 39051692, 39672328, 40423882, 41288603, 42341511, 43460607, 44497030, 45556481, 46783749, 48266892, 49891724, 51596856, 53418128, 55503033, 57665227, 60498241, 63809706, 67306850, 70445160, 72569057, 73480193, 73916230, 74090595, 73847684]
6569G3847684o46978o93147o98914l48813M12608J126502J637094J204674R23669
6560G6764379R19690R90222J310264J487862J331084J111151L18770m22169p88163
6551H3023090j053405j105621j057603q24287n29963n04865j132377j450751j166920
6542G4197298j028301j152822r98685o08795N9737P27338J359230J415737N87996
6533G4558733n07557j565476k118849k440005l103119l419533l288094l154540
6525E4961560k867043k309266k246121j796314j366565j175863r85944o92508
6517D1521936k19867j38040n8893j1421j48939j67531k40982m44425n98067o57399
6507C8836372p47342o85469n92966o24581r11489p70952o46035q21895n99026
$$ y = [73847684, 73200706, 72507559, 71808645, 71459832, 71872440, 72998942, 74636036, 75840710, 76764379, 77684069, 78674291, 79984555, 81472417, 82803501, 83914652, 84233422, 83811253, 83023090, 81969685, 80864064, 79806461, 78982174, 78452211, 77947346, 76814969, 75364218, 74197298, 73168997, 72016175, 71017490, 70408695, 70468432, 71195770, 72555000, 73970737, 74558733, 74051176, 72485700, 70366851, 67926846, 64823727, 61404194, 58116100, 54961560, 52094517, 49785251, 47539130, 45742816, 44376251, 43200388, 42214444, 41521936, 41302069, 41164029, 41105136, 41093715, 40944776, 40777245, 40536263, 40091838, 39493771, 38836372, 38089030, 37403561, 36810595, 36186014, 35274525, 34503573, 33857538, 33035643, 32436617]
6498C2436617n83057m86505k64986l51593n40865l57202l60262l47596n67101
6489B8577450j96678m6181m35476k91866m23317o76652p28062o44156o54060p14944
6479B3766058n63997m79438m28432j73783l12629l65797l79449l98485m50958
6470B0213090o88631o03819n70557n60034o71312n38378n47192o18428o09140
6461A4805599m40922m29916l31708m83957m46903p1383m5423j92606j68420k17563
6451A1976798j29299J29456j24657j35663l1988k04710o2458n90r2764o0901j64509
6440A1098715p8383m9755k1497j64834l19625j71826m2523n8801M690j73838r5382
6429I926941j35984p2202K2635p2055m7108R9218J34808k0052K1342k41052M8239
$$ y = [32436617, 31853560, 31367055, 31102069, 30750476, 30209611, 29852409, 29492147, 29144551, 28577450, 28380772, 28334591, 27899115, 27607249, 27183932, 26507280, 25779218, 25135062, 24481002, 23766058, 23202061, 22722623, 22294191, 22120408, 21807779, 21441982, 21062533, 20664048, 20213090, 19524459, 18920640, 18350083, 17790049, 17118737, 16580359, 16033167, 15414739, 14805599, 14364677, 13934761, 13603053, 13119096, 12672193, 12600810, 12555387, 12362781, 12194361, 11976798, 11847499, 11976955, 11852298, 11716635, 11684647, 11479937, 11417479, 11416889, 11324125, 11263224, 11098715, 11020332, 10970577, 10949080, 10784246, 10464621, 10292795, 10250272, 10191471, 10196161, 10022323, 9926941, 9790957, 9718755, 9741390, 9669335, 9622227, 9721445, 9856253, 9836201, 9857543, 9616491, 9664730]
6418I664730J44238O9162O9175n204J34010j9058o9039K16J14245J12171N8041
6407A0272687M5076M1733L1329M151L2089K00367q4243K9874J18926N7813K7435
6396A0777237j07572N6643J36493J38995L2970J51291j9279K2380o5884M2109
6386A1165383J99524m784p1605O0076J08443o054R0996J77935K12562L9894L5306
6375A2007676q8294l8224J82291J81160J5609J45671P3592j24761K0136N6857
6365A2431713K44357J24689M1788K16397K27703N4621k399K34822Q0419J16756
6355A3770866J72216J39126K31188K08949J59605R2768K46544J19005J34359K47821
6345A5522447J27090J34496J86463J09850K10096L44404L03061J02651J43641
$$ y = [9664730, 9808968, 9878130, 9947305, 9942101, 10076111, 10057053, 9988014, 9988230, 10102475, 10214646, 10272687, 10317763, 10359496, 10390825, 10394976, 10427065, 10627432, 10543189, 10573063, 10691989, 10749802, 10777237, 10669665, 10726308, 10862801, 11001796, 11034766, 11186057, 11166778, 11189158, 11123274, 11165383, 11364907, 11360123, 11288518, 11348594, 11457037, 11450983, 11541979, 11719914, 11932476, 11972370, 12007676, 11919382, 11881158, 12063449, 12244609, 12260218, 12405889, 12479481, 12354720, 12374856, 12431713, 12676070, 12800759, 12842547, 13058944, 13286647, 13341268, 13338869, 13573691, 13654110, 13770866, 13943082, 14082208, 14313396, 14522345, 14681950, 14774718, 15021262, 15140267, 15274626, 15522447, 15649537, 15784033, 15970496, 16080346, 16290442, 16634846, 16937907, 17040558, 17184199]
6336A7184199J03726K73552K31353R0053K18535K55046K04326K70042J88750K21098
6326A9240680K42129K35574J71357K26127L45936K99266K90501K08693K63140
6317B1523403K38704M15314L25753K06436M17911M40026L33396M09688M22799
6308B4733430M35165M21645M02674N53918N03223N00822N78910Q63507O29454
6299B9622748M29874N06084L11784N10612K42656J15840J19305J95411R6120J62670
6289C2313104J34085J74625K33315L95860L40240M91482O13242N58474O51167
6280C5905594O74890P43429P69973J068150J038189R91323J099511J196152Q84027
6271D4371238P48200N86592L39826K64233K62773J95900J75288L24987K17944
$$ y = [17184199, 17287925, 17561477, 17792830, 17882883, 18101418, 18356464, 18560790, 18830832, 19019582, 19240680, 19482809, 19718383, 19889740, 20115867, 20461803, 20761069, 21051570, 21260263, 21523403, 21762107, 22177421, 22503174, 22709610, 23127521, 23567547, 23900943, 24310631, 24733430, 25168595, 25590240, 25992914, 26546832, 27050055, 27550877, 28129787, 28993294, 29622748, 30052622, 30558706, 30870490, 31381102, 31623758, 31739598, 31858903, 32054314, 32150434, 32313104, 32447189, 32621814, 32855129, 33250989, 33591229, 34082711, 34695953, 35254427, 35905594, 36580484, 37323913, 38093886, 39162036, 40200225, 41191548, 42291059, 43487211, 44371238, 45119438, 45706030, 46045856, 46310089, 46572862, 46768762, 46944050, 47269037, 47486981]
6262D7486981M26697N15452L79498M45852O08943P63415Q92973R48124J023488
6253E3491423J138954J380005J390992J426573J579346J642301J665291J785918
6245F5500803J959304K122305K151070K247446K255478K574106K332156J899937
6237H3042605J645705J098318M38657m0643m28058p22794o93250p02531o47035
6228H2990974n93192j86344J25029M22537P43896J082572J357991J827110K154739
6219H9925312K740378K885561L034686L675985L757196K969923K039184Q62362
6211A11890587o0940j066515k232206l001028l538037l831686l637766l205782
6203I1316627l023907k416476k120308j867404j242358j056228r16069m12984
$$ y = [47486981, 47913678, 48429130, 48808628, 49254480, 49863423, 50626838, 51519811, 52467935, 53491423, 54630377, 56010382, 57401374, 58827947, 60407293, 62049594, 63714885, 65500803, 67460107, 69582412, 71733482, 73980928, 76236406, 78810512, 81142668, 83042605, 84688310, 85786628, 86225285, 86184642, 85756584, 85033790, 84340540, 83638009, 82990974, 82397782, 82211438, 82336467, 82759004, 83502900, 84585472, 85943463, 87770573, 89925312, 92665690, 95551251, 98585937, 102261922, 106019118, 108989041, 111028225, 111890587, 111829647, 110763132, 108530926, 105529898, 101991861, 98160175, 94522409, 91316627, 88292720, 85876244, 83755936, 81888532, 80646174, 79589946, 78673877, 78260893]
6195G8260893m4837J66946N90144J190980J376346J417674J284700N91355m55726
6186H4378475j102017j429100k220662k819949l394333l501074l244581k975842
6178F3690917l057286k761597k607514k214038j875585j892193j748849j543194
6170D5990661j301775j240732j250163q67998p19960o00178n29718m88442l13877
6161C8677818k92879l51313l88685m60955o40561q51314p74743o57008r22294
6152C3338066j054402p62030r01636p11291l78593o72817m38697n17640k23241
6143B7677719k90608l05140j18263k76752k06337J0147m3115r584j72007J42078
6133B6408138J67499K96116J13000J6261J23870L11088R1155P0444J53500n8819
$$ y = [78260893, 78216056, 78383002, 78973146, 80164126, 81540472, 82958146, 84242846, 84834201, 84378475, 83276458, 81847358, 79626696, 76806747, 73412414, 69911340, 66666759, 63690917, 60633631, 57872034, 55264520, 53050482, 51174897, 49282704, 47533855, 45990661, 44688886, 43448154, 42197991, 41329993, 40610033, 40009855, 39480137, 38991695, 38677818, 38384939, 38033626, 37644941, 37183986, 36543425, 35692111, 34917368, 34260360, 33338066, 32283664, 31521634, 30619998, 29908707, 29530114, 28857297, 28418600, 27900960, 27677719, 27387111, 27081971, 26963708, 26686956, 26480619, 26490766, 26447651, 26438067, 26266060, 26408138, 26575637, 26871753, 26984753, 27001014, 27124884, 27435972, 27527127, 27597571, 27751071, 27692252]
6123B7692252J88436Q9801R1969J57538K71095L28016M81310J45491k3400N8450
6113B9480958p2148m1265j39759j72293Q0264l4483n9027K95998L14960J27437
6103B9780642J19748n2048K5613R3071j08128l2650j82740j93385J0733k03926
6093B9256930j56691n2674o5322N4109j41623j6005o4210o7441K2429J94542J59300
6082B9123344O3652K26032K46305J91226M0659J1135L79082J69893L7538J03183
6072C0592049J14408R2823J00222J26768R9244J60222J6339J15658K24535J46552
6062C1788820J98430K35607K12904J51997J31986K66221J84060L45840K05079
6053C3720944K02305J98668L89692L78909L46197M09690K27486M11644M77919
$$ y = [27692252, 27880688, 27970489, 28062458, 28219996, 28491091, 28819107, 29300417, 29445908, 29422508, 29480958, 29408810, 29367545, 29227786, 29055493, 29135757, 29101274, 29042247, 29338245, 29653205, 29780642, 29900390, 29848342, 29873955, 29967026, 29858898, 29826248, 29643508, 29450123, 29460856, 29256930, 29100239, 29047565, 28982243, 29036352, 28894729, 28878724, 28814514, 28747073, 28769502, 28964044, 29123344, 29186996, 29413028, 29659333, 29850559, 29891218, 29902353, 30281435, 30451328, 30488866, 30592049, 30706457, 30799280, 30899502, 31026270, 31125514, 31285736, 31302075, 31417733, 31642268, 31788820, 31987250, 32222857, 32435761, 32587758, 32719744, 32985965, 33170025, 33515865, 33720944, 33923249, 34121917, 34511609, 34890518, 35236715, 35646405, 35873891, 36285535, 36763454]
6044C6763454K60432N91895M73317M61317N52261M39175O52067L29536M36010
6035D0959464P03012N00226M94997M37076O29490M76911L57655L52136M26086
6026D5337053M48926M65106L04360M68719N94945N10247N58580O44672O91132
6017E0023740N12318P09781P46646P10523Q88398Q14339Q94238Q36056R64965
6008E7101004J018422Q17059O83305P16908Q07131O27598Q37936P71036Q12724
5999F4193123R01142J059015J053280J074715R30235J128344J123079J161271
5991G2624204J139116J432651J445600J355170J387338J387446J393074J333126
5983H3497725J394826J378392J278002J230948J330320J138023J015782R46301
$$ y = [36763454, 37023886, 37615781, 38089098, 38550415, 39102676, 39541851, 40193918, 40523454, 40959464, 41662476, 42162702, 42657699, 43094775, 43724265, 44201176, 44558831, 44910967, 45337053, 45785979, 46251085, 46555445, 47024164, 47619109, 48129356, 48687936, 49332608, 50023740, 50536058, 51245839, 51992485, 52703008, 53591406, 54405745, 55299983, 56136039, 57101004, 58119426, 58936485, 59619790, 60336698, 61143829, 61771427, 62609363, 63380399, 64193123, 65094265, 66153280, 67206560, 68281275, 69211510, 70339854, 71462933, 72624204, 73763320, 75195971, 76641571, 77996741, 79384079, 80771525, 82164599, 83497725, 84892551, 86270943, 87548945, 88779893, 90110213, 91248236, 92264018, 93210319]
5975I3210319J090900J250955J447549J690948J908020K179325K238792K244070
5967A07260878K204507K254719K335369K536520K751262L048922L566242L835813
5959A29794232M002035M358703M753745M908998M209944K900201J778774P75609
5951A57482241P25404M93518N8285K00462N07900J202376K239393K882653L495526
5942A69287758L462568L176379L458933L624738L676855M278867M961178N649058
5934B01576334N034346L288093J589258P01382j72974j159719j880092k080956
5926B06895672k166880k186969j903434j306228l76020J58182J048675K234542
5918B02397540L757743M890393N887107P159004P770672P721671Q415535R980535
$$ y = [93210319, 94301219, 95552174, 96999723, 98690671, 100598691, 102778016, 105016808, 107260878, 109465385, 111720104, 114055473, 116591993, 119343255, 122392177, 125958419, 129794232, 133796267, 138154970, 142908715, 147817713, 152027657, 154927858, 156706632, 157482241, 158207645, 158701163, 158759448, 158959910, 159467810, 160670186, 162909579, 165792232, 169287758, 172750326, 175926705, 179385638, 183010376, 186687231, 190966098, 195927276, 201576334, 206610680, 209898773, 211488031, 212189413, 212016439, 210856720, 208976628, 206895672, 204728792, 202541823, 200638389, 199332161, 198956141, 199114323, 200162998, 202397540, 206155283, 211045676, 216932783, 224091787, 231862459, 239584130, 247999665, 257980200]
5910B57980200J2103517J4150620J4486535J1188297M349859k654769p894559
5903C03709700j1723056j5784781j9310279k0935528k0754945j9426504j8026750
5896A77747857j6325930j4182836j2257581j0856127r728247q810553p558312
5889I8028271o484828n728451n186695m484514l979065l673525l316593l152840
5881F2021760k815766k577165k132970j878122j867728j675243j558898j435832
5873D6080036j532890j539738j412022j472832j522309j159274j329157r94326
5865C5117488j131811r90097r50747j036163q42025q56207r12937p55652o38369
5856B7003480p24802n33307m77985m81256n08932n67766o03446m82509m11907
$$ y = [257980200, 270083717, 284234337, 298720872, 309909169, 314259028, 311604259, 303709700, 291986644, 276201863, 256891584, 235956056, 215201111, 195774607, 177747857, 161421927, 147239091, 134981510, 124125383, 114397136, 105586583, 98028271, 91543443, 85814992, 80628297, 76143783, 72164718, 68491193, 65174600, 62021760, 59205994, 56628829, 54495859, 52617737, 50750009, 49074766, 47515868, 46080036, 44547146, 43007408, 41595386, 40122554, 38600245, 37440971, 36111814, 35117488, 33985677, 32995580, 32044833, 31008670, 30166645, 29310438, 28397501, 27641849, 27003480, 26278678, 25745371, 25267386, 24786130, 24277198, 23709432, 23105986, 22623477, 22211570]
5847B2211570l31113n07906l75967k76079k81105k47651k87061l05138j36319
5838A9463231j85848j12732j47654k5829j44314j17560l8242n3315l9705p4009
5828A8524023J27945N5038k9287n2306m7508k8690q5857m6532Q5995l9440n0288
5817A8413093J6062J90717O0400P3988m2235R6303K17314j1529K79760K20190
5807A9514063O6925J32358K61922M09812L69569K92528L82122L39137K63505K79436
5797B2311377K29776J90463K59227J73528n837J4664Q063m9167O2975r392J37415
5786B3323092P8255P7890J64174L2079K88103K39111N20075L99264L99927O21334
5776B6143304L69700N24807O08812O26116O67539Q45843Q59841R01158Q27715
$$ y = [22211570, 21880457, 21372551, 20996584, 20720505, 20439400, 20191749, 19904688, 19599550, 19463231, 19277383, 19164651, 19016997, 18991168, 18846854, 18729294, 18691052, 18637737, 18598032, 18524023, 18651968, 18707006, 18677719, 18625413, 18577905, 18549215, 18463358, 18416826, 18502821, 18463381, 18413093, 18429155, 18619872, 18680272, 18754260, 18712025, 18808328, 19025642, 19014113, 19293873, 19514063, 19580988, 19713346, 19975268, 20385080, 20754649, 21047177, 21429299, 21768436, 22031941, 22311377, 22541153, 22731616, 22990843, 23164371, 23158534, 23173198, 23181261, 23132094, 23195069, 23185677, 23323092, 23401347, 23479237, 23643411, 23675490, 23963593, 24202704, 24722779, 25122043, 25521970, 26143304, 26513004, 27037811, 27646623, 28272739, 28940278, 29786121, 30645962, 31547120, 32374835]
5767C2374835P27466N90605L11624J53250K69649J15735q8318j86233l24292j34458
5757C3809863k40115j93552k027J04965J26300k9071J75009K70186K69751L2551
5747C4323860J48433J80949q5811J1786k00220j26290j67788k52165r0127j06617
5737C3636010J3069J40371K4857k69499l87693k16710k75723m43020m84096n45929
5727C1191637l92487l84385r6115r507l8282J11151J55791O6566J58586J44921
5717C0907876J29094K82989K28595K30931N64334P85625R22585J224605J419772
5708C6696406J586473J493172R01956L68762l08349q51365j244289j957662k344338
5699C4340766k160305k189235k190084k030006j775901j351418j453163j356957
$$ y = [32374835, 33102301, 33692906, 34004530, 34157780, 34427429, 34543164, 34454846, 34268613, 33944321, 33809863, 33569748, 33376196, 33374169, 33479134, 33605434, 33576363, 33751372, 34021558, 34291309, 34323860, 34472293, 34653242, 34567431, 34579217, 34378997, 34252707, 34084919, 33832754, 33742627, 33636010, 33649079, 33789450, 33814307, 33544808, 33157115, 32940405, 32664682, 32221662, 31737566, 31191637, 30799150, 30414765, 30318650, 30309143, 30270861, 30382012, 30537803, 30604369, 30762955, 30907876, 31036970, 31319959, 31548554, 31779485, 32343819, 33129444, 34052029, 35276634, 36696406, 38282879, 39776051, 40678007, 41046769, 40738420, 39887055, 38642766, 36685104, 34340766, 32180461, 29991226, 27801142, 25771136, 23995235, 22643817, 21190654, 19833697]
5691A9833697j056060j081260q52708p66731o64646m74988o29531l27082l61248
5682A3619443l49923k51585l47348l00774k51786j70743j14697j76433k1231m6270
5672A1588653k30091j25486j63238j0511n645k13766l5417P9879n603j02769O6038
5661A0842044J12134J0803J771L8140n4543L5752J63324N3562j34029q2748q6878
5650A0899332j88943j23235m9751L1323l7191j45245m6866q7192r9735O4857j0071
5639A0207283m6080J02455j31235N7609J14993J26006J30312k2301N6359J50342
5629A0745743J79240r4359K2470J48196J92161J03728K9552K47919P2439l7296
5619A1609793o3451N3110M034n7311P5732P0162P6579K462N8400K65820Q3r4131
$$ y = [19833697, 18777637, 17696377, 16843669, 16076938, 15412292, 14937304, 14307773, 13980691, 13619443, 13269520, 13017935, 12670587, 12369813, 12118027, 11947284, 11832587, 11656154, 11634923, 11588653, 11358562, 11233076, 11069838, 11059327, 11053682, 10839916, 10804499, 10884378, 10878775, 10776006, 10842044, 10954178, 10964981, 10966752, 11004892, 10950349, 10986101, 11149425, 11202987, 11068958, 10986210, 10899332, 10710389, 10587154, 10537403, 10568726, 10531535, 10386290, 10339424, 10252232, 10152497, 10217354, 10207283, 10161203, 10263658, 10132423, 10190032, 10305025, 10431031, 10561343, 10539042, 10595401, 10745743, 10924983, 10830624, 10853094, 11001290, 11193451, 11297179, 11326731, 11574650, 11647089, 11609793, 11546342, 11599452, 11603486, 11546175, 11621907, 11692069, 11768648, 11771110, 11829510, 12095330, 12095413, 12001282]
5607A2001282J5336p4106L284j01580j756K26621J45463O8482N1626J20895Q5337
5596A2540884J34353M0828n4414J61523R4883p6198J17245L44674K34971J31391
5586A3670140Q6771K36541J24844J61497L14048J73180J37741K9975K81790L78082
5576A5594609M06770K99922J91838Q6225L6516K7809m7662j15035j73153k45189
5566A6062650j06636R439j08481j09078j59548K6584j5993L0005K00886Q6234
5556A5916062J06598R213j645j9190L2338J17797K2046J94247K8743L37650J32953
5545A6876812K29069Q4122K05269K81168L80858R4702J52373K31076R542J57362
5535A8702353M44412P9794R1304K47197J03535L18571K47960R7564J01110N24412
$$ y = [12001282, 12016618, 11942512, 11945796, 11844216, 11842460, 12069081, 12214544, 12283026, 12334652, 12455547, 12540884, 12675237, 12716065, 12661651, 12823174, 12918057, 12841859, 12959104, 13303778, 13538749, 13670140, 13756911, 13993452, 14118296, 14279793, 14593841, 14767021, 14904762, 14934737, 15216527, 15594609, 16001379, 16301301, 16493139, 16579364, 16615880, 16643689, 16596027, 16480992, 16307839, 16062650, 15956014, 15965453, 15856972, 15747894, 15588346, 15614930, 15598937, 15628942, 15829828, 15916062, 16022660, 16031873, 16030228, 16011038, 16043376, 16161173, 16183219, 16377466, 16406209, 16743859, 16876812, 17105881, 17190003, 17395272, 17676440, 18057298, 18152000, 18304373, 18535449, 18544991, 18702353, 19146765, 19226559, 19317863, 19565060, 19668595, 19987166, 20235126, 20332690, 20433800, 20958212]
5525B0958212J88523R1950J14090K51403L54841L23242K01487J82493L90652M29271
5515B3486164L49450K88884N06194O37038N84552P65598N76127N23876M42573
5506B8160456L77994M92190M85820M33266O88772O96708O55439O23163M57678
5497C3071486M64760M97952O23284P16400O25641M90323O61784Q08952Q09960
5488C8770542R73895J072935J024359J013892J033733J066255R86838J258783
5480D7201232J322935J439848J664572K079522K496915K432643K228311K243196
5472F3109174K355847J644336N24462j36248J2810O58490R55464J422342J929151
5463G2475828K673363K874821K979549L339393M255866N253147N277234N528514
$$ y = [20958212, 21146735, 21238685, 21352775, 21604178, 21959019, 22282261, 22483748, 22666241, 23056893, 23486164, 23835614, 24124498, 24630692, 25267730, 25852282, 26617880, 27194007, 27717883, 28160456, 28538450, 29030640, 29516460, 29949726, 30638498, 31335206, 31990645, 32613808, 33071486, 33536246, 34034198, 34657482, 35373882, 35999523, 36489846, 37151630, 37960582, 38770542, 39744437, 40817372, 41841731, 42855623, 43889356, 44955611, 45942449, 47201232, 48524167, 49964015, 51628587, 53708109, 56205024, 58637667, 60865978, 63109174, 65465021, 67109357, 67633819, 67497571, 67510381, 68168871, 69124335, 70546677, 72475828, 75149191, 78024012, 81003561, 84342954, 88598820, 93851967, 99129201, 104657715]
5455A04657715O357742P459740Q876714J0252255J3771646J9427819K4011682
5448A94815313J9249000L933228n327196p429465p378370j2733816j8897292j9257622
5440A46973780j7975948j5333806j4147090j3017916j0201140p790302o689033
5433F1818545o275117n429895m437066l401721k761510k068573j733949j796058
5425C3914656j126280j016857p68165o75711k87733r7772K34662J38234l31129
5416B9983905p22578p56990p45130r03192j094622j021776r86235q80019q80749
5407B1992614q20089n64672n98676l50450l45175l95821m9055J22304p5512J58166
5397A9073634Q7141K51348K82376M99732L81232N01270O01613R07220J309944
$$ y = [104657715, 111015457, 118475197, 127351911, 137604166, 151375812, 170803631, 194815313, 214064313, 217997541, 212670345, 205240880, 197862510, 185128694, 166231402, 146973780, 128997832, 113664026, 99516936, 86499020, 76297880, 68507578, 61818545, 55543428, 50113533, 45676467, 42274746, 39513236, 37444663, 35710714, 33914656, 32788376, 31771519, 31003354, 30327643, 30039910, 29942138, 30176800, 30315034, 29983905, 29261327, 28504337, 27759207, 26856015, 25761393, 24739617, 23753382, 22873363, 21992614, 21172525, 20607853, 20009177, 19658727, 19313552, 18917731, 18868676, 18990980, 18915468, 19073634, 19160775, 19412123, 19694499, 20194231, 20575463, 21076733, 21678346, 22585566, 23895510]
5388B3895510J736735K067651K081171O58456n94880p70686o50892r90672j904691
5379B5527702k043588j761025j465559j426484j171470j079725p97784o34306
5371A5147761l86308o18268k00863p4442j80898q5124n2871j47406k10903j39447
5361A3051231m842J07367j01307K7756J25292J40814J62610L26381K28066J78439
5351A4241807O25105L05083K09915O92683O67260O80105J082172J441084J871629
5342B1816843J546541O39621m0039o18133p86979j086586j615108j734438j617729
5333A6503993j614956j504225j099703r24843q72930p83166o64541o35217n49201
5324G855211m38506j82165l10181k99198l04048j81991N5639j07820k32207o7102
$$ y = [23895510, 25632245, 27699896, 29781067, 30439523, 29844643, 29073957, 28423065, 27432393, 25527702, 23484114, 21723089, 20257530, 18831046, 17659576, 16579851, 15782067, 15147761, 14761453, 14143185, 13942322, 13867880, 13686982, 13601858, 13548987, 13401581, 13190678, 13051231, 13046389, 13153756, 13052449, 13080205, 13205497, 13346311, 13508921, 13835302, 14063368, 14241807, 14866912, 15171995, 15381910, 16074593, 16741853, 17421958, 18504130, 19945214, 21816843, 23363384, 24003005, 23962966, 23344833, 22557854, 21471268, 19856160, 18121722, 16503993, 14889037, 13384812, 12285109, 11360266, 10487336, 9704170, 9039629, 8404412, 7855211, 7416705, 7234540, 6924359, 6625161, 6321113, 6139122, 6194761, 6086941, 5854734, 5787632]
5314E787632q7810j68019J8503L3718k8660J7139j14320O480L374j03765j2841
5303E351431l8940j06701q181n3542J2916p4148k01664n0503l4586k52458j22654
5292D420970j7568M8433J2363M4693J70000j439N4247j35318L8440j960l6307
5281D596554J34192j9892N6092R0742K8156m0961o455l1620J89456J29362K26661
5270E352287O2532k8162J27645l6353N6682J2926J59783q080r6625r0196L9644
5259E552083K04345J22819o076K55442K00101L19453K99424L54303J37458L67839
5249G807191L56650M46589O66929P28777J018215J199047R34716R4843l80985
5240A2871972n10896k91312q38110j217482r27339q77916o27216p41644n46848
$$ y = [5787632, 5699822, 5531803, 5550306, 5584024, 5555364, 5572503, 5458183, 5464663, 5468037, 5364272, 5351431, 5312491, 5205790, 5197609, 5144067, 5156983, 5082835, 4881171, 4830668, 4796082, 4543624, 4420970, 4403402, 4451835, 4464198, 4508891, 4678891, 4677452, 4731699, 4596381, 4634821, 4632861, 4596554, 4730746, 4710854, 4766946, 4857688, 4885844, 4844883, 4838428, 4806808, 4996264, 5125626, 5352287, 5414819, 5386657, 5514302, 5477949, 5534631, 5547557, 5707340, 5699260, 5602635, 5512439, 5552083, 5756428, 5879247, 5873171, 6128613, 6328714, 6648167, 6947591, 7301894, 7439352, 7807191, 8163841, 8610430, 9277359, 10006136, 11024351, 12223398, 13158114, 13252957, 12871972, 12361076, 12069764, 11231654, 10014172, 9086833, 8208917, 7581701, 6840057, 6293209]
5231F293209l32232m72815l98945m57057j79099k38696j58405j35005k21583j34693
5221C564679j54319k8790k5548n3791j35412K2826Q3357p2196j83436J51628j19651
5210C049347m1895j8783j85173J3110j36955J0728l7426J09138J22977j43534
5200B741534K8975N7207J82614j32297N0177l924L789J353j5197J53616J46828
5189C214675j16694j93880l9547j9693j2523j07522Q7669j08702l9252j35495
5179B529036M9504L1229p3143L2733M5245r0615o4721k3293N5645Q5199m833o4033
5167B507953l7800J51981n1653j14861J70977j26241q3097J74504N4280K1590
5157B667633K32206k9252L9667j03864M3422J3172n292J08666P5984j9760K47011
$$ y = [6293209, 5960977, 5488162, 5089217, 4632160, 4453061, 4214365, 4055960, 3920955, 3699372, 3564679, 3410360, 3381570, 3356022, 3302231, 3166819, 3189645, 3273002, 3200806, 3017370, 3168998, 3049347, 3007452, 2988669, 2803496, 2816606, 2679651, 2690379, 2652953, 2762091, 2885068, 2741534, 2770509, 2827716, 3010330, 2878033, 2928210, 2924286, 2928075, 2929428, 2914231, 3067847, 3214675, 3097981, 2904101, 2864554, 2844861, 2832338, 2724816, 2812485, 2703783, 2664531, 2529036, 2578540, 2609769, 2536626, 2569359, 2614604, 2523989, 2459268, 2435975, 2491620, 2576819, 2571986, 2507953, 2470153, 2622134, 2570481, 2455620, 2626597, 2500356, 2417259, 2591763, 2646043, 2667633, 2899839, 2870587, 2910254, 2806390, 2849812, 2862984, 2857692, 2966358, 3042342, 3022582, 3269593]
5146C269593Q4354l5556K52779J10751Q5095R027r3678j86983o3194j14843M1358
5135C358703j0922m1468J2923P1654j06129K4678p6903j09989r5950j82484j43948
5124B700165j8895j10392M742J2184k29558j23986o562p7004j96241J66817J11103
5113B232373m0691j61279k8972J43352k6456M5964M2028n3769q0742r6970J18331
5102B093169Q8802k5330K8695j37720p1532o286r408P0385N7419j79320r3830
5091A815044J00736j28712N2076Q0155Q7710j04313p3195P259L6149j54382j06441
5080A612086O5063n5888K1307Q7463N3253K651l7117K3938r50P8149p5122L6305
5068A811138Q0773K292K4785j60716K9243j08113o5720k725J22917n9413j43139
$$ y = [3269593, 3353947, 3318391, 3571170, 3681921, 3767016, 3776043, 3682365, 3495382, 3432188, 3317345, 3358703, 3347781, 3306313, 3319236, 3390890, 3284761, 3309439, 3232536, 3122547, 3026597, 2844113, 2700165, 2681270, 2570878, 2575620, 2587804, 2358246, 2234260, 2227698, 2150694, 1954453, 2121270, 2232373, 2191682, 2030403, 2001431, 2144783, 2118327, 2164291, 2206319, 2152550, 2071808, 1974838, 2093169, 2181971, 2156641, 2185336, 2047616, 1976084, 1969798, 1960390, 2030775, 2088194, 1908874, 1815044, 1915780, 1787068, 1839144, 1919299, 2007009, 1902696, 1829501, 1836760, 1872909, 1718527, 1612086, 1677149, 1621261, 1642568, 1730031, 1783284, 1785935, 1748818, 1772756, 1771806, 1849955, 1774833, 1811138, 1891911, 1894203, 1918988, 1758272, 1787515, 1679402, 1613682, 1610957, 1733874, 1674461, 1531322]
5057A531322J19470J81699o399o6855J57502q6459r7513k3537K3893L4465m6913
5046A720675m3840P8824N8784l0742N5467l1013Q471K8049j11517p0248O9777
5035A732687r5175N9929J53215o6186n2324q8512n4568J47090j40698J73764J02599
5024A871821n3830p0141j72720N2419J9928K4512j02768p270k5975l1063L1435
5013A536348r9727j8480Q4190L144Q2185R3487j73807k5370O153N4681n3991k03549
5001A285264k2095N2566M7022L4206o7503J10204N4812J7513k6689k31814k2115
4990A231371O1867o0343m5279j02024J62488r6884k3561L0443J23590K8914l7695
4979A272887m3873p1153K91064L867q1726R3231R8157q2587m332m3028p541l8360
$$ y = [1531322, 1650792, 1832491, 1826092, 1759237, 1916739, 1830280, 1732767, 1709230, 1733123, 1767588, 1720675, 1676835, 1755659, 1814443, 1783701, 1839168, 1808155, 1816626, 1844675, 1733158, 1662910, 1732687, 1637512, 1697441, 1850656, 1784470, 1732146, 1643634, 1589066, 1736156, 1595458, 1769222, 1871821, 1817991, 1747850, 1575130, 1627549, 1647477, 1671989, 1569221, 1561951, 1535976, 1504913, 1536348, 1436621, 1418141, 1502331, 1505475, 1587660, 1681147, 1507340, 1481970, 1488123, 1542804, 1488813, 1285264, 1263169, 1315735, 1362757, 1396963, 1329460, 1439664, 1494476, 1511989, 1485300, 1253486, 1231371, 1293238, 1232895, 1187616, 1085592, 1248080, 1151196, 1127635, 1158078, 1281668, 1310582, 1272887, 1229014, 1157861, 1448925, 1452792, 1371066, 1464297, 1562454, 1479867, 1475535, 1432507, 1424966, 1386606]
4967A386606O8442m2344j10758J8730o0459O2417J46000J35961K5328k02639j00183
4956A327101j715p0454P8647q2034K063P0199K1293K8854n2288l0700K0108Q5447
4944A396521Q0654l6650k31197l2948R2124j0927N5414J96393o8973j4634o4083
4933A361694O3496J0402q5188J05186o5798k0512r8045k4520J45633J65697Q103
4922A566148l6589O3782M5016r334j67190J4529J00095K452j8883R8304m7480
4911A610850j00563N1980N5183l8634q380N4346j11933j45548P5884J89964Q9488
4900A722637M6539L9074l4043J34500r6918m8252R6585n9741j27210m8893J0720
4889A634998K29849r5035m0972o5648k03417J63436m9862j78338J58312M4615
$$ y = [1386606, 1455048, 1412704, 1301946, 1320676, 1260217, 1322634, 1468634, 1604595, 1629923, 1427284, 1327101, 1325386, 1254932, 1333579, 1251545, 1253608, 1323807, 1345100, 1373954, 1321666, 1290966, 1311074, 1396521, 1477175, 1440525, 1209328, 1176380, 1268504, 1257577, 1312991, 1509384, 1440411, 1425777, 1361694, 1425190, 1435592, 1350404, 1455590, 1389792, 1369280, 1271235, 1246715, 1392348, 1558045, 1566148, 1529559, 1593341, 1638357, 1629023, 1461833, 1476362, 1576457, 1578909, 1560026, 1658330, 1610850, 1510287, 1562267, 1617450, 1578816, 1570436, 1624782, 1512849, 1367301, 1443185, 1633149, 1722637, 1769176, 1808250, 1774207, 1908707, 1811789, 1763537, 1860122, 1800381, 1673171, 1624278, 1634998, 1864847, 1769812, 1728840, 1663192, 1459775, 1623211, 1573349, 1395011, 1553323, 1597938]
4879A597938l6175L4736J15803p6697j8624J00686j00678j02102K14737J54435
4869A884059j27661O4054p1132j6899N8131k3756j04449j2290l1872m274J3824
4858A627735M6864O1776K1073j3989o635J37610K4307n3748k39626Q3453K22715
4847A911535N185m1262m2904J7021o5962Q3784j27014j548M8882K23154j12958
4836A897913N984o44L9567O8653o3795M1587j2248o3125j18931q0019m3671k9893
4824A641378n5157M6417J03430P7022j58721l4842o1255J13076k1396m2774k6569
4813A580609j3707m5475j2014M3952l1703j36857r4524J49327L7870Q0722j56577
4802A401623J22489J8383p5270L5503J08210j13861k5162J24844L346q678M4678
$$ y = [1597938, 1561763, 1596499, 1712302, 1635605, 1616981, 1717667, 1616989, 1514887, 1729624, 1884059, 1756398, 1820452, 1749320, 1732421, 1790552, 1766796, 1662347, 1650057, 1618185, 1613911, 1627735, 1674599, 1736375, 1757448, 1743459, 1736824, 1874434, 1898741, 1844993, 1605367, 1688820, 1911535, 1916720, 1875458, 1832554, 1849575, 1783613, 1867397, 1740383, 1738835, 1787717, 2010871, 1897913, 1903897, 1903253, 1942820, 2011473, 1947678, 1989265, 1977017, 1913892, 1794961, 1714942, 1671271, 1641378, 1586221, 1632638, 1736068, 1813090, 1654369, 1619527, 1558272, 1671348, 1649952, 1607178, 1580609, 1566902, 1521427, 1509413, 1553365, 1521662, 1384805, 1290281, 1439608, 1477478, 1558200, 1401623, 1524112, 1542495, 1467225, 1502728, 1610938, 1497077, 1471915, 1596759, 1600105, 1591427, 1636105]
4791A636105J3029L3315j0187N4961N1134N740o725n411k5176j06410k0867j62738
4779A456770J06572K21461K7830L8601j60636j91221K09370P1187j39829J14989
4769A755094R6591P4023M7556p7069J2918R1548j08068k8934p866l757o0296o6039
4757A725701Q3980P6308K8357N9860P449J9899j39683j33523n7595k0718J52684
4746A802719l6177N6426o0491p887q4894l4162J0248J32868Q4862j19215n6108
4735A688189Q9138P4719j00789Q6010o1963j09058M694o1907Q1463P6885J67789
4724A935170o1208l5014L759p7965q153j12558Q4985Q700j21121J25848Q1637
4713A824080J0989m9189l2892k150R4728r5343J17985J34845J3408q2790l3203
$$ y = [1636105, 1649134, 1682449, 1672262, 1727223, 1778357, 1784097, 1777372, 1771961, 1746785, 1640375, 1619508, 1456770, 1563342, 1784803, 1812633, 1851234, 1690598, 1499377, 1708747, 1779934, 1640105, 1755094, 1851685, 1925708, 1973264, 1896195, 1909113, 2000661, 1892593, 1863659, 1855793, 1852036, 1791740, 1725701, 1809681, 1885989, 1914346, 1974206, 1981655, 2001554, 1861871, 1728348, 1670753, 1650035, 1802719, 1766542, 1822968, 1762477, 1754590, 1669696, 1635534, 1645782, 1778650, 1863512, 1744297, 1688189, 1777327, 1852046, 1751257, 1837267, 1775304, 1666246, 1670940, 1609033, 1690496, 1767381, 1935170, 1873962, 1838948, 1842707, 1764742, 1756589, 1644031, 1729016, 1737716, 1616595, 1742443, 1824080, 1835069, 1785880, 1752988, 1750838, 1845566, 1750223, 1868208, 2003053, 2016461, 1933671, 1900468]
4702A900468n5222J44065L9566j5533J26746j39672p5365J26005J2633L0642L2327
4691B126660J8306j2552l3754J21028O5942J914p6442j263l7650M1606K07592
4680B421387k4780n4301J9350j5987P5876J11750m3756J61546l0748j8664k7545
4669B574128J00331J66071j47715N9977R0590M8894j81597J37269J28899j968
4659B974879p645j22880R5224m4089k4148K30656N5699q271J17881p0280n5787
4648C141239N7289L3112J10340J49017l9076j25682J18056n490J2456p0645R8946
4637C479562J17596L2814q900M4628j33225J72575R8789J05905n0743M6511K6786
4626C932298k6697R694L0148J17241L5667p2349n2850J08557K7918J79860o1663
$$ y = [1900468, 1845246, 1989311, 2028877, 2013344, 2140090, 2000418, 1925053, 2051058, 2063691, 2094333, 2126660, 2144966, 2132414, 2098660, 2219688, 2285630, 2287544, 2211102, 2209839, 2172189, 2213795, 2421387, 2396607, 2342306, 2361656, 2345669, 2421545, 2533295, 2489539, 2651085, 2620337, 2601673, 2574128, 2674459, 2840530, 2692815, 2752792, 2843382, 2892276, 2710679, 2847948, 2976847, 2974879, 2967234, 2844354, 2939578, 2895489, 2871341, 3101997, 3157696, 3149425, 3267306, 3197026, 3141239, 3198528, 3231640, 3341980, 3490997, 3451921, 3326239, 3444295, 3438805, 3451261, 3380616, 3479562, 3597158, 3629972, 3621072, 3665700, 3532475, 3705050, 3803839, 3909744, 3859001, 3905512, 3932298, 3905601, 3915295, 3945443, 4062684, 4098351, 4026002, 3973152, 4081709, 4109627, 4289487, 4227824]
4615D227824j64004m606J04814K91553J53820p804K553J79158p2215k1430p188
4604D682475M9349J27524L3521l8088Q6821J01266R9067j2580K9673J0962R5985
4593E265975J73165j18211m9343M7021j1880M7870L19452j4660m6833N0374J59493
4582E822423O8633L2886M5379J00565q1095M7752J41609J30259R2792O2748n6088
4571F407863J90669K8005O3254J89710j22400K11451J33985J02846K00024J08124
4561G513531K29115M9835n8744K3380J31157M5270J50687J75232J09833k8116
4551H341180L7855J36293J16740J27065K03419J72574K6011M738J15133K53427
4541I534435J58011Q0809J61677K60805L09813Q1017Q2510J39436K26266J16311
$$ y = [4227824, 4063820, 4059214, 4164028, 4455581, 4609401, 4601597, 4604150, 4783308, 4711093, 4689663, 4682475, 4731824, 4859348, 4892869, 4854781, 4941602, 5042868, 5141935, 5129355, 5159028, 5169990, 5265975, 5439140, 5320929, 5271586, 5318607, 5306727, 5354597, 5674049, 5659389, 5612556, 5662930, 5822423, 5891056, 5923942, 5969321, 6069886, 5988791, 6036543, 6178152, 6308411, 6401203, 6463951, 6407863, 6598532, 6626537, 6689791, 6879501, 6757101, 6968552, 7102537, 7205383, 7405407, 7513531, 7742646, 7792481, 7733737, 7757117, 7888274, 7933544, 8084231, 8259463, 8369296, 8341180, 8379035, 8515328, 8632068, 8759133, 8962552, 9135126, 9161137, 9165875, 9281008, 9534435, 9692446, 9773255, 9934932, 10195737, 10505550, 10586567, 10669077, 10808513, 11034779, 11151090]
4531A1151090J73430K19438L04878L15906K15122L03833K00712R437J25081J45396
4521A3164323L06908L15439J20340l5612L58911K16783R7751L72832L32964K69096
4511A5519735K65411M98591M94130M28899M69571O09555N90970P36837N92046
4502B0205745N35931P06418Q03311Q26295Q90210P96538O06189M74237M94409
4493B6339283K63379K44100K9846K10424K11296J08139J67598L25347M49366O92813
4483B9041591P82262N47213M89060M36644K59576L27554K10447J28769K23545
4474C2446661J51881K36489L74598O19499J011336J170771J359203J332323M15925
4465C9118686l42766n71071o64918r98394j417002j523469j199801j044837j172620
$$ y = [11151090, 11324520, 11543958, 11848836, 12164742, 12379864, 12683697, 12884409, 12893846, 13018927, 13164323, 13471231, 13786670, 13907010, 13871398, 14230309, 14447092, 14544843, 14917675, 15250639, 15519735, 15785146, 16283737, 16777867, 17206766, 17676337, 18285892, 18876862, 19613699, 20205745, 20741676, 21448094, 22251405, 23077700, 23967910, 24764448, 25370637, 25844874, 26339283, 26602662, 26846762, 26876608, 27087032, 27298328, 27406467, 27574065, 27899412, 28348778, 29041591, 29823853, 30371066, 30860126, 31296770, 31556346, 31883900, 32094347, 32223116, 32446661, 32598542, 32835031, 33209629, 33829128, 34840464, 36011235, 37370438, 38702761, 39118686, 38775920, 38204849, 37539931, 36541537, 35124535, 33601066, 32401265, 31356428, 30183808]
4456C0183808q39574p35900m03912l57542m31835l26204m33483o33548o50470
4447B5371340n51944o98371p16873o89073o61454m52806k34118j44744q7705P4565
4437B1208817N2616j81783n30677m83761n10492n15972n50468n24840p09372o56154
4427A6597914m38417m20835k44779m93839k61584j17315j53497k16696q9650J6823
4417A4178125j49671j8770j42041J5389J17035R3427K16349J37301J27268L15550
4407A4889962M72430M12704L84347L32324L87786O06279O46946O58264R83391
4398A9774433J232771J454663J115368N37703l27037r90060j463245j450838j408383
4389A8475375j290955j470080j238522j087608j046306o92262q14261o91620n66421
$$ y = [30183808, 29344234, 28608334, 28204422, 27846880, 27415045, 27088841, 26655358, 26021810, 25371340, 24819396, 24121025, 23404152, 22715079, 22053625, 21600819, 21366701, 21221957, 21134252, 21208817, 21261433, 21079650, 20548973, 20065212, 19554720, 19038748, 18488280, 17963440, 17254068, 16597914, 16159497, 15738662, 15493883, 15000044, 14738460, 14621145, 14467648, 14250952, 14161302, 14178125, 14028454, 14009684, 13867643, 13883032, 14000067, 14093494, 14309843, 14447144, 14574412, 14889962, 15362392, 15775096, 16159443, 16491767, 16879553, 17485832, 18132778, 18791042, 19774433, 21007204, 22461867, 23577235, 24114938, 23787901, 22797841, 21334596, 19883758, 18475375, 17184420, 15714340, 14475818, 13388210, 12341904, 11649642, 10835381, 10143761, 9577340]
4380I577340l27440k53205k87606k16722j96339k60177j79811m8488r6401n4448
4370G656703p6378n4783j42996j4487R0977p1138M506j04378j36315L3104j49947
4359G034868k4816K2194j04432j30179j03927J28293Q292R7300o4829j52921J1757
4348F721600J10498j1395k5238M5480o5615M3184M5781n7985m4378R684Q8253
4337F859869N8435j2684n3786o3865N0384P5752k5213j30288K2991K8239n9785
4326F750049m9537K67110R0018O1233k1866r6046j43333M2478j8944N7930o8195
4315F870897n4220O0202R4844J13463O5707n4929j07976J65440K9897M0244J6782
4304G240351P2879N1843j64710J1237J15374p9077L8197J3571n449L6620J5139
$$ y = [9577340, 9249900, 8996695, 8709089, 8492367, 8296028, 8035851, 7856040, 7807552, 7711151, 7656703, 7580325, 7525542, 7382546, 7368059, 7459036, 7387898, 7392404, 7288026, 7151711, 7184815, 7034868, 7010052, 7032246, 6927814, 6797635, 6693708, 6822001, 6830293, 6927593, 6862764, 6709843, 6721600, 6832098, 6820703, 6795465, 6840945, 6775330, 6818514, 6864295, 6806310, 6761932, 6771616, 6859869, 6918304, 6905620, 6851834, 6787969, 6838353, 6914105, 6888892, 6758604, 6781595, 6809834, 6750049, 6700512, 6967622, 7057640, 7118873, 7097007, 7000961, 6857628, 6900106, 6881162, 6939092, 6870897, 6816677, 6876879, 6971723, 7085186, 7150893, 7095964, 6987988, 7153428, 7183325, 7223569, 7240351, 7313230, 7365073, 7200363, 7211600, 7326974, 7247897, 7286094, 7299665, 7294216, 7330836, 7345975]
4293G345975J35186J45262P7952k05122k10691Q6545J5262m1346r3731q535Q992
4282G255749P978M7146K07773K247k3710M0659j8707n8908l7953o6025J14032
4271G470281j1370J85850q2441J3442j4794J53517N3428n9095Q845m196q451J14237
4259G819253J40445o6776j10794O3634j13401j1883K22722P9470R293J3004q4514
4248G960453l8550K14248N0366J6800n1740J00567J10924Q284j1994Q7206q5102
4237H361462j3376L5571J91913m3004q8645l8766q515m5063J36560O5037J0668
4226H563842l8198N3796K69804j5342J620r6416Q5338J3839q3042J31432J46917
4215I033590O1354J13194j33707L9359Q5225R2159j17011J51716K04760l8111
$$ y = [7345975, 7481161, 7626423, 7704375, 7499253, 7288562, 7375107, 7390369, 7349023, 7255292, 7246757, 7255749, 7263727, 7310873, 7518646, 7520893, 7497183, 7537842, 7519135, 7460227, 7422274, 7356249, 7470281, 7458911, 7644761, 7562320, 7575762, 7560968, 7714485, 7767913, 7708818, 7717663, 7713467, 7705016, 7819253, 7959698, 7892922, 7782128, 7845762, 7732361, 7720478, 7943200, 8022670, 8031963, 8044967, 7960453, 7921903, 8136151, 8186517, 8203317, 8151577, 8252144, 8363068, 8371352, 8359358, 8446564, 8361462, 8348086, 8383657, 8575570, 8532566, 8443921, 8405155, 8396640, 8351577, 8488137, 8553174, 8563842, 8525644, 8579440, 8849244, 8833902, 8835522, 8739106, 8824444, 8838283, 8755241, 8886673, 9033590, 9094944, 9208138, 9074431, 9113790, 9199015, 9291174, 9174163, 9325879, 9530639, 9492528]
4205I492528n3539J59415m5189j15869J45582O3516P1363R9022j5611k19074J18187
4194I700331M7075j08795K8898M7568o0988P9919J46080J33372o7439Q4143p4677
4183I955487J38789P3536o5759J1828j08667k7745J18519k405J60788J29570j04140
4172A0279801q384K1411m9767J43939J92007L3329M3499r5994r6005J65788n6967
4161A0572657k744Q15K7749R6110P9123M0910L7065N2784J16503l0921L0209P8630
4149A1098890J62164k1878P329m4605k4033J33515P1322L4044J18960K1163N7130
4138A1614001r563o3434K37887J9326j9059O1070J33963q7721m7814L16166J50691
4127A2305513J1261n2729N2055J01020O6123J8902o2555L4693J29976J56277J40617
$$ y = [9492528, 9438989, 9598404, 9553215, 9437346, 9582928, 9646444, 9717807, 9816829, 9801218, 9582144, 9700331, 9747406, 9638611, 9667509, 9715077, 9654089, 9734008, 9880088, 10013460, 9946021, 10030164, 9955487, 10094276, 10167812, 10102053, 10113881, 10005214, 9977469, 10095988, 10093583, 10254371, 10383941, 10279801, 10271417, 10292828, 10243061, 10387000, 10579007, 10612336, 10655835, 10559841, 10463836, 10629624, 10572657, 10569913, 10570728, 10598477, 10694587, 10773710, 10814620, 10851685, 10904469, 11020972, 10990051, 11020260, 11098890, 11261054, 11239176, 11246505, 11201900, 11177867, 11311382, 11382704, 11416748, 11535708, 11556871, 11614001, 11604438, 11541004, 11778891, 11798217, 11779158, 11840228, 11974191, 11886470, 11838656, 12154822, 12305513, 12316774, 12264045, 12316100, 12417120, 12483243, 12502145, 12439590, 12474283, 12604259, 12760536, 12901153]
4116A2901153J4175J03832L8867j17246L16103J21575o675J82406J4703M1469
4106A3610362J38497k3580K21959L7875L2604J33397K6611J80688L37245J60090
4096A4855748P5944k8646J17709K03588K46674P7837J53941Q4414J56565K40097
4086A6183871J48690J39841J91040r396J20266J25776j075J06753L3738L2630
4076A7072134J66218L2932J79543K20915K66769L772Q6755J64028M7976K90989
4066A8532031P4773K35724J89789K36991R5165J35284J85332N5005J63784K97762
4056B0201640K45439J46054J47069J74914J66227J36664J79745J91458L27065
4047B1916275J15865J83268J21676J29732K48094J90440J03016J53512K30215
$$ y = [12901153, 12915328, 13019160, 13058027, 12940781, 13256884, 13378459, 13371784, 13554190, 13568893, 13610362, 13748859, 13725279, 13947238, 13985113, 14017717, 14151114, 14177725, 14358413, 14695658, 14855748, 14931692, 14903046, 15020755, 15224343, 15471017, 15548854, 15702795, 15787209, 15943774, 16183871, 16332561, 16472402, 16663442, 16654046, 16774312, 16900088, 16899013, 17005766, 17039504, 17072134, 17238352, 17271284, 17450827, 17671742, 17938511, 17942283, 18029038, 18193066, 18241042, 18532031, 18606804, 18842528, 19032317, 19269308, 19364473, 19499757, 19685089, 19740094, 19903878, 20201640, 20447079, 20593133, 20740202, 20915116, 21081343, 21218007, 21397752, 21589210, 21916275, 22032140, 22215408, 22337084, 22466816, 22714910, 22905350, 23008366, 23161878, 23392093]
4038B3392093L92274K41659K15002K16542K12922J58718K88713K30935K00260
4029B5549118M17834K09703K58423J62477L46776L77530K60007M40757L82577
4020B8405202J26844K26930K13010K46389K70524N22814M00201J79083L76241
4011C0967238K54124K32509M37010K80379L09841K63811K93819L55867M67321
4002C3861919K69962M17508M74539K88065M99964M27983N31967M98009L13527
3993C7583443N24648N24797N10435N37468N69753N86748N45905O51745N62069
3984D2597011N37457N48223N63800O10708O43618N36668N15642O79863O71070
3975D7904060P08728N22605P12613O95829O08303O14934Q47028Q78520Q42200
$$ y = [23392093, 23784367, 24026026, 24241028, 24457570, 24670492, 24829210, 25117923, 25348858, 25549118, 25966952, 26176655, 26435078, 26597555, 26944331, 27321861, 27581868, 28022625, 28405202, 28532046, 28758976, 28971986, 29218375, 29488899, 30011713, 30411914, 30590997, 30967238, 31221362, 31453871, 31890881, 32171260, 32481101, 32744912, 33038731, 33394598, 33861919, 34131881, 34549389, 35023928, 35311993, 35811957, 36239940, 36771907, 37269916, 37583443, 38108091, 38632888, 39143323, 39680791, 40250544, 40837292, 41383197, 42034942, 42597011, 43134468, 43682691, 44246491, 44857199, 45500817, 46037485, 46553127, 47232990, 47904060, 48612788, 49135393, 49848006, 50543835, 51152138, 51767072, 52614100, 53492620, 54334820]
3966E4334820P19176N50345R10019R23931P96645R76119J026295J058017J144709
3957F2440076J322367J124322R16407J134501J319478J402692J347899J032628
3949G2040370J235413J734903J620611J587407J736410J806792J997991J966283
3941H5726180K113017K063109K190756K187889K032220K178362J792130J748491
3933A02032154J626348J526681J145230M41144j38515l95941r87036j551627j973054
3924A01725384k343045k588490k588809k664192k766023k675517k540663k356692
3916H1201953k209369j859938j610228j345007j193581j226451j175654j218193
3908F9363532j241716j260246j497678j504189j497746j327475j485586j369407
$$ y = [54334820, 55053996, 55604341, 56514360, 57438291, 58234936, 59211055, 60237350, 61295367, 62440076, 63762443, 64886765, 65803172, 66937673, 68257151, 69659843, 71007742, 72040370, 73275783, 75010686, 76631297, 78218704, 79955114, 81761906, 83759897, 85726180, 87839197, 89902306, 92093062, 94280951, 96313171, 98491533, 100283663, 102032154, 103658502, 105185183, 106330413, 106771557, 106633042, 106237101, 105250065, 103698438, 101725384, 99382339, 96793849, 94205040, 91540848, 88774825, 86099308, 83558645, 81201953, 78992584, 77132646, 75522418, 74177411, 72983830, 71757379, 70581725, 69363532, 68121816, 66861570, 65363892, 63859703, 62361957, 61034482, 59548896, 58179489]
3900E8179489j377669j360656j245978j277947j085179r60581j051292q46716
3892D8973471o59867p43515p78780n00590l06151m45356k54874k23812J98473
3883D5258999J95452K78465M55137Q05361P24674K63687l01347n81787p48777
3874D6349864j158124j504229j686955j635211j446186j396165j546381j403886
3866C4572727j143840j064772p56792n48207n87530o92732m45601l84733m42481
3857B8506039l27014k24691j02660o2393K4895m6147J02979j9445K87560M82650
3847B8621773L93813L1948p8617j62530l39603n27969p59504p77401r13653o04843
3837B4883414n77508p39184o88572n61617m98376m58704l22854j32512l20113
$$ y = [58179489, 56801820, 55441164, 54195186, 52917239, 51832060, 50871479, 49820187, 48973471, 48313604, 47570089, 46791309, 46290719, 45984568, 45539212, 45284338, 45060526, 45258999, 45454451, 45732916, 46188053, 46993414, 47718088, 47981775, 47680428, 47098641, 46349864, 45191740, 43687511, 42000556, 40365345, 38919159, 37522994, 35976613, 34572727, 33428887, 32364115, 31607323, 31059116, 30471586, 29778854, 29333253, 28948520, 28506039, 28179025, 27954334, 27851674, 27789281, 27814176, 27768029, 27871008, 27851563, 28139123, 28621773, 29015586, 29047534, 28968917, 28806387, 28466784, 27938815, 27179311, 26401910, 25488257, 24883414, 24305906, 23566722, 22878150, 22316533, 21818157, 21359453, 21036599, 20904087, 20583974]
3828B0583974l87193l09749k49632j96563k06754k38646r9041j72500j81143q7959
3818A8454794p7229o6513k88445j43669M2899j75736j48820j72330r2539j81085
3808A7151327q0991J38519j11431j12039k04467j21969m5012j65303P2467J0383
3798A6531484j34874j7923j59359N2439k10418n5481J51537j33029k496k1979
3788A5999901K890k9878m5215k50023J35039L3304k09261k2558j7126m0642m9056
3777A5507375j15474K0882L1640j12452N3068r7295K4065J8487r3540j9134m1785
3766A5175837r335l2163n7429j0277j68701M6082P1100n906j14006j86945J39971
3755A4848228p3507j71499R6530k0033L148L276p3194m5110l3475j79875J11123
$$ y = [20583974, 20196781, 19887032, 19637400, 19440837, 19234083, 18995437, 18896396, 18723896, 18542753, 18454794, 18377565, 18311052, 18022607, 17878938, 17921837, 17746101, 17597281, 17424951, 17332412, 17151327, 17070336, 17208855, 17097424, 16985385, 16780918, 16658949, 16613937, 16448634, 16521101, 16531484, 16396610, 16378687, 16219328, 16271767, 16061349, 16005868, 16157405, 16024376, 16021880, 15999901, 16002791, 15972913, 15927698, 15677675, 15812714, 15846018, 15636757, 15614199, 15597073, 15556431, 15507375, 15391901, 15412783, 15444423, 15331971, 15385039, 15287744, 15311809, 15330296, 15236756, 15217622, 15175837, 15166502, 15134339, 15076910, 15066633, 14897932, 14944014, 15015114, 15009208, 14895202, 14708257, 14848228, 14774721, 14603222, 14699752, 14679719, 14682867, 14686143, 14612949, 14567839, 14534364, 14354489, 14465612]
3744A4465612N9703o0559J2869P546J7855m3059p5568l7097j6241q8335p0342
3733A4172384L6102K8038J04809K2823N3266K6407p491j42857p6325n9994K4769
3722A4181931N7386J18422R0164k7860m2712Q351L4452n1714j59875J98802J10877
3711A4518224q2727M5802k9491J13337J76773J07552J07673O8892j02126Q8987
3701A5012896L0198L6876J65223J41386J16377K50332p0097J94821J14895l373
3691A5989534J78474J43506M1245L8444K93867R7953k1112K3299L43756J86168
3681A7315134J22515J60989P2205J57498K17132K29706L17649J56729K01801K53686
3671A9205044O3302L29827J74539J80680J04345J60049R0352J53859K56114K22683
$$ y = [14465612, 14525315, 14464756, 14477625, 14485171, 14503026, 14459967, 14384399, 14347302, 14331061, 14242726, 14172384, 14208486, 14236524, 14341333, 14364156, 14417422, 14443829, 14436338, 14293481, 14217156, 14157162, 14181931, 14239317, 14357739, 14447903, 14420043, 14377331, 14385682, 14420134, 14368420, 14208545, 14407347, 14518224, 14435497, 14481299, 14451808, 14565145, 14741918, 14849470, 14957143, 15026035, 14923909, 15012896, 15043094, 15079970, 15245193, 15386579, 15502956, 15753288, 15683191, 15878012, 15992907, 15989534, 16168008, 16311514, 16352759, 16391203, 16685070, 16783023, 16761911, 16785210, 17128966, 17315134, 17437649, 17598638, 17670843, 17828341, 18045473, 18275179, 18592828, 18749557, 18951358, 19205044, 19268346, 19598173, 19772712, 19953392, 20057737, 20217786, 20308138, 20461997, 20718111, 20940794]
3661B0940794J75390K13813J38637J95024J74129J16601J75816J90118J12189
3652B2432511J81483J81895L68125K98984K60430K41838K33474M63542M12027
3643B5074309K13255M66849K83912M63367O30791K58879L96148N09954L63354
3634B8660818K64821L07720M08911M40770L28007M87679M31811N10681N46542
3625C2387760M34906L70567M86847J81514O05929M72163L13331J37179K99360
3616C5689556L13697J86520K22186R5609L69736L82801N17267L71713L57927M85722
3606C8992734O02816L75331O16889P23593N66918N67052Q07668P38976O20117
3597D4612094P54589P19588P24002N92677N82949J15670N400k22616n02758o92653
$$ y = [20940794, 21116184, 21329997, 21468634, 21663658, 21837787, 21954388, 22130204, 22320322, 22432511, 22613994, 22795889, 23164014, 23462998, 23723428, 23965266, 24198740, 24662282, 25074309, 25287564, 25754413, 26038325, 26501692, 27132483, 27391362, 27787510, 28297464, 28660818, 28925639, 29233359, 29642270, 30083040, 30411047, 30898726, 31330537, 31841218, 32387760, 32822666, 33193233, 33680080, 33861594, 34467523, 34939686, 35253017, 35390196, 35689556, 36003253, 36189773, 36411959, 36507568, 36877304, 37260105, 37777372, 38149085, 38507012, 38992734, 39595550, 39970881, 40587770, 41311363, 41878281, 42445333, 43253001, 43991977, 44612094, 45366683, 46086271, 46810273, 47402950, 47985899, 48101569, 48106969, 47884353, 47381595, 46688942]
3587D6688942o79978p61973o48191o31957o97958m95657l77680k52410j47230
3578D1995908j2938m3909K04867K37377K17214J69695K15779P4480K48804K75198
3568D3582475K16801o6836j7765K2325k90143m86996n13275q85840r31618r71098
3558C9658030r81700j041246j042641q54024j084609q50602p36063n71934n57916
3549C1937295n16793n07606l59151m60907l81362m20103m32138n17106m71870
3540B7870259k40056m54657p42864o62486o40592p58008p85204q87892o58989
3531B2039511p75819q39269p82120o31539n41511p13012o38177n24366l78386
3522A6215312m48650m79688l49105n55517n01787k10972l69973j25768j29338
$$ y = [46688942, 46008964, 45246991, 44598800, 43966843, 43268885, 42773228, 42395548, 42143138, 41995908, 41982970, 41939061, 42143928, 42381305, 42598519, 42768214, 42983993, 43058473, 43307277, 43582475, 43799276, 43732440, 43714675, 43737000, 43446857, 42959861, 42446586, 41560746, 40629128, 39658030, 38676330, 37635084, 36592443, 35738419, 34653810, 33803208, 33067145, 32495211, 31937295, 31420502, 30912896, 30553745, 30092838, 29711476, 29291373, 28859235, 28342129, 27870259, 27630203, 27175546, 26432682, 25770196, 25129604, 24371596, 23586392, 22698500, 22039511, 21263692, 20424423, 19642303, 19010764, 18469253, 17756241, 17118064, 16593698, 16215312, 15766662, 15286974, 14937869, 14382352, 13880565, 13669593, 13299620, 13173852, 13044514]
3513A3044514k78943m00210k59707k11472k39552j63023k99884k27595m36028
3504A0528100j84265j99460k01185j03413j18300l22458k76017k16177o8010j70300
3494H668515l26533P030O1396j75880l38780r5844l3185k21846r8902P4721j48880
3483G371812j26865j977j74662k66905p0759J9062K2208k75139q087J37343j55288
3472F470743j19507p3027r2943j76905j07189L3255j63642q2267n8086j36624
3462E493808r2870j12581r0801j752J7894m727m9980r0653k3501j15178M3799
3451D973458N2649k19890k5531o1108M054l7908j66524J5106M636j4537Q8486
3440D612891K4735j11933r8676j78495M104q6936r2097N1091J0347m7027k19328
$$ y = [13044514, 12765571, 12365361, 12105654, 11894182, 11654630, 11491607, 11191723, 10964128, 10528100, 10343835, 10144375, 9943190, 9839777, 9721477, 9399019, 9123002, 8906825, 8838815, 8668515, 8341982, 8349012, 8410408, 8234528, 7895748, 7799904, 7766719, 7544873, 7445971, 7520692, 7371812, 7244947, 7242970, 7068308, 6801403, 6730644, 6749706, 6771914, 6496775, 6488688, 6626031, 6470743, 6351236, 6278209, 6185266, 6008361, 5901172, 5934427, 5770785, 5688518, 5630432, 5493808, 5400938, 5288357, 5197556, 5195804, 5213698, 5208971, 5158991, 5068338, 5044837, 4929659, 4973458, 5026107, 4806217, 4780686, 4719578, 4723632, 4685724, 4519200, 4534306, 4538942, 4524405, 4612891, 4637626, 4525693, 4427017, 4248522, 4252626, 4165690, 4073593, 4124684, 4135031, 4088004, 3868676]
3429C868676K1783r9845r0065l8207L7653N9966q6789r3574O6775q1780m8129
3418C516464q1027J7980L0229r9096m8821j56167r492j4634O9998J05027p8316
3407C252145k544k37321K9354J04705m3626n4047n6988Q3626q0752O4819j48245
3396B911126J34347Q1192j91337j24051q681l1495J24446j42786j16105q0226
3386B556430J47354J23739o0030P3644Q5144j29694m6596j63778O492Q3607J33800
3375B810112J0191j42807j1263k7609J19877q9434j67516J23411q8034J04311
3365B641239q852p1195N9213j07658j33715O2605J36258j7739m3412q1257N8185
3354B493672q2379l465j00863q333L1084j7169O1047l5431j3718J52467j742l9350
$$ y = [3868676, 3890459, 3790614, 3700549, 3662342, 3699995, 3759961, 3673172, 3579598, 3646373, 3564593, 3516464, 3435437, 3453417, 3483646, 3384550, 3335729, 3179562, 3170070, 3155436, 3225434, 3330461, 3252145, 3249601, 3012280, 3041634, 3146339, 3102713, 3048666, 2991678, 3075304, 2994552, 3059371, 2911126, 3045473, 3126665, 2935328, 2811277, 2802596, 2771101, 2895547, 2752761, 2636656, 2556430, 2703784, 2827523, 2767493, 2841137, 2926281, 2796587, 2749991, 2586213, 2592705, 2676312, 2810112, 2820303, 2677496, 2666233, 2638624, 2758501, 2669067, 2501551, 2624962, 2536928, 2641239, 2632387, 2561192, 2620405, 2512747, 2379032, 2441637, 2577895, 2560156, 2516744, 2435487, 2493672, 2411293, 2407828, 2306965, 2298632, 2329716, 2312547, 2373594, 2338163, 2324445, 2476912, 2475170, 2435820]
3342B435820K0806L839q0820q4321n9380J01894R411k15369R2437O9417K667o996
3330B289405N3597J2731J8337j79173j59257J18110R036K6913P2924p8882j58198
3319B025543J21557J2893J24869j45080J1784K3452l2992J01670j06746j56870
3309A980080P5356j245m5345j419K7441l241l1295N3477k1343J05581k5809q6563
3297B025675n2266L8512J1352J36145l1065Q6998j04969j56209n6400n743J50479
3286B042509k07159K7773N6629o2299j37794Q6558Q5905n9656L0897O5382j6847
3275A911898l314J11581q5818j11185j9927J111K19101j32668j18645Q4198j6840
3264A839492j60345J22835N017K0057K8546r5815j18560J0383K285l9418r0507
$$ y = [2435820, 2456626, 2460465, 2379645, 2295324, 2235944, 2337838, 2347249, 2131880, 2224317, 2293734, 2296401, 2289405, 2343002, 2355733, 2374070, 2194897, 2035640, 2153750, 2162786, 2189699, 2262623, 2183741, 2025543, 2147100, 2159993, 2284862, 2139782, 2151566, 2175018, 2142026, 2243696, 2136950, 1980080, 2055436, 2054191, 2008846, 2007427, 2034868, 2031627, 2000332, 2053809, 2032466, 2138047, 2112238, 2025675, 1973409, 2011921, 2023273, 2159418, 2128353, 2215351, 2110382, 1954173, 1897773, 1892030, 2042509, 1835350, 1863123, 1919752, 1857453, 1719659, 1806217, 1892122, 1832466, 1863363, 1928745, 1911898, 1908584, 2020165, 1934347, 1823162, 1803235, 1804346, 2023447, 1890779, 1772134, 1856332, 1839492, 1679147, 1801982, 1806999, 1827056, 1855602, 1759787, 1641227, 1651610, 1653895, 1614477, 1523970]
3253A523970k2435N892o129J08190Q2625J02445m2738o0551j25072j0891l4805
3242A520501N3126R427n3946q3754j9966R0622o4187q357k53L3408O1233n1584
3230A486270q9475P8224j23098q2512R1813J21074O6643K2724m8153p5585l2569
3219A415356l5470j5714J05428q0424j49850o6030M5810K12028p9704N6242k03393
3208A204279K7251J27199n130m3847J7133j66743Q9502K252p6550P538J1282M8154
3196A242320J10289j0437j40991l7654R0023R4133K1692q1428j59530l7582J98640
3185A289475j38284j86753J3138K5963J00614P9004q6151m7579J1622k0683O2021
3174A102387n5542Q8187Q0292j07192L124J08707Q523n6695K7159L5567k2059
$$ y = [1523970, 1501535, 1507427, 1501298, 1609488, 1692113, 1794558, 1751820, 1691269, 1566197, 1555306, 1520501, 1573627, 1583054, 1529108, 1445354, 1425388, 1516010, 1451823, 1443466, 1443213, 1476621, 1537854, 1486270, 1396795, 1475019, 1351921, 1269409, 1361222, 1482296, 1548939, 1571663, 1523510, 1447925, 1415356, 1379886, 1364172, 1469600, 1389176, 1239326, 1173296, 1219106, 1431134, 1351430, 1407672, 1204279, 1231530, 1358729, 1353599, 1309752, 1326885, 1160142, 1249644, 1251896, 1175346, 1182884, 1194166, 1242320, 1352609, 1342172, 1201181, 1163527, 1253550, 1347683, 1369375, 1287947, 1128417, 1090835, 1289475, 1151191, 964438, 977576, 1003539, 1104153, 1183157, 1097006, 1049427, 1061049, 1040366, 1102387, 1046845, 1135032, 1215324, 1108132, 1111256, 1219963, 1228486, 1171791, 1198950, 1234517, 1212458]
3163A212458J3209j18500P816L3069K8148L8358o0208O159M0064k09655L6867
3152A027785R899M2851n9309p5067K87916L2019o1791Q931o8740j4151O417m3537
3140A093223m6308K9371L7523r3204o8733J04250K4909m5913J53579N748l2599
3129A161846j06743N4775o39L8451J08369p9939j56191J06358m9052R927L0664
3118A117826P1970l8407j20733K1327Q2131P7046p4342o8097j85111K00709j17827
3107I66492L1945J91631j37631m9481k4101m1618J63091O8862j37476J9947J05867
3096A157528k16073l397J21361p2291o6715j05693m7572J3147j25783J87578K21021
3085A063111K4014j30328M8813J0566j68504n3172N1230J61036O4572j19703j36063
$$ y = [1212458, 1225667, 1107167, 1114983, 1148052, 1176200, 1214558, 1154350, 1160509, 1200573, 990918, 1027785, 1037684, 1080535, 1021226, 946159, 1234075, 1266094, 1204303, 1213234, 1144494, 1130343, 1136760, 1093223, 1046915, 1076286, 1113809, 1020605, 951872, 1056122, 1081031, 1035118, 1188697, 1194445, 1161846, 1055103, 1109878, 1109239, 1147690, 1256059, 1176120, 1019929, 1126287, 1077235, 1087162, 1117826, 1189796, 1151389, 1030656, 1051983, 1134114, 1211160, 1136818, 1068721, 883610, 1084319, 966492, 998437, 1190068, 1052437, 1002956, 978855, 937237, 1100328, 1169190, 1031714, 1051661, 1157528, 941455, 938058, 1059419, 987128, 920413, 814720, 767148, 780295, 654512, 842090, 1063111, 1087125, 956797, 1005610, 1016176, 847672, 794500, 845730, 1006766, 1071338, 951635, 815572]
3074H15572R2102P6169R4573q4858j46941M9493J36224J00594p2740j41366l1241
3063H87581N4972J56780N5613k23187J8611O3113R2004p368j34743j97834J46889
3052I12431J7031j03579n014m2371J7425j1270m9650L9349J05618j47446K5673
3041G58197p0364J56738Q3262J4032O6222j32713j2979p8383M5163j0734l5102
$$ y = [815572, 907674, 983843, 1078416, 993558, 846617, 896110, 1032334, 1132928, 1060188, 918822, 887581, 942553, 1099333, 1154946, 931759, 950370, 1013483, 1105487, 1098119, 963376, 765542, 912431, 929462, 825883, 820869, 778498, 795923, 784653, 735003, 774352, 879970, 732524, 758197, 687833, 844571, 927833, 941865, 1008087, 875374, 862395, 784012, 829175, 818441, 783339]
$$ [...]
##END NTUPLES=NMR SPECTRUM
##END=
