##TITLE=1H_EC-3312(IV-23)
 CDCl3
 8 sc, 
 25.6.2024
##JCAMPDX= 6.0         $$ Bruker NMR JCAMP-DX V2.0
##DATA TYPE= NMR SPECTRUM
##DATA CLASS= NTUPLES
##ORIGIN= UXNMR, Bruker Analytische Messtechnik GmbH
##OWNER= root
$$ XWIN-NMR		Version 3.5
$$ Tue Jun 25 14:54:55 2024 Russian Standard Time (UT+4h)  she@DPX200
##.OBSERVE FREQUENCY= 200.1311
##.OBSERVE NUCLEUS= ^1H
##.ACQUISITION MODE= SIMULTANEOUS
##.ACQUISITION SCHEME= undefined
##.AVERAGES= 8
##.DIGITISER RES= 18
##SPECTROMETER/DATA SYSTEM= spect
##.PULSE SEQUENCE= zg30
##.SOLVENT NAME= DMSO
##.SHIFT REFERENCE= (INTERNAL, DMSO, 0, 14.4688)
##AUDIT TRAIL= $$ (NUMBER, WHEN, WHO, WHERE, WHAT)
$$ ##TITLE= Audit trail, XWIN-NMR		Version 3.5
$$ ##JCAMPDX= 5.01
$$ ##ORIGIN= Bruker BioSpin GmbH
$$ ##OWNER= she
$$ F:/spectra/data/she/nmr/H-F/1/pdata/1/auditp.txt
$$ ##AUDIT TRAIL=  $$ (NUMBER, WHEN, WHO, WHERE, WHAT)
(   1,<2024-06-25 14:53:50.43 +0400>,<she>,<DPX200>,
      <created by zg, POWCHK disabled, PULCHK disabled
       configuration hash MD5:
       00 E9 B6 7A A2 85 ED C7 34 08 36 98 17 FE 4E 26
       data hash MD5: 16K
       A6 4F 2F E9 31 6D CA 62 26 38 DA BC C7 DE 1C 0C>)
(   2,<2024-06-25 14:53:52.79 +0400>,<she>,<DPX200>,
      <Start of raw data processing
       efp BC_mod = 2 LB = 0.24 FT_mod = 6 PKNL = 1 PHC0 = -25318.34 PHC1 = 12.58748 SI = 16K 
       data hash MD5: 16K
       0C A2 E3 F2 EA 6B 02 3F C1 E3 9A B0 6D AD 48 6C>)
(   3,<2024-06-25 14:54:08.71 +0400>,<she>,<DPX200>,
      <pk PHC0 = 3.705364 PHC1 = -3.8 
       data hash MD5: 16K
       D5 8F 3C DB 2E D4 C6 C2 C0 94 96 D8 92 B2 A3 C8>)
(   4,<2024-06-25 14:54:12.01 +0400>,<she>,<DPX200>,
      <abs ABSG = 5 
       data hash MD5: 16K
       2F F0 8D 69 88 D8 61 3C 6A E5 80 80 5C 17 85 C9>)
$$ ##END=
$$ 
$$ hash MD5
$$ D5 7F F8 45 8C 2F F7 D7 57 43 DA 59 A8 17 6B EE
##$RELAX= 
##$RELAX= 
##$RELAX= 
##$RELAX= 
##$RELAX= 
##$RELAX= 
$$ Bruker specific parameters
$$ --------------------------
##$DU= <F:/spectra>
##$EXPNO= 1
##$NAME= <H-F>
##$PROCNO= 1
##$TYPE= <nmr>
##$USER= <she>
##$AMP= (0..31)
100 100 100 100 100 100 100 100 100 100 100 100 100 100 100 100 100 100 
100 100 100 100 100 100 100 100 100 100 100 100 100 100 
##$AQSEQ= 0
##$AQ_mod= 1
##$AUNM= <au_zg>
##$AUTOPOS= <>
##$BF1= 200.13
##$BF2= 200.13
##$BF3= 200.13
##$BF4= 200.13
##$BF5= 200.13
##$BF6= 200.13
##$BF7= 200.13
##$BF8= 200.13
##$BYTORDA= 1
##$CFDGTYP= 0
##$CFRGTYP= 5
##$CHEMSTR= <none>
##$CNST= (0..31)
1 1 145 1 1 1 1 1 1 1 1 1 1 1 1 1 1 1 1 1 1 1 1 1 1 1 1 1 1 1 1 1 
##$CPDPRG= <>
##$CPDPRG1= <>
##$CPDPRG2= <>
##$CPDPRG3= <>
##$CPDPRG4= <mlev>
##$CPDPRG5= <mlev>
##$CPDPRG6= <mlev>
##$CPDPRG7= <mlev>
##$CPDPRG8= <mlev>
##$CPDPRGB= <>
##$CPDPRGT= <>
##$D= (0..31)
0 1.2 0 0 0 0 0 0 0 0.06 0 0.03 0 0 0 0 0.0002 0 0 0 0 0 0 0 0 0 0 0 0 
0 0 0 
##$DATE= 1719312829
##$DBL= (0..7)
120 120 120 120 120 120 120 120 
##$DBP= (0..7)
150 150 150 150 150 150 150 150 
##$DBP07= 0
##$DBPNAM0= <>
##$DBPNAM1= <>
##$DBPNAM2= <>
##$DBPNAM3= <>
##$DBPNAM4= <>
$$ [...]
##$SUBNAM3= <"">
##$SUBNAM4= <"">
##$SUBNAM5= <"">
##$SUBNAM6= <"">
##$SUBNAM7= <"">
##$SUBNAM8= <"">
##$SUBNAM9= <"">
##$SW= 18.051750892319
##$SWIBOX= (0..15)
0 0 2 0 0 0 0 0 0 0 0 0 0 0 0 0 
##$SW_h= 3612.71676300578
##$TD= 16384
##$TD0= 1
##$TE= 0
##$TE2= 300
##$TE3= 300
##$TEG= 300
##$TL= (0..7)
0 120 120 120 120 120 120 120 
##$TP= (0..7)
150 150 150 150 150 150 150 150 
##$TP07= 0
##$TPNAME0= <>
##$TPNAME1= <>
##$TPNAME2= <>
##$TPNAME3= <>
##$TPNAME4= <>
##$TPNAME5= <>
##$TPNAME6= <>
##$TPNAME7= <>
##$TPOAL= (0..7)
0.5 0.5 0.5 0.5 0.5 0.5 0.5 0.5 
##$TPOFFS= (0..7)
0 0 0 0 0 0 0 0 
##$TUNHIN= 0
##$TUNHOUT= 0
##$TUNXOUT= 0
##$USERA1= <user>
##$USERA2= <user>
##$USERA3= <user>
##$USERA4= <user>
##$USERA5= <user>
##$V9= 5
##$VALIST= <valist>
##$VCLIST= <CCCCCCCCCCCCCCC>
##$VD= 0
##$VDLIST= <DDDDDDDDDDDDDDD>
##$VPLIST= <PPPPPPPPPPPPPPP>
##$VTLIST= <TTTTTTTTTTTTTTT>
##$WBST= 1024
##$WBSW= 4
##$XGAIN= (0..3)
0 0 0 0 
##$XL= 0
##$YL= 0
##$YMAX_a= 475041
##$YMIN_a= -577408
##$ZGOPTNS= <>
##$ZL1= 120
##$ZL2= 120
##$ZL3= 120
##$ZL4= 120
##$ABSF1= 14.55034
##$ABSF2= -3.501512
##$ABSG= 5
##$ABSL= 3
##$ALPHA= 0
##$AQORDER= 0
##$ASSFAC= 0
##$ASSFACI= 0
##$ASSFACX= 0
##$ASSWID= 0
##$AUNMP= <proc_1d>
##$AZFE= 0.1
##$AZFW= 0.1
##$BCFW= 0
##$BC_mod= 2
##$BYTORDP= 0
##$COROFFS= 0
##$CY= -3
##$DATMOD= 1
##$DC= 0
##$DFILT= <>
##$DTYPP= 0
##$F1P= 0
##$F2P= 0
##$FCOR= 1
##$FTSIZE= 16384
##$FT_mod= 6
##$GAMMA= 0
##$GB= 0
##$INTBC= 1
##$INTSCL= 3.70164e-10
##$ISEN= 128
##$LB= 0.24
##$LEV0= 0
##$LPBIN= 0
##$MAXI= 10000
##$MC2= 0
##$MEAN= 0
##$ME_mod= 0
##$MI= 1.114404
##$NCOEF= 0
##$NC_proc= -6
##$NLEV= 6
##$NOISF1= 3.799351
##$NOISF2= 2.8
##$NSP= 0
##$NTH_PI= 0
##$NZP= 0
##$OFFSET= 14.4688
##$PC= 1
##$PHC0= -25314.63
##$PHC1= 8.787479
##$PH_mod= 1
##$PKNL= yes
##$PPARMOD= 0
##$PSCAL= 0
##$PSIGN= 0
##$REVERSE= no
##$SF= 200.130010717088
##$SI= 16384
##$SIGF1= 3
##$SIGF2= 2
##$SINO= 5.538805
##$SIOLD= 16384
##$SREGLST= <1H.CDCl3>
##$SSB= 0
##$STSI= 16384
##$STSR= 0
##$SW_p= 3612.71676300578
##$SYMM= 0
##$S_DEV= 0
##$TDeff= 16384
##$TDoff= 0
##$TI= <>
##$TILT= no
##$TM1= 0
##$TM2= 0
##$TOPLEV= 0
##$USERP1= <user>
##$USERP2= <user>
##$USERP3= <user>
##$USERP4= <user>
##$USERP5= <user>
##$WDW= 1
##$XDIM= 16384
##$YMAX_p= 309624922
##$YMIN_p= -1061486
$$ End of Bruker specific parameters
$$ ---------------------------------
##NTUPLES= NMR SPECTRUM
##VAR_NAME=  FREQUENCY,     SPECTRUM/REAL,   SPECTRUM/IMAG
##SYMBOL=    X,             R,               I
##VAR_TYPE=  INDEPENDENT,   DEPENDENT,       DEPENDENT
##VAR_FORM=  AFFN,          ASDF,            ASDF
##VAR_DIM=   16384,         16384,           16384
##UNITS=     HZ,            ARBITRARY UNITS, ARBITRARY UNITS
##FACTOR=    0.220516191357247, 1,           1
##FIRST=     2895.64101722313, 0,            0
##LAST=      -717.075745782653, 0,           0
##MIN=       -717.075745782653, -1061486,    0
##MAX=       2895.64101722313, 309624922,    0
$$ Real data points
##PAGE= N=1
##DATA TABLE= (X++(R..R)), XYDATA
$$ [...]
9415C35581n1468K2205J06698J21492j14098o4039n9199o38K08521l792n1239
9404D50024Q615k7112j04957o0401M5958M7995N5330m4671k9289m9745k258p5394
9392B14095Q5018R0005p1524k3520p140k4868j9714m7748k8608K9838N6842N2383
9380C05059m7813K2217J6020N5752N671j041l500j12852m7068J2203N5898R2978
9368C53524m9061j1115j31811J18452N6481J23003Q843k290l2649k7077R8122
9357E04422N6158P3821m789J27020R4868K4896M3571l8014j09408j71376k7239
9346E73930j62309k6577j4173m7027j5065Q535l8260j5897N071k9003k4107j129
9334B13989j9524K1166j36780j00474N7359P8046j8112Q9947J9253j97745R378
$$ plain form
9415 335581 284113 306318 413016 534508 420410 356371 297172 296534 505055 501263 450024
9404 450024 458639 431527 326570 266169 312127 360122 415452 370781 341492 291747 289489 214095
9392 214095 299113 389118 317594 294074 286934 262066 242352 194604 165996 195834 252676 305059
9380 305059 257246 279463 295483 351235 356906 355865 352365 239513 192445 204648 260546 353524
9368 353524 304463 293348 161537 279989 336470 459473 468316 466026 433377 406300 504422
9357 504422 560580 634401 629612 756632 851500 876396 919967 881953 772545 601169 573930
9346 573930 411621 385044 370871 323844 308779 317314 279054 263157 268228 239225 215118 213989
9334 213989 194465 215631 78851 -21623 35736 113782 95670 185617 204870 7125 16503
9323A6503L2275r752N6501n7349N4354O9545j6761m9258m1883N7349n0758L3695
9311I4461n103j0513k5868k9P0931P3385o4336N1765j5939k2978n5341o3264m1262
9298a4091Q188O428N8289j4661n3914J02175N3489k0854k9830j7584q4939J42821
9286A35517K7623j7136n5590p8087L1754L7345m4645j5417k0855k2938n9078k5489
9274a06996J21580L9663p1706o1136P1810o7424m787K1839J21236J19724M2423
9263B26226r5526k07005Q8590J48837q1731q2853R7383J02312o5654j19560k6596
9252a5577O1060L2779j35733n847J36949O6358j2520o9525M0391m4565N1391j1620
9240I3541m759J22756O3201j87240Q5979N2686k1207j51921j0827J01703p4097
$$ plain form
9323 16503 48778 39026 95527 38178 92532 162077 145316 96058 54175 111524 60766 94461
9311 94461 89358 78845 52977 52948 123879 197264 132928 184693 168754 145776 90435 27171 -14091
9298 -14091 -5903 525 58814 44153 -9761 92414 145903 125049 95219 77635 -7304 135517
9286 135517 163140 146004 90414 12327 44081 81426 36781 21364 509 -22429 -81507 -106996
9274 -106996 14584 54247 -17459 -78595 -6785 -74209 -78996 -57157 64079 183803 226226
9263 226226 130700 -76305 12285 161122 79391 -3462 93921 196233 130579 11019 -15577
9252 -15577 45483 78262 -57471 -63318 73631 139989 127469 57944 98335 53770 105161 93541
9240 93541 88782 211538 274739 87499 173478 226164 204957 53036 42209 143912 69815
9229F9815m2617O143N1053j1453m1722L8309l7506m6937j2619R920l3392j03834
9217a54840J11119P8716P5077o8230j03186K6560N3842P7408J6389j5304r6288
9206A263q6001Q2608M3410O0998J159J1578O9518n683q9806p4662L8769K0562
9194G3713J0478N3935K4469m7270k8322p0734m9246L9436l3574J2524k2980J16555
9182G8984L1644j54562q7221J09402O2407k3027R0108j08033q2077j9677L6782
9171f5270P1715N0449O1010R0945q9684j00267o4382j1575P7414l1730M3010j8855
9159A2780L616J9120N7031k3008J2855l9075q805K1846m2869l3656N3660N0484
9147H3979k0375q4617M6903L2531j29081N9282Q3854o1877O3784L2438M3043o3821
$$ plain form
9229 69815 27198 33341 84394 72941 31219 69528 32022 -14915 -27534 -17614 -51006 -154840
9217 -154840 -43721 34995 110072 41842 -61344 -34784 19058 96466 112855 97551 1263
9206 1263 -84738 -2130 41280 102278 103437 115015 184533 178850 89044 14382 53151 73713
9194 73713 84191 138126 162595 115325 87003 16269 -32977 6459 -27115 -14591 -37571 78984
9182 78984 110628 -43934 -131155 -21753 40654 17627 107735 -298 -82375 -102052 -65270
9171 -65270 6445 56894 117904 208849 119165 18898 -45484 -57059 20355 -11375 31635 12780
9159 12780 16396 35516 92547 69539 82394 43319 34514 56360 13491 -20165 33495 83979
9147 83979 63604 -21013 25890 58421 -70660 -11378 72476 10599 74383 106821 149864 86043
9135H6043m2816q3081m6759N4857N5547p4523J02384j71349m2859J70905J3535
9124B1884r958q8091L2619k9135m815K1175m467M705j40032k94J38622N4400j1616
9111a5003o1019O4956r3280N5642J53952J8984l2581j21707J1818L6944k0255
9100a549K5648L752p7983k4716P2972j4182k7047k6299R7434Q1057q2497j13079
9088h6489R406p4467O4747m3469Q2563P6385q741p393M2751o3310P7270O9633
9076A38886K0358j0455l5411Q4326l0434p7732K6739n5776l3948J4937Q3312k0330
9064A04472N363K1455k4009Q3399j00878q6016N166k1461K8339j1304K6241M7094
9052G7861n7436o5170r7197J2731O0364N560O8036o8589j15460N0758M5462J28836
$$ plain form
9135 86043 43227 -39854 -86613 -31756 23791 -50732 51652 -119697 -162556 8349 21884
9124 21884 11926 -76165 -43546 -72681 -77496 -56321 -60788 -56083 -196115 -196409 -57787 -3387 -15003
9111 -15003 -76022 -11066 -104346 -48704 105248 124232 91651 -30056 -18238 18706 -1549
9100 -1549 24099 27851 -50132 -74848 -1876 -16058 -43105 -69404 28030 109087 26590 -86489
9088 -86489 -77083 -151550 -86803 -130272 -47709 28676 19935 12542 55293 -8017 69253 138886
9076 138886 159244 148789 113378 197704 167270 89538 116277 60501 26553 41490 124802 104472
9064 104472 109835 131290 107281 190680 89802 3786 8952 -12509 15830 4526 30767 77861
9052 77861 20425 -44745 -141942 -129211 -68847 -63287 4749 -63840 -179300 -128542 -83080 45756
9040D5756k2930o5202o0324K3532L460p8528J3089O3224P7522o5600k3203L8986
9028e0218J6493M3948j345j9790n2596m1565k2854Q0444j6401j5847N2392J9782
9016g557k7369r4155j0267J784J0474M3370K5408M4650k6823l1438K5050L0006
9004a6867l6451l2022o2405m544K4874k4067Q3713K1140k5765Q383m1764L4315
8992g1460P0522K617n1632r9653M8990K5001n1427J0465j21005J23586Q7880o0091
8980h6207L4548Q9222k43199N9417Q3259n505M4429j5797m9948N5217Rj9238M767
8967d9026n14R5551j28984j3565J1597l5081O8067M7990n5299r7093p888J19978
8955d4267p0227o596l2627M868K5685K1666j5507P669J7316J5056n1690l4452
$$ plain form
9040 45756 22826 -42376 -102700 -79168 -75708 -154236 -141147 -77923 -401 -66001 -89204 -50218
9028 -50218 -33725 10223 8878 -10912 -63508 -105073 -127927 -47483 -63884 -79731 -27339 -7557
9016 -7557 -34926 -129081 -139348 -137564 -127090 -83720 -58312 -13662 -40485 -71923 -46873 -16867
9004 -16867 -53318 -85340 -147745 -152289 -127415 -151482 -67769 -46629 -72394 -64011 -105775 -71460
8992 -71460 -938 1679 -49953 -149606 -100616 -75615 -127042 -116577 -237582 -113996 -26116 -86207
8980 -86207 -51659 37563 -205636 -146219 -62960 -68465 -24036 -39833 -89781 -34564 -34555 -53793 -49026
8967 -49026 -49540 46011 -82973 -96538 -84941 -120022 -51955 -3965 -59264 -156357 -164245 -44267
8955 -44267 -114494 -121090 -153717 -148849 -123164 -101498 -117005 -109336 -92020 -76964 -128654 -163106
8943a63106J3063J21471k1080j47469M9328P6718n7018K0081l344m2512M7928
8932a05940j2352k9256l5248O1973J11555l4844M0915M0559q413j14433n8892
8921a44376L4627m8427N0440P2801q1875n2356N9326m9490R8136M8977Q919n3746
8909e7044q377r0695o7726J16756N5534M2148l8888N8186n7459r9470K7328J6736
8897a02971M7502l5230j40942q75Q0317L4684J33992o8446l6089k8726l3461Q4863
8885f5382r004l1003M7912l9379p4857O7984K3890p7479j04549M1128L9M4850
8873a75850Q6020r2081L2432J6445r474M341r4592k4834N8107R5541l3457L5681
8861a01721L9917Q0426n9768o8692k2494m5688K9378K3878k2595L6585j6373q3082
$$ plain form
8943 -163106 -150043 -28572 -49652 -197121 -147793 -71075 -128093 -108012 -111356 -153868 -105940
8932 -105940 -118292 -147548 -182796 -120823 -9268 -44112 -3197 37362 28949 -85484 -144376
8921 -144376 -109749 -158176 -107736 -34935 -116810 -169166 -109840 -159330 -61194 -12217 -3298 -57044
8909 -57044 -65421 -156116 -223842 -107086 -51552 -9404 -48292 9894 -47565 -147035 -119707 -102971
8897 -102971 -55469 -90699 -231641 -232516 -152199 -117515 16477 -51969 -88058 -116784 -150245 -65382
8885 -65382 -74386 -105389 -57477 -96856 -171713 -103729 -79839 -157318 -261867 -220739 -220700 -175850
8873 -175850 -89830 -181911 -149479 -133034 -142508 -138167 -232759 -257593 -199486 -103945 -137402 -101721
8861 -101721 -61804 18622 -41146 -109838 -132332 -178020 -148642 -124764 -147359 -110774 -127147 -210229
8849b10229O4646J568k2130O3052M0986L2860j00012P1512K3836p1360j01968
8838b07239M5146M2320K925m2815m7293P4311O4977k9836l3708L1704k8902o714
8826a35124k8371m3927J7292J46522m1627q0754K0988L5452j05524J4226J2754
8815a88093o8001N8822M2712M2451k4238m7064j14183N0171N5306l9129N6485
8804a74761Q0384q8962k1493P0215P2765P7220k17803O7530L5502o3710n7199
8793b20312J1453L9963N4643m2124k3694M3377K5748m2869l5572M874L5346l5507
8781a84674o85p146O0551j02739n0262K13602K1091o9619l1758n473J2507j0478
8769a55083J01393J55994j22224m3655J09119p5634o8352n2631q1624p5177K8638
$$ plain form
8849 -210229 -145583 -144015 -166145 -103093 -62107 -29247 -129259 -57747 -33911 -105271 -207239
8838 -207239 -162093 -119773 -116848 -159663 -206956 -132645 -67668 -97504 -131212 -99508 -128410 -135124
8826 -135124 -163495 -207422 -190130 -43608 -85235 -165989 -145001 -109549 -215073 -200847 -188093
8815 -188093 -256094 -197272 -154560 -112109 -136347 -183411 -297594 -247423 -192117 -231246 -174761
8804 -174761 -94377 -183339 -204832 -134617 -61852 15368 -202435 -134905 -99403 -163113 -220312
8793 -220312 -208859 -168896 -114253 -156377 -180071 -136694 -110946 -153815 -189387 -184513 -149167 -184674
8781 -184674 -185359 -192505 -131954 -234693 -284955 -71353 -50262 -119881 -151639 -157112 -144605 -155083
8769 -155083 -53690 102304 -19920 -63575 45544 -30090 -98442 -151073 -232697 -307874 -279236
8758b79236J65136K1003l8947N4013P4703l9712j05053R819n687P7206l7914M2945
8746f1724J7507l454j0105q570l0603j00776R1702K4968j55619Q3753R3640n303
8734f4584p7942k7556P4484o7535K1309M6480N5619j37194j4493J13644J01470
8723B3702K0911m8335P636j1227m6640L5022J0497r9235k5125N5338l1761J9418
8711h9799k2573P7950m989j4749M3500M7307K0991n9015o4600n4069R722l0261
8699a40585o8947J41838L4516j35535j2463L127l3438J17625L3621l0407o7293
8688a57941P6058O168K5355j10377j7906J05770O127j17796R0674J88609l6151
8677E8590o6007J1070j07742o1862Q5255k9767l3691m2504M6830L3110L291m4069
$$ plain form
8758 -279236 -114100 -93097 -132044 -78031 -3328 -43040 -148093 -138274 -143961 -66755 -104669 -61724
8746 -61724 -44217 -47671 -57776 -66346 -96949 -197725 -106023 -81055 -236674 -152921 -59281 -64584
8734 -64584 -142526 -170082 -95598 -163133 -141824 -95344 -39725 -176919 -191412 -77768 23702
8723 23702 44613 -3722 3914 -7313 -53953 -18931 -8434 -107669 -132794 -77456 -109217 -89799
8711 -89799 -112372 -34422 -39411 -54160 -10660 36647 57638 -1377 -65977 -120046 -110324 -140585
8699 -140585 -209532 -67694 -33178 -168713 -181176 -178049 -211487 -93862 -60241 -90648 -157941
8688 -157941 -81883 -75715 -50360 -160737 -178643 -72873 -66746 -184542 -93868 94741 58590
8677 58590 -7417 3653 -104089 -165951 -80696 -110463 -144154 -186658 -139828 -106718 -103427 -147496
8665a47496L7235M9548p9460Q2963M0499l545n3970n3341j7281M5697L872K603
8653i2676j9272n2404Q4383J60449k6654j74484L3294l0237M5951n445o8997O5876
8641h0216L1273l2542P8109j4538q8127j10383K7187N476M6981j2402q8541K0432
8629b17291R1501J3296M0877o0984J70538N8860l8974r9289j9471K9585l0152
8618f1504j9332J0853m9590K3339k9367m1920O4708l0075r7373n2860J12962q3151
8606b53310L2128J03730J10202M5903l8050L3213j0895p8103j16163p228Q8761
8595h9812M6156L1801L9761p2701Q102K6257m3697m3609M3119J1058m3108m124
8583i0797j4213J8044O2416k072r847L7111j2449L4747j34449L7082P0744j2166
$$ plain form
8665 -147496 -110261 -60713 -140173 -57210 -16711 -20256 -74226 -127567 -144848 -99151 -95279 -92676
8653 -92676 -111948 -164352 -79969 80480 53826 -120658 -87364 -117601 -71650 -77095 -146092 -80216
8641 -80216 -48943 -81485 -3376 -17914 -106041 -216424 -189237 -183761 -136780 -149182 -237723 -217291
8629 -217291 -125790 -112494 -71617 -132601 37937 96797 57823 -41466 -60937 -31352 -61504
8618 -61504 -80836 -69983 -119573 -96234 -125601 -167521 -102813 -132888 -230261 -283121 -170159 -253310
8606 -253310 -221182 -117452 -7250 38653 603 33816 22921 -55182 -171345 -178573 -89812
8595 -89812 -43656 -11855 27906 -44795 -36693 -10436 -54133 -97742 -54623 -43565 -86673 -90797
8583 -90797 -105010 -86966 -24550 -26622 -36469 642 -11807 22940 -111509 -74427 -3683 -15849
8571a5849m0214L2278j26553N6646O4081K0070n136m4304N5558M6278l1970q0757
8559f9872N3071k8659R255j16821M7725N6510j5032J9193N9966l1533L3741p7193
8547e9649n6895N8723P8576J7712m4984M8384n7839L3398m9289m3694o9130k8508
8535a73195R0652n3609L0045L6844K066j4904L855K520O3645L0129M463m4926
8523b2415l7859M8768P1540J2983n0988n305R920n1936O3667j2440N188j15067
8511h3944o9822Q8127k9922M0973L3524M4692l6021o799r4982j5471Q5367L7957
8499f321K1713o4649N214Q2137l4774m5829M0594L7864o0780r6179J17422J04094
8487A00506p5159j37280n2887J49676p6684l4077m9977J52171L5234l7193p2652
$$ plain form
8571 -15849 -56063 -23785 -150338 -93692 -29611 -9541 -14677 -58981 -3423 42855 10885 -69872
8559 -69872 -16801 -45460 -36205 -153026 -105301 -48791 -63823 -44630 15336 -16197 17544 -59649
8547 -59649 -116544 -57821 20755 38467 -6517 41867 -15972 17426 -31863 -75557 -144687 -173195
8535 -173195 -82543 -136152 -106107 -69263 -67197 -82101 -78246 -75726 -12081 18048 22511 -22415
8523 -22415 -60274 -11506 60034 73017 22029 16724 26644 -25292 38375 25935 31123 -83944
8511 -83944 -153766 -65639 -95561 -54588 -21064 23628 -12393 -19192 -114174 -129645 -44278 -6321
8499 -6321 15392 -49257 -44043 38094 3320 -42509 -1915 35949 -24831 -121010 -3588 100506
8487 100506 25347 -111933 -164820 -15144 -91828 -125905 -175882 -23711 11523 -25670 -98322
8476i8322R1964L9281j09867J4376R7230m7072K8151k5170m242l3214N785N1594
8464A0494M7561J7175j36411L5706N0897o3467q2092O4701R0724j06360k4476
8453i5548M6149K0299n019r7347P4704k6979n7695J814O9618n2822m8816R1652
8441g9990M3988J08186n2579p8645Q2096J1160l4673p931m9805K2095M2796n1791
8429d5093O2152n5609K9567Q7262j33411n3843J21409L0962k1539k3204J00615
8418I9268l6947r0285o1948k8089L7156N3306R4952M7159o7782n5056n0407O821
8406e1852N80j7108K3938K4994o3442M5260K2292j8664j2756K2387O2160l3279
8394D510j0527m364o3924Q0094K8015J9567J2170K138r0482P3027J910j00251
$$ plain form
8476 -98322 -6358 32923 -76944 -62568 34662 -12410 15741 -9429 -13671 -46885 -41100 10494
8464 10494 58055 75230 -61181 -25475 25422 -38045 -120137 -55436 35288 -71072 -95548
8453 -95548 -49399 -29100 -34119 -131466 -56762 -83741 -141436 -139622 -70004 -122826 -171642 -79990
8441 -79990 -36002 72184 19605 -59040 23056 34216 -457 -8388 -58193 -36098 6698 -45093
8429 -45093 17059 -38550 -8983 78279 -55132 -108975 12434 43396 21857 -1347 99268
8418 99268 62321 -27964 -89912 -118001 -80845 -27539 67413 114572 46790 -8266 -58673 -51852
8406 -51852 -51272 -68380 -44442 -19448 -82890 -37630 -15338 -34002 -46758 -24371 37789 4510
8394 4510 -6017 -10381 -74305 5789 33804 53371 65541 67679 -22803 50224 52134 -48117
8382d8117O5163K3916r5690K6959o4927n6022K01783n4274j26393K6021P961k7968
8370a21588K8745K7914k0479j3065n6547L9446N6850k1914M9600J6321L6114L7406
8358E8803m7733j11900J8505Q5525N8964o0612J1926J7842m080n0240n376M5462
8346A7086L7402p3594J0811J08475L8394o8474j22223k9049n8431P2980j5774
8335h2397K1641o504k4294N7910M3561L2049j36077q6886N50O0728l875L1441
8323i2153J520Q7107m4221l9870M2881j3748J4293K9679J706l8646K9941q9094
8311a10605J5635n2436N5000R5810J1834o3480l8576P8760L0080N1056m8200q1934
8299e7056J5943M1743p7313M3690N7227j5370j9573J19633n2478j05931O208M1442
$$ plain form
8382 -48117 17046 40962 -54728 -27769 -92696 -148718 53065 -1209 -127602 -101581 -93620 -121588
8370 -121588 -92843 -64929 -85408 -98473 -155020 -115574 -58724 -80638 -31038 -14717 21397 58803
8358 58803 11070 -100830 -82325 3200 62164 1552 13478 31320 27240 -23000 -28376 17086
8346 17086 54488 -19106 -8295 100180 138574 70100 -52123 -81172 -139603 -66623 -82397
8335 -82397 -60756 -67260 -91554 -33644 9917 41966 -94111 -180997 -180447 -119719 -123594 -92153
8323 -92153 -90633 -3526 -47747 -87617 -44736 -58484 -44191 -14512 -12806 -51452 -21511 -110605
8311 -110605 -94970 -147406 -92406 3404 15238 -48242 -86818 -8058 22022 73078 24878 -57056
8299 -57056 -41113 630 -76683 -32993 24234 8864 -10709 108924 56446 -49485 -43277 -1835
8287a835J5354m0686n6713j9599J5283k065O7645R6306m8555j10492l5660n855
8275a26872R7977R3510m8854m5808J0220M7132o2052j9030J05765j47824L3061
8264f2775j4699j13960M8739K9575O3973N23J48866o8263K321N1967k3992o0592
8252A683M435M5998o1546N789N8852K4877m4230N0636j20537j03065J26307O8537
8240E7736r4298L5028R5541m5760j15771P4385l6201o1115J44462p260m4432L966
8228F281O3669m8933R9394q5510l9693K9977J01943r4626j19589M2611P7513l8763
8216e726Q184N7463k6687l3690k1372L3688J58006R7224o9088J13058p9387p463
8204B24210r188P260j42405J56015j36383M4807N8688J83580l0364L27117m5689
$$ plain form
8287 -1835 13519 -27167 -83880 -103479 -88196 -90261 -22616 73690 25135 -85357 -121017 -126872
8275 -126872 -28895 64615 15761 -30047 -19827 27305 -34747 -53777 51988 -95836 -62775
8264 -62775 -77474 -191434 -142695 -113120 -49147 -48624 100242 31979 34300 86267 62275 1683
8252 1683 6118 52116 -9430 -3641 55211 80088 35858 86494 -34043 -137108 -10801 57736
8240 57736 -36562 -1534 94007 48247 -67524 6861 -29340 -90455 54007 46747 2315 6281
8228 6281 69950 21017 120411 34901 -4792 25185 127128 32502 -87087 -44476 33037 -5726
8216 -5726 2458 59921 33234 -456 -21828 11860 169866 267090 198002 311060 231673 224210
8204 224210 215022 222282 79877 235892 99509 144316 203004 386584 356220 683337 637648
8193F37648Q03359j152815j349678P55949p9175J90804m905J8164j8063J35529
8183f3183j454Q6815K6162N6914j50508j04123j0299J47942j649p5019L5268O4308
8171A1174m2076n895n9138Q1290M0728O1562j7028j10743o0160J1649l8902N337
8159a22202J0966O9728L4644M1154J9842l3300m6872K2650J03417o2514p4947
8148c7434k1750O6895q4067j6262O6933j537K9963O0149q6053k5574R8629P3901
8136A23793j11062n6121L7661J01503q990l6751O9756p9020M1296J36786m7299
8125A71552J559L14q5771q3108m929o7835N3167j9540J26128N3890j53071m7875
8113e5519M8382N8028J25868l2275j21199o2886O341J19693l2260L1882J759j5147
$$ plain form
8193 637648 1441007 288192 -1061486 -305537 -384712 -193908 -198813 -180649 -198712 -63183
8183 -63183 -64637 22178 48340 105254 -45254 -149377 -159676 -11734 -13383 -88402 -53134 11174
8171 11174 -30902 -36797 -95935 -14645 26083 87645 70617 -40126 -100286 -88637 -127539 -122202
8159 -122202 -111236 -41508 -6864 34290 54132 20832 -26040 -3390 100027 37513 -37434
8148 -37434 -59184 7711 -76356 -92618 -25685 -27222 2741 62890 -23163 -48737 49892 123793
8136 123793 12731 -43390 -5729 95774 86784 50033 119789 40769 82065 218851 171552
8125 171552 173111 173425 87654 4546 -383 -68218 -15051 -34591 91537 145427 -7644 -55519
8113 -55519 -7137 50891 176759 144484 23285 -39601 -33260 86433 54173 86055 87814 72667
8101G2667J13754L2904r5622l1797J11067p075j05102J11795j3697L6950j4068
8090B11776j46056m8845J35715J41784r5866j06224J3619M1944j3854r217Q5390
8079B10166Q8144p9405l2058N0603j45277N9188J75640j1332J9268P9166l0828
8068C83275J3431m5776j09299J00478P4925q9918P4343J17017J6482J0539k2770
8057E22727L4770L5949K6869L6135k3657o806J03487R1144q6941p6495j00928
8046E56254J05888N8280o9708J383k6678k5821Q1822r771o033J1493o0661K0565
8034F37013j6945m3189M0112J94996L2725L1739N5103k9391P7721M8762r692R2882
8022A111836J36769J21259Q4649q0246o6343O2598l4544k10139j42579P173o026
$$ plain form
8101 72667 186421 219325 123703 91906 202973 195898 90796 202591 188894 225844 211776
8090 211776 65720 16875 152590 294374 198508 92284 105903 147847 133993 124776 210166
8079 210166 298310 218905 186847 237450 92173 151361 327001 315669 334937 414103 383275
8068 383275 396706 350930 241631 342109 417034 327116 401459 518476 534958 545497 522727
8057 522727 557497 593446 620315 656450 632793 625987 729474 820618 733677 657182 556254
8046 556254 662142 720422 650714 652097 625419 599598 681420 671649 665616 677109 616448 637013
8034 637013 620068 576879 616991 811987 844712 876451 931554 902163 979884 1028646 1018954 1111836
8022 1111836 1248605 1369864 1454513 1374267 1307924 1370522 1335978 1125839 983260 990433 984407
8011I84407P1831o2971K4167r7769l713k0598N6348r3994j18957J16591O6870
8000I22212J6426o4189o4025P4278N8565L8058K6796q2552P5595K9707j03310
7989I27561L5063l0816N3720q059j54197p6327m722j35q7702J7568l5955n2355
7977E83644m5165m4782m2260P9098j5177l932j5476r3459J21043L9444j74156
7966C88822Q0348L3112m7665m0547q3761J20205Q037k3683q7577r791J28622M340
7954D70462K6047j20103K6181L7763P0150n4875p1898Q4850O3740J0295j4752
7943E27860j45934J38019P1840k9761n0188L3220M8608l6532K3965j15458L9251
7932E04890L3497J4092j2902L3924P145j9596j5654J02554l0528L8024p2372n4806
$$ plain form
8011 984407 1056238 993267 1017434 919665 915952 895354 951702 857708 738751 855342 922212
8000 922212 938638 874449 810424 884702 943267 981325 1008121 925569 1001164 1030871 927561
7989 927561 962624 931808 985528 977469 823272 746945 742223 742088 654386 671954 635999 583644
7977 583644 538479 493697 451437 530535 515358 511426 495950 402491 523534 562978 388822
7966 388822 469170 502282 454617 414070 330309 450514 458551 434868 347291 337500 466122 470462
7954 470462 496509 376406 402587 440350 510500 455625 383727 468577 532317 542612 527860
7943 527860 381926 519945 591785 562024 511836 545056 593664 557132 581097 465639 504890
7932 504890 538387 552479 539577 573501 580646 561050 545396 647950 617422 655446 583074 528268
7920E28268J0127O0484n5390Q6329m8677n6654J55075J38158N2215j11425P8124
7909H36634j15848p6453j69434K0507o3387K5718R6536M9412N0752M4984l1932
7898F67489p1703R0401K8356K4793J23749J574O7975M8833M2051M6232J19083
7887A188833m6359N2509M7176O7024O4524p6384K8211o8440J45710k0467n7756
7876A324581r5658Q9090N782l1391j07733n317o9897j242j00560j3977o1873n0994
7864H80811K3804N1503q9765r009j38477q6506n9081J42502Q1566r6534r7639
7853F03175j42402l5422k5490p778N1964L2897l5696N4570m2797L7670k190p4377
7841D14124l5496J11898o2088p8178p1698J61156j286M7752o5174Q3939r772M2950
$$ plain form
7920 528268 538395 598879 543489 629818 581141 524487 679562 817720 869935 758510 836634
7909 836634 720786 644333 474899 495406 432019 457737 554273 603685 654437 699421 667489
7898 667489 595786 686187 714543 739336 863085 864659 932634 981467 1023518 1069750 1188833
7887 1188833 1142474 1194983 1242159 1309183 1373707 1297323 1325534 1257094 1402804 1382337 1324581
7876 1324581 1228923 1318013 1323795 1292404 1184671 1179354 1109457 1108215 1007655 993678 931805 880811
7864 880811 904615 956118 866353 857344 718867 632361 573280 715782 797348 700814 603175
7853 603175 460773 425351 399861 392083 444047 476944 441248 495818 453021 490691 488501 414124
7841 414124 378628 490526 428438 350260 278562 439718 438432 486184 421010 504949 495177 538127
7829E38127K6054K3449R3143m9038q3914k4304m1965j3933j11219Q5690P5686
7818E17776j8662L4255q2326l8373P4935p4649k19618M21661L4906r2954J06426
7807F63377o366J29732l6335l4565O3516K7178j68703j1376n561M7676l5154J5573
7795F48992L380m1191P4661o9221m04K4342j13346N0835J44097o3603O2380K1361
7783G42283Q7063J236k7573N3410N0775m0964J79696Q9662k28983L7738j8578
7772I25765j15629P5596l0588O744n2361n1619K9456l224j19037o2014K3747l9579
7760E87257M2129J51282q6827l0759Q7360k6677L6667M0138j39109n7746J43251
7749G46966o900L4483J6468Q7204n4895n2158J3820O103L7320q2069o3906n0975
$$ plain form
7829 538127 564181 587630 680773 631735 547821 523517 481552 467619 356400 442090 517776
7818 517776 499114 533369 451043 412670 487605 412956 193338 614999 649905 556951 663377
7807 663377 657011 786743 750408 715843 779359 806537 637834 626458 620897 668573 633419 648992
7795 648992 652372 611181 685842 616621 616217 640559 527213 578048 722145 658542 720922 742283
7783 742283 829346 830582 803009 856419 907194 866230 1045926 1135588 906605 944343 925765
7772 925765 810136 885732 855144 861888 809527 757908 787364 784140 665103 603089 626836 587257
7760 587257 629386 780668 693841 663082 750442 723765 760432 800570 661461 603715 746966
7749 746966 740066 774549 791017 878221 823326 771168 784988 791091 828411 746342 682436 631461
7737F31461j2168l1977m3839Q5413o5774M0448K9130j5343j30410O0885m2443
7726E05383r4416j3099m9882J14286j8374j4915n7785J04069R8355O5191k3545
7715F15268j1052r1650Q8347p476l2709n4555L9864q804L0538O6457q4561l1368
7703E18299L4527N2403l5960o4485J5471j6993J20821R2590k7582n3452Q9583
7692G25222l3342r3187J576m2415J41039Q5035j35982l7444K9337j2896j9361
7681F07582m7917M0667m3166J22734O1496J3930j7545j4939l6114K6663K0991
7670G34382k6028J6631n780Q4703K8480L6842j3430p0612l7395m1170L8893k2485
7658G23031J4811J8885Q5681j1924K2203j0545l8897q5433J34230J19666m7044
$$ plain form
7737 631461 619293 587316 543477 628890 563116 603564 632694 617351 486941 547826 505383
7726 505383 410967 397868 347986 462272 443898 428983 371198 475267 573622 638813 615268
7715 615268 604216 512566 600913 593437 560728 506173 546037 537233 567771 634228 549667 518299
7703 518299 552826 605229 569269 504784 520255 503262 624083 716673 689091 635639 725222
7692 725222 691880 598693 600269 557854 698893 783928 647946 610502 639839 626943 607582
7681 607582 559665 600332 557166 679900 741396 755326 737781 722842 686728 713391 734382
7670 734382 708354 724985 719205 803908 832388 869230 855800 785188 747793 706623 745516 723031
7658 723031 737842 756727 842408 830484 852687 842142 803245 717812 852042 971708 924664
7647I24664p4115Q520Q6168N1220K2197K38270J8646r5950L5321P0177J05983
7636A391101K6568P652L324j7465J08236j6373n6574k9157O9066N742K1436K3540
7624A537096l0685n6647j3649O374r685J38119J0516J02399Q5053R2974K7253
7613A889118J3052q678J92739J03078K404Q9608J52430L2627k24960r5583J61961
7602B307796o9583o6458Q852n8282n3267n5704k2079L3657o0750Q3718Q4139Q1522
7590B213561m4280P8698J26477J09992J24668J7276L6671J71009J49642J62222
7580C145936J55456P3129j9379P556J53183K20204J69466K41368J40958l142J54723
7569D439458J24661R2492l9885k1910p9327j06902o9594Q29q3772q2111M4534
$$ plain form
7647 924664 850549 859069 945237 996457 1018654 1256924 1275570 1179620 1214941 1285118 1391101
7636 1391101 1417669 1425321 1428645 1411180 1519416 1503043 1446469 1417312 1486378 1492120 1513556 1537096
7624 1537096 1506411 1449764 1436115 1442489 1432804 1570923 1581439 1683838 1768891 1861865 1889118
7613 1889118 1902170 1893492 2086231 2189309 2191713 2281321 2433751 2466378 2241418 2145835 2307796
7602 2307796 2238213 2171755 2180607 2122325 2069058 2013354 1991275 2024932 1964182 2047900 2132039 2213561
7590 2213561 2169281 2247979 2374456 2484448 2609116 2626392 2663063 2834072 2983714 3145936
7580 3145936 3301392 3374521 3355142 3362698 3515881 3736085 3905551 4146919 4287877 4284735 4439458
7569 4439458 4564119 4656611 4616726 4594816 4515489 4408587 4338993 4339822 4256050 4173939 4218473
7558D218473M8216L6775O6241J9218O6737J28638K29962K60419K09042M19786
7548E703507K63008K38699L44152L06349L43687K89498J24301j42526j32001l02163
7538G036511l92768l56633m35998k84354l44218k54147j96169l19996n9474J5540
7528D408294o0974l9112K3156L5352k697J19273J03365J76738K2538J00459Q6532
7517D972924L6601J58164l5984j82536k38274l43187k22148r0174j24076k74437
7507C656873k12944j42795n3465j38449j90862n3758q4489m2533r5109R372j13127
7496B538714o0309q8473K3364k6155K9890k2535j09202O4912R7125j51107k7653
7485B268571N3804O7970Q7689m7834m011J8336q8633K2414j3037l4350p2689J31940
$$ plain form
7558 4218473 4266689 4303464 4369705 4388923 4455660 4584298 4814260 5074679 5283721 5703507
7548 5703507 5966515 6205214 6549366 6855715 7199402 7488900 7613201 7470675 7338674 7036511
7538 7036511 6643743 6287110 5851112 5566758 5222540 4968393 4772224 4452228 4392754 4408294
7528 4408294 4347320 4308208 4331364 4366716 4364019 4483292 4586657 4763395 4785933 4886392 4972924
7517 4972924 5009525 5167689 5131705 4949169 4710895 4367708 4145560 4055386 3931310 3656873
7507 3656873 3443929 3301134 3247669 3109220 2918358 2864600 2780111 2737578 2642469 2651841 2538714
7496 2538714 2478405 2389932 2413296 2387141 2417031 2394496 2285294 2350206 2447331 2296224 2268571
7485 2268571 2322375 2390345 2478034 2430200 2426189 2444525 2355892 2378306 2365269 2330919 2258230 2390170
7473B390170J9323j43755j0042J57524N7089r1013Q918J89071n6349r4522j10341
7462B316073r8076J01568l2637l8724l2035R268j52938J5822M2284l8163Q1395
7451B173837l714l8222p4074J9208O548r9020K6697P5568j224m1534r253N5261
7439B090078J04881K7118l0638m1576m7315j0481L0557M5553N7163p0660l4288
7428B120392l1336J30898O7560r001j05221M3507J9381p4365M7596J17365n0539
7417B276237j8802k4957M6122Q6010Q2997o9526J5632Q9184J0190J32271J03842
7406B729200M0158K5089O5230O8540r715P4798k4562R3486O4474j7188P1093M8794
7394C229397J77132J63367R7353J27350M6408K5394P7631P2036P9514M4940J39986
$$ plain form
7473 2390170 2409493 2265738 2255696 2413220 2470309 2379296 2388214 2577285 2520936 2426414 2316073
7462 2316073 2217997 2319565 2286928 2248204 2216169 2225437 2072499 2088321 2130605 2092442 2173837
7451 2173837 2170123 2131901 2057827 2077035 2083583 1984563 2011260 2086828 2085604 2044070 2034817 2090078
7439 2090078 2194959 2222077 2191439 2149863 2102548 2092067 2122624 2168177 2225340 2154680 2120392
7428 2120392 2089056 2219954 2287514 2278513 2173292 2216799 2236180 2161815 2209411 2326776 2276237
7417 2276237 2257435 2232478 2278600 2364610 2447607 2378081 2393713 2482897 2493087 2625358 2729200
7406 2729200 2769358 2794447 2859677 2928217 2918502 2993300 2968738 3062224 3126698 3109510 3180603 3229397
7394 3229397 3406529 3569896 3667249 3794599 3841007 3866401 3944032 4016068 4095582 4140522 4280508
7383D280508R2743l7559j46524R6983L4629j14036r5124j1906J15014k0265J7128
7372D211591q95Q3261J25776J03885Q1597N9833J55137n3002L2826J52521J74565
7361E127095o2157j6964Q1134l6027O892L8689k9779j03156J5433j523j7828M9234
7349E051043l9478p4013J21415R2292K1814N9753J53344K5884N5089K3723O9102
7338E559968J40043j810j12427P9297O4567R44J24154K9387J12994J7283M1694
7327F056094J74981P7365J36762J90957L9942Q8248K76866J46746J02757J67288
7317G458006K63190K99301K94624M27116K75820K93413L87780N34065N29966O05339
7307A1368620P03290P02314N78544N25096J58436q8157k72364m28488l77623l98513
$$ plain form
7383 4280508 4373251 4335692 4189168 4286151 4320780 4206744 4111620 4099714 4214728 4194463 4211591
7372 4211591 4210696 4293957 4419733 4523618 4605215 4665048 4820185 4767183 4800009 4952530 5127095
7361 5127095 5064938 5047974 5129108 5093081 5099973 5138662 5108883 5005727 5021160 5019637 5001809 5051043
7349 5051043 5011565 4937552 5058967 5151259 5173073 5232826 5386170 5412054 5467143 5490866 5559968
7338 5559968 5700011 5698201 5585774 5665071 5729638 5730582 5854736 5884123 5997117 6014400 6056094
7327 6056094 6231075 6308440 6445202 6636159 6676101 6764349 7041215 7187961 7290718 7458006
7317 7458006 7721196 8020497 8315121 8742237 9018057 9311470 9699250 10233315 10763281 11368620
7307 11368620 12071910 12774224 13352768 13877864 14036300 13948143 13675779 13247291 12869668 12471155
7297A2471155l05090o0502n5470Q6699K37830K87270L46998M42247N78944N20235
7287A4550316O32079P26536P93258R22306J092708J171327J151101J200493J082586
7278B3322710Q06601K07170n31144j141991j595456j540321j186247j158719q63966
7269A6318637m85237l77350j90332p2853n4073j7109J17434K99808K98018M16958
7259A6253901M63134N55527O67537O94966P09652N19361M37777K22995M6333k62541
7249B0308642o90034o22316p28438r70018o69597n58959m48299l06052m09778
7240A4905151j87889K1823j744N2179O5931K03063J73989L55748L92769L36957
7230A6317977L20961L63156K84905K99249M22345K67870M23591K42830J25526
$$ plain form
7297 12471155 12166065 12105563 12050093 12136792 12374622 12661892 13008890 13451137 14030081 14550316
7287 14550316 15182395 15908931 16702189 17624495 18717203 19888530 21039631 22240124 23322710
7278 23322710 24129311 24336481 23805337 22663346 21067890 19527569 18341322 17182603 16318637
7269 16318637 15833400 15456050 15265718 15192865 15138792 15121683 15239117 15538925 15836943 16253901
7259 16253901 16717035 17272562 17940099 18635065 19344717 19864078 20301855 20524850 20571183 20308642
7249 20308642 19618608 18996292 18267854 17297836 16628239 16069280 15620981 15314929 14905151
7240 14905151 14717262 14739085 14737341 14789520 14855451 15058514 15232503 15588251 15981020 16317977
7230 16317977 16638938 17002094 17286999 17586248 18008593 18276463 18700054 18942884 19068410
7221A9068410J11390M9779J074J28061J14007J49690L81214L90377M39609N87583
7211B1421194O82897R02706P57616J031840J221335J214423J441500J265322J620514
7202C1559347J724313J857972J951870K076047K179448K083533K109701J951395
7194D7493626J490308J141743N30507j46468q72659j023494j106004r80747o26001
7185D5900811j39257N3024M77852Q65914J224911J689020J948014K321132K529079
7176E6870500L084008L371573L608773L812515L798186L586012L128340K353944
7168H3613851J002590o17348k250557l784725m573611m881462m621135l818239
7160F0069364l291069k548488j739083j323240q70064k88194J16734L62923O83967
$$ plain form
7221 19068410 19179800 19229579 19230653 19358714 19472721 19622411 20003625 20394002 20833611 21421194
7211 21421194 22104091 23006797 23764413 24796253 26017588 27232011 28673511 29938833 31559347
7202 31559347 33283660 35141632 37093502 39169549 41348997 43432530 45542231 47493626
7194 47493626 48983934 50125677 50656184 50509716 49637057 48613563 47507559 46526812 45900811
7185 45900811 45761554 45814578 46292430 47158344 48383255 50072275 52020289 54341421 56870500
7176 56870500 59954508 63326081 66934854 70747369 74545555 78131567 81259907 83613851
7168 83613851 84616441 83999093 81748536 77963811 73390200 68508738 63887603 60069364
7160 60069364 56778295 54229807 52490724 51167484 50297420 50009226 50125960 50488883 51172850
7151E1172850J124645J359225J504628J457524J209842Q75777M09099k17184q53613
7142E8042793j681545k529986k962512l299975l282024l114009k793670k313707
7134C6065365k045658j715884j403462j263861r24753p47974n39118n02567l91336
7125B6530752k33595k91522m54176m72523o37620p49156p72218r10343q65304
7116B1144295r07639o32186m18944m42739m15289m88810k30487j18933j31648
7107A7357620j60640j07570L192O5536K6068R150k6330m3708Q1662j63775q8462
7096A6952743j24947k034j07105j38414j53639j21896j20551r659M7627R5583
7086A6317708O9981k0539L02324J55014L18774L07414K66041K73254P9467k9184
$$ plain form
7151 51172850 52297495 53656720 55161348 56618872 57828714 58704491 59113590 58896406 58042793
7142 58042793 56361248 53831262 50868750 47568775 44286751 41172742 38379072 36065365
7134 36065365 34019707 32303823 30900361 29636500 28711747 27963773 27424655 26922088 26530752
7125 26530752 26297157 26005635 25551459 25078936 24441316 23692160 22919942 22009599 21144295
7116 21144295 20236656 19604470 19185526 18742787 18327498 17838688 17608201 17489268 17357620
7107 17357620 17196980 17089410 17092602 17158138 17184206 17193356 17167026 17123318 17204980 17041205 16952743
7096 16952743 16827796 16825762 16718657 16580243 16426604 16304708 16184157 16174498 16222125 16317708
7086 16317708 16387689 16367150 16669474 16824488 17143262 17450676 17716717 17989971 18069438 18040254
7076A8040254k8206M830M3861L1489J74290K44644K23069K68524M81219L96614
7066A9880588M61309K60061N5007J7639O0808Q9320J20101R0917K39618M56263
7056B1731631N36966M62425M63514L89019L29461K11427K25755J28972J66054
7047B4645224L76456L97311K89331K02118P2352K32583M61616M51848P39540R73436
7037B8841815J196049J163262J006930J239869J365712J705329K047697K392812
7029D0959475K882788L188592L876301M103919L937162K637070N21430j266799
7021F0839938k270608k260903j714974p38230L12603J050123J690142K561243
7013E9469334K982784K879956K060276R30240J98165J93327Q56008J529510J938593
$$ plain form
7076 18040254 18012048 18016878 18060739 18092228 18266518 18511162 18734231 19002755 19483974 19880588
7066 19880588 20341897 20601958 20656965 20674604 20735412 20824732 20944833 21035750 21275368 21731631
7056 21731631 22268597 22731022 23194536 23583555 23913016 24124443 24350198 24479170 24645224
7047 24645224 25021680 25418991 25708322 25910440 25982792 26215375 26676991 27128839 27868379 28841815
7037 28841815 30037864 31201126 32208056 33447925 34813637 36518966 38566663 40959475
7029 40959475 43842263 47030855 50907156 55011075 58948237 61585307 62106737 60839938
7021 60839938 58569330 56308427 54593453 53855223 54167826 55217949 56908091 59469334
7013 59469334 62452118 65332074 67392350 68322590 68520755 68714082 69570090 71099600 73038193
7004G3038193J149272P8251j190444j980338k002739j432039p51774L81721P54676
6995F8044779L14559o48606j447031j757321j510995j040254k86467N77276J455670
6986F3701610K195982K734078K406434N01562k003576l899247n049920m928049
6978E5658874l875136l115990k205835j571246j117138r62163q52158r43116q57842
6969D0158250j001527n88651k29160o8973l14253p41021q57424r04704p14572
6960C4737965n09179j07088Q7698J00860R9613L21784P9716l43505o91383q37153
6950C2939328p84286m14439j77303J3308q130k54127n35305q05866q71315q09432
6940B8292433n71864k10332M2090M0613j75499n14416o09890o83225m58495l60605
$$ plain form
7004 73038193 74187465 74265716 73075272 71094934 69092195 67660156 66908382 67290103 68044779
6995 68044779 68359338 67710732 66263701 64506380 62995385 61955131 61668664 62245940 63701610
6986 63701610 65897592 68631670 71038104 71539666 69536090 65636843 60586923 55658874
6978 55658874 51783738 48667748 46461913 44890667 43773529 42811366 41959208 41016092 40158250
6969 40158250 39156723 38568072 38338912 38269939 37955686 37214665 36357241 35452537 34737965
6960 34737965 34228786 34121698 34209396 34310256 34409869 34731653 34811369 34467864 33776481 32939328
6950 32939328 32155042 31740603 31563300 31576608 31568478 31314351 30779046 29973180 29101865 28292433
6940 28292433 27720569 27510237 27552327 27592940 27417441 26903025 26293135 25609910 25151415 24790810
6930B4790810k62925m0326J05948L34723L32493n8670n84395r55615j199151j187224
6920B1275668r73736p23451p08872o45278p53676q78893o89322p99669p47739
6911A4355032o95714o70776n70277m83078l17519l13737l01665l15778j85941
6902A0500547j62006j31013j55853p325M6299q1116k9828k7198k1951o3516k00083
6891I666957k46460j66051k84553k47971l36051k88503l22153k82284j69256j88793
6881G134882j04502k05946k65699j44699k07851k1203k83843j20006l2284P631
6871E756480k514o8516q8079q4443M8081r850j39822O3368J17407j44182j12397
6860E335533J5675K4362m6018q8975l5244K131O4414J2392r8365n193l2825j57888
$$ plain form
6930 24790810 24527885 24487559 24593507 24928230 25260723 25202053 24617658 23662043 22462892 21275668
6920 21275668 20301932 19578481 18869609 18224331 17470655 16591762 15902440 15102771 14355032
6911 14355032 13659318 12988542 12418265 11935187 11617668 11303931 11002266 10686488 10500547
6902 10500547 10338541 10207528 10051675 10044350 10090649 10009533 9979705 9952507 9930556 9867040 9666957
6891 9666957 9420497 9254446 8969893 8721922 8385871 8097368 7775215 7492931 7323675 7134882
6881 7134882 7030380 6824434 6558735 6414036 6206185 6184982 5901139 5781133 5748849 5756480
6871 5756480 5753966 5685450 5597371 5512928 5561009 5551159 5411337 5474705 5592112 5447930 5335533
6860 5335533 5351208 5375570 5329552 5240577 5205333 5207464 5271878 5284270 5185905 5180712 5147887 4989999
6848D989999j84196J7925P1733J57794L1846m6312j17300k2905R8199j2426K3151
6837E007508K2075o0146J26406L1958r2545R5317n6472K0902J03029j6991O563
6826E187604j20049M5063R7231n5981M5006J0595Q943O5589q5116J77300m053
6815E372132L8993J20604O4621J14100K57j6194P7433R1175O6196N1590J25982
6804F106889J26658l2177j67P1567J49803P4457L8221J37938J07968Q8516J97230
6793G066903J04052K31726J55597K3321k6891K09061J70340K60283L80766K25162
6783H800320J91455J84323K72253K35315J79105L04265K61444J55798K67942L45627
6773A1197847K59264K33804J12445J83187M3432J49659J32116R4877L07155K88674
$$ plain form
6848 4989999 4805803 4823728 4895461 5053255 5085101 5038789 4921489 4898584 4996783 4984357 5007508
6837 5007508 5029583 4969437 5095843 5127801 5035256 5130573 5074101 5095003 5198032 5181041 5187604
6826 5187604 5067555 5112618 5209849 5153868 5198874 5209469 5218412 5284001 5198885 5376185 5372132
6815 5372132 5411125 5531729 5596350 5710450 5710707 5694513 5771946 5863121 5929317 5980907 6106889
6804 6106889 6233547 6201370 6201203 6272770 6422573 6497030 6535251 6673189 6781157 6869673 7066903
6793 7066903 7170955 7402681 7558278 7581599 7554708 7763769 7934109 8194392 8575158 8800320
6783 8800320 8991775 9176098 9448351 9683666 9862771 10167036 10428480 10584278 10852220 11197847
6773 11197847 11457111 11690915 11803360 11986547 12029979 12179638 12311754 12406631 12713786 13002460
6763A3002460L29651L70446N22997N03112N65359O70580P61640Q06844P25471
6754A8258560Q71778R26917Q90432J008445J208735J233474J073446J203694P74200
6745B7449681M31670l2234l64781n31966o94507o92432n69843l94732j21391p5441
6735B4404024J13057K09908K34263M37555O60521N77040R11363J003709J191905
6726B9743345J339226J557400J669844J810334J978964J978623J665567P67286
6718D2510589r2961q05209j241245j337724j332888r74594o98886o47344k02916
6709C5176822p8700R037L12911O48273P62780Q37424J019911J329731J331431
6700D1349620J228736J353256J252125J164152J420103J461469J525171J471633
$$ plain form
6763 13002460 13332111 13702557 14225554 14728666 15294025 15964605 16726245 17533089 18258560
6754 18258560 19130338 20057255 20947687 21956132 23164867 24398341 25471787 26675481 27449681
6745 27449681 27881351 27849117 27484336 26952370 26257863 25565431 24995588 24600856 24479465 24404024
6735 24404024 24517081 24726989 24961252 25398807 26059328 26636368 27547731 28551440 29743345
6726 29743345 31082571 32639971 34309815 36120149 38099113 40077736 41743303 42510589
6718 42510589 42417628 41612419 40371174 39033450 37700562 36725968 36027082 35379738 35176822
6709 35176822 35098122 35107159 35420070 36068343 36831123 37668547 38688458 40018189 41349620
6700 41349620 42578356 43931612 45183737 46347889 47767992 49229461 50754632 52226265
6692E2226265J422468J506496J581541J560815J692240J856004J729749J647448
6684F5223026J332898P08246N5303o29438j007010j118721r55735r53255r09612
6675F1745702q08235q16788q08285o17589l06758O1587M65862J101110J628996
6666F1645602K174005K521483L048030L449411L569462L687438L029405J853142
6658H4977978o6862k274657l894165m600669m769375m449980l810610l372059
6650E7739601k911812k516217k057741j847646j473352j151064p52718m20899
6642D4608152k02777O6741K79873L94648O37435O20894N67495M30117q1008q77228
6632D6444342j422825j945565k446144k456840k316443k099119j724796j548569
$$ plain form
6692 52226265 53648733 55155229 56736770 58297585 59989825 61845829 63575578 65223026
6684 65223026 66555924 67264170 67319473 66690035 65683025 64564304 63608569 62655314 61745702
6675 61745702 60937467 60120679 59312394 58694805 58388047 58449634 58915496 60016606 61645602
6666 61645602 63819607 66341090 69389120 72838531 76407993 80095431 83124836 84977978
6658 84977978 84911116 82636459 78742294 74141625 69372250 64922270 61111660 57739601
6650 57739601 54827789 52311572 50253831 48406185 46932833 45781769 45029051 44608152
6642 44608152 44405375 44472116 44751989 45146637 45784072 46404966 46972461 47402578 47321570 46444342
6632 46444342 45021517 43075952 40629808 38172968 35856525 33757406 32032610 30484041
6624C0484041j311518j044484q51985q78714q26667m94393n18322m17877m52029
6615B3688052n94146m64007n47928n29168n21445m70723l66288l94993l53143
6606A9446211k16745j77394j65977j13021j58133N9519L5600P6999j5748l0840
6596A8740471M7598J4139L2185k2973n8678j83651j62929j63173k86700r5588
6586A7860701j15999j2034m7795J42180K68023J79356K47246J89466K53205K45732
6576A9210081K33567J37252L5030q880L4051p8813o1398j11345j09705j15141
6566A9164699l41565k53179j86642k68655k45958j16085N2490j6256R2008J56803
6556A8037660J84779L85116M29966M87780K52346L13612K8602j26785l23301m52030
$$ plain form
6624 30484041 29172523 28128039 27276054 26397340 25570673 25076280 24557958 24140081 23688052
6615 23688052 23093906 22629899 22081971 21552803 21031358 20560635 20194347 19799354 19446211
6606 19446211 19229466 19052072 18886095 18773074 18614941 18674460 18710060 18787059 18771311 18740471
6596 18740471 18788069 18802208 18834393 18811420 18752742 18569091 18406162 18242989 17956289 17860701
6586 17860701 17744702 17732668 17684873 17827053 18095076 18274432 18521678 18711144 18964349 19210081
6576 19210081 19443648 19580900 19615930 19607050 19641101 19562288 19500890 19389545 19279840 19164699
6566 19164699 18823134 18569955 18383313 18114658 17868700 17752615 17805105 17788849 17880857 18037660
6556 18037660 18222439 18607555 19037521 19525301 19777647 20091259 20119861 19993076 19669775 19217745
6546A9217745l38664k70997j94862l24519l55254k05732k57307k19487l05462
6537A6745461k73929k31558k15607k20644k27071K6851K5838O3251Q8974j0648
6527A5770918O7684P7289K7875k9387k11565k36122p2852o3249M8014j36304k0045
6516A5222256k5618O928j1028J4039l5704Q986J32443j39466k4042O774o5284
6505A5090284q157J18722J78574J22397R8424R8044P3372K23479K51309R9616
6495A6346064K04936K18430K42329K33090K23164K74851L43173J84372K14409
6486A8484818K55556L05471L90810K79008M53285N08145N09044L69154N63253
6477B2118544M41906M59152L50022K60464L75603L81855L77162L85574O17595
$$ plain form
6546 19217745 18879081 18608084 18413222 18088703 17733449 17527717 17270410 17050923 16745461
6537 16745461 16471532 16239974 16024367 15803723 15576652 15603503 15629341 15692592 15781566 15770918
6527 15770918 15838602 15915891 15943766 15914379 15702814 15466692 15393840 15330591 15378605 15242301 15222256
6516 15222256 15196638 15203566 15192538 15206577 15170873 15179859 15312302 15172836 15148794 15155568 15090284
6505 15090284 15082127 15200849 15379423 15501820 15600244 15698288 15771660 15995139 16246448 16346064
6495 16346064 16551000 16769430 17011759 17244849 17468013 17742864 18086037 18270409 18484818
6486 18484818 18740374 19045845 19436655 19715663 20168948 20677093 21186137 21555291 22118544
6477 22118544 22560450 23019602 23369624 23630088 24005691 24387546 24764708 25150282 25767877
6468B5767877P31425P63212Q40138O57035O75174Q25297R85860Q30786R41145
6459C3017949J058404J178066J186191J289969J147380R73205O46738K90962K51068
6450D1039932J47069L04074N35238P30533R70036J059093J363868J538272J367934
6441D9056049J196902J423014J358213J578720J700856J459544J253103Q49765
6433E9876166O50468N21551M56390P19716Q52204J205709J312176J280163J338318
6424F8212861J135227J098297J041834J332384J610382J721105J968030J943863
6416H0063983J991272K206693K071499K184132K297613K721202L308640L893939
6408A00738973M068676M350027M688916M797243M646599L489520J595941N631
$$ plain form
6468 25767877 26499302 27262514 28102652 28759687 29434861 30260158 31246018 32076804 33017949
6459 33017949 34076353 35254419 36440610 37730579 38877959 39851164 40497902 40788864 41039932
6450 41039932 41187001 41491075 42026313 42756846 43726882 44785975 46149843 47688115 49056049
6441 49056049 50252951 51675965 53034178 54612898 56313754 57773298 59026401 59876166
6433 59876166 60526634 61048185 61504575 62224291 63076495 64282204 65594380 66874543 68212861
6424 68212861 69348088 70446385 71488219 72820603 74430985 76152090 78120120 80063983
6416 80063983 82055255 84261948 86333447 88517579 90815192 93536394 96845034 100738973
6408 100738973 104807649 109157676 113846592 118643835 123290434 126779954 128375895 128381526
6400A28381526o62266k84559J048178K513761L696880M594661N176050N996168
6392A50460399O461296O560827O283503N863929M970231M429719M594108N346668
6384A94970680O839828P318989N102564j05737n347785q376560q743397o511086
6376A85147496m334400l004764k950844l194765k818856j655449M84251K841334
6368A70514003M907581O807239Q246499R086200R584067R519763R325164R146019
6360B37136535J0059394J1849326J4379578J5829288J3855398O515403n474796
6353C04150126j7255855k5443858k8436374k6873362k2913521j8699280j4824838
6346A49703038j2143853j0305320q976678q051770p269949o353740n441999m593964
$$ plain form
6400 128381526 127719260 127434701 128482879 130996640 134693520 139288181 144464231 150460399
6392 150460399 156921695 163482522 169766025 175629954 180600185 185029904 189624012 194970680
6384 194970680 201810508 209129497 214232061 214126324 208778539 200401979 191658582 185147496
6376 185147496 180813096 177808332 174857488 171662723 168843867 167188418 167672669 170514003
6368 170514003 175421584 182228823 190475322 199561522 209145589 218665352 227990516 237136535
6360 237136535 247195929 259045255 273424833 289254121 303109519 309624922 304150126
6353 304150126 286894271 261450413 233014039 206140677 183227156 164527876 149703038
6346 149703038 137559185 127253865 118277187 110225417 102955468 96601728 91159729 86565765
6338H6565765l789982l337459l090090l021526l030017k815800k636329k216195
6330F2628367j905926j602635j140297j101293q73846o17845p30543j051708j382871
6321E2221403j557287j568972j499378j165905j003760r44792o51881q96278r11533
6312D2021617q54041j041442j141692j329361j114502r17137r67061j008494q78295
6303C2769592r24601q55950p93614o58950p15660p24174q20132q04029n57582
6294B5914900n50814p30698o61775n94886m31530m19312n69543l02384j47382
6285B1506576k00004j22162k78563k6034n9160j55467o2031m0164M1516L6759
6275B0641266Q7710J36714J09050J50178K62938L83889L22517M19645N58083M91990
$$ plain form
6338 86565765 82775783 79438324 76348234 73326708 70296691 67480891 64844562 62628367
6330 62628367 60722441 59119806 57979509 56878216 56004370 55386525 54655982 53604274 52221403
6321 52221403 50664116 49095144 47595766 46429861 45426101 44481309 43829428 42933150 42021617
6312 42021617 41167576 40126134 38984442 37655081 36540579 35623442 34656381 33647887 32769592
6303 32769592 31844991 30989041 30195427 29536477 28820817 28096643 27276511 26472482 25914900
6294 25914900 25364086 24633388 23971613 23376727 22945197 22525885 21956342 21653958 21506576
6285 21506576 21306572 21184410 20905847 20879813 20820653 20665186 20603155 20562991 20604507 20641266
6275 20641266 20728976 20865690 20974740 21124918 21387856 21771745 22094262 22513907 23071990 23563980
6265B3563980M10676M28679L15854K02884N4554J21424L60937M47728N74749O82002
6255B7163467P63144R43023J175403J182758J246518R67179O07214k7841m60853
6246C3560012n19216p83195p46746n27090l47028l05866l41007q2477J46799L79695
6236C0433881M21081Q33641J149220J286215J485278J822526J834508J526493
6228D0792843J133235Q16247P06904R04752J486302K086468K521484K987554L571773
6219E7007562M033078L390606J507560p01245k561292l817505l829002l172196
6211E1857566k632841j980910j441064j103934q25219n59101k90761j24009K79604
6202D3179331N52161O95041Q90343Q26402R40289R12483Q14247Q58313P57856
$$ plain form
6265 23563980 23974656 24403335 24719189 24922073 24976627 25098051 25458988 25906716 26481465 27163467
6255 27163467 27926611 28869634 30045037 31227795 32474313 33441492 34048706 34020865 33560012
6246 33560012 33040796 32257601 31510855 30983765 30636737 30330871 29989864 29907387 30054186 30433881
6236 30433881 30854962 31688603 32837823 34124038 35609316 37431842 39266350 40792843
6228 40792843 41926078 42742325 43449229 44353981 45840283 47926751 50448235 53435789 57007562
6219 57007562 61040640 64431246 65938806 65237561 62676269 58858764 55029762 51857566
6211 51857566 49224725 47243815 45802751 44698817 43873598 43314497 43023736 42899727 43179331
6202 43179331 43731492 44426533 45316876 46143278 47083567 47996050 48810297 49668610 50426466
6193E0426466Q61987J011884J050937J260949J661067K183842K611612K434460
6185F3503204J120904j129304l202141m541110m805831m281282l665663k881026
6177D0117751j977839j552833j178456q81660n95873n50644n36540m65156n32634
6168C1846116m11871m05408j28100r4959K30838M66126N87647P40446J127967
6159C3958802J322865J565236J780437J771100J603496Q96289l24715j501891
6151D1071619k413851k764042l009156k765891k413509k002933j709651j370890
6143B2621696j068408j022131q77130q55068p67360q45784o69743p86934p11513
6134A5017625n67317n78930m42421l83916m34430m75059l27759k42547k18481
$$ plain form
6193 50426466 51288453 52300337 53351274 54612223 56273290 58457132 61068744 63503204
6185 63503204 64624108 63494804 60292663 55751553 50945722 46664440 42998777 40117751
6177 40117751 38139912 36587079 35408623 34526963 33931090 33380446 32843906 32378750 31846116
6168 31846116 31434245 31028837 30900737 30805778 31036616 31502742 32090389 32830835 33958802
6159 33958802 35281667 36846903 38627340 40398440 42001936 42898225 42573510 41071619
6151 41071619 38657768 35893726 32884570 30118679 27705170 25702237 23992586 22621696
6143 22621696 21553288 20531157 19654027 18798959 18031599 17185815 16516072 15729138 15017625
6134 15017625 14450308 13871378 13428957 13045041 12610611 12135552 11807793 11565246 11346765
6125A1346765j46462j27005j85194j56681p6897L0584n4420R9317P9063J14637
6115A0923707J80851K38108K67059L85903J97671K02749K47923Q5288J7865k23075
6105A2524049k49631l68794k55055l67320l97654k86643m08363m63719l13557
6096I413313l27808k54448j44565k00372k07351n8958j94730j44629J9543M7797
6086G947792O0178M8984P0264J80425K58209L21806Q4224J45314J60317J34149
6076I411662K00638J78514J45763P3305n5433l6082j58597l62888l90462k32009
6066H774411k50277l20878j73971j96345j14612j22310k48152l38097n1438m8878
6056F909453j1561o6236j92581l5688n8686l7571j0703O9391R1659P4121l3335
$$ plain form
6125 11346765 11200303 11073298 10888104 10731423 10654526 10685110 10630690 10730007 10809070 10923707
6115 10923707 11104558 11342666 11609725 11995628 12193299 12396048 12643971 12729259 12747124 12524049
6105 12524049 12274418 11905624 11650569 11283249 10885595 10598952 10190589 9726870 9413313
6096 9413313 9085505 8831057 8686492 8486120 8278769 8219811 8025081 7880452 7899995 7947792
6086 7947792 8007970 8056954 8127218 8307643 8565852 8887658 8971882 9117196 9277513 9411662
6076 9411662 9612300 9790814 9936577 10009882 9954449 9918367 9759770 9396882 9006420 8774411
6066 8774411 8524134 8203256 8029285 7832940 7718328 7596018 7347866 7009769 6958331 6909453
6056 6909453 6897892 6831656 6639075 6603387 6544701 6507130 6496427 6565818 6657477 6731598 6698263
6045F698263k2983N8577J87312P1516J70449P3488k521R9863q1879j88246j33629
6034F930210k11918k38295q024J0860j6688L5888K1803L2786L1433J82632O7592
6023F838279o177L1380O7255m7569m5044J14338o006J17159K71466K06092Q2776
6012G623949p8608p5992j99359j60334p9469L7453j01797j36760n769j43478o8027
6001F611809j40439r9809P2497L2769L0027J3985J11163J21344n7244K17824K4442
5990F938368J94234J59069L249J56084J73784J11274J96802J83849K35037Q1011
5980H432761J51519J49048J26676K21998K74649K99490J98949J36534J33125J37783
5970A0262532J63567K81127K07216K02089L85584K11014K71047K76266L47468
$$ plain form
6045 6698263 6675280 6733857 6921169 6992685 7163134 7236622 7234101 7333964 7252085 7063839 6930210
6034 6930210 6718292 6479997 6471973 6482833 6466145 6502033 6523836 6556622 6588055 6770687 6838279
6023 6838279 6832102 6863482 6930737 6883168 6838124 6952462 6946456 7063615 7335081 7541173 7623949
6012 7623949 7545341 7469349 7269990 7109656 7030187 7067640 6965843 6829083 6823314 6679836 6611809
6001 6611809 6471370 6371561 6444058 6476827 6506854 6520839 6632002 6753346 6696102 6913926 6938368
5990 6938368 7132602 7291671 7294920 7451004 7624788 7736062 7932864 8116713 8351750 8432761
5980 8432761 8584280 8733328 8860004 9082002 9356651 9656141 9855090 9991624 10124749 10262532
5970 10262532 10426099 10707226 10914442 11116531 11502115 11713129 11984176 12260442 12607910
5961A2607910K62251L97200M30999M29391M34961M05402N19565N88840M93150
5952A6569669M33513P15776Q01387O07268K14620l1113j82455p4269p9303j554
5942A8973539K85663M68167N37098N75874P99009P84215Q53959R41296Q90384
5933B5109204J138721J320813J540201J727269J898134K398238K777421L416629
5925D1326630L631688K768685N91316j191241k095757k223069j309510l41768
5917D1156974L72602J012609J518170K051787K743956L453978M090536N051108
5909F1451720N857941O017028O270986O859356Q253866R915043J1846695J3492101
5901A29964736J5753598J9385317K4578412K6836668J8203079m547304k1551719
$$ plain form
5961 12607910 12870161 13267361 13698360 14127751 14562712 14968114 15487679 16076519 16569669
5952 16569669 17003182 17718958 18520345 19127613 19342233 19311120 19128665 19054396 18975093 18973539
5942 18973539 19259202 19727369 20264467 20840341 21639350 22423565 23277524 24218820 25109204
5933 25109204 26247925 27568738 29108939 30836208 32734342 35132580 37910001 41326630
5925 41326630 44958318 47727003 48318319 47127078 45031321 42808252 41498742 41156974
5917 41156974 41529576 42542185 44060355 46112142 48856098 52310076 56400612 61451720
5909 61451720 67309661 73326689 79597675 86457031 94710897 104625940 116472635 129964736
5901 129964736 145718334 165103651 189682063 216518731 234721810 230174506 208622787
5894B08622787l1810700l3268193k5526070j9080081j3739136j0184809q138999
5887F6874799o903274n807127m965737m168758l654666k669301k026939j593948
5879C5085049j182663r16027r04818n79931m54688j64691P4772L79281L32055
5870C1668339O90849Q27332R77936K40656r17243j833920k265223k200114j616789
5861B5571823j292687q03933n81443l65172m03746k42549j21889J54347K73581
5852B2188332L48513M76385Q22618Q64239R62229J214459J287159J520925K047049
5843C1731908K377834K889530L081321L626396M199876N425748O336354N796845
5835F5465812J275361l935035o747210q340905o826197n042701l550330k505932
$$ plain form
5894 208622787 176812087 143543894 118017824 98937743 85198607 75013798 66874799
5887 66874799 59971525 54164398 49198661 45029903 41375237 38705936 36678997 35085049
5879 35085049 33902386 32986359 32081541 31501610 31046922 30882231 30957003 31336284 31668339
5870 31668339 32359188 33186520 34164456 34405112 33487869 31653949 29388726 27188612 25571823
5861 25571823 24279136 23475203 22893760 22528588 22124842 21882293 21760404 21914751 22188332
5852 22188332 22536845 23013230 23835848 24700087 25662316 26876775 28163934 29684859 31731908
5843 31731908 34109742 36999272 40080593 43706989 47906865 53332613 59668967 65465812
5835 65465812 66741173 62806138 56058928 47718023 40891826 35849125 32298795 29792863
5827B9792863j852244j602777j347664j003085p02513n74408j84337k81514l2477
5818B2211844K38095K51380L31145M51710L45006M30194M78219O74161R76534
5809B6388288J246535J639832K135304K462112K522102K274675K116544K040857
5801D2826249K755839L672065M522244N092813O159859P526426R559156J1364606
5793I3479257J0061968K518489n868450j1766238j4645724j2952060j0311144
5786E0516098p565863n546524m404809l539713k938004k621100k099962j891756
5778A9908367j623630j268331r23475r05485q30464o54492n37675l24871m34243
5769A2405701m70894l85138l00922k18216k67496l26550l55341k63992l49843
$$ plain form
5827 29792863 27940619 26337842 24990178 23987093 23284580 22710172 22525835 22244321 22211844
5818 22211844 22449939 22701319 23032464 23484174 23829180 24259374 24737593 25411754 26388288
5809 26388288 27634823 29274655 31409959 33872071 36394173 38668848 40785392 42826249
5801 42826249 45582088 49254153 53776397 58869210 65029069 72555495 82114651 93479257
5793 93479257 103541225 106059714 100191264 88425026 73779302 60827242 50516098
5786 50516098 42950235 37403711 32998902 29459189 26521185 23900085 21800123 19908367
5778 19908367 18284737 17016406 16092931 15187446 14356982 13702490 13164815 12839944 12405701
5769 12405701 11934807 11549669 11248747 11030531 10763035 10436485 10081144 9817152 9467309
5760I467309k10308j57351k33175k16613q5496j59267j78159r7758j10932p3112
5750G945138k85001k33148j72198k46793k15920j34739j01031j04454j05759Q171
5740F354266N7747j4213j16129J8875M8096j63797j2508k0558o1876m8459J0294
5729F051738l3127O5268N2947L7157P4338R7821P3858p0188j7041J53472J85337
5718F671580J9631J2846J70585J77177J90173L46916K66464K84006N09452N32499
5708I181329M70033P44981R15181J096088J037987J054404J262431J314411J885584
5699A8962429K253557K448678K752515L139986L887492M885370N044005K745415
5691D6119447j749946m690560o407940o100222m633016l456951k509074k075666
$$ plain form
5760 9467309 9257001 9099650 8866475 8649862 8564366 8405099 8226940 8129182 8018250 7945138
5750 7945138 7660137 7426989 7254791 7007998 6792078 6657339 6556308 6451854 6346095 6354266
5740 6354266 6412013 6397800 6281671 6300546 6348642 6184845 6172337 6151779 6089903 6041444 6051738
5729 6051738 6018611 6083879 6136826 6173983 6248321 6346142 6420000 6349812 6332771 6486243 6671580
5718 6671580 6691211 6704057 6874642 7051819 7241992 7588908 7855372 8139378 8648830 9181329
5708 9181329 9651362 10396343 11311524 12407612 13445599 14500003 15762434 17076845 18962429
5699 18962429 21215986 23664664 26417179 29557165 33444657 38330027 43374032 46119447
5691 46119447 44369501 39678941 33271001 27170779 22537763 19080812 16571738 14496072
5683A4496072j534839j426850j125328r28196r29770p80028n26980m27345l62970
5674F453766k67075j64569j24378l09684k39679j38828j35639o5608j93587j45777
5664D668942q1786k06214k07202q4783j95485q9348q0083j01537m1732n0455o542
5653C523775j23690n2221k5943K6803P2803O2792J42941R6121L9654Q8331J86119
5642D037485K25353L6273r664j35237k84285l24956k28117m5793j90991q200j60093
5631B911775k8392j15880q7459K1282j27938l5564n7201l9842P1929j9822j1765
5620B481123o797J0348J0460M3189K7254O225L7946j5272J00272N8838J20259
5609B873845J71159K11686J36205J98167J78402J74598K65598L55817K89555M56084
$$ plain form
5683 14496072 12961233 11534383 10409055 9480859 8551089 7771061 7244081 6816736 6453766
5674 6453766 6186691 6022122 5897744 5588060 5348381 5209553 5073914 5008306 4814719 4668942
5664 4668942 4587156 4380942 4173740 4088957 3893472 3804124 3724041 3622504 3580772 3530317 3523775
5653 3523775 3400085 3347864 3321921 3348724 3421527 3484319 3627260 3723381 3763035 3851366 4037485
5642 4037485 4262838 4299111 4289447 4154210 3869925 3544969 3316852 3271059 3080068 3071868 2911775
5631 2911775 2883383 2767503 2680044 2701326 2573388 2537824 2480623 2440781 2512710 2492888 2481123
5620 2481123 2474326 2484674 2495134 2538323 2565577 2571802 2609748 2594476 2694748 2753586 2873845
5609 2873845 3045004 3256690 3392895 3591062 3769464 3944062 4209660 4565477 4855032 5311116
5599E311116O20789N56485P43259J066131J103864L40708l29675p93132j155500
5590G464045j160936q75531o78600m81323k88387j96616j73703m8422k56670n4925
5580C248932j67866j89363l2262j56358j63060k21596j14209j47669j41038j16322
5570A799189j46006Q5577m4116m6380q1553m9908J24716K3883N1355j37377m3404
5559A535976R8394N4701k7067q0362L0633K1164q0092j4093k5900p4629M880k281
5547A441324r8764n1585J3722N2840j08127m1062m0311L0631J1860K0710j47346
5536A083892m9728l8680L6496K1853k882k3025q318k2291j5131j04836M9251R6693
5524A023294n2462J59064j59341p640J55901P0714m9903n843m5671n6702j5939
$$ plain form
5599 5311116 5931905 6488390 7231649 8297780 9401644 9742352 9412677 8619545 7464045
5590 7464045 6303109 5427578 4748978 4267655 3979268 3782652 3608949 3560527 3303857 3248932
5580 3248932 3081066 2891703 2859441 2703083 2540023 2318427 2204218 2056549 1915511 1799189
5570 1799189 1653183 1738760 1694644 1648264 1566711 1516803 1641519 1665402 1716757 1579380 1535976
5559 1535976 1634370 1689071 1662004 1581642 1612275 1633439 1553347 1539254 1513354 1438725 1443605 1441324
5547 1441324 1342560 1290975 1304697 1357537 1249410 1208348 1168037 1198668 1210528 1231238 1083892
5536 1083892 1034164 995484 1031980 1053833 1050951 1027926 1019608 997317 982186 877350 926601 1023294
5524 1023294 970832 1129896 970555 962915 1118816 1189530 1139627 1133784 1088113 1031411 1015472
5513A015472K3816n9380j08340l8861J2632o4509J32721Q5590K8069n465p9042
5502I42703M5792J10878J19691K4491l6815Q0494K46959P0812J97819J17539K23579
5491B143942J89728j8648o8877k01535l47002j61660p0097j54267M5403p7087
5481A279900L8976L3518j48208k10342l6012k9899j15674K6222L1015j7521j47388
5470G04587K8948k5884p5713n7656M235p0151m9189O508R5029R3539J2543p6930
5458E89866j579k6018m1918k2205J8929o0042J21954j14304j08919R7101r8284
5447C54581j0629N1969N2393Q7615n9369J8293N2916j05276R204N4996M2651j33265
5435D16079o4343L3188k6775l4355Q7387m778L2969j9960l0510r6134J06300l9718
$$ plain form
5513 1015472 1039288 979908 871568 832707 845339 780830 913551 999141 1027210 1021745 942703
5502 942703 988495 1099373 1219064 1243555 1206740 1287234 1534193 1605005 1802824 1920363 2143942
5491 2143942 2333670 2315022 2246145 2044610 1697608 1535948 1465851 1311584 1356987 1279900
5481 1279900 1318876 1352394 1204186 993844 957832 927933 812259 838481 869496 851975 704587
5470 704587 733535 707651 631938 574282 578517 508366 459177 465685 560714 654253 666796 589866
5458 589866 588287 562269 520351 498146 517075 457033 578987 464683 355764 452865 354581
5447 354581 343952 395921 448314 535929 476560 494853 547769 442493 451697 506693 549344 416079
5435 416079 351736 384924 358149 323794 411181 406403 439372 419412 388902 292768 399068 359350
5423C59350o5376M6682N6141j4511o6078J28525l8482l388J28929M0569p9974
5412D92387O1459L7946r0436Q9681j67232o8234J39490Q385n4504k3867l8059
5401C87016L7411K0113L2720Q5224L7242p388l0432m0283L5744m4732K2987N9100
5389E94722m3226l8959J4635R1378k5355j6828L4430L5727n7851P2317K0124J37056
5377H18170P3084l6177R4229L0860n4475r6165J04736l5952n1923j00995o4512
5366F80880j32645L7291Q8170j18640L1390l767J9118j6057Q0845n0333r9625
5355E16627l1104J0823P394K7713M4973j8013o3409J10744R3857m6948m9746q0251
5343E22660J07283j3878j25741o266J47526J0531m3175m5242l0662L6625K8149
$$ plain form
5423 359350 293974 340656 396797 382286 316208 444733 406251 402863 531792 572361 492387
5412 492387 553846 591792 501356 591037 423805 355571 495061 503446 448942 425075 387016
5401 387016 424427 444540 477260 562484 599726 592338 561906 521623 557367 512635 535622 594722
5389 594722 551496 512537 527172 618550 593195 576367 610797 646524 588673 660990 681114 818170
5377 818170 891254 855077 949306 980166 925691 829526 934262 898310 846387 745392 680880
5366 680880 548235 585526 673696 555056 586446 582679 601797 585740 666585 616252 516627
5355 516627 485523 496346 503740 531453 576426 558413 495004 605748 699605 652657 602911 522660
5343 522660 629943 616065 490324 484058 631584 642115 598940 553698 523036 559661 587810
5332E87810j0726N5598o402O1446R2839o0770j26809R100j828p4168Q9525K02740
5320H18355K8979q2299q0695J6737j3409N1021J9510j20022N8762L8215k4596
5309G10558M7169O3073N9423K398o642k9266j07003J27126J90646N0509j09025
5298I98966J54794L5890J53014J40604q839J24218J89907K55758K55944K92584
5288B592840L16440L03819J45248j7869l42953l85540m59212l82439j63348j74032
5278A432954j00118j81568n1565r2249l0455m4452j72072K0384L0423m5936m5797
5267G19549j09706M4519J7031k5940l2191l5115l6118j38537k0569j6422j20564
5256B45937J40686L0952k9716K442P1628N8999K0902l6015k4662j1484q5638p1644
$$ plain form
5332 587810 577084 632682 626280 687726 780565 719795 592986 602086 600258 526090 615615 818355
5320 818355 847334 765035 684340 701077 687668 738689 758199 638177 696939 735154 710558
5309 710558 757727 820800 880223 882621 875979 846713 739710 866836 1057482 1107991 998966
5298 998966 1153760 1189650 1342664 1483268 1474429 1598647 1788554 2044312 2300256 2592840
5288 2592840 2909280 3213099 3358347 3340478 2997525 2611985 2152773 1770334 1606986 1432954
5278 1432954 1332836 1151268 1099703 1007454 976999 932547 760475 780859 811282 765346 719549
5267 719549 609843 654362 671393 645453 613262 578147 542029 403492 382923 366501 245937
5256 245937 386623 417575 387859 390301 461929 520928 541830 505815 481153 469669 384031 312387
5244C12387Q1540K3912M2276p0409J8322K5859o7621K08421p5067j03058M0812
5233D37374k1298J0251l2245J3703k6211O5774N7407n3377J35407n9232q2801
5222D44752J10131R4746r225K443j8653L7656L8854J09014J47756J43330M6021
5211A146825k4432J45955K10871M1443J83518J02824j26681j94466k50589j55339
5201A079929j34168j07086j4926j43327j07304l0570o5764K4496p6864q4334j0251
5190C29831R1621M383p8007Q0663K3479l1458m1982j6886O932p5413m4779L718
5178B52102R6911J22003q9843j29637M0062M3666j4839L063r6515L2329q2696
5167A76606J1513J18496j6997j05465Q8497J02329k5145P4978l9186j13710O8495
$$ plain form
5244 312387 393927 417839 460115 389706 408028 433887 366266 574687 499620 396562 437374
5233 437374 416076 426327 394082 407785 381574 447348 504755 451378 586785 527553 444752
5222 444752 554883 649629 640404 642847 624194 661850 700704 809718 957474 1100804 1146825
5211 1146825 1122393 1268348 1479219 1520662 1704180 1807004 1680323 1485857 1235268 1079929
5201 1079929 945761 838675 823749 680422 573118 542548 476784 501280 424416 340082 329831
5190 329831 421452 425835 347828 428491 451970 420512 378530 361644 368576 293163 248384 252102
5178 252102 349013 471016 381173 251536 291598 335264 320425 323488 226973 259302 176606
5167 176606 188119 306615 289618 184153 272650 374979 349834 424812 385626 271916 340411
5156C40411k4414L3012q0470P2270P2683n1417n1380L3673j879M4674K8143n5981
5144C59325J10569p1359o0803k9653N3406Q7878n9265j049K555N9786M0855n4876
5132D37369k1649p8330Q7500N1547n7243l1526N8206o6363N3050L6420r7157K2802
5120C94626N1651N8189k0303j13180L5571Q2714k7553n7983o7508J31357R6874
5109E64455j08254N7469J02773m2970k0500O9298M4514J8212k2753R8210m467
5098G55987q8089J21623L3916j31615J5508j4466j0252Q788p8222J9123O8474
5087G00775n2333j34952Q643R8833L4192L6754O9907O9244k9407j18085j0583
5076F72988n8751q15P1765k6202L6748Q1933r0423K5643K0437K1566o5483j423
$$ plain form
5156 340411 315997 349009 268539 340809 413492 362075 310695 344368 342489 387163 415306 359325
5144 359325 469894 398535 337732 308079 361485 449363 390098 389049 391604 451390 492245 437369
5132 437369 415720 337390 424890 476437 419194 387668 445874 379511 432561 468981 371824 394626
5120 394626 446277 504466 484163 370983 406554 489268 461715 403732 336224 467581 564455
5109 564455 456201 513670 616443 573473 552973 622271 666785 684997 662244 760454 755987
5098 755987 667898 789521 823437 691822 707330 692864 682612 691400 613178 632301 700775
5087 700775 648442 513490 522133 620966 655158 691912 761819 831063 801656 683571 672988
5076 672988 614237 613422 685187 658985 695733 777666 687243 712886 733323 754889 689406 687983
5064F87983J1924o1909Q1494P9826m6106n8341M0761m4256M7612N3200N3283J7357
5052H62828J0235o700K9692K5697J64680p2366R4868L7945q9035N5920n4980q9621
5040I69163n5940k5101J31284K8015n2633J45905k7587j11391Q6209p6077K6632
5029A038479J206J1398R6552R5058k2019K3565K9032M2022l3719m0684P3812N6295
5017A370997K2035P2830M3975m131l6638p939K5181l9777J6300k8265K139K731
5005A439438k8362R2694L6560j13243K5819M4071j0148o2108K25225m3272k8624
4994A578050J44275R2090J9359Q0906J82508L8237j56601L3571N4560P8480Q7211
4983B232646J08511m712P1590o4999m2352l9566O9969N4889J38210N0846n236
$$ plain form
5064 687983 699907 637998 719492 799318 753212 694871 735632 691376 738988 792188 845471 862828
5052 862828 873063 866363 896055 921752 1086432 1014066 1108934 1146879 1057844 1113764 1058784 969163
5040 969163 913223 888122 1019406 1047421 994788 1140693 1113106 1001715 1087924 1011847 1038479
5029 1038479 1039685 1051083 1147635 1242693 1220674 1244239 1273271 1315293 1281574 1240890 1314702 1370997
5017 1370997 1393032 1465862 1509837 1505706 1469068 1461129 1486310 1446533 1462833 1434568 1436707 1439438
5005 1439438 1411076 1503770 1540330 1427087 1452906 1496977 1486829 1424721 1649946 1606674 1578050
4994 1578050 1722325 1814415 1833774 1914680 2097188 2135425 1978824 2012395 2066955 2145435 2232646
4983 2232646 2341157 2336445 2408035 2343036 2300684 2261118 2331087 2385976 2524186 2575032 2569796
4972B569796J71783N0729R0300k0434r9009N682J41914J51126J09222K7330m3736
4961C154703n1357L4460J0177j38968q9749N979j10845P851j02057O5114m5580
4950B739728J66245L6347r6930J04024J2130k7043o8411p3368J17655m6482j8676
4939B845219J00210l317J43972K1606O0223l9456J09035K20457o1804O19R0752
4928C487516j86160q6495J0846J7807J28644k2537j25064l8275Q8874J6819l4355
4917C257620l3445q4043N0032j1514j12420j8358n6026J07924O415J8143J09146
4906C233474j15907m8398R3787J00721N141Q3987M4097J49657R828L86J20893
4895C677666L3405N8158J2720k20O4213J46544J07052O8082J06959J32603K37900
$$ plain form
4972 2569796 2741579 2792308 2882608 2862174 2763165 2768847 2910761 3061887 3171109 3198439 3154703
4961 3154703 3103346 3137806 3147983 3009015 2919266 2925245 2814400 2822251 2720194 2785308 2739728
4950 2739728 2905973 2942320 2845390 2949414 2961544 2934501 2866090 2792722 2910377 2863895 2845219
4939 2845219 2945429 2942112 3086084 3107690 3167913 3128457 3237492 3457949 3396145 3396764 3487516
4928 3487516 3301356 3214861 3225707 3243514 3372158 3349621 3224557 3186282 3275156 3291975 3257620
4917 3257620 3224175 3140132 3190164 3178650 3066230 3047872 2991846 3099770 3106185 3124328 3233474
4906 3233474 3117567 3069169 3162956 3263677 3268818 3352805 3396902 3546559 3556387 3556773 3677666
4895 3677666 3711071 3769229 3781949 3781729 3845942 3992486 4099538 4167620 4274579 4407182 4645082
4884D645082J30171J98965J71859L59999K67751M15928L99653L63336N72966N82319
4874H108029O88052P90788R62676R68495R50611J160797J445386J710595J965576
4865A8751005K097321K434470K884056K893178K050424k12732k311659l548434
4857B5037629l949387l389576k583996j936595j486348j128885j152808q69880
4849H540154o93244o41061p54126m23696l62399k18591k60697k47500j95256k72534
4839D471050j35843k9117l01265j06905r742j11762j66265j58785n3754o2241
4829C335371j00588l9589j49213n8972K7099j00927o8042n8395n5799O850M6669
4818B784464m351j8548L0169K6948j45451n9351j72414M3053m994n2283m9702
$$ plain form
4884 4645082 4775253 4974218 5146077 5506076 5773827 6189755 6589408 6952744 7525710 8108029
4874 8108029 8796081 9586869 10549545 11518040 12468651 13629448 15074834 16785429 18751005
4865 18751005 20848326 23282796 26166852 29060030 31110454 30897722 28586063 25037629
4857 25037629 21088242 17698666 15114670 13178075 11691727 10562842 9410034 8540154
4849 8540154 7846910 7205849 6451723 6028027 5665628 5447037 5186340 4938840 4743584 4471050
4839 4471050 4335207 4306090 4004825 3897920 3888178 3776416 3610151 3451366 3397612 3335371
4829 3335371 3234783 3195194 3045981 2987009 3014108 2913181 2845139 2786744 2730945 2737795 2784464
4818 2784464 2780113 2761565 2791734 2818682 2673231 2613880 2441466 2484519 2479525 2427242 2377540
4807B377540k2556k1448P7776l9859o4204M8123m8800Q742m0857J7329J6701n1340
4795B257147n7991N1585m3692m750J39233j3274m9978R2363j5821J5665m0369
4784B330118J2556j38857o6780R72m3708R2336k8531k3017k900J8429J3561j26723
4772B037456n3631J73498J68247o2201M6760N3634M1269N6775P3270O2104J35063
4761B732244R208p8328N9972N403k7988J47803O1001j56987q1188O7433l7545
4750B701028j15865n2786l8366Q9777K7687Q2062L8438k7224P86l5206N7239K9957
4738B757527L9857J24065J44443J69234J46212J6576M0401M1910j362J23231r309
4727C592785j1756Q7465J23762M2173L5393j8223j6974n315m0163p0615j29074
$$ plain form
4807 2377540 2354984 2333536 2411312 2371453 2307249 2355372 2306572 2315314 2274457 2291786 2308487 2257147
4795 2257147 2199156 2250741 2207049 2202299 2341532 2328258 2278280 2370643 2354822 2370487 2330118
4784 2330118 2342674 2203817 2137037 2138009 2094301 2186637 2158106 2135089 2132189 2150618 2164179 2037456
4772 2037456 1983825 2157323 2325570 2263369 2310129 2363763 2405032 2461807 2535077 2597181 2732244
4761 2732244 2741452 2663124 2723096 2728499 2700511 2848314 2909315 2752328 2671140 2738573 2701028
4750 2701028 2585163 2532377 2494011 2583788 2611475 2693537 2731975 2704751 2705537 2670331 2727570 2757527
4738 2757527 2797384 2921449 3065892 3235126 3381338 3397914 3438315 3480225 3478863 3602094 3592785
4727 3592785 3581029 3668494 3792256 3834429 3869822 3851599 3834625 3829310 3789147 3718532 3589458
4716C589458r2475O4313j9226J05870k0851K9327K7750N5471J01769J10860J23212
4705D075478Q9463L2192J33972P2362O3586k3127o1015n3533J30735N1356J2204
4694D523673L0767J08831J43251k4437R0406J18712K6458q927j36719j86173l7543
4683D648299o5885o4504j8956p2005j4712j2324N0982R3332M3853J43832J12007
4672D843919r8225P1792J47356J02609J60032J5750m2375N7991k566o4764L2573
4661E224092P4671j68783q7085K1286l1976o8760L3681j5817J2253j5467p5468
4650D902627j3669j74312N0736J1065q1413p9616j20760M2107J04292J20768p021
4639D754804p077J21227r3545N8721J2084l1982q3522J26089J12562o5803q2619
$$ plain form
4716 3589458 3496983 3561296 3542070 3647940 3627089 3656416 3684166 3739637 3841406 3952266 4075478
4705 4075478 4164941 4197133 4331105 4403467 4467053 4443926 4382911 4329378 4460113 4511469 4523673
4694 4523673 4554440 4663271 4806522 4782085 4872491 4991203 5017661 5008734 4872015 4685842 4648299
4683 4648299 4582414 4517910 4498954 4426949 4412237 4399913 4450895 4544227 4588080 4731912 4843919
4672 4843919 4745694 4817486 4964842 5067451 5227483 5243233 5200858 5258849 5256283 5191519 5224092
4661 5224092 5298763 5129980 5042895 5064181 5032205 4963445 4997126 4981309 4993562 4978095 4902627
4650 4902627 4888958 4714646 4765382 4776447 4695034 4615418 4494658 4536765 4641057 4761825 4754804
4639 4754804 4747727 4868954 4775409 4834130 4846214 4814232 4730710 4856799 4969361 4903558 4820939
4628D820939q0408j65490N212n845o040k08916m9265R3073L8990M3690j24136
4617D361804l1522p5422j12510l3254j32837q2040J2941P7269l4611o6354J0867
4606C894331M3279J08817n3571j0414P4419j2006K6530K623o2096j08821l0991
4595C872100j27473O0247M5471J9126j6505j37828j708K5401j21495j1488k3570
4584C582278L4112Q9458J6315r2010j0722L0274j9097k0851R7732K681k764J4721
4572C722127J07470l5545j61435j0201J20792N7372J4335j63571N7887P3447m1053
4561C741625Q5884L9523K1839Q7600J33282J21280p0181J1365K22039J17008J38921
4550D650185q7170L4999J04122R7098J64098K17927J84989L38569K26909K93579
$$ plain form
4628 4820939 4740531 4575041 4580253 4574408 4568368 4359452 4310187 4403260 4442250 4485940 4361804
4617 4361804 4330282 4254860 4142350 4109096 3976259 3894219 3907160 3984429 3949818 3883464 3894331
4606 3894331 3937610 4046427 3992856 3982442 4056861 4044855 4071385 4074008 4011912 3903091 3872100
4595 3872100 3744627 3804874 3850345 3869471 3852966 3715138 3713430 3738831 3617336 3605848 3582278
4584 3582278 3616390 3705848 3722163 3630153 3619431 3649705 3630608 3609757 3707489 3710170 3707406 3722127
4572 3722127 3829597 3794052 3632617 3622416 3743208 3800580 3814915 3651344 3709231 3782678 3741625
4561 3741625 3827509 3867032 3888871 3976471 4109753 4231033 4160852 4172217 4394256 4511264 4650185
4550 4650185 4563015 4598014 4702136 4799234 4963332 5181259 5366248 5704817 5931726 6225305
4540F225305K34216j7669k40514j85979k19911j97162j23697o0396o3023p803
4530E343367j74930p2902J12422J8571r4252M9785P3214Q2009M1862K2682K38921
4519E640749M1931R0827J62493k6473J60888J66699J28797N7308K25167P4797
4509F723183Q3820K5080L0766R9740N0031J51586J5435K4701N137m2691n4531
4498G112257j18525Q1377P8464M4064l5211J79970J12055N4177J22842J55144
4488G786614Q9764J09984J30540J33508K16317K28257J10669J85086J58273J70945
4478I319957K28486K90164K94487K62531K49871K65194J99740J09558R7288J26394
4468A1443670L7261k2867j3145m1621J24763N8808k2794J12719O9035L8579J48116
$$ plain form
4540 6225305 6459521 6441852 6201338 6015359 5795448 5598286 5474589 5414193 5351170 5343367
4530 5343367 5168437 5095535 5207957 5226528 5132276 5182061 5255275 5337284 5379146 5401828 5640749
4519 5640749 5682680 5773507 5936000 5909527 6070415 6237114 6365911 6423219 6648386 6723183
4509 6723183 6807003 6832083 6862849 6962589 7012620 7164206 7179641 7204342 7209479 7166788 7112257
4498 7112257 6993732 7075109 7153573 7197637 7162426 7342396 7454451 7508628 7631470 7786614
4488 7786614 7876378 7986362 8116902 8250410 8466727 8694984 8805653 8990739 9149012 9319957
4478 9319957 9548443 9838607 10133094 10395625 10645496 10910690 11110430 11219988 11317276 11443670
4468 11443670 11480931 11458064 11444919 11403298 11528061 11586869 11564075 11676794 11745829 11784408 11932524
4457A1932524J05795J00066J46085K02477K87532K30820K06022L62931L13048
4448A3887300K85396L44325M00127M06746M74835L65361L92403L59207L39049
4439A7254749K76609K18649J67314L62619J88186J94552K42158K11494J00496
4430A9216826J45503J33952K84406K42846K56747L49930L14233M18660K85402
4421B1648505M15774M80182M88101N11899N75960O69739O87559N80114P81423
4412B6839256Q34795P91181Q46917Q99370J104025J084233J259407J327220J253072
4403C6239476J275650J165419J184492J248639J327661J627955J427561J533990
4395D7030843J702941J617877J587870J547830J373558J287414J195606J188247
$$ plain form
4457 11932524 12038319 12138385 12284470 12486947 12774479 13005299 13211321 13574252 13887300
4448 13887300 14172696 14517021 14917148 15323894 15798729 16164090 16556493 16915700 17254749
4439 17254749 17531358 17750007 17917321 18279940 18468126 18662678 18904836 19116330 19216826
4430 19216826 19362329 19496281 19780687 20023533 20280280 20630210 20944443 21363103 21648505
4421 21648505 22064279 22544461 23032562 23544461 24120421 24790160 25477719 26057833 26839256
4412 26839256 27674051 28465232 29312149 30211519 31315544 32399777 33659184 34986404 36239476
4403 36239476 37515126 38680545 39865037 41113676 42441337 44069292 45496853 47030843
4395 47030843 48733784 50351661 51939531 53487361 54860919 56148333 57343939 58532186
4387E8532186J011204R77982P11671O19561K86387k6796m52128q18332j081138
4378E9760597j172185j098612p65192p12168l11206M2938N2735K7088J22525M73644
4368E6420164R36706J384873J957592K569732L309840L654941L009092J082618
4360G4325558j366834l394006m390453m453669m088921l739327l168472k776400
4352D6947476k438444j749198j399003q97655o95482l48349L5550M62719Q06761
4343D0724375J076231J392707J869571K033173K160452K428767K998130L617055
4335E8300461M279533M929092N740072O926816Q045314P537650L975951j296734
4327I8438155n650940q781765r670585r167483p888631o558216n154570m104892
$$ plain form
4387 58532186 59543390 60521372 61233043 61852604 62138991 62112195 61660067 60841735 59760597
4378 59760597 58588412 57489800 56724608 56012440 55701234 55744172 55796907 55823995 55946520 56420164
4368 56420164 57356870 58741743 60699335 63269067 66578907 70233848 73242940 74325558
4360 74325558 72958724 69564718 65174265 60720596 56631675 52892348 49723876 46947476
4352 46947476 44509032 42759834 41360831 40463176 39767694 39419345 39454895 39917614 40724375
4343 40724375 41800606 43193313 45062884 47096057 49256509 51685276 54683406 58300461
4335 58300461 62579994 67509086 73249158 80175974 88221288 95758938 99734889 98438155
4327 98438155 92787215 84005450 74334865 65167382 57278751 50720535 45565965 41461073
4319D1461073l062182k619533k204399j833819j502342j033749o39689m75421
4311B8089939r8403J60640M18359L98961Q00431R87150J066859J375689J608219
4302C4807844J952303K207491K739819L138004L085347K047836j42931k472070
4294D7363643m223911m782424m563543m088297l246483k588719j946106j660754
4286B0263406j343752j257614j206390q60656p69665p68572n41635m27175m12808
4277A2675139l95950m91342l68441l12331l04128k14319k20916k61677l35941
4268I770094j67415q6322j92901k76769k10770l33579j76107r8967k06063r6176
4258G925025j03514j33806k87865k37776q0980p6304j62334q3439K8343m8936
$$ plain form
4319 41461073 38398891 35779358 33574959 31741140 30238798 29205049 28565360 28089939
4311 28089939 27991536 28152176 28570535 28969496 29769927 30757077 31823936 33199625 34807844
4302 34807844 36760147 38967638 41707457 44845461 47930808 49978644 49835713 47363643
4294 47363643 43139732 38357308 33793765 29705468 26458985 23870266 21924160 20263406
4286 20263406 18919654 17662040 16455650 15594994 14825329 14056757 13515122 13087947 12675139
4277 12675139 12279189 11787847 11419406 11107075 10802947 10588628 10367712 10106035 9770094
4268 9770094 9602679 9516357 9323456 9046687 8835917 8502338 8326231 8227264 8021201 7925025
4258 7925025 7821511 7687705 7399840 7162064 7081084 7004780 6842446 6759007 6787350 6738414
4248F738414n8918p7045r681k1598j06427j33564j70963j7873P0466k13870j20030
4237E878911j46373j31760m8942j02147Q0155j0352m3343l1891j27649o7324K6821
4226E276106j26402r1991N2052k3856m4769q3761L65p6727j47210p2047J26797
4215D788557m7500m7122l1024K1539j0442j26471j1574K0444j53762P1086j8281
4204D455450j10661q088m0423j08685L0879J0119J9641p7775L8110l4015j7245
4193D157307L2143j3062l2759j47533L1615p2431J2119m9152r0090l0373J6050
4182C813834K9911l8235k8024k3331M3435J9128p3704O3498k4815n6772K0314
4171C745239k7860R3047l8334J48244P4939o328M3979L0199M8942k4408M828k507
$$ plain form
4248 6738414 6679496 6602451 6592770 6571172 6464745 6331181 6160218 6142345 6212811 5998941 5878911
4237 5878911 5732538 5600778 5551836 5449689 5529844 5519492 5476149 5444258 5316609 5249285 5276106
4226 5276106 5149704 5057713 5109765 5085909 5041140 4957379 4957744 4881017 4733807 4661760 4788557
4215 4788557 4741057 4693935 4662911 4684450 4674008 4547537 4535963 4556407 4402645 4473731 4455450
4204 4455450 4344789 4336701 4296278 4187593 4218472 4228591 4248232 4170457 4208567 4174552 4157307
4193 4157307 4189450 4176388 4143629 3996096 4027711 3955280 3967399 3918247 3828157 3797784 3813834
4182 3813834 3843745 3805510 3777486 3754155 3797590 3816718 3743014 3806512 3781697 3724925 3745239
4171 3745239 3717379 3810426 3772092 3920336 3995275 3988947 4032926 4063125 4112067 4087659 4092487 4089980
4159D089980K03J57941n934O1925k7023l042R813L4905Q1401Q6937o740O5847
4147D546213J61003P1991O9578J16697J64637K3847K45215P5005M9261K76794
4137E800241K38442K23685J68164J68586K61779L24967L95741L41450L51036K71679
4127H545770M37862M11966M47206L20662J35043o7110n8218j22757j91110j73722
4117I685592j83724M4503J27243L13806L09278K85834K00466J31577m4788j88708
4107A0681079j81289k66856J8478j742K63683K56135K04500L42797M97467K92141
4097A2106393N07681N39215O12538P43884P42893P80949P05199K73440J28147
4088A7140339j96964l54806l45664l11343K6502K08832L73382N84248M80759N21815
$$ plain form
4159 4089980 4090183 4248124 4242190 4304115 4277092 4274050 4283863 4318768 4400169 4487106 4480366 4546213
4147 4546213 4707216 4779207 4848785 4965482 5130119 5153966 5399181 5474186 5523447 5800241
4137 5800241 6038683 6262368 6430532 6599118 6860897 7185864 7581605 7923055 8274091 8545770
4127 8545770 8983632 9395598 9842804 10163466 10298509 10231399 10173181 10050424 9859314 9685592
4117 9685592 9501868 9546371 9673614 9987420 10296698 10582532 10782998 10914575 10869787 10681079
4107 10681079 10499790 10232934 10251412 10249670 10513353 10769488 10973988 11316785 11814252 12106393
4097 12106393 12614074 13153289 13765827 14509711 15252604 16033553 16738752 17012192 17140339
4088 17140339 16943375 16588569 16242905 15931562 15958064 16166896 16540278 17124526 17605285 18127100
4078A8127100N69065J17917j32741k80758k72929n02634m35951k33427k69533
4069A6686109j48647L9010R5718J37680J50111J35861L10661L78292M24098L41497
4059A8550390L44151L56900L32911K05207K38072M15264L14583M76268M63013
4050B1696759N36484O94317P52480M84817J21977l34454q03713j127551j131841
4041B0889275j105854j006345q80861o53796n72451n04868k64068k52062k25211
4032A5423759j53308j1457N1452J06436J59401J48879J53453J74415K29572l593
4022A6279009J51691J5049m6170Q3102j88769k32325k92748m76347n73971n75751
4012A4142770o21430n37549n44496m02460k87573m60731k13856k26956k87353
$$ plain form
4078 18127100 18696165 18814082 18681341 18400583 18127654 17625020 17189069 16955642 16686109
4069 16686109 16537462 16576472 16672190 16809870 16959981 17095842 17406503 17784795 18208893 18550390
4059 18550390 18894541 19251441 19584352 19789559 20027631 20442895 20757478 21233746 21696759
4050 21696759 22233243 22927560 23680040 24164857 24286834 23952380 23148667 22021116 20889275
4041 20889275 19783421 18777076 17896215 17242419 16669968 16165100 15901032 15648970 15423759
4032 15423759 15270451 15258994 15310446 15416882 15576283 15725162 15878615 16053030 16282602 16279009
4022 16279009 16430700 16445749 16399579 16482681 16293912 16061587 15768839 15292492 14718521 14142770
4012 14142770 13521340 12983791 12439295 12036835 11749262 11288531 11074675 10847719 10560366
4003A0560366j75027k30987q8193j72866j52545j16942k18555j21695l37044k15955
3993H730557j77324l09166j69379l59807l57498l01600m42279k48421l37945l13357
3983E713781k60138k61222k19693j76160j90851j25812r1037p3311k11201j0411
3973D093945q7585j28305j02163p0718n5883j92900j18045k7106r3561j32167
3963C085512q2097o8476l1221n4785j90636q2871m4293m7936j26359j48114n8148
3952B150576j29695O1393k1059P5754p9307n4710J5822m9099l3436j28445k313
3941A805481p5185m2022R103p4724N3667j41527j8681P5907j7389r921l3241j09452
3929A422016K6841j7518q4992o7090K0762O0202m4099n2183p2022L3341j9727
$$ plain form
4003 10560366 10385339 10154352 10066159 9893293 9740748 9623806 9405251 9283556 8946512 8730557
3993 8730557 8553233 8244067 8074688 7714881 7357383 7055783 6613504 6365083 6027138 5713781
3983 5713781 5453643 5192421 4972728 4796568 4605717 4479905 4388868 4315557 4104356 4093945
3973 4093945 4006360 3878055 3775892 3705174 3649291 3456391 3338346 3311240 3217679 3085512
3963 3085512 3003415 2934939 2903718 2848933 2658297 2575426 2531133 2483197 2356838 2208724 2150576
3952 2150576 2020881 2082274 2061215 2136969 2057662 2002952 2018774 1969675 1936239 1807794 1805481
3941 1805481 1730296 1688274 1697377 1622653 1676320 1534793 1516112 1592019 1574630 1564709 1531468 1422016
3929 1422016 1448857 1431339 1346347 1279257 1300019 1360221 1316122 1263939 1191917 1225258 1205531
3918A205531p8239j32219M4455M533j3823O7724o8990J2046N7737m545j8142K6106
3906A102174j1806k4252J6475r6424m7343k6568j46073n028n7750N3701J4385
3895G71491n1546o5125k8510Q510J4860p9056J2663O3719K0160n0713j23807K2215
3883E14861q6842j732P9779j6943O7686l3409p7441O8308Q1383n0992o8282l164
3871D73212J0166R5670p5456j03006j09240l7645J83793l9130J0922k3689k3590
3860C62007m944k0672J7586O1775q6038p2586l6915L0865O7156j12525P3089K9018
3848C07816K8893k8906K9431O6176j09734K3511O5098q3777l8957L9850O912l6386
3836B69927k636O8778l4223m9260N2597k8264m20K5731M4656j06863Q4237N2643
$$ plain form
3918 1205531 1127292 995073 1039528 1044061 1030238 1097962 1028972 1041018 1098755 1094210 1076068 1102174
3906 1102174 1090368 1066116 1082591 986167 938824 912256 766183 761155 703405 757106 771491
3895 771491 719945 654820 626310 634820 649680 570624 583287 647006 667166 616453 492646 514861
3883 514861 428019 426287 506066 489123 556809 523400 445959 514267 595650 544658 476376 473212
3871 473212 483378 579048 503592 400586 291346 253701 437494 398364 409286 385597 362007
3860 362007 357063 336391 353977 415752 329714 257128 220213 251078 318234 205709 278798 307816
3848 307816 336709 307803 337234 403410 293676 317187 382285 298508 259551 299401 306313 269927
3836 269927 267291 336069 301846 252586 305183 276919 276499 302230 346886 240023 324260 376903
3824C76903m3459N108j10731M5660l4085K3307O7611o3658L4224j01887l7366
3813A61627J45544j5003J9242N0784o3178j44518N5025J4707L5253l1188K9665
3802B57960L9385k1307O0738n0135q1684o6887Q9045l9306O1379J4447j3686K678
3790B52627R8949K2343J8900m963j39709K9523l6996M0299l4052j17978j02560
3779B6383J02625j4378M3275P5300m4272K5610k8315j4363j0694O6023o4495O1826
3767B24525L7658Q2670N1974r8545q0609n9729J4991Q4217K089k8247Q9350n0106
3755B70238l7464q0500L7807P9892l8965J4931P4818k5120q9912P3020P0628q0601
3743B68772j03668N0896Q1531n4935O6507k9680j57412O4659R2365j24841m208
$$ plain form
3824 376903 333444 338552 227821 273481 239396 262703 330314 266656 300880 198993 161627
3813 161627 307171 292168 311410 362194 299016 154498 209523 224230 259483 228295 257960
3802 257960 297345 276038 336776 286641 204957 138070 227115 187809 249188 263635 249949 252627
3790 252627 351576 373919 392819 387856 248147 277670 240674 280973 246921 128943 26383
3779 26383 129008 114630 157905 233205 188933 214543 186228 171865 161171 227194 162699 224525
3767 224525 262183 344853 396827 298282 217673 157944 172935 257152 259241 230994 320344 270238
3755 270238 232774 152274 190081 269973 231008 245939 320757 295637 205725 278745 349373 268772
3743 268772 165104 216000 297531 242596 309103 279423 122011 186670 279035 154194 149986
3732A49986m3460p682K9392k9612j6401q5939P8394N4835J11393j30770K4109
3721A34245J6380r1128P488L1686J5535m6080l7275J32191L1186J387j34313n8611
3709B691l642N8965M5786m0025l7725L5090j10831L7589Q7162J6332j6321j05523
3697c0452N6312K6723M1123K4965k4542p5028m8972J5154j0214l8462K0728L9366
3685c299J2544K3468m8615q2756J6748M4919M4103q5144P2780k3369j16247L9466
3673a05402R1013N514J6120M7977m226l7847N9675O0370j9040o9982j4103j2895
3661A7174P7704k9244r0987Q0128M1918j52027m9208N3255O2257Q3909j0798j35281
3649e1200k8384m143K6101j2011P918m3589K5876p4589P171J02734J02273Q9285
$$ plain form
3732 149986 106526 98844 128236 98624 82223 -3716 74678 129513 240906 110136 134245
3721 134245 150625 59497 66985 98671 114206 68126 30851 163042 194228 195615 61302 2691
3709 2691 -951 58014 103800 63775 26050 61140 -49691 -12102 75060 91392 75071 -30452
3697 -30452 25860 52583 93706 118671 94129 19101 -29871 -14717 -24931 -63393 -42665 -3299
3685 -3299 9245 32713 -15902 -98658 -81910 -36991 7112 -78032 -5252 -28621 -144868 -105402
3673 -105402 -14389 -8875 7245 55222 50996 13149 72824 133194 114154 44172 30069 17174
3661 17174 94878 65634 -25353 54775 96693 -55334 -104542 -51287 10970 94879 84081 -51200
3649 -51200 -79584 -83727 -57626 -69637 -61719 -105308 -79432 -154021 -146850 -44116 58157 147442
3637A47442o7573r6239L7886j9107j2404M5305o6302m0598k681O5637J2644q841
3625d831o2777Q871M5341q274k0185j03871n2205N1428J94815K3887p6942j40105
3613a44848p635M3208O9534J09983q1044j14118J347J14823N3183m6676n9992
3602f2235p1540M3449p2695K4726M6860J199K7288O3110P1342r8420o1564r3R2555
3589C982j9460j02720R8366j3168p2307K1200r0985K6165L1834j510K5248k3684
3577a17039o5009j3413n454N6095R0635M2388j0492O662q6169R8022k2322J9635
3565f461p2080L6669n1119O4015o9335q2898J40282J4892l1843j0625M5176n1495
3553g4822J11651k6289j33745J73763J27393o1074q5893K6372n2924k4815k0721
$$ plain form
3637 147442 79869 -16370 21516 2409 -9995 35310 -30992 -71590 -74271 -8634 4010 -4831
3625 -4831 -67608 -58737 -13396 -21670 -41855 -145726 -197931 -146503 48312 72199 -4743 -144848
3613 -144848 -152483 -109275 -39741 70242 -10802 -124920 -123573 -8750 44433 -2243 -62235
3602 -62235 -133775 -90326 -163021 -138295 -91435 -90236 -62948 162 71504 -26916 -88480 -88573 3982
3589 3982 -15478 -118198 -19832 -33000 -105307 -84107 -175092 -148927 -117093 -118603 -93355 -117039
3577 -117039 -182048 -195461 -200915 -144820 -54185 -11797 -22289 -15627 -101796 -3774 -26096 -6461
3565 -6461 -78541 -41872 -92991 -28976 -98311 -181209 -40927 -26035 -57878 -68503 -23327 -74822
3553 -74822 36829 10540 -123205 50558 177951 116877 30984 57356 4432 -20383 -41104
3542d1104n0709L5130k4457l485J4754r1995P4941O4957O8108Q551n1407k3047
3530a9763N9999K1018q702K4666j1302n2378j4484j1260r6519J62240j9742O8581
3518A02354K4951n3072n8831J0604o9991L590R2336j6010k7683L6034Q6894n2205
3506G8971q8889J7201J08708k7636n0316o5737K8335l9886J5747N4760r9999J06580
3494C7839l7553q3481J09986P8967q2050k9931m171j4087O5269N9213P2452j31682
3482D0771j3809M318m6321M9986l7270m0991k8844q537k9473N4958J0015K1462
3470b3735j2499q1745R2783Q3650R938j05206k3858k2775J21753K6695n5434L24
3458I891K3089M3595j1394N7021j46072o7713q9049J58590L2153N236l3439J8903
$$ plain form
3542 -41104 -91813 -56683 -81140 -84625 -69871 -161866 -86925 -21968 46140 54691 3284 -19763
3530 -19763 40236 61254 52552 77218 65916 13538 -946 -12206 -108725 53515 33773 102354
3518 102354 127305 74233 15402 26006 -43985 -40395 51941 35931 8248 44282 131176 78971
3506 78971 -9918 7283 115991 88355 38039 -27698 637 -39249 -23502 31258 -68741 37839
3494 37839 286 -83195 26791 105758 23708 -6223 -10394 -24481 40788 100001 172453 40771
3482 40771 26962 31280 -15041 34945 -2325 -43316 -72160 -80697 -110170 -55212 -45197 -23735
3470 -23735 -36234 -117979 -25196 58454 68392 -36814 -60672 -83447 38306 65001 9567 9891
3458 9891 32980 76575 65181 122202 -23870 -91583 -180632 -22042 10111 15347 -18092 811
3446H11r3367J8011O3730k025O2886l1795M972p8083k874k6797J03289n6682o3835
3433a01759M97M7472L8988J90500o5485j8247k5753o4275P7251J02194k4833l2844
3421A23706p5824l2019n5259k1088J60228m9118m1402m526J32749n2424q1822
3410C201M5516Q5616o3074p389M9336K0468l4862k9462k175J6136n1968K8100
3398E9443J48259L0832p0260j0270j14996J42559q0052m6764K8960J9386J08193
$$ plain form
3446 811 -92556 -74545 -10815 -12840 50046 18251 23223 -54860 -57734 -84531 18758 -37924 -101759
3433 -101759 -101262 -53790 -14802 175698 110213 91966 66213 1938 79189 181383 156550 123706
3421 123706 47882 15863 -39396 -60484 99744 50626 9224 4698 137447 85023 3201
3410 3201 48717 134333 71259 63870 113206 133674 98812 69350 67175 83311 31343 59443
3398 59443 207702 238534 168274 158004 43008 185567 105515 58751 87711 107097 215290
$$ [...]
##END NTUPLES=NMR SPECTRUM
##END=
