##TITLE=1H_EC-3312(IV-22)
 CDCl3
 8 sc, 
 25.6.2024
##JCAMPDX= 6.0         $$ Bruker NMR JCAMP-DX V2.0
##DATA TYPE= NMR SPECTRUM
##DATA CLASS= NTUPLES
##ORIGIN= UXNMR, Bruker Analytische Messtechnik GmbH
##OWNER= root
$$ XWIN-NMR		Version 3.5
$$ Tue Jun 25 15:45:25 2024 Russian Standard Time (UT+4h)  she@DPX200
##.OBSERVE FREQUENCY= 200.1311
##.OBSERVE NUCLEUS= ^1H
##.ACQUISITION MODE= SIMULTANEOUS
##.ACQUISITION SCHEME= undefined
##.AVERAGES= 8
##.DIGITISER RES= 18
##SPECTROMETER/DATA SYSTEM= spect
##.PULSE SEQUENCE= zg30
##.SOLVENT NAME= DMSO
##.SHIFT REFERENCE= (INTERNAL, DMSO, 0, 14.4556)
##AUDIT TRAIL= $$ (NUMBER, WHEN, WHO, WHERE, WHAT)
$$ ##TITLE= Audit trail, XWIN-NMR		Version 3.5
$$ ##JCAMPDX= 5.01
$$ ##ORIGIN= Bruker BioSpin GmbH
$$ ##OWNER= she
$$ F:/spectra/data/she/nmr/H-F/1/pdata/1/auditp.txt
$$ ##AUDIT TRAIL=  $$ (NUMBER, WHEN, WHO, WHERE, WHAT)
(   1,<2024-06-25 15:44:02.89 +0400>,<she>,<DPX200>,
      <created by zg, POWCHK disabled, PULCHK disabled
       configuration hash MD5:
       00 E9 B6 7A A2 85 ED C7 34 08 36 98 17 FE 4E 26
       data hash MD5: 16K
       76 90 56 31 E6 63 A5 AA 14 4D B4 D8 50 3A 0E B8>)
(   2,<2024-06-25 15:44:14.85 +0400>,<she>,<DPX200>,
      <Start of raw data processing
       efp BC_mod = 2 LB = 0.24 FT_mod = 6 PKNL = 1 PHC0 = -25314.63 PHC1 = 8.787479 SI = 16K 
       data hash MD5: 16K
       AA 93 E8 7D 5E 33 4C CA 62 92 79 3E CA F1 46 AC>)
(   3,<2024-06-25 15:44:36.34 +0400>,<she>,<DPX200>,
      <pk PHC0 = 0.7401515 PHC1 = 1.2 
       data hash MD5: 16K
       65 4E EE 85 87 23 2A 2D 8F A2 F2 53 D9 1C 75 1C>)
(   4,<2024-06-25 15:44:40.04 +0400>,<she>,<DPX200>,
      <abs ABSG = 5 
       data hash MD5: 16K
       09 6A 98 FE 7F 57 1B D1 46 83 61 EC 61 D0 A3 78>)
$$ ##END=
$$ 
$$ hash MD5
$$ 8C 11 6A 0D 60 B0 94 6A D3 B8 B7 DD B7 EE 7D 59
##$RELAX= 
##$RELAX= 
##$RELAX= 
##$RELAX= 
##$RELAX= 
##$RELAX= 
$$ Bruker specific parameters
$$ --------------------------
##$DU= <F:/spectra>
##$EXPNO= 1
##$NAME= <H-F>
##$PROCNO= 1
##$TYPE= <nmr>
##$USER= <she>
##$AMP= (0..31)
100 100 100 100 100 100 100 100 100 100 100 100 100 100 100 100 100 100 
100 100 100 100 100 100 100 100 100 100 100 100 100 100 
##$AQSEQ= 0
##$AQ_mod= 1
##$AUNM= <au_zg>
##$AUTOPOS= <>
##$BF1= 200.13
##$BF2= 200.13
##$BF3= 200.13
##$BF4= 200.13
##$BF5= 200.13
##$BF6= 200.13
##$BF7= 200.13
##$BF8= 200.13
##$BYTORDA= 1
##$CFDGTYP= 0
##$CFRGTYP= 5
##$CHEMSTR= <none>
##$CNST= (0..31)
1 1 145 1 1 1 1 1 1 1 1 1 1 1 1 1 1 1 1 1 1 1 1 1 1 1 1 1 1 1 1 1 
##$CPDPRG= <>
##$CPDPRG1= <>
##$CPDPRG2= <>
##$CPDPRG3= <>
##$CPDPRG4= <mlev>
##$CPDPRG5= <mlev>
##$CPDPRG6= <mlev>
##$CPDPRG7= <mlev>
##$CPDPRG8= <mlev>
##$CPDPRGB= <>
##$CPDPRGT= <>
##$D= (0..31)
0 1.2 0 0 0 0 0 0 0 0.06 0 0.03 0 0 0 0 0.0002 0 0 0 0 0 0 0 0 0 0 0 0 
0 0 0 
##$DATE= 1719315842
##$DBL= (0..7)
120 120 120 120 120 120 120 120 
##$DBP= (0..7)
150 150 150 150 150 150 150 150 
##$DBP07= 0
##$DBPNAM0= <>
##$DBPNAM1= <>
##$DBPNAM2= <>
##$DBPNAM3= <>
##$DBPNAM4= <>
$$ [...]
##$SUBNAM3= <"">
##$SUBNAM4= <"">
##$SUBNAM5= <"">
##$SUBNAM6= <"">
##$SUBNAM7= <"">
##$SUBNAM8= <"">
##$SUBNAM9= <"">
##$SW= 18.051750892319
##$SWIBOX= (0..15)
0 0 2 0 0 0 0 0 0 0 0 0 0 0 0 0 
##$SW_h= 3612.71676300578
##$TD= 16384
##$TD0= 1
##$TE= 0
##$TE2= 300
##$TE3= 300
##$TEG= 300
##$TL= (0..7)
0 120 120 120 120 120 120 120 
##$TP= (0..7)
150 150 150 150 150 150 150 150 
##$TP07= 0
##$TPNAME0= <>
##$TPNAME1= <>
##$TPNAME2= <>
##$TPNAME3= <>
##$TPNAME4= <>
##$TPNAME5= <>
##$TPNAME6= <>
##$TPNAME7= <>
##$TPOAL= (0..7)
0.5 0.5 0.5 0.5 0.5 0.5 0.5 0.5 
##$TPOFFS= (0..7)
0 0 0 0 0 0 0 0 
##$TUNHIN= 0
##$TUNHOUT= 0
##$TUNXOUT= 0
##$USERA1= <user>
##$USERA2= <user>
##$USERA3= <user>
##$USERA4= <user>
##$USERA5= <user>
##$V9= 5
##$VALIST= <valist>
##$VCLIST= <CCCCCCCCCCCCCCC>
##$VD= 0
##$VDLIST= <DDDDDDDDDDDDDDD>
##$VPLIST= <PPPPPPPPPPPPPPP>
##$VTLIST= <TTTTTTTTTTTTTTT>
##$WBST= 1024
##$WBSW= 4
##$XGAIN= (0..3)
0 0 0 0 
##$XL= 0
##$YL= 0
##$YMAX_a= 253529
##$YMIN_a= -321507
##$ZGOPTNS= <>
##$ZL1= 120
##$ZL2= 120
##$ZL3= 120
##$ZL4= 120
##$ABSF1= 14.4688
##$ABSF2= -3.58305
##$ABSG= 5
##$ABSL= 3
##$ALPHA= 0
##$AQORDER= 0
##$ASSFAC= 0
##$ASSFACI= 0
##$ASSFACX= 0
##$ASSWID= 0
##$AUNMP= <proc_1d>
##$AZFE= 0.1
##$AZFW= 0.1
##$BCFW= 0
##$BC_mod= 2
##$BYTORDP= 0
##$COROFFS= 0
##$CY= -3
##$DATMOD= 1
##$DC= 0
##$DFILT= <>
##$DTYPP= 0
##$F1P= 0
##$F2P= 0
##$FCOR= 1
##$FTSIZE= 16384
##$FT_mod= 6
##$GAMMA= 0
##$GB= 0
##$INTBC= 1
##$INTSCL= 3.70164e-10
##$ISEN= 128
##$LB= 0.24
##$LEV0= 0
##$LPBIN= 0
##$MAXI= 10000
##$MC2= 0
##$MEAN= 0
##$ME_mod= 0
##$MI= 1.114404
##$NCOEF= 0
##$NC_proc= -8
##$NLEV= 6
##$NOISF1= 3.799351
##$NOISF2= 2.8
##$NSP= 0
##$NTH_PI= 0
##$NZP= 0
##$OFFSET= 14.45558
##$PC= 1
##$PHC0= -25313.89
##$PHC1= 9.987479
##$PH_mod= 1
##$PKNL= yes
##$PPARMOD= 0
##$PSCAL= 0
##$PSIGN= 0
##$REVERSE= no
##$SF= 200.13001336226
##$SI= 16384
##$SIGF1= 3
##$SIGF2= 2
##$SINO= 5.538805
##$SIOLD= 16384
##$SREGLST= <1H.CDCl3>
##$SSB= 0
##$STSI= 16384
##$STSR= 0
##$SW_p= 3612.71676300578
##$SYMM= 0
##$S_DEV= 0
##$TDeff= 16384
##$TDoff= 0
##$TI= <>
##$TILT= no
##$TM1= 0
##$TM2= 0
##$TOPLEV= 0
##$USERP1= <user>
##$USERP2= <user>
##$USERP3= <user>
##$USERP4= <user>
##$USERP5= <user>
##$WDW= 1
##$XDIM= 16384
##$YMAX_p= 402393747
##$YMIN_p= -1092984
$$ End of Bruker specific parameters
$$ ---------------------------------
##NTUPLES= NMR SPECTRUM
##VAR_NAME=  FREQUENCY,     SPECTRUM/REAL,   SPECTRUM/IMAG
##SYMBOL=    X,             R,               I
##VAR_TYPE=  INDEPENDENT,   DEPENDENT,       DEPENDENT
##VAR_FORM=  AFFN,          ASDF,            ASDF
##VAR_DIM=   16384,         16384,           16384
##UNITS=     HZ,            ARBITRARY UNITS, ARBITRARY UNITS
##FACTOR=    0.220516191357247, 1,           1
##FIRST=     2892.9953700658, 0,             0
##LAST=      -719.72139293998, 0,            0
##MIN=       -719.72139293998, -1092984,     0
##MAX=       2892.9953700658, 402393747,     0
$$ Real data points
##PAGE= N=1
##DATA TABLE= (X++(R..R)), XYDATA
$$ [...]
14925 -490058 -775272 -422964 90597 40301 -385440 182741 227728 20144 -199270 144254
14915 144254 -368149 108044 67973 -85135 -221697 -640107 -245704 -705904 -450383 -211448
14905 -211448 -605574 -501473 41808 940901 971759 248592 -327841 -209256 203529 145123
14895 145123 -52005 -125712 227681 589494 323884 157764 402326 334456 418294 -27956
14885 -27956 16091 357999 -346319 -194973 -118536 -67563 580850 472978 -18400 49777
14875 49777 69800 69019 372720 320061 14928 74958 -44677 55604 99005 399069 -52632
14864 -52632 -197785 -97646 -68674 361244 -4969 -134818 25882 -35971 -13115 -163999
14854 -163999 -131321 339394 286808 61896 76829 -197832 6895 147445 231832 117822
14844 117822 -213794 64196 68618 264107 30666 204275 329405 -278880 -464423 -51340
14834 -51340 391867 346395 123887 428661 809306 160576 43816 370372 525893 335311
14824 335311 32006 -284308 -444508 -144357 -46099 342862 621823 139442 -475789 -218167
14814 -218167 33863 122362 136283 -88527 253157 271776 301604 60637 -76300 -123451
14804 -123451 -681105 -433789 -371375 -186022 -332299 -558429 104545 172157 200092 441530
14794 441530 215574 299895 360497 331114 -33433 102522 -324195 -307767 -100452 -109221 -112512
14783 -112512 87465 -25666 -266541 75707 26170 253607 538754 188708 -400557 -551980
14773 -551980 -176678 30320 312807 498165 383135 333295 415621 420508 307348 242428
14763 242428 118041 -293612 -453854 -146616 157076 384119 488173 74910 238397 325862
14753 325862 304352 84828 -135320 -101612 -149057 -465367 -184108 286825 -3058 -200439
14743 -200439 23640 458658 -297032 -286823 -102256 -449369 -239365 -21624 -362171 -220314
14733 -220314 -17846 198320 15076 99544 299782 -103333 185454 -57605 -42708 67785
14723 67785 -39015 -88150 337135 389161 334063 275076 -123729 -182835 87960 431801 -8457
14712 -8457 -171280 -273631 -99595 -244229 -166827 213746 238826 -341158 -328494 17345
14702 17345 251148 -150163 -111306 -192471 -357456 -164745 -50655 -68791 298353 -83165
14692 -83165 -663919 -331777 -287283 136742 218363 455753 310360 213524 238297 -10802
14682 -10802 -169610 -367872 -264218 29413 112695 -151118 -206669 -449323 -81143 -34926
14672 -34926 62534 464306 534574 542219 21577 -376165 -423211 -22599 92769 379189 415972
14661 415972 62754 20602 -52411 -296906 10150 -71505 -214417 -390839 -622565 -239922
14651 -239922 -75329 68320 3395 212162 299769 -131538 -391150 -14273 74018 -66699
14641 -66699 265982 78108 -348715 -199366 20035 52323 -37796 -170178 103042 -279253
14631 -279253 -606226 -390687 -92009 71652 267976 330259 539641 636794 605095 363206
14621 363206 127252 -136881 -83060 42957 137833 495151 665430 259337 -187711 112836
14611 112836 147155 56219 225196 205947 58373 -15917 251437 466528 194188 -114631
14601 -114631 24963 -50236 54346 153774 412541 22258 -3951 29608 72125 228731
14591 228731 -80974 306661 40027 72231 231576 229287 559516 204756 64546 -54194
14581 -54194 -95533 69223 18736 65698 -26921 -84198 -185928 220777 315162 283378 -169904
14570 -169904 -163527 -255266 -118166 -109106 428121 445860 107161 -216775 -97635 -266901 -491816
14559 -491816 -632856 -574056 -25169 -238590 40583 -143410 -98908 -197397 -459491 -396828
14549 -396828 -294294 -609905 -864155 -389906 -245016 -483787 -494832 -463619 -142766 338107
14539 338107 -370913 -404022 73581 -124919 -389637 -413972 -238966 99115 63721 -70341
14529 -70341 214993 -28205 194607 73528 137914 556719 432173 -17690 -421860 -189208
14519 -189208 -21413 -99609 10089 177149 129165 74218 -275548 -373731 -136888 -211805
14509 -211805 -125337 128038 -118645 -427421 -109456 -424896 -373599 -497282 -278657 -348967
14499 -348967 -519174 -101353 425144 651931 38882 -371031 -69061 209404 -349636 -227755
14489 -227755 -331449 171698 411067 38099 122126 -78331 -130516 -192072 -498644 -213414
14479 -213414 93975 -133930 52605 -167777 -49401 144480 52418 -189411 -150657 316148
14469 316148 -38015 -459222 -61777 115107 258849 172037 565250 575394 378874 113625
14459 113625 118254 24540 -344790 -144618 94265 185039 42021 -182139 103652 -129821
14449 -129821 -310951 133343 258321 188385 -254564 -101264 -268849 -186359 -135275 25736
14439 25736 351510 -165833 -307167 -367535 537971 677798 411427 679764 610329 472270
14429 472270 -211779 -219354 -11121 -137860 214772 -10672 -73002 394806 551169 487912
14419 487912 240842 -82559 132234 302943 258137 -110670 -547998 -138772 312855 42631
14409 42631 -144553 -233844 54618 454463 46974 148985 571496 364769 68683 509326
14399 509326 -236178 -137714 -110910 57930 -82744 -74760 -192716 -335551 27111 171656
14389 171656 460301 379533 -134764 -356861 -461386 -171414 91903 326432 274336 77459
14379 77459 219117 -126232 -351645 12383 362980 -68573 -374089 107916 316644 204757
14369 204757 -183900 -41857 177986 -18426 -279681 -232691 -375439 -541169 -630150 -126569
14359 -126569 181367 -124271 247779 57242 -174430 -424824 -145302 20098 51320 -9774
14349 -9774 -147392 -269181 -94205 265054 427491 -67917 -120035 -581211 -356529 239900
14339 239900 80020 62349 -261999 -219211 8677 15377 -96256 -39092 99244 300920
14329 300920 443038 39259 -57883 -109103 78582 6307 -242599 -191224 -565974 -499697
14319 -499697 -255116 -79321 32383 -257006 -656444 -70088 -319675 -589709 -201239 41793
14309 41793 259010 13042 -61106 -253164 -128485 465 59743 238307 58082 -208740
14299 -208740 -196003 -108033 291021 195081 -20436 -116179 136276 -95624 -80279 111279
14289 111279 -75228 177519 146474 -130225 -247977 -195613 -13468 191200 329693 357046
14279 357046 -27402 -219166 -28289 417373 172118 -10688 -364610 77748 356954 464083
14269 464083 -56976 125256 625146 510419 214822 108349 344938 289355 708346 159234
14259 159234 -145124 -447823 -361183 -410269 -276810 207567 194242 4783 -403715 -660589
14249 -660589 -525540 -199932 -10403 -17146 -134956 -308584 -116319 191966 216839 -40689
14239 -40689 120541 213936 88244 -31356 33354 27346 3537 -69005 -117451 -42912 148477
14228 148477 45834 -311008 -224292 -304136 -185572 220055 348767 383794 395524 -94358
14218 -94358 -75436 326604 136364 14267 -210828 -176040 32706 221971 200094 529246
14208 529246 493835 -60000 -238047 -187071 -434632 -373645 49451 34830 -132343 348126
14198 348126 442671 57916 190682 268500 -200050 -120543 -166734 -190944 -333240 -573983
14188 -573983 -308127 36266 -93301 -92193 497115 585413 228032 64882 -13929 255145
14178 255145 4823 -144795 154347 98007 485494 556043 75492 -8010 119971 -51153
14168 -51153 166940 164898 -191146 -143126 387677 400734 -176553 195117 495921 -17194
14158 -17194 26622 -227444 -59331 369850 483587 -88249 -112604 130616 159742 -9971
14148 -9971 -46030 -102863 -23326 -100946 -214926 -460514 -205760 -671812 -603407 -286004 254606
14137 254606 556390 438779 728358 -221040 -567981 -50293 -215498 -55427 -85837 265616
14127 265616 842488 622097 345244 92686 -452002 19005 349386 491500 79104 305483
14117 305483 78235 342779 216730 -136971 89999 284589 414617 403040 -51984 -625081
14107 -625081 -186624 43705 386360 542633 358914 287900 265590 -183518 162202 277765
14097 277765 541187 691380 471927 -225021 61384 264317 -171377 -109883 49315 75517
14087 75517 356509 -136449 -383806 -420149 430916 764577 -71020 57753 369897 -124354
14077 -124354 -592209 -682530 -360464 -359939 21838 -156513 -203937 -172443 -255479 -86409 31450
14066 31450 -68652 -138416 -452879 51801 168394 254542 409732 153976 282863 340267
14056 340267 480106 195525 115645 -300640 -66052 203916 117829 138574 -113891 30672
14046 30672 78296 -257744 -317537 -422666 -730858 -320623 -231285 79870 -93722 53260
14036 53260 411821 461470 406043 120106 -53442 -171209 209797 504910 650341 124245
14026 124245 3520 -232568 -505973 -349612 -134778 14436 -102589 -159463 -148075 -15050
14016 -15050 147599 64579 -118300 -715084 -417252 -65366 -219217 36895 47226 352586
14006 352586 -51294 -402802 -265455 -163585 -134385 -29452 -2363 119325 -297571 5840
13996 5840 99240 -13781 -173367 -345360 -91871 -21457 15705 33753 148819 95895 23439
13985 23439 -87655 30970 43836 -297120 -117161 -316440 -332645 -21427 49117 101043
13975 101043 -104702 119393 172899 254938 169394 272625 -117452 326513 513322 35366
13965 35366 -427104 65154 332247 259492 372872 201716 -65434 -205428 -10455 3782
13955 3782 -18128 -4056 -120473 -81626 431286 416657 -245532 -237946 7606 -143194 202931
13944 202931 294654 254349 639331 269772 289960 203664 251745 52526 -49989 -260578
13934 -260578 2683 67607 -247578 -408866 -209917 2753 -8648 -371398 -602269 -724734
13924 -724734 -206982 47287 -301526 -229419 340694 359403 208231 186533 76427 -41321
13914 -41321 19079 -614737 -583068 -381436 -504798 -121000 275032 30193 260561 236146
13904 236146 473007 277397 -124784 153159 57662 -370108 -417553 68564 -205963 -186538
13894 -186538 -53201 428342 140194 7000 -561378 -185812 83046 -225068 -345340 -168880
13884 -168880 115214 331692 325184 42787 45073 -210712 -681523 -526502 -198886 -232709
13874 -232709 -466129 -291172 -244277 -77336 338227 626141 316606 -19428 -527945 106534
13864 106534 510527 235286 -143514 -201010 -640475 -172457 140589 -222776 -335010 -377591
13854 -377591 294659 -183361 -32910 -145111 -13271 -215547 -292726 -266125 153343 178254
13844 178254 98971 736347 499022 350260 -22705 -93038 -597829 -399882 -205929 -385911
13834 -385911 -447455 232990 110902 236068 -123463 -572014 -506327 27982 -281020 158192
13824 158192 -293073 -148758 89680 1263 175877 402054 327438 161900 218223 99387
13814 99387 100128 -113322 -126053 45033 67858 184984 601938 536506 396227 23620 -79342
13803 -79342 -128591 367526 8027 451509 675095 559444 82726 -259543 -264499 76225
13793 76225 -43225 494029 21026 -117315 -73733 -129997 143056 -193350 -414215 -336596
13783 -336596 -134532 -228103 -209347 -244269 -442958 -378072 -117714 -322780 -547227 -365851
13773 -365851 -323145 -256982 -581738 -479581 -267895 -341429 -198562 -116640 71672 98201
13763 98201 68330 118988 301468 199773 -6423 -247060 202234 -124272 -604984 -463995
13753 -463995 14090 -11350 -155315 85111 199036 29677 131235 512448 178070 -184534
13743 -184534 -451903 -396602 112675 307675 367069 417814 57105 524038 347169 65627
13733 65627 -252794 -464392 -366408 -121652 -21467 265895 376055 422926 196169 468263
13723 468263 433245 62797 -9991 75755 180120 189194 81664 432653 84454 -27852
13713 -27852 -244651 -542062 -554208 -469231 132707 412013 531194 290313 398966 161918
13703 161918 -8644 -140843 -441524 -255409 -221628 152689 -21457 148210 94031 420761
13693 420761 585405 518041 190084 -162026 -6184 -123939 85318 -137300 -328064 -250836
13683 -250836 -569303 -322951 -238981 -292680 -339831 -434819 -78365 -123326 239994 224311 725065
13672 725065 -95555 -144203 -60883 -163294 -600185 -837787 -237795 154681 -119794 140314
13662 140314 254923 202288 202426 -114614 -141706 33935 23297 -170942 132487 175744 320056
13651 320056 213510 51819 46318 -78902 168959 -104206 -661664 -119550 90151 -512387
13641 -512387 -20908 170030 -450485 -936442 -385167 54338 222876 -106927 -105748 -400504
13631 -400504 -113751 246772 40786 -230612 219375 296514 108552 400857 -168743 -180960
13621 -180960 -169353 -206242 48402 265129 210713 11856 -54403 405996 775944 122078
13611 122078 182883 71880 -162778 148036 -136057 -241639 -446219 -497257 -107029 -408817
13601 -408817 -134657 -318232 -184950 74833 -400676 -487458 -420824 -102154 106192 -181229
13591 -181229 -307632 -121009 -415994 -263451 368694 -12918 15338 -299970 -324585 132874
13581 132874 -39060 -166875 -365095 7039 106417 17585 116596 427099 56912 -366731
13571 -366731 -673382 -330748 -386795 -94823 -8450 266332 268746 279380 112047 4568
13561 4568 1090 114741 -55843 -6380 209350 101136 29782 209833 230500 -15337 -24336
13550 -24336 39516 -126010 211606 48874 -811644 -580686 -234477 -386975 -367261 -179482
13540 -179482 -240911 98848 109005 -228204 142187 279803 -22421 -227453 -191579 -154421
13530 -154421 275046 348189 665864 414918 263803 159996 346480 595649 362962 579327
13520 579327 393535 237530 115000 169823 297992 101387 21280 -365394 -465938 -489188
13510 -489188 -543437 -898187 -1007609 -600704 -441309 -391474 -359387 146416 514505 468963
13500 468963 479771 712815 798229 254214 229206 392768 604981 601007 39374 -237057
13490 -237057 -330897 262426 667553 344231 219761 402230 -395909 -279685 -68483 43896
13480 43896 -7020 94534 -252424 -17489 179530 149069 387911 50919 -46704 -21390
13470 -21390 -142031 -208401 232666 246918 -363030 -499941 108594 -101609 321588 201045
13460 201045 -86221 193297 370062 432096 59652 -66337 -320668 -81079 48067 -117845
13450 -117845 -329049 -391016 -298394 -312074 -228687 185685 -124122 -31643 -374412 -114901
13440 -114901 159409 -27000 231335 46680 -193200 -242094 -81479 -153812 -396042 -163765
13430 -163765 124771 -11261 -435233 -123391 167213 -4965 125949 -163352 -306384 -233191
13420 -233191 -292146 -147547 -155427 53133 48980 -62468 -153760 -565701 -342280 -92183 -59308
13409 -59308 -107404 -90546 278237 310361 20572 -115957 -41174 85630 301479 372586 327040
13398 327040 203355 -169404 -10637 207708 -172115 -355373 170210 148454 441403 -44851
13388 -44851 73536 -223339 -423954 121682 28691 158246 269669 402376 -219110 -149973
13378 -149973 213562 268827 -492349 -199414 3056 -42179 -35176 -226745 -163830 -346173
13368 -346173 -197679 -186624 -257506 -319163 -178687 -228047 -342541 -378394 -416789 20697 -182948
13357 -182948 7400 -193090 243981 394193 -285138 -197148 -119041 -277073 -94808 -118450
13347 -118450 -33308 -18728 147862 309540 -37884 -303145 -184333 8120 251178 516186
13337 516186 232082 219789 153700 281701 -124400 -219578 -121097 58630 -247751 -394381
13327 -394381 -239881 471380 626357 861642 470617 2714 -114013 -160103 -309238 -171470
13317 -171470 144000 11412 242652 250670 60814 10345 53292 436081 471180 411810 -320061
13306 -320061 -367190 -444704 -50897 286801 126638 327635 549743 322860 249732 18756
13296 18756 -63305 61142 266833 445998 20575 -183765 -236635 -237129 -113136 200709 -2716
13285 -2716 54371 -24525 40517 16992 -261805 -306231 -103868 -397023 -399042 144078 133070
13274 133070 460869 417453 295065 80562 -31230 23872 -450370 -430034 -241469 -48791
13264 -48791 -394382 -448723 -705772 -696040 -256699 57314 -628905 -513741 -25678 13749
13254 13749 137781 365213 363543 112279 180368 13907 -54665 191879 697536 554772
13244 554772 184738 91053 41477 22974 -245258 58963 -52212 291942 -118440 -325428
13234 -325428 167822 -133779 -583143 57921 439609 408190 698882 578727 257846 -51263
13224 -51263 -316694 -826760 -302712 436900 85496 41167 86530 -114141 202770 198739
13214 198739 -146082 -155478 -283461 -79669 128156 -71790 84084 -193594 -29467 118514
13204 118514 -3154 77530 70444 -540182 -540933 -239304 -5811 64991 -27437 -155010 -299776
13193 -299776 -21636 -223777 -181117 77552 174290 -65614 -247249 -441938 -210515 -101212
13183 -101212 19010 121908 62103 116590 1731 94220 264226 -68608 -523978 -309940
13173 -309940 -32944 -97916 -84419 -354234 -447282 -1878 -40916 -51657 -288782 -82969
13163 -82969 -283997 -473984 -470885 -118963 266863 -67677 -418410 -291619 -266209 -260865 -444200
13152 -444200 -95240 60784 -304856 -34003 13567 -55454 119409 361591 117966 -129150
13142 -129150 -475641 -339506 -175404 -175164 -326352 -96953 414707 84232 -617494 -547317
13132 -547317 26357 15410 25942 -12134 -135220 -196611 -47842 22988 -64062 457004 6415
13121 6415 98733 147263 -325462 -570671 -237295 68110 129019 -16163 -569886 -324836
13111 -324836 -271625 -163717 -27502 -71759 116565 370040 191310 -181369 -314122 -138701
13101 -138701 -241257 173979 172979 -137344 -359380 -316236 -247780 -20301 -165170 -428170
13091 -428170 -623314 -372643 -315839 -265250 -193623 -118610 50339 -66014 7661 -124129
13081 -124129 -342388 -117836 -47737 -217925 -177639 -12214 436150 186997 -158091 -456850
13071 -456850 -219877 -220406 -252161 126108 153156 -432213 -709268 -589912 28780 -325692
13061 -325692 -477370 -109402 9 184155 -46170 -385573 -155938 541 96322 269368
13051 269368 9620 -230653 -75564 -197776 -384066 -62777 5106 -57166 -272463 -151950
13041 -151950 -137166 189023 81551 -139121 -117727 -239696 -204705 -280867 -686349 -526061
13031 -526061 -268473 178289 -168338 -576600 -496419 -491907 -475959 -401709 -334161 -296001 -129942
13020 -129942 -474325 -222088 520315 518816 -131627 -265505 102746 -58852 -359339 -361448
13010 -361448 -112121 -441792 -339573 -223334 -309938 -128666 -408598 174897 432988 -41917
13000 -41917 15472 43116 55165 -219318 -169598 -171242 -495738 -347896 -66177 14522 -228462
12989 -228462 -187339 46141 158675 235335 -89978 83421 -54318 -235613 41700 -338357
12979 -338357 -211690 40778 328650 9307 85466 -156482 -235155 -510975 107063 419543
12969 419543 79702 123544 214280 399686 229436 -82796 -168781 -115598 221220 40500
12959 40500 31739 64811 -50839 298649 296938 209479 -10187 -69601 162833 304721 133376
12948 133376 94907 -238073 -629773 -440735 -124762 18549 -132890 -242288 -264130 -244807
12938 -244807 5780 140087 -300271 -473964 -240065 -118092 -42856 -171360 271952 332362
12928 332362 177736 526175 647188 239429 -235577 -140072 106971 174661 377106 -29806
12918 -29806 -99461 -170522 108163 151717 -85690 -304311 -482664 -370761 -366785 -486934 -377381
12907 -377381 -254356 62705 -62537 -113635 -223087 -211545 -228591 -176273 158763 -208476
12897 -208476 -296541 -181472 -285389 -38030 216595 94174 -207271 -329896 -25068 176992
12887 176992 53245 -251176 109479 -366881 -274106 -42785 -146512 -193789 -326173 -277718
12877 -277718 -460700 -522932 -256131 -21973 -9886 -113646 -58205 2127 -66607 -122869 234758
12866 234758 258251 171072 648432 351845 237170 265587 -117439 -548522 -412174 -215443
12856 -215443 -20686 -367231 -461003 3524 367293 204372 330314 223580 160321 -192946
12846 -192946 -595258 -172066 -9378 -149632 -304260 141852 209054 -252154 67658 -63807
12836 -63807 -249022 9336 -8248 -166103 -262476 -80700 -19174 172640 -197119 -148221
12826 -148221 -159750 -252247 -264900 -222018 -394162 -255094 -444603 -771196 -311053 286793
12816 286793 391028 5451 19421 -156571 -481373 -315932 95478 171880 1060 337884
12806 337884 -8270 -185260 -328360 -710323 -260310 11875 -228266 22454 255140 -50012
12796 -50012 -342667 -314001 9147 138313 121895 -102087 -70847 -82373 -227899 -406683
12786 -406683 -411359 -306663 -335334 -313327 -134643 27550 289512 240496 389873 -23351
12776 -23351 -537899 55669 -87036 -331734 -168796 231527 477882 446888 371285 -393986
12766 -393986 -459983 -271792 137874 352783 413910 575742 320594 229821 40949 -249418
12756 -249418 -125563 -143851 -29259 -59842 224154 146253 17096 28847 55819 -108786
12746 -108786 -247729 -59506 -53074 44221 313630 27413 -27760 145314 -83559 -310024
12736 -310024 -308907 -137824 -72126 -253509 -254766 -404476 -387311 -213076 -426928 -351061 -538501
12725 -538501 -116343 28657 -151071 -219287 -183756 179669 405528 -54451 -15 -117259
12715 -117259 -24248 106659 -35346 20806 4674 128345 162599 -24347 162144 675778
12705 675778 565407 92446 -135031 -715436 -231810 112002 315962 -382829 -482137 -213930
12695 -213930 -265563 -291580 -411475 -167963 -27669 -12404 49835 115539 -128649 -3582
12685 -3582 120473 -29838 95900 545130 169999 -89553 387391 155563 -288003 -219223
12675 -219223 -195964 -276711 -353887 -167850 221428 429543 147645 -282003 -26330 -22118
12665 -22118 -157958 206636 -34723 -551959 -166954 59746 24558 332858 136184 -42400
12655 -42400 -81370 -237600 -47120 85526 -216827 -186614 -245858 -658560 -316390 -56699
12645 -56699 70701 92100 138273 161651 66491 68854 -368164 67611 252594 307581 276805
12634 276805 457470 211449 187570 50364 -66189 -8415 -142661 100842 153695 326923
12624 326923 438981 279179 320360 289787 278199 -5102 283547 121378 -44018 -190857
12614 -190857 -223860 -366873 -394813 -304595 24032 -129376 -300486 -412526 -283195 -146473
12604 -146473 -71307 323653 618051 242743 496969 374328 228840 201430 166370 428457
12594 428457 54373 17526 153408 -145161 -560836 -368302 -493534 -379875 -361660 -583821
12584 -583821 -550840 -136352 -281922 -41606 -125528 -487259 -356841 -719462 -532826 -194869
12574 -194869 -637539 -483407 -283043 -43194 -39591 -285254 -401306 -233394 -352226 -146973
12564 -146973 144913 390565 426956 -18223 46155 56726 -133338 -39372 -13632 188293
12554 188293 251343 181307 86596 -108552 -400241 -4391 -109417 -272426 -209980 164564
12544 164564 10477 -720474 -478692 -580307 -503207 -86671 270627 203671 33668 -312926
12534 -312926 -442838 -360237 -630325 -348313 -305518 -180535 2501 -32350 -83784 39059
12524 39059 -363682 -14264 -21528 369561 238450 118069 52142 -7282 -191921 13928
12514 13928 -186353 -240477 243005 353812 -445439 -1092984 -560683 -198232 46803 147779
12504 147779 13174 -216416 90720 -194452 22582 100099 259454 235813 747413 536447
12494 536447 27271 57154 442818 -8807 -310398 -275607 328981 373001 -205470 -37430
12484 -37430 8036 -69701 -31266 55629 186062 -264054 -315219 -330186 -135186 -47541 -271651
12473 -271651 -89105 56604 -235496 -470091 -266256 -93896 -4966 19000 16768 -392612
12463 -392612 -541480 -493127 -174674 73571 -1593 152641 -88329 -145301 402142 293056
12453 293056 175548 -28799 9035 46529 124265 291713 336249 -43619 -362389 -562709
12443 -562709 -500064 -379569 -19019 464231 266876 -227075 -266700 -101596 -107797 -222599
12433 -222599 131038 211605 -371953 -275668 3010 -199510 -152268 385580 -27049 43340
12423 43340 421925 301608 -31550 -257397 86374 5178 -287272 83557 -19517 -143294
12413 -143294 -5172 435 207247 172043 -106469 -89503 51693 4295 209225 831060
12403 831060 555633 97092 16898 -18571 -65681 337881 439031 410761 83159 -100530
12393 -100530 -61604 -48796 245235 101808 -13250 -175917 -281616 -229924 -47252 158713
12383 158713 -388934 17122 86970 -311819 -484015 -457659 -346906 -464750 -321656 -237616
12373 -237616 -198748 -343187 -463820 -332997 -344404 -336089 340727 303005 45816 170113
12363 170113 -28591 -138221 -63422 39833 172021 125938 593668 206434 397599 185274
12353 185274 443668 23421 340778 564555 758238 9637 -477181 284550 292895 657182
12343 657182 253519 234639 167977 -280375 -522494 -481070 -353953 -200195 -643392 -460474
12333 -460474 -262021 -158916 -380390 -591590 -844139 -631505 -288317 301535 155285 -242168
12323 -242168 287671 210243 80722 -100522 -375851 -77172 375509 362495 211411 98940
12313 98940 221854 183936 553287 835888 364909 -353630 -436982 -314132 -91842 -2203
12303 -2203 165146 212308 317161 165097 161042 364100 187042 121269 -40661 401745 -38787
12292 -38787 -365988 51928 -110799 -181230 76485 -257848 -327146 179522 519568 353906
12282 353906 106842 -96412 -284345 6113 -136663 -445493 -626414 -681058 -103328 57187
12272 57187 -309940 -243225 -56669 -194760 -12444 162303 227919 293698 98521 -40740
12262 -40740 -14626 -41440 419818 206016 26730 -128107 -379905 -78454 -16628 -101963
12252 -101963 -76384 -25738 -107568 -52239 -159235 -6214 -253323 -355468 138354 24122
12242 24122 -483003 -101217 -224353 141904 475799 -20210 88321 -168596 60702 192935
12232 192935 105904 59001 181516 388358 534076 412516 102832 46625 -393714 -306317
12222 -306317 -295392 -163313 82675 -73396 -17512 323692 -59295 -539362 -423745 -561991
12212 -561991 -421685 -585175 -369232 -221104 -263503 -127235 -301362 -343127 15097 601380
12202 601380 110493 -31399 65903 -314756 -79998 69836 -27872 -33936 -259242 -233041
12192 -233041 -235278 -329588 -44121 419155 140542 97510 357122 381642 29558 170647
12182 170647 -147308 -218239 25199 -25034 184621 135378 121733 154821 580102 324289
12172 324289 134600 354609 245351 -281652 -116083 -472317 -371599 -339017 -449597 -405811
12162 -405811 -266441 -453916 -151029 69712 148112 375977 338012 -100040 33592 -23440
12152 -23440 -58959 -27551 19197 111344 70757 36105 241113 444558 500866 283116 -83853
12141 -83853 32131 173607 269049 433373 217475 -61541 -110561 -92227 -79802 -131929 192660
12130 192660 53631 381464 212513 267624 2627 32117 287272 73459 8433 572151
12120 572151 592115 481941 261297 353797 377778 399370 -289426 -555822 -251620 -13089
12110 -13089 -342574 -133332 222033 348034 158397 206356 213766 -457684 -615838 -58637
12100 -58637 -9870 -211407 245738 146773 -64614 181225 322405 70615 39698 147377
12090 147377 21856 -125853 8120 294370 654860 548513 228959 -271498 -280105 -47790
12080 -47790 187047 164737 8112 -57260 -26059 -108287 -32747 136284 302772 -26699 -110372
12069 -110372 -221645 53572 -89943 217600 286147 380304 109060 73231 170752 596021
12059 596021 620351 -90420 -29314 -149503 -606631 -318919 11461 199341 56311 84109
12049 84109 261910 -321477 135752 10253 -223198 -472220 -327065 -20409 255141 236116
12039 236116 419727 381698 9285 -154987 245125 239761 122409 67411 155270 110707 304464
12028 304464 -182065 -408914 -126928 200103 401578 151310 16544 -162457 210908 152180
12018 152180 -129991 -296712 -254934 -358614 46304 205318 -13086 -160709 6768 435256
12008 435256 652330 339948 -114810 -69916 156726 340939 473238 64278 -17277 104174
11998 104174 181675 238453 -294004 -469882 -650729 -313524 73457 -163002 -617633 -523597
11988 -523597 -68455 -145917 -246189 -355883 -141988 -475406 -332173 -240813 -157475 10309
11978 10309 -151526 -434669 -91133 -134407 -116110 337472 -10080 54544 247442 232618
11968 232618 -124270 -358019 -251606 22861 53040 26126 514 -4791 275069 -24505
11958 -24505 -330194 -262809 -104208 62059 -20286 -302713 -376066 -445578 -479742 -371280 -76536
11947 -76536 -143212 212376 -305825 -12739 286057 -27537 114718 117616 301730 29552
11937 29552 517273 518413 219358 154421 539429 95584 -253054 -116076 24074 266252
11927 266252 -130004 -253479 3241 -21590 -7019 -69384 -134695 -379850 -82644 71899
11917 71899 -285483 -90904 715507 482376 412592 -35907 129652 274997 247647 532263
11907 532263 485334 509183 155200 320867 170531 354590 557562 318135 -293871 -166666
11897 -166666 -200799 -272852 -309040 -135888 -320108 -394589 -245493 -216821 -64408 -259109
11887 -259109 30113 -243657 -257229 -178256 -221153 -213519 574928 502621 195783 141405 467026
11876 467026 51230 -275437 -258432 -285938 -215268 -84870 -88509 -392763 -541014 -260490
11866 -260490 40560 -251424 -254272 -183709 -244688 167432 369651 393984 286476 58872
11856 58872 460016 209801 475385 115103 110289 -285811 -160396 -85870 116711 151877
11846 151877 306836 96329 378662 360462 -15049 -397897 -345629 -234903 43257 43668
11836 43668 -568114 -364378 149562 320775 267942 -119918 -269060 -108353 -89150 190860
11826 190860 54195 66838 -93724 144562 7650 -196347 132303 -307555 -438285 -235134
11816 -235134 -504360 -263122 -167337 -89398 221119 131328 -218257 -39223 -79668 16107
11806 16107 -466203 -366690 -169836 -224969 -5655 -325544 -374946 -27926 -177931 297430
11796 297430 377851 730989 177605 -33685 -263755 -61042 123977 226025 217538 -251370
11786 -251370 305710 273118 91678 -272511 -178136 -245944 -131110 -307735 -77565 -154549
11776 -154549 360645 217291 -18050 -144601 -66615 74236 -409344 -81642 211858 350699
11766 350699 429419 748592 707016 804306 574092 30268 -274633 220639 388857 153521
11756 153521 -27566 -221763 -583159 -627852 -456274 -250025 268954 308324 435596 397463
11746 397463 101173 -95783 -198288 4099 -205825 -377391 -13298 209359 393678 399635
11736 399635 342335 10222 -212459 119824 -388948 -320708 -502185 -346285 278201 28113
11726 28113 -78332 -18165 75548 383947 531771 782399 574080 171163 87247 80377 362118
11715 362118 642222 123815 -198007 -121134 270046 648364 459136 783504 425199 171818
11705 171818 -71522 -369054 -395097 -97171 -343398 -536703 -320983 43391 -78705 -241765
11695 -241765 34033 92237 -299342 -257779 22125 -674946 -937348 -318880 -294824 -528709
11685 -528709 -353068 -45938 -72777 -91644 -78167 -61224 -585667 -308964 85770 122516
11675 122516 118873 207927 402788 560521 286986 -87559 -440890 302816 147302 -25227
11665 -25227 212079 151625 158437 -27284 153481 -122139 -361196 -364044 -397201 -359084 -320249
11654 -320249 27032 -98669 112287 176018 117591 300247 287972 265972 -358 3374 162894
11643 162894 -144408 -205273 17722 -14640 501509 252371 284637 -57539 -382703 -613086
11633 -613086 -154812 58317 -19972 -345951 -279586 -468117 -266693 -92694 -281650 -239485
11623 -239485 -384900 -208218 -46037 -240505 -203104 -339416 -87268 110006 183391 -464469
11613 -464469 -608846 -152905 257210 336308 358674 217778 -7837 15868 -126817 268796
11603 268796 602952 490101 352146 394800 -150195 -258035 -71202 139301 217185 66448
11593 66448 49962 93575 62968 -322441 56309 196950 49501 -20505 -331804 -163846
11583 -163846 463 -208500 -399811 -315643 -313180 -36798 74342 -92388 68926 -21545
11573 -21545 -102069 -149754 -99995 -93533 119240 -95725 -31265 79148 45607 -4528 -258827
11562 -258827 -480366 69009 394924 158132 -75904 40735 63092 -201371 -21050 52498
11552 52498 65043 -492756 -360070 -294152 170985 128823 71235 -180389 31440 136535
11542 136535 262470 82045 98255 -7757 25531 -38986 14047 -335409 -248526 -284945 -494458
11531 -494458 -493614 -166807 -163886 41756 157157 -138820 244830 302227 -46077 176505 -110051
11520 -110051 -233028 -158179 -615500 -145739 282567 262993 489963 -86840 -394578 165405
11510 165405 -167799 -59708 -200913 113153 -30477 178371 85970 -119539 -170157 33226
11500 33226 99742 -91940 172373 2173 145590 506937 235401 -104802 136833 527016
11490 527016 650461 440007 418107 126161 49124 279053 344967 629430 696756 634131
11480 634131 395779 343165 899847 938009 246092 2339 179661 253024 660518 764603
11470 764603 244957 439960 765227 93178 -279700 -92204 -137097 -102842 -19353 197820
11460 197820 199238 517857 515349 506511 211132 130258 -6296 172189 -427983 -514274 -207755
11449 -207755 -196508 -21251 93914 42793 12430 -8243 283062 544681 -34163 -74653
11439 -74653 -144343 -51532 -28278 -44500 -292634 -13530 -29922 -294679 -79539 264845 341327
11428 341327 95207 74268 144874 -72902 -231166 187890 24380 232323 265939 -56115
11418 -56115 76640 84879 227428 -330020 60916 694388 139689 3207 -48363 10566
11408 10566 181880 3227 -547229 -197224 34945 415330 531614 430688 353774 217707
11398 217707 -75245 -641441 -259082 -25136 -308152 -113643 173969 -151369 -236642 -180808
11388 -180808 -222241 -236976 -313558 -333326 -315100 -180864 124609 407261 806541 464044
11378 464044 583814 539338 597116 396696 218746 -48903 -79258 -440898 -348604 -188644
11368 -188644 101126 336051 365303 192345 432460 581443 153333 246565 168223 67007
11358 67007 -57311 -305251 -55621 -75504 -31474 309705 -7568 55837 154345 401672
11348 401672 284831 399337 210172 131962 8604 364501 220776 -211375 49882 332534
11338 332534 485719 349377 320906 390172 459709 -13177 372732 553359 337554 436523
11328 436523 653279 536660 565367 691419 416196 164652 132327 643987 775220 722034
11318 722034 670767 573395 890275 866998 544537 189975 336009 364261 194907 316469
11308 316469 230388 98481 94535 226496 81583 341468 416991 229980 106286 445320
11298 445320 748816 651633 358628 331910 119146 336162 267613 -68949 -89978 316605
11288 316605 198506 467535 579041 819689 935472 168858 144178 134829 24205 168062
11278 168062 355702 275541 13320 -112903 71298 -20312 227181 136492 739560 1130002
11268 1130002 861072 701330 392896 144646 23671 173559 374353 673773 789303
11259 789303 421394 324005 708272 602318 780586 724819 802717 685248 234474 468902
11249 468902 641047 676608 716027 336677 535759 648477 711846 1112852 780668 300887
11239 300887 586065 610096 748329 769979 359695 530044 909026 902557 933004 752968
11229 752968 877508 899182 933284 1001110 754584 741876 546549 403129 445311 772934
11219 772934 927328 1046051 1006450 661945 564886 310608 294854 330927 32387 242055
11209 242055 243191 404627 569737 805181 331133 824294 454688 -3670 71187 166769
11199 166769 394225 407538 -56933 546886 386019 514555 505208 344464 316098 224407
11189 224407 289504 154798 207080 368565 -53197 38845 243004 398414 613783 136443
11179 136443 411647 397240 525724 17545 -1539 -250492 -180218 335885 732990 385524
11169 385524 497445 625603 523137 457879 669342 421323 1038626 698841 452125 422508
11159 422508 145256 -5261 476255 737165 249515 403986 572102 553626 360667 128494
11149 128494 266509 547693 517464 791849 984805 1140808 1042110 690612 814135 679191
11139 679191 501327 611927 449277 688657 780233 791561 648579 780731 824508 867094
11129 867094 1019980 892676 1207298 1191839 1536703 1682366 1434167 1487230 956607 1166167
11119 1166167 1233607 1186438 1212340 1401548 1193042 1335659 1317492 1308490 1176492 1320394
11109 1320394 1638792 1703512 1321611 1434815 1473301 1219920 918065 733286 567568 850989
11099 850989 829545 477735 970988 1061664 1034353 931485 1555814 1707448 1309027 1068428
11089 1068428 1007829 1277590 1327069 1150917 1149972 1406442 1780036 1591040 1722180 1730121 1554763
11078 1554763 1567890 1392060 1535367 1806362 1537272 1651968 1284334 1526265 1576729 1442446
11068 1442446 1934560 1938718 1630462 1291894 1145215 1134486 1048642 1741049 1486494 1665585
11058 1665585 2064033 1773945 1303318 1266916 1307708 1046161 1301916 1487138 1903375 1613567
11048 1613567 1680635 1609997 1523270 1804167 2328813 2496456 2672114 2622817 2303325 2362841
11038 2362841 2317248 2239287 1895449 1848413 1918585 2287599 2194855 2221727 2529570 2745592
11028 2745592 2661614 2582035 2843055 3203101 3707689 3873025 3847171 3986642 4261812 4636701
11018 4636701 5285564 6192069 6740861 7085689 7210553 7274538 7183833 7061045 7562593 7227117
11008 7227117 7092164 6483040 6330987 5729694 5280109 4776539 3823962 3917391 3734176 3398875
10998 3398875 2955061 2733966 3053650 2935407 2612509 2478280 2344453 2146250 1962639
10989 1962639 1776662 1863488 2006012 1745926 1221157 1536706 1641712 1490949 1584768 2052307
10979 2052307 1738441 1698016 1659766 1916478 1944243 1646934 1500148 1568710 1669547 1738734
10969 1738734 1555930 1709321 1673928 1496326 1766123 1467205 1665829 1680680 1679994 1608719
10959 1608719 1300927 1208370 1609290 1511367 1324422 1486384 1490443 1540145 1854593 1529265
10949 1529265 1471916 1333246 1093143 1282878 1657466 1235281 1320482 1155094 1626129 1823325
10939 1823325 1302496 1558169 2097389 1758515 1332651 1819292 1979782 1912747 2241422 2152406
10929 2152406 1879335 1658833 1563719 1662605 1844586 1913326 1501470 1842534 2138738 2451506
10919 2451506 2494531 2503579 2598398 2202146 2660910 2345419 1483778 1882586 2058303 2031608
10909 2031608 2655922 2580711 2609068 2727842 2931954 2594150 2355931 2845247 3181485 2732196
10899 2732196 2800412 2997727 2888643 3115901 3353316 3248264 2671131 2563501 2880450 3128336
10889 3128336 3050559 2901579 2739689 3136322 2946986 2791031 2893036 2978182 3002249 3518844
10879 3518844 3371163 3095345 2944613 2861984 2421671 2800257 2920686 2612834 2677422 2386232
10869 2386232 2490065 2503950 2610199 2557646 2811956 3356762 3194013 2966415 2749526 2954229
10859 2954229 3160393 2996044 3033761 2749584 2651052 2998717 3405661 3417683 3480887 3212420
10849 3212420 3232538 2992571 3786719 3990759 3567934 3874247 4227497 4174616 4016531 4419724
10839 4419724 4291786 4227437 4203431 4188913 4190751 3777116 3714619 3509612 3439205 4026833 3786789
10828 3786789 3361153 3543223 3624751 3490549 3464261 3514367 3426889 3237027 3559459 3120196
10818 3120196 3512118 3946896 3541085 3568970 3351181 3531648 3743280 4007146 4254505 3802548
10808 3802548 3709778 4014519 3836469 3954347 3921799 3619621 3462587 3984989 3892820 3862912
10798 3862912 4168355 3879649 4182626 4121719 4272067 4128930 4142985 4062823 4318161 4603242
10788 4603242 4593448 4891585 4950140 4367581 4488230 4674988 4404782 4165301 4342199 4446830
10778 4446830 4619634 5036466 4945095 5260048 5048247 4951057 5134258 5378460 5776294 5679714
10768 5679714 5139719 5134984 5404486 5510836 5632013 6230251 6034524 5886508 6597456 6821912
10758 6821912 6629922 6606958 6614507 6892246 7266424 6962659 7253539 7238751 7316168 6900050
10748 6900050 6947367 7381112 7211269 7297453 7328341 7519761 7721248 8152017 8143667 8077612
10738 8077612 8139816 7969008 8269038 8526938 8216535 8647359 9257017 9343522 9187815 9660418
10728 9660418 9810389 9907014 9952155 10120806 10169827 10219992 10255476 10410937 10488240 9746426
10718 9746426 10389895 10721498 11056698 11255230 11141471 11378477 11623668 11747797 11592176
10709 11592176 11232004 11320668 11249365 10524292 10427328 10922868 11207475 10887081 10795983 11110958
10699 11110958 11377836 11337063 11225350 11667733 11540332 11435098 11850293 11844893 12143451 12125034
10689 12125034 12185509 12444119 12661247 12870429 13152575 13257544 13936300 14185990 14545732
10680 14545732 14448673 14857814 14744622 14648921 15581227 16410639 16217194 16302532 16342650 16326414
10670 16326414 16111231 16865758 17191390 17191937 17934252 18011310 18273929 18642091 18967876 18803159
10660 18803159 19457589 19690315 20147138 20489995 21298674 21937709 22484296 23294180 24185491
10651 24185491 24761721 25353307 26284706 27429717 28457011 29368215 30601716 31908619 33085543
10642 33085543 34635529 36358579 38232729 39743097 41053324 42586795 44225153 46172257
10634 46172257 47806273 48882018 50279533 51372755 52261383 53052884 54156865 54323730
10626 54323730 54321386 54327209 54075634 53562321 53308801 52545020 51387551 51116801 50713527 50096465
10616 50096465 50223795 50707058 50534848 51344119 51781310 51773662 51685446 51781251 51574844 51193635
10606 51193635 51123984 51752761 52471916 52380422 52260887 52387522 51796956 51466075 51320438 50808203
10596 50808203 51146678 51516306 52230254 53181994 54093375 55745831 56965212 58072569 59279584
10587 59279584 60449861 61987399 63696826 65376179 67790783 70551604 73679947 77322399
10579 77322399 81392862 86376197 91756338 97330223 102917758 108513730 112427217 117145246
10571 117145246 120489694 122194333 123048960 122864020 122487072 121309480 118996594 116852029
10563 116852029 115255992 114470987 114531855 115128427 116641875 119339238 123848009 128379659
10555 128379659 133855926 139166965 143846497 147602118 150296543 152159845 154882895 158985081
10547 158985081 163656849 168918657 174271927 179089487 183649397 187879845 192524175 197933838
10539 197933838 202939265 206819048 211557861 215704846 218363220 219849618 220279159 220585770
10531 220585770 219822364 218823002 218429017 220091086 223405521 228226158 234726773 242430963
10523 242430963 250639456 258299038 264782906 269520840 272402909 275071770 278394850 281539664
10515 281539664 283396796 284604882 283609482 278649117 270817394 261480252 251482912 241561558
10507 241561558 231630546 220743571 209226178 196854966 183836155 171029646 160295172
10500 160295172 151536126 143582805 137367424 132301069 127627909 124240089 121029096 118116111
10492 118116111 116002489 114394756 112867813 112217051 111520600 111366685 111379394 111548916 112072215
10483 112072215 112261989 111792736 109870016 107583301 104657896 101364318 98787724 96294936
10475 96294936 94917906 93851266 91696577 89383643 86206206 82580858 79269919 76000234
10467 76000234 73297021 71166807 69721839 68526436 67453533 66642999 66172735 66618664
10459 66618664 66396131 66487039 66088389 66256985 66738293 67109351 67827987 68458194 69082539
10450 69082539 69821713 70509590 71051902 71715996 72183910 72313995 72394586 72367338 72553721 72209384
10440 72209384 71897629 71890055 72943740 73927876 74421753 73990251 73627000 73561124 72741030 72457529
10430 72457529 72758614 73549617 73522586 73500298 72100334 70712007 69759517 68728214 68587234
10421 68587234 68664906 69653918 70214975 69515245 68646874 68362033 67969831 66709691 66199428
10412 66199428 65983823 65025265 64437545 64335086 64259719 64662119 64810782 64472546 63892417
10403 63892417 63406350 62582303 61788630 61126099 60931040 60525141 61225442 62160788 63004354
10394 63004354 64297359 66209562 68456436 71093271 74398806 78967723 84405717 89505577
10386 89505577 94551520 100218214 106470143 112668415 117888643 122214490 126253331 127626122
10378 127626122 126810914 125367057 124725029 123598219 120319969 116119250 110963265 103394016
10370 103394016 94520068 86247263 78581225 71359042 65367849 60545896 56872644 53398303
10362 53398303 49998039 46767441 44964039 42592563 40300123 38728860 37673071 36340169
10354 36340169 34677967 33602290 32364302 31482209 30290530 29566770 29014387 28443048 27634670
10345 27634670 26945862 26265491 25871419 25169855 24345846 23852817 23614829 23353659 22387744
10336 22387744 21843847 21585061 21238883 20757000 20524331 20093218 19751256 19549267 19227824
10327 19227824 19427188 19355957 18685971 18570200 19057640 19028500 18544594 18193383 18125520 17600931
10317 17600931 17363298 17369357 17520788 17706333 17781636 17339952 17213930 17178239 17034337 17375171
10307 17375171 17817499 18126133 18286832 18003588 17997458 18297399 18051619 17586180 17005128 16858604
10297 16858604 16549597 16972723 16555672 16319519 16525010 16296151 16019030 16097189 15669789
10288 15669789 16151198 16292680 16306511 16203221 16076412 16065330 16392216 16564014 16367763 16793414
10278 16793414 17319254 17518778 17503563 17554733 17215167 17541453 17633034 17973961 18448933 18371891
10268 18371891 18248181 18511559 18887598 19617542 20297856 20861384 20791748 20952280 21131482
10259 21131482 21832875 22132389 22866722 23141744 23767974 24459468 24795125 25447161 26384393
10250 26384393 27416297 28209793 29337124 30875059 32648198 34338012 35827076 36691185
10242 36691185 37242345 37455013 36848631 36774569 36983817 37249210 36597564 36528068 36951544 37076596
10232 37076596 37171539 37813983 38468209 38670369 39309383 39522830 39745092 40172550 41011889
10223 41011889 41680215 42518919 43641600 45672776 47708394 49873843 52911217 55787283
10215 55787283 59196479 62930034 66879004 70133035 72496553 75568462 78225205 82467193
10207 82467193 87456949 93846830 100898044 108254757 116132872 124895280 132647779 134880614
10199 134880614 133506310 130996138 127864916 126253832 126366489 128196588 127785962 121996328
10191 121996328 114525298 105699420 95989513 87415174 80573667 74991003 70444166 66333600
10183 66333600 62136741 58414395 54606489 51237422 48861957 46395117 44340033 42717191
10175 42717191 40976993 39895075 39028007 37828285 37084402 36246017 35596721 35098145 34119218
10166 34119218 33197364 32718311 31922102 31469342 31465831 30987007 30549205 29948229 29566630 29259275
10156 29259275 28679817 27870231 27700133 28060156 27965967 27906199 27477482 27309664 27363532 27764820
10146 27764820 27495509 27042819 27135932 26794018 25993431 26187040 25778203 25601330 25276324
10137 25276324 25263671 25376531 24944692 25313299 24944480 25226623 24991285 25076870 24688529 24578581
10127 24578581 24954869 25151590 24652724 24562228 24643073 24896407 25167270 25297876 25236984 25238562
10117 25238562 25564176 25888638 26207215 26873301 27675959 28309047 28730762 28712940 28949104
10108 28949104 29012938 29645857 30171211 30386218 30791051 31058149 31497773 31818775 32402856
10099 32402856 32939811 33715075 34356328 35201133 36498424 37358119 39005835 40661221 42878695
10090 42878695 44787006 46847852 49379481 51636870 53139271 54178192 54792824 54527059
10082 54527059 54963389 55177350 55509917 56555120 57488691 57654599 57309850 57015149 55842549
10073 55842549 54908056 53900039 53196740 52393833 52658765 52631589 52608150 52736517 53123745
10064 53123745 53782407 54509625 55604416 56553101 57374321 58473092 59974408 61961878 63485332
10055 63485332 65362991 67763285 70414116 73554588 76574569 79992663 84063556 88496916
10047 88496916 91432450 93830312 95543499 97202971 98783191 100110178 101752068 104497218
10039 104497218 107389956 110407769 112126115 113038018 113948442 115224663 117411534 120374681
10031 120374681 123864807 128624656 133887230 139669905 144780448 149739956 154460940 160028808
10023 160028808 166310907 171454438 175381975 177746527 178262189 177829887 177524792 177717996
10015 177717996 179120049 180780684 182920684 183232686 182845340 181367349 179730492 179521871
10007 179521871 180204069 182743375 185904034 188463795 189891375 191379243 192771271 194308457
9999 194308457 197096528 200619362 205705489 210258018 214523258 217173908 220178941 223767811
9991 223767811 227299890 230466873 233616501 236999689 240004772 243089217 247233968 251267805
9983 251267805 255018418 257169698 256959463 254478500 250560605 246841065 243647935 242188054
9975 242188054 242320598 243382352 242863630 240325120 236069637 231405074 227247983 224717109
9967 224717109 224966388 227035206 229320939 230612575 230840907 231195702 231184624 231115467 230128504
9958 230128504 229740939 229687968 229345412 226297992 220364178 213432904 206597210 200607379 195608793
9949 195608793 191706013 189391304 188108752 188294747 190131602 193030466 196342438 198997812
9941 198997812 201531679 202689346 203742745 203770322 202922613 202063436 200475455 196975212 192161498
9932 192161498 186232516 178541878 168742643 158615068 149010927 139427850 131726784 124512301
9924 124512301 117434903 111447070 106131552 101503748 97327361 93780181 91307241 88438725
9916 88438725 86347484 84398377 83455702 82711974 81923961 81602120 81390117 82387104 83428502
9907 83428502 84988255 86443254 88503588 90554794 91864778 93233188 93846482 94237716
9899 94237716 93503754 92682008 92383490 91515208 90151520 88759074 87522370 85982954 84363758
9890 84363758 83668608 82140015 80657780 79682220 78261670 77114196 76354162 74896645 73943981
9881 73943981 73341052 72895103 72192166 72255868 71785258 71389580 72085980 72695570 73907481
9872 73907481 75083958 76409652 78128074 80550228 82744926 86110491 89312733 93025601
9864 93025601 97285005 102130111 107504931 112711780 116671329 119205534 120753637 120447092
9856 120447092 119651661 118209659 117095450 116791761 116388752 116483923 116856363 117683308 119268118
9847 119268118 121589545 124975442 130242471 136484617 143180462 149978311 158767060 168551186
9839 168551186 180618395 195586770 214046132 235468036 259665462 287268818 321281919
9832 321281919 359784204 397115498 402393747 379236628 355982942 326509174 294983560
9825 294983560 270046723 252091634 237695403 223720544 210326786 198639209 187143636
9818 187143636 177309806 168202778 160067278 152543666 145995501 139796924 134582071 130892274
9810 130892274 128246797 126208605 124348215 123211881 123057795 123288845 123994348 125017097
9802 125017097 126490856 128811696 130360935 131073621 132862821 135065507 136279370 136746507
9794 136746507 136815044 135562916 134442893 132282987 129971529 127368548 124083474 120827970
9786 120827970 116657332 112809646 109083047 105755112 102621634 99483247 97399181 95854294
9778 95854294 94251048 93083750 92523652 92291491 92907584 93735994 94731996 96018420 97834805
9769 97834805 99971193 101441531 103121149 104913442 105974733 106319753 107096492 107109019 107090115
9760 107090115 107323214 106509796 105281786 102919298 100636266 98798467 96979374 96020402
9752 96020402 95551603 96548237 97584588 99675187 102290978 104271210 105765019 106198593 105200348
9743 105200348 103361437 101136824 99300276 97346856 94724906 93094579 92050502 91293949
9735 91293949 91216343 92163648 93682111 94861389 96159993 98137583 99192458 99799864 99979267
9726 99979267 99645100 98860799 97889200 96619970 95944877 95652874 95290104 95313282 95778039
9717 95778039 96471916 97587204 99522382 101768988 105480715 110196111 115752932 122434623
9709 122434623 129992097 136735217 141083717 143047084 142086091 137724369 132541675 126934907
9701 126934907 121087335 116984361 113551036 111292199 109775109 109710198 110556889 112273515
9693 112273515 114417260 116975948 119213336 121679939 124771518 128061298 131848042 135863034
9685 135863034 139763485 143168944 143931339 142409499 138956351 132245324 124835540 117975352
9677 117975352 111810436 105767263 102107070 99387922 97531001 97478635 97871311 98886062
9669 98886062 100894780 102434186 102375921 101584821 99175561 94706152 89220430 84543883 80493716
9660 80493716 77447381 75355338 73921413 73099891 72728461 73296284 73515181 74233609 74686436
9651 74686436 75538003 76655982 77998986 80127096 83095360 86334123 89925137 92777091
9643 92777091 93057120 91628684 87668994 81193924 75084519 69309716 63890226 59421299
9635 59421299 55258620 51779643 49233975 46923285 44558433 42693816 40788802 38960396
9627 38960396 37709958 36253503 34964326 33935317 32858650 32050506 30861620 29633529
9619 29633529 28897628 28742128 28157356 27258346 26477167 26221636 26228322 25545512 25299943 24716239
9609 24716239 24607967 24528404 23797705 23381449 23059794 22928794 22666449 22377206 22347101 22033491
9599 22033491 21723070 21435324 21179175 21702401 22047619 21707927 21672937 21878643 22288876 23109474
9589 23109474 23684766 24157511 25041322 26133413 27399293 28399334 29271528 30093811 30114792
9580 30114792 29257776 28105255 26634441 25383322 24151003 22341958 21106304 20260699
9572 20260699 19834607 18706373 18317466 17881423 17399243 17039181 16892439 16527563 15603562
9563 15603562 14868354 14641616 14183124 14026718 13969896 13717367 13420039 13528772 13784067 13441880
9553 13441880 13731442 13784120 14224409 14685839 15271792 16180969 16859739 17584276 18686432
9544 18686432 19920693 20319623 20482874 20363275 19727048 18744639 17634062 16139622 14904294
9535 14904294 13849656 12872542 12358201 11596595 10704902 10326015 10245498 9770357 9187143
9526 9187143 8961143 8645533 8542046 8425014 8244835 7611808 7381812 7176258 6675693 6732134
9516 6732134 6773904 6766746 6187312 6337081 6452295 6294144 5951139 6115552 6143137 6038429
9506 6038429 5729236 5917048 5524498 5281392 5195510 4925661 4828981 4520442 4826708 4960336
9496 4960336 4951831 4573447 4522273 4656116 4377369 4575174 4679844 5246150 5219163 4620254
9486 4620254 3953281 3736026 3978613 4092784 3993224 3685578 3959009 3828259 3490690 3264618
9476 3264618 3347693 3563680 3706257 3737722 3591600 3569022 3962190 3662572 3430015 3619967
9466 3619967 3601146 3377693 3479247 3649000 3328018 3327279 3725296 3734690 3150309 3420068 2913956
9455 2913956 2902156 3252982 2751340 2700394 3095733 3395926 3102970 3197279 2896015 2996437
9445 2996437 3140649 3083847 2784063 2683745 2506601 2732085 2612341 2848601 2661083 2738145
9435 2738145 2777444 2727888 2506357 2392028 2409704 2416868 2747449 2767101 2716183 2502546 2530623
9424 2530623 2811112 2525010 2799125 2821988 2504119 2955129 2660497 2441662 2484475 2041239
9414 2041239 1464810 1593515 1819126 1989858 2344672 2412794 2125329 2203302 2532928 2433771
9404 2433771 2156256 2289833 2236955 2268997 2114509 2051421 1622360 2041061 2366077 2543446
9394 2543446 2088774 2152978 2250298 2147787 1992197 2022093 1631957 1839957 1970669 1486969
9384 1486969 1409904 1473921 1515135 2181191 2389759 1849676 1474701 1591762 2071272 1937765
9374 1937765 1833586 2210837 2534793 2451759 2313749 2396123 2416188 2154248 2259867 2496633
9364 2496633 2589546 2205946 2357117 2442948 2519135 2516693 2275997 2213708 2845909 3328859 3417043
9353 3417043 3349006 2877099 2879297 2924800 2481173 2661649 2249186 2245921 1984599 1975132 2179972
9342 2179972 2584031 2729807 2840999 2822892 3058934 2635534 2034779 2387178 2221913 1848962
9332 1848962 1849725 2131232 1973037 2055804 1833434 1527565 1528581 1716939 1843187 2073628 1960629
9321 1960629 2225447 2477526 2238846 2060180 2064087 2195647 2033557 2142966 2141218 1642334
9311 1642334 2072756 1952639 1599576 1523284 1616204 1417505 1587039 1762008 1693655 1825197
9301 1825197 1517038 1609048 1503989 1689192 1600608 1493717 1110110 1398539 1973897 1862421
9291 1862421 1804125 1918368 1647446 1297447 1327436 1462935 1506840 1673074 1816439 2059334
9281 2059334 1838240 1799679 1625090 1245915 1646835 1776574 1569521 1741240 1464043 1614127
9271 1614127 2064567 2079416 1623644 1766639 1743665 1387576 2075115 2313159 2200375 2785717
9261 2785717 2904937 2807706 3182004 2947810 3251027 3432102 3524369 3908456 4030480 3528997
9251 3528997 3356851 2891078 2895347 2656321 2649045 2158593 2084836 1777476 1755919 1665127 2089077
9240 2089077 2022014 1491775 1458887 1670499 2029975 1899639 1736622 1860525 1888690 1801359
9230 1801359 2028413 1959417 2065856 1854839 1632690 1872724 2027372 1707186 2163352 2442011
9220 2442011 2626606 2748137 2948834 3048632 2925993 3042828 3070299 2954458 3115563 2810405
9210 2810405 2751204 2171321 1685130 1902080 1680294 1578829 1667009 1478965 1545824 1510924
9200 1510924 1443879 955652 1288390 1259303 1163656 1761578 1570393 856629 1110550 857532
9190 857532 650874 559127 1227379 937989 813059 790378 1169337 1235074 443693 639424
9180 639424 858072 1073196 775485 752827 592010 537319 629762 829463 621921 447552
9170 447552 624629 1095463 1051640 992713 1008878 782280 395182 738032 736618 861770 881950
9159 881950 888539 925120 776194 727101 657090 663564 968039 803914 834942 716033 830951
9148 830951 343538 707378 883520 988998 821543 557672 625621 836460 873885 1012453
9138 1012453 908376 893502 742892 572561 757629 642461 650337 494984 1104660 988925
9128 988925 1297548 1397744 1041921 695170 1041304 1421033 1492052 1065614 1181622 1217614
9118 1217614 1314334 1243206 1040584 1192792 1182107 1250112 1245023 1225802 1823857 1955458 1184256
9107 1184256 1607610 1783895 1847898 2026709 2035947 1950951 1646478 1793962 1576433 1496478
9097 1496478 1563238 1459343 1830070 1927976 1817117 1803910 1669819 2114358 1695342 2001753
9087 2001753 2342630 1997939 1918155 1960032 1969820 1694470 1851235 1668580 1894325 2545791
9077 2545791 2416817 2489109 2902945 2686861 2675285 2448506 1874416 2016750 1888122 1750310
9067 1750310 1728649 1431481 1641420 1795712 1696549 1467826 1476486 1693694 1677713 2083045
9057 2083045 2119673 1870475 2122854 2060804 1707091 1682175 1417007 1645111 2402219 2220452
9047 2220452 2001919 2053758 2410772 2730204 2720375 2449818 2269103 2148444 2285570 2313328
9037 2313328 1960296 1884047 1642055 1277894 1324828 921642 875121 1110750 925993 1064596
9027 1064596 1054559 1055023 939185 1075995 1308873 1261574 1196154 1416606 1536286 1682841 1630889
9016 1630889 1056021 765910 1021287 1424991 1454118 1562498 1554691 1495172 1711613 1783582
9006 1783582 1629890 1371856 1241909 1458217 1021290 944059 1004810 647397 600477 430246
8996 430246 812920 738530 770466 1452344 1537352 925683 996554 1372484 1581966 1113552
8986 1113552 1039701 939739 871917 993575 921957 1237901 1132588 1261977 1285488 1159770
8976 1159770 964934 549247 627821 690976 465884 275038 437895 666178 260717 314089
8966 314089 332826 86946 24392 -57524 427248 824013 687736 579142 546170 750795
8956 750795 435692 264420 54970 351212 401201 329542 429938 323359 -164602 -34133
8946 -34133 -35391 -66474 193984 598316 339460 407484 378935 311641 312416 136406 395134
8935 395134 358119 237523 162706 67435 -39133 -172036 -425992 -300323 -151222 306902
8925 306902 362833 401463 277651 262368 295137 311966 239106 176820 -130202 211885 627673
8914 627673 555401 -39596 -216370 -177001 150727 129677 275794 313397 41977 19344 288329
8903 288329 228463 -26744 302228 290611 -97456 -345998 -125319 -33763 324013 117974
8893 117974 52383 468119 613664 189758 81177 118953 396240 389140 564425 438929
8883 438929 426591 214257 117105 705692 660273 228186 -191988 33215 -191509 -212375
8873 -212375 -164810 256613 126545 -366337 65370 365253 298588 -41691 174392 432203
8863 432203 193793 97195 180216 47103 -45705 -286014 73588 354077 -77651 243424
8853 243424 643576 181520 -9311 497289 184828 377021 296151 83757 319495 573247
8843 573247 226271 67569 606211 530830 156509 178010 48409 -124803 87652 462241
8833 462241 356683 -46917 47319 227137 75841 -115331 203248 401622 229876 493410
8823 493410 298137 102828 117473 208406 179670 284559 294297 -30942 138201 70079 151445
8812 151445 244361 706710 508330 18659 25833 164273 255313 -63460 -109641 24852 207591
8801 207591 172658 -187453 522110 384960 89077 117699 254652 357550 -49648 75167
8791 75167 -287265 261437 353565 315159 303527 258354 -51124 63468 340784 321960 768149
8780 768149 143387 -66188 -272982 -227276 -17181 479984 174682 -310029 -225651 -191996
8770 -191996 -128818 -145215 -59585 112906 204179 -136143 -497770 -319789 -121056 -26212 -311136
8759 -311136 -440006 -176545 -325808 271394 393764 -23284 -39277 -328522 -648120 -329668
8749 -329668 -382098 -272990 14868 6159 -88634 -267331 -329044 31184 202688 -93588 347737
8738 347737 174811 11396 63759 -5124 -189564 160212 42384 -189993 360932 567628
8728 567628 -93215 -333554 -180388 46634 100055 309923 120516 -86805 42338 23190
8718 23190 23518 38942 139107 293813 -75552 37538 89890 -208850 -585609 -339437 5686
8707 5686 8966 459494 371935 23076 68151 447504 -329790 -630075 -334709 186992 142403
8696 142403 250510 87810 17701 -247787 -71046 -82869 -25401 462646 -122569 -86934
8686 -86934 -1596 137863 239570 50652 138210 165023 151344 107705 152678 316660 335167
8675 335167 522746 540913 455834 413428 141939 19580 -5335 201619 203690 -74073 -124808
8664 -124808 -118408 -70242 -276203 -193767 6065 -125271 -297028 -408953 21903 -184914
8654 -184914 122775 -6744 -38461 -235137 -163830 249138 34875 -229350 111330 16461
8644 16461 234475 197138 -77651 379736 126939 -29539 102242 408643 458402 -13576
8634 -13576 408842 361518 201475 206331 165837 -69863 167752 404875 356939 311266 644997
8623 644997 703094 -5076 368725 -126807 249213 453418 136603 -94986 -6521 41961
8613 41961 -2022 28795 354242 176567 137647 154565 269804 402592 428817 266962 145610
8602 145610 -92125 142259 528917 272335 84677 32186 265949 342163 -139587 76251
8592 76251 305903 375461 415620 273729 305469 68928 385032 668209 595227 247257 366151
8581 366151 631029 485240 -229584 -358478 -86352 -153426 61047 -91182 235573 -269550
8571 -269550 -865052 -271391 124857 122015 190412 486644 600188 628946 692071 246139 -16736
8560 -16736 -233829 -361442 -376721 17209 149405 144926 109201 156645 6043 3928 144301
8549 144301 225185 444088 -92398 25522 189764 461475 143692 10325 -102928 -88237
8539 -88237 -229281 -72847 -175498 -68679 -194299 -1579 79552 -3337 -307231 -189021
8529 -189021 234440 -59011 -225323 -275731 278061 206314 219498 307595 92531 73490 24500
8518 24500 45015 -77296 -469402 275351 692108 516708 313719 474248 268048 379111
8508 379111 31346 -56325 71591 62195 -108553 -238207 -42317 362155 4884 -649047
8498 -649047 -406705 -140802 -460912 -474656 429742 433310 -314741 -410582 395894 123216
8488 123216 -219958 -377663 -274811 -108717 -165880 -156555 -64197 -302287 -351659 191022 324979
8477 324979 468488 117212 -168042 -114554 -221474 -362154 -117138 218913 10245 117913
8467 117913 -54689 -5257 -294622 -569107 -502745 -456311 -212535 -143184 -7195 484287
8457 484287 690801 180292 -24635 196830 221766 359273 134605 116255 139681 14603
8447 14603 5222 -104815 141016 -124446 -170850 90245 -172727 -426451 -543849 -901020
8437 -901020 -353321 -213861 -176875 -110952 -274989 48931 2978 -175712 -509572 199782
8427 199782 434959 232017 -114859 299763 587659 335997 332135 210118 -36796 266345
8417 266345 331193 27755 -201133 -57569 -31201 -354668 -139131 -209469 -379044 125193
8407 125193 235541 226794 115202 11639 12995 -132808 121902 649036 574438 326588 320282
8396 320282 365870 878244 602571 727520 354045 3423 -367826 -91279 627978 810258
8386 810258 543262 490423 521307 253093 251482 706021 630821 511426 103699 225598 691402
8375 691402 335674 51661 -23385 389213 380250 -132958 -28659 204158 471425 198760
8365 198760 -90595 328306 923110 589596 394911 666241 284557 348507 168648 363552
8355 363552 543170 558242 624323 756693 675981 603849 754899 797222 232818 59045 243629
8344 243629 381932 537830 -54011 -262621 44711 140523 -125052 -246712 -361808 194388
8334 194388 158923 -121091 84995 433438 710907 70042 -448975 -337736 -119734 285471
8324 285471 375038 -20550 219352 733243 403605 -470699 -225459 14090 266087 876206
8314 876206 414553 491483 608706 224314 128680 19138 -44659 -275235 -25065 190973
8304 190973 29706 58410 -13234 -95768 367475 292308 -367992 -495239 -215841 -240312 366201
8293 366201 1004334 628123 276436 60572 105457 65428 113280 161300 412731 451519 118081
8282 118081 -9773 310200 198935 373365 332274 440861 731969 388666 -30989 -252746
8272 -252746 135040 698966 277805 68331 -62622 89365 137852 -53708 128080 -169390
8262 -169390 -95385 49382 42873 -394933 -349288 -84845 203474 240385 52410 245360 502372
8251 502372 87458 73900 449170 484651 107873 94896 -176453 -57925 27186 345373
8241 345373 893899 775112 434599 163661 -30186 178662 230602 551816 454899 808119
8231 808119 941087 548855 698023 715906 566455 850014 1324136 1169382 1086998 1035908
8221 1035908 825957 916462 593277 827367 510131 223741 431566 849340 871014 373543
8211 373543 481671 634085 811367 586207 688230 833908 357458 5664 95380 95069
8201 95069 343610 138756 398174 582097 688142 218612 391143 427396 641718 -425697
8191 -425697 -543718 -190512 203319 479120 182457 315880 257852 114363 54536 528608
8181 528608 352012 427178 450900 375827 183041 173315 571040 704103 284087 626276 692982
8170 692982 482487 709116 686505 683574 1235506 1161374 463530 569116 628769 227871 200053
8159 200053 672978 899842 803970 980831 862394 750924 1101318 1255295 905534 662457
8149 662457 522269 838461 831720 656575 861683 688994 838677 1047016 846229 575582
8139 575582 679100 813603 482273 426788 757706 771465 939195 872107 599163 27060
8129 27060 -109569 -69045 37512 766931 770912 479653 442176 296258 445227 362467 767721
8118 767721 363356 122747 697668 946119 1222750 1058597 1069342 774265 778819 738705
8108 738705 1037298 812529 458135 456695 548691 423259 796036 1242769 840664 413264
8098 413264 645072 1124621 524047 -22406 205875 479115 526634 889452 1180850 1335953
8088 1335953 955089 1158736 903557 461291 609596 674595 392841 616775 709394 817599
8078 817599 875962 688489 513987 712283 762612 960721 1062990 948419 1239213 872599
8068 872599 751080 1181438 1179312 1096964 1184687 1054825 1308777 1104849 844244 723833
8058 723833 941067 854731 870432 458997 525219 996058 1161033 1171519 887954 1004737
8048 1004737 950888 1078312 1091260 1435253 1419735 954937 743094 712535 1018706 928033
8038 928033 1217347 1289331 1052195 938813 929759 953238 1154596 921890 966280 1250286 1389810
8027 1389810 1100512 1028748 1090598 936168 1134190 1355554 1267048 1208486 1205709 1259912 992139
8016 992139 747090 861833 1123162 1014219 886129 1031657 1501983 1302444 1059307 955780
8006 955780 813922 1048110 1380629 1062816 1027643 1270122 1054589 1063544 1094235 1308684
7996 1308684 1447905 1445320 1293473 1597798 1232052 1330934 1185283 856902 957060 1158382
7986 1158382 1287156 1342830 1756947 1809836 1254902 1193963 1922244 1618958 863122 1035056
7976 1035056 1156006 881932 539231 837512 1277536 1110382 630325 711642 864262 1033324
7966 1033324 1169343 859971 884219 1310645 1016011 906788 878257 1436850 1813305 1971702
7956 1971702 1968645 1454270 1960624 2001323 1678278 1198136 1527026 2267418 2327095 1694939
7946 1694939 1516740 2259141 2403996 2404697 1845522 1866069 1996199 1807051 1806779 1821669 1783242
7935 1783242 1757170 2321581 1824449 1630084 1954430 1864442 2007110 1995318 1979830 2006338
7925 2006338 2269406 2376577 2644990 2139588 1921045 1767875 1493355 1382701 1609792 1141066
7915 1141066 1039534 1011404 849066 914470 1453861 1578417 1384467 1569060 1198807 1225835
7905 1225835 1353402 1515998 1537849 2073658 2006143 1817199 1613306 1586136 1427763 1702710
7895 1702710 2085498 2420656 2571528 2649504 2465044 2375274 2172519 1859540 1816586 1925594
7885 1925594 1923263 2240924 1846889 1944691 2172700 2507210 2263473 2074652 2494581 2502467
7875 2502467 2641051 2538800 2286928 2840055 3114282 2943566 2749482 2909419 3327308 3391315
7865 3391315 3491335 3493385 3659312 3832805 3859817 4183467 4634467 4554851 4518312 4030815
7855 4030815 4152624 4403476 4471269 4194594 4125286 4381924 4504182 4500945 5190896 5279743
7845 5279743 5554059 6243699 6644085 6575536 7337267 7920641 7552523 7159620 7505200 7501966
7835 7501966 7136301 7399612 7538982 7356764 7081278 7072457 6941701 6389675 6867836 6777203
7825 6777203 6449103 6772980 7164023 7325913 7417342 7715667 7774134 8107642 8328329 8423164
7815 8423164 8842888 8633192 9985645 12205750 11688277 11234745 11080083 11357173 10744163
7806 10744163 10307485 10092790 9806864 9457483 8324859 7904015 7666309 7103736 6536060
7797 6536060 6299536 6780543 6146685 5979960 6052684 5688272 5722511 5623171 5336875 5717286
7787 5717286 5582823 5830924 6879576 6830673 6658983 6857641 6812299 6300163 5864319 5955308
7777 5955308 5768111 5261332 5076506 5153663 4683653 4637719 4659593 4301539 4049554 3371796
7767 3371796 3424135 3006157 2946335 3658973 3450192 2824059 2641967 2390169 1884823 2600718
7757 2600718 2771775 2335033 2263570 2108601 1459315 1941583 1884043 1760298 2092167 1712237
7747 1712237 1777559 1929049 2246055 2230085 2481985 2037563 1839324 1864196 1648681 1464667
7737 1464667 1571746 1502074 1390766 1250711 1216703 1481941 1090560 696487 1244727 1265183
7727 1265183 1034486 905426 1439586 1393954 1247040 1176937 1059871 1525204 1503081 1354983
7717 1354983 1168724 983584 1192961 944019 809748 924273 1171234 1504330 984292 859091
7707 859091 606126 766616 1172798 1051808 1105967 1196971 1056478 848540 624724 636665
7697 636665 830556 874643 669625 621925 1010870 1277201 1118686 944589 1033627 1211359
7687 1211359 730525 596720 1342055 1223868 1088626 1067979 639070 397539 631848 1144033
7677 1144033 1255415 1065988 1384793 1388084 1256487 1282849 1500770 1373936 1318609 1200007
7667 1200007 1625294 1775189 1359034 1456669 1314777 1098248 705358 921098 1019888 1036769
7657 1036769 1175212 1434861 1438132 1155617 1050925 1247826 998293 1129150 1653553 1638177
7647 1638177 1706615 1497498 1205362 1144224 1247763 1601108 1569546 1606519 1579133 1621978 1976496
7636 1976496 2256346 2355395 1767787 1550554 1652454 1726152 1559497 1467434 1587460 1520293
7626 1520293 1843075 1619796 1329207 1326199 1686205 1447214 1514302 1509433 1494613 1679721 1507896
7615 1507896 2180120 2154390 2293723 2415699 2001614 1794638 2396928 2623209 2455900 2739074
7605 2739074 2890153 2734083 3038880 3003450 3122447 3321895 3124678 2527164 2861960 3084434
7595 3084434 3066360 2949216 2461340 2657035 2846104 3375814 3179535 3135565 2976566 3063498
7585 3063498 3281653 3562103 3665631 4371412 4095614 3938024 4592856 4839532 4639303 4474659
7575 4474659 4767399 5311924 5277875 4633595 4475660 4417327 4137101 3844523 3969572 3806331
7565 3806331 3560120 3583299 4037474 3313773 3410641 3677081 3422383 3489112 3842107 4078393
7555 4078393 3552712 3350170 3241722 3604430 3950930 3961964 3861461 3593785 3615741 3584377
7545 3584377 3644955 3843086 3613258 3536135 3128804 3407795 3398482 3524007 3278650 3619664
7535 3619664 3567831 3095428 3333039 3587358 3907214 3809426 4012818 4163048 3895475 3428436
7525 3428436 3685900 3768102 3813381 4127787 3610298 4205973 4676913 4274764 4434928 4243392
7515 4243392 4258985 4772505 4751601 5156233 5076760 4874132 5130031 4819927 5059524 5113203
7505 5113203 5113832 5229146 4950874 4803136 4927455 5333266 5221507 5133023 5118148 4964171
7495 4964171 5721055 6301387 6641177 6217283 6349014 6570849 7305490 7574206 7401508 7130086
7485 7130086 7028190 6937721 6743674 6857422 6751533 6778715 6946716 6372663 6421997 6475905
7475 6475905 6408653 6279640 6129153 5964754 5877319 6145995 6195416 6028788 6259638 6638584
7465 6638584 6675023 6483889 6654309 6671524 6894774 6858993 6852546 6402664 6249234 6279967 6385949
7454 6385949 6745339 6580889 6370362 6231307 6432303 6153488 6344056 6568860 6616753 6876794
7444 6876794 6930649 7505323 7115307 6480730 6977803 7266870 7577188 7523474 7958000 8237157
7434 8237157 8093361 7859530 8001565 8630752 9473079 9854268 10064815 10497892 10682804 11042381
7424 11042381 11614656 11536345 12196299 12764641 13645777 14491599 14735570 15481843 16571662
7415 16571662 16710509 17524576 18269021 18271544 18480393 19027189 19040721 19025495 18859397 18728067
7405 18728067 18710560 18975833 19493734 19522285 19453353 19703529 20716053 20990849 21416257 22087514
7395 22087514 22942830 23866893 24978456 26439669 27384615 28087495 28741215 29296966 29114279
7386 29114279 28626311 28078996 27510979 27280964 26661584 25874782 25411860 25190915 24614233
7377 24614233 24386152 23502372 23057340 22584014 22041216 21678372 21330331 21597552 21410351
7368 21410351 21087782 20500891 20457431 20464255 20854623 20728534 20326624 20245458 20224106 19325141
7358 19325141 18501871 17983055 17735944 17550123 17166390 16752195 16557270 15708979 15788977 15480561
7348 15480561 14868582 14242503 13549475 13569701 13176125 12883360 12585156 11806397 11866558 12097224
7338 12097224 11828678 11783582 11487115 11047057 10816693 10513384 10503218 10411077 10184486 10262299
7328 10262299 10075158 9898358 9714471 10157829 10188758 10126317 9656336 10127138 9997848 9995303
7318 9995303 10152752 11003795 10847052 10638678 10449568 10666498 10902236 11047271 11292427 11304281
7308 11304281 11315750 11532215 11236274 11500290 11705667 11578413 10987179 10715358 10950107 10610599
7298 10610599 10963137 11725960 11428899 11061189 11472521 11377138 11503227 11724441 12229178 12609749
7288 12609749 13113152 13040262 13348214 13493790 13979805 14284983 14227653 14668343 14844095 14752482
7278 14752482 14476272 14632988 14401770 13832955 13787671 13543975 13279197 13042683 12857262 12499064
7268 12499064 12782632 12974210 12980151 12988237 12719349 12964229 13059660 13152425 13297731 13716182
7258 13716182 14352582 14782054 14903294 15113591 15792575 16276424 16099608 16345861 16467209
7249 16467209 16146274 16823344 17392166 17565888 17495629 17864736 18427936 18830109 19039541 19693854
7239 19693854 19962260 20280181 20864121 21554226 22292454 23458250 24725010 25625708 26709159
7230 26709159 27968094 29274873 30795061 32288573 33850198 35373992 36251575 37300578
7222 37300578 37789576 37952707 38345136 39139169 39421054 39513258 39429259 39527474 40089862 41036087
7212 41036087 42491670 44046413 45307186 47327410 50118200 52587627 55748766 59255771
7204 59255771 62901340 66491928 70761644 74920667 79036214 82917258 85010718 86254228
7196 86254228 86138365 84460985 81883693 78775306 76465856 73913760 71926999 70615494
7188 70615494 69758465 69185428 69112433 69576886 70572245 72490340 74843011 77938555 81623350
7179 81623350 85143147 89260498 93798811 98388286 102164029 106241589 109146229 110667079
7171 110667079 109471132 105805543 101615172 96220451 90251042 85010263 80092840 75423830
7163 75423830 72208280 69716913 67167029 65167931 63818721 63375615 63356856 62886834 63377437
7154 63377437 63926582 64926226 66146243 67396401 67860010 68942377 68802941 68038029 67309256
7145 67309256 65866674 62641925 59311062 55889683 52849767 49917759 47538872 45183897
7137 45183897 42986488 40882734 39249386 38053163 36923388 36534700 35705921 34984646 34602103
7128 34602103 34121296 34047762 33831657 33465725 33131191 32527065 31901797 31339450 31095662 30936860
7118 30936860 29923762 29126528 29264300 29099894 28779637 28036590 28297725 28652350 28580586
7109 28580586 28385654 28891557 29430233 29749572 30126350 30351410 30677498 31292944 31427896
7100 31427896 31394501 30962636 30470447 30694186 31098670 30708845 30246070 30235425 30526896 30448523
7090 30448523 30624800 30762478 30713667 31333946 32103374 32514156 33528982 34479280 34861470
7081 34861470 35915794 37050473 37783326 37942426 37752319 37122660 36621937 36110078 35118191
7072 35118191 34487292 33584545 32868008 33040790 32963292 32732930 32142167 32145868 32364525 32698313
7062 32698313 33273773 33504383 34479882 34766341 35336795 36402453 37200751 37775544 38006538
7053 38006538 37781889 37533743 37179278 36474333 36056041 35661513 35278302 34597176 34236390
7044 34236390 33918336 33598534 33412225 33077675 33396876 34014462 34496282 35153284 35731454
7035 35731454 36123607 37077378 37791286 38458188 39438672 40098191 40593345 41360317 42059597
7026 42059597 42772086 43433620 43554435 43778158 43898017 44171336 44673922 44945156 45552841
7017 45552841 45803102 46443023 48088360 49043583 50468104 52618755 54785587 56909330 59167057
7008 59167057 61380878 63747278 66172127 68595815 70854789 72490163 73751250 74280832
7000 74280832 74494034 73557224 72535142 72167000 71713519 71798176 71614693 72129458 72631875
6991 72631875 73355998 74255921 75206624 76722823 78865228 81755025 84449060 87735168 91183270
6982 91183270 94673727 98310058 100851296 102708125 103493912 103460257 102908099 101687792 99957477
6973 99957477 98513211 97563504 96704264 96622147 96727845 96907390 97989148 98797157 99452339
6964 99452339 100503910 100678422 101197118 101210338 101197528 101185364 100931302 100581028 99915384 99393853
6954 99393853 98717454 97389869 95585814 93968989 92051407 90668499 90133827 89981802 90003553
6945 90003553 90596616 91890458 93366036 94659112 96520863 97727404 99142567 99512363
6937 99512363 98192230 96276063 93245358 89210182 84717165 80215134 76165514 72379268
6929 72379268 69228923 66684108 63773431 61442390 59660810 57861329 56631820 55938868
6921 55938868 55839642 55225399 54605699 54820586 55398715 55365256 55979535 56355560 55740053 54974313
6911 54974313 53301746 50687282 48363432 46159013 43682650 41203931 38296763 36941747
6903 36941747 35141576 33279510 31510267 30143317 28694916 27492910 26562404 25702982
6895 25702982 24888610 24330755 23373905 22708428 21828731 21651797 21484733 20510924 20098465
6886 20098465 19883530 19567106 19116742 18806595 18406354 18106025 17787047 17584727 17580151 16978847
6876 16978847 16084501 15870289 15766488 15658538 15103253 14767434 14407024 14057521 13509207
6867 13509207 12908652 13071904 12892518 12824407 12945863 12882803 12365392 11861585 11994285 12263417
6857 12263417 12096148 11917602 11590017 11575568 11679094 11387955 11493655 11622718 11489125 11250738
6847 11250738 11078185 11098519 10926211 11067004 10877459 10474201 10549833 10533472 10386160 9941711
6837 9941711 9647320 9243024 9399849 9314801 9759454 9476397 9022197 8902783 8827279 8571771
6827 8571771 8461714 8623675 8814005 9023967 8586485 8106492 8013997 8019553 8214218 8264589
6817 8264589 8422241 8345085 8121447 8438194 8608505 8623942 9017224 9149304 8913423 8894938
6807 8894938 9175056 9264276 9301547 8840990 8876847 8649269 8850124 9100753 9059578 9260488
6797 9260488 9569522 9946674 9777133 9930743 9769538 10385016 10139839 10518455 10949775 10733368
6787 10733368 11187018 11481012 11281661 11737554 12115311 11914462 11874639 12439286 12427375 12365754
6777 12365754 12494237 12269610 12392322 12438054 12936049 13098633 13250551 13093331 12678141 13098928
6767 13098928 13228560 13486760 13801748 14127145 14409842 14469979 14966538 15084849 15397138 15434976
6757 15434976 15585201 15447692 15887618 16388739 16494609 16869860 16822821 16843643 16895539 17175864
6747 17175864 16829260 16728218 17021617 17345180 16779817 17004101 17413989 17933348 18141886
6738 18141886 18143679 18468969 18884651 19642485 19635094 20990375 22277835 22381814 22572501 22987233
6728 22987233 23759745 24423139 25595012 26854719 27679613 28588301 29924441 31075756 31623176
6719 31623176 32702779 33340274 33393662 33387140 33290641 32580094 31869465 31368870 31101432 30828580
6709 30828580 30914837 30730016 30867840 31906879 32368202 32995620 33749087 34712111 36372912
6700 36372912 37434423 38525653 39614110 41079884 43163876 44781227 45838962 47046413
6692 47046413 47182947 46155016 45284086 43910815 41880555 40269145 38838722 37302034
6684 37302034 35985620 34581285 34009978 33616089 33077071 32899059 32552067 32601954 33060623
6675 33060623 33287177 33510728 33818593 34394193 34852281 35029488 35585034 35769861 35960860
6666 35960860 35892079 35072910 34543089 33480499 32841768 31930158 31385648 30963217 30378175
6657 30378175 29918462 29236767 28880723 28605971 28028837 27661892 27726648 27409282 27159261 27523711
6647 27523711 27545264 27983966 28206857 28218751 28411526 28598303 29151298 29310376 29765856 30187098
6637 30187098 30269462 30980764 31006913 31513470 32038548 32812095 33538386 33631590 34266735 34225293
6627 34225293 34938043 35771942 36378666 36922322 37461919 38375724 39241742 40147597 41278146
6618 41278146 42541092 43917864 45689840 46937776 47974693 49472950 51048833 52811646
6610 52811646 54552227 56058865 58090971 60674816 63424409 66246349 69321068 72719811
6602 72719811 76231739 79901915 83017463 86117303 87861719 88653423 88967874 88958522 88931192
6593 88931192 88931923 89301011 89891387 90606982 91068070 91371839 92174683 92517537 93408016 94520053
6583 94520053 95110531 96337892 98214550 100446810 103507920 107087847 111415967 116038486
6575 116038486 120288574 123257941 123951577 122495577 120204791 117460448 114316679 112104618
6567 112104618 110069820 108134000 106005308 104313972 103081020 101902918 100046165 98047713
6559 98047713 96426256 95044300 92972901 91496191 90356536 89101281 88372142 88166289
6551 88166289 88215080 88069464 88088605 87568688 86607088 85059776 82958524 80537060 78728842
6542 78728842 77205711 75363711 73889013 72946965 71623926 70464925 69908081 69256591 68970352
6533 68970352 68317557 67464384 66540123 66175501 65993767 65000818 64317513 63623018 62940334
6524 62940334 61984164 61123803 59745734 58938056 58372457 57732523 58234995 58100731 57957027
6515 57957027 58238772 59068760 60115160 60832368 62099769 63607469 65038595 66465183 67815252
6506 67815252 69208357 70526942 71448969 72223111 72701271 73419777 73379906 73293747 73489865
6497 73489865 73991258 74370234 74603915 75194455 75821144 76870864 78039196 79390814 80382281
6488 80382281 81617750 82656888 83857300 85722678 87398295 88654556 89575978 90802861
6480 90802861 92409283 93631917 94254046 93776282 93977503 95141014 95440466 96147248 97398174
6471 97398174 98920653 100624808 102228850 104080332 105867054 107955768 109989319 112573885
6463 112573885 115242622 118150658 120622144 123366893 126281191 128891350 130828784 132080141
6455 132080141 133319929 134362790 135742748 137459726 138676744 140278639 142022606 144068590
6447 144068590 146270502 148236974 149956987 151631717 154003767 156430094 158278618 159609046
6439 159609046 161123170 161804025 162249004 162947897 164405781 166549212 169472696 173476630
6431 173476630 178484039 184814029 190955941 197131614 202808840 207608063 211159192 211359883
6423 211359883 208157496 203016029 196878228 189864656 183072414 177041293 171953645 168768214
6415 168768214 166689072 164717383 163727633 163702949 164215693 165629374 166724403 168670870 172030724
6406 172030724 174793467 177642977 181249604 186092534 191348406 196720418 202113729 207311380
6398 207311380 211378686 214856665 218052530 221685863 225844547 228477636 225621100 217381251
6390 217381251 206279464 193404716 180089903 167513221 156449555 147138060 138984385
6383 138984385 131936589 125421832 120348236 116692107 113484738 110592752 107535035 104763601
6375 104763601 102530352 99519513 96306800 92870936 88311390 83608032 79788463 76018643
6367 76018643 72000862 68819116 65935879 63379013 60454599 58146190 56100979 54437225
6359 54437225 52690856 50803162 49150603 47561551 46637898 45825858 44373588 43294747
6351 43294747 42532992 41889738 41209810 40536656 39752809 38287765 37680331 37128577 36572026
6342 36572026 36230158 35716511 35397159 34957896 34390078 34016867 33765122 33520488 33524179 33113757
6332 33113757 32363773 32550092 32347530 32428150 32539094 32195004 31852959 31493074 31610627 31351321
6322 31351321 31330334 31236174 31603443 31739572 32294492 31912582 32048773 32684874 32868297 32955368
6312 32955368 32623701 32619339 33353085 33542639 33297275 33587104 33795427 33931456 34117244 34775280
6302 34775280 35434606 35980623 35999106 36545538 36567688 36990186 38256919 39367868 39446561 40271066
6292 40271066 41387977 42214914 43464007 44313445 45539062 47031306 47895375 49069206 50629759
6283 50629759 51706458 52867752 54452921 56140226 57931716 59479080 61527290 63275116
6275 63275116 65281547 67845447 71117868 74111856 77647971 81624898 85362434 89270189
6267 89270189 93211890 97665909 100924984 103539080 106303643 108505253 109065446 109221003
6259 109221003 108480701 107406391 106010678 105244443 104423178 103863656 103815335 104473340 105291443
6250 105291443 106562538 108376833 111123295 113562785 116198447 119891726 123480914 127737405
6242 127737405 132082514 136867507 142133819 147882744 153914258 159440336 164620819 169257883
6234 169257883 172787278 176411915 179948959 183644484 188363117 192851334 197798199 203461829
6226 203461829 209329314 215682734 222487987 229383395 235990003 242616075 250050309 256910007
6218 256910007 263310576 268861313 273041770 276329300 277388870 277233065 275281851 271117639
6210 271117639 265224758 258335334 249907040 240982734 231333980 222386131 213125272 203875564
6202 203875564 195552850 188077006 180620997 173672549 167961235 163417838 160185593 157754178
6194 157754178 157104958 157402071 158582656 159868834 161547268 162085883 161470101 159476119 156305272
6185 156305272 152651704 148603710 144992386 141994729 139561034 138008827 137818951 139014501
6177 139014501 140551201 143614932 147873357 152562515 157082428 160903310 162146013 160234186
6169 160234186 154726435 146915878 137719526 127784287 118995232 110697282 103485758 97384964
6161 97384964 91829126 86109709 81614825 77639714 73601524 69861752 66341487 63091400
6153 63091400 60394059 58031342 55492350 52989510 51264897 49403134 47990766 46457360
6145 46457360 44920416 43160831 41939343 41215817 40264789 39129087 38313857 37375226 36981217
6136 36981217 36072972 35414429 35266869 34828015 34553879 34729428 34859275 34447119 34338244
6127 34338244 34015154 33757111 33518330 32841571 32577812 31784840 30520698 29651626 28905421
6118 28905421 28252590 27479892 26705360 26149488 25662209 24531239 23810158 23184537 22862218
6109 22862218 22453201 22112355 21539582 21656509 21083340 20499409 20384352 20023258 19817679
6100 19817679 19741616 19995388 20324562 20355652 19969736 20265962 20717951 20938578 20796562 20493964
6090 20493964 20071907 20033131 20104967 19473503 18573120 17329755 17005274 16624756 16121003 15803834
6080 15803834 15018141 14201527 14101550 14127267 14091619 13906661 13245728 12396574 12369274 12535466
6070 12535466 12336339 12031275 11487195 11049588 11014513 11080667 10965596 10558625 11132779 10957525
6060 10957525 10717332 10755445 10980299 10544486 10103106 10224251 10355092 10037423 9400681 9118536
6050 9118536 8823554 9168711 8868936 8907585 8554197 8028034 7750036 7777118 7627256 7588288
6040 7588288 7622420 7377715 7003102 7068719 6960750 6848943 6389407 6410110 6252039 6248734
6030 6248734 5688531 5681048 6117489 6243988 6123824 6061579 5958597 5688210 5707499 5434447
6020 5434447 5205596 5444481 5641718 5278804 5318295 5474827 5860241 5795228 5219471 5420181
6010 5420181 5298747 5367245 5459201 5395977 5732328 5226910 5471420 5449493 5389931 5304263 5340416
5999 5340416 5281197 5365087 5174219 4912370 5144629 5420899 4764954 4979189 4850667 4696392
5989 4696392 5251875 5371314 5129107 4900865 4957572 5209896 5232934 5333129 5371831 5288853
5979 5288853 5427291 5662540 5848538 6619625 6890974 6696788 7337163 7363636 7430171 7408797
5969 7408797 7218106 6936631 6966300 6511614 6084635 5973382 6298352 6017715 5956952 5579644
5959 5579644 5113038 4605999 4645676 4678236 5079013 4651407 4388503 4837473 4953692 4691600
5949 4691600 4323148 3999622 4205201 4722660 4400895 4810377 4699752 4659387 4590185 4482834
5939 4482834 4449603 4434180 4292219 4380248 4336082 4460995 4983740 5163439 4301971 4245785
5929 4245785 4311463 4341715 4350292 4541551 4344674 4078366 4011947 4598577 4858929 4247706
5919 4247706 4889318 4694491 4731286 4529636 4535222 4322790 4926381 5160053 5009276 5069981
5909 5069981 4700247 5043175 4795873 4571317 5064156 5034425 5057822 4756697 4868273 5022283
5899 5022283 5151730 4932966 4947276 4768337 4987946 5279922 5313282 5115639 4763227 5418001
5889 5418001 5336233 5180110 5194781 5473706 5176809 5113036 5547117 5672744 6033725 6117852
5879 6117852 6340112 5946148 5433988 5489628 5292367 5399019 5392521 5400939 5565579 5768342
5869 5768342 5778675 5786922 6102216 6447232 6512590 6699665 6131455 6115634 6627957 6944890
5859 6944890 6869331 6805202 7143900 7631043 7572590 7797629 7750577 8002421 8551804 8777887
5849 8777887 9006518 9441124 9688806 10385054 10494189 11060751 11395393 12246884 12430978 13208971
5839 13208971 14155539 14101287 14298310 14651681 15526754 16142139 16845993 16551382 17276900 17427153
5829 17427153 17252551 17874410 18557352 19536500 20505756 21993774 23302696 24972363 26168346
5820 26168346 27213024 28694649 30555089 32574630 35599763 39470743 43635007 48588183
5812 48588183 53791290 58758362 61000496 60685572 57288141 52287300 46515168 40468055
5804 40468055 35345882 31442828 28578211 25483596 23228232 21765137 19527204 17833052
5796 17833052 16507311 15220718 14408924 13407516 12810456 12298305 11550241 10758373 10265505
5787 10265505 9915308 9438249 9202971 8810166 8993228 8954259 8452663 7662586 7251240 7000252
5777 7000252 7259724 7123863 7218651 7134312 7353345 7710529 7788767 7376917 7218548 6626989
5767 6626989 6305674 6067965 5739092 5453449 5129086 5397777 4988338 4734276 4455176 4820715
5757 4820715 4820597 4469058 4224056 4497755 4190398 3986268 4456257 4119451 4605263 4365326
5747 4365326 4079362 4098260 4468617 4585046 4187245 3761507 3737661 3824487 3891079 3840552
5737 3840552 4149100 3790767 3630394 3729868 3332885 3336656 3397432 3421286 3640381 3808871
5727 3808871 3733055 3641533 3555351 3643417 3672540 3329050 3186985 2931436 2892095 3190248 3459602
5716 3459602 3199328 2501806 2685320 3163748 2874301 2890668 3433492 3233154 3421459 3008209
5706 3008209 3125188 3392085 3714755 3252007 3554148 3532557 3635234 3483457 3266972 3207210
5696 3207210 3307653 3475183 3644148 3305849 3170512 3403831 3201651 3417535 3519392 3054542
5686 3054542 3142624 3462719 3468933 3684205 4193975 3608464 3409189 3479814 3035290 3248227
5676 3248227 3638927 3537809 3475374 3704322 3273467 3175671 3114887 3435441 3773592 3707852
5666 3707852 3873153 3777674 3735319 3372716 3189710 2880437 3157135 3432249 3855195 3466553
5656 3466553 3410892 3294996 3459541 3880600 3469432 3138744 3415193 3748811 3003854 3354371
5646 3354371 3681442 3646358 3509836 3567024 3595473 3438708 3475595 3365106 3359870 3507297 3141186
5635 3141186 3546701 3692212 3524648 3234167 2959939 3030369 3205385 2943683 3633992 3262941
5625 3262941 2888569 3381970 3719258 3862525 3556315 3784033 3514112 3330273 3381733 3303672
5615 3303672 3573502 4067540 4016600 4005247 4436172 4310596 3917767 3907074 4271693 3939854
5605 3939854 3926928 3654903 4076420 3859616 4090624 3877332 3591758 3387551 3440417 3223993
5595 3223993 3045876 2868338 2693757 3324656 3100701 3164407 3479922 3340083 3609691 3518471
5585 3518471 2838508 2947642 3320226 3505224 3319838 3204404 3139311 3255586 3154227 3027968
5575 3027968 2984797 3184901 3089288 2994566 3331143 3145354 3132190 3689448 3376507 3267944
5565 3267944 3245035 3558746 3109629 3131410 3243580 3153563 3200495 4021373 4101586 3689200
5555 3689200 3710128 3808857 4046885 3794788 3736244 3299586 3455871 3635772 3217104 2985092
5545 2985092 2976626 3378187 3112609 2975849 3412027 3438594 3312970 3199318 2968607 3169382
5535 3169382 3554292 3193992 2996102 3237576 3056718 3065633 3482741 3447337 2873295 3020993
5525 3020993 3309380 3550832 3562851 3408559 3833986 3883297 3697300 3320637 3591057 3274762
5515 3274762 2960107 3290801 3698719 3887697 4163781 3668096 3516462 3784624 4067849 4287139
5505 4287139 4008102 4228470 4668474 4496437 4596717 4551622 4281682 4268504 4033292 3929626
5495 3929626 3576065 3306167 3410370 3250930 2795747 3148099 3120701 3051076 3104994 3071716
5485 3071716 3049335 2866909 2930671 3231556 3217069 3379397 2881916 2846411 3035832 3135563
5475 3135563 2888738 2761313 3100544 2895613 2485309 2734485 2607783 2624834 2597463 2541129
5465 2541129 2611979 2484936 2333694 2629507 2734782 2490020 2655338 2871030 2901858 2652793
5455 2652793 3103628 2717933 2704083 2670999 2954901 3148340 3248275 3055282 2624719 2465606
5445 2465606 2685760 2661528 2949866 3296132 3061068 3125969 2622618 2650106 3154454 3409904
5435 3409904 3091389 2952981 3019458 3254656 3437396 3259604 3144308 3039989 3097201 3086831
5425 3086831 3185050 3049548 3027420 3485010 3407565 3216724 3347696 3842730 3438577 3127039
5415 3127039 3245526 3263474 3069011 2836786 2829261 3133451 3035875 2795557 3001856 3196507
5405 3196507 3377975 3717386 3663555 3515909 3574724 3673173 4129459 3935526 3557336 3570229
5395 3570229 3559145 3310270 3807562 3843630 3745091 3990859 4024880 3969598 4119560 4219104 3813213
5384 3813213 3576647 4039285 4287792 4603456 4181565 4057059 4036250 3819898 3943638 4004627
5374 4004627 4632643 4232399 3721651 4187259 4264711 4038992 4029407 4471960 4439094 4522392
5364 4522392 4638804 4464457 4544382 4883714 4936674 4891487 4937116 4840573 4506810 4268098
5354 4268098 4463025 4616741 4604199 4454239 4355643 4552340 4381548 4350783 4276389 4496793
5344 4496793 4374899 3997110 4439386 4672600 4154139 4461177 4866828 4856113 4938489 4367873
5334 4367873 4460367 4536640 4529761 4470445 5091105 4716881 4827475 5282837 5245086 4878758 4006924
5323 4006924 4455397 4735007 4577392 4523744 4554140 4662743 4499916 4324793 4231913 4418559
5313 4418559 4799817 5137962 5086045 4898135 4718569 4962490 5055144 5042736 5437948 5063071
5303 5063071 5584518 5837563 6002941 6380255 6121466 5566455 5172500 5114398 4610219 4958524
5293 4958524 4830884 4337661 4310958 4636330 4550572 4507254 3746226 3573169 3725711 3763013
5283 3763013 3774984 3796052 3650443 3843975 3926571 3965908 3808688 3598770 3822440 3615348
5273 3615348 3382215 3389578 3532054 3226160 3677283 3567976 3617354 3706021 3402712 3428303
5263 3428303 3373268 3148032 3602155 3432131 3548844 3452836 3016529 3555687 3669156 3957182
5253 3957182 4187787 3959481 3806070 3560751 3768296 3892474 3902810 4048383 4471961 4345019
5243 4345019 4092067 4294518 4454925 5125873 5161135 4745314 4986183 4967378 5310207 5898839
5233 5898839 6170956 6593431 7328135 7933577 8314641 9417252 10633623 11719074 13067098
5224 13067098 14428336 14279325 13206379 11955932 10620689 9246233 8152495 7018238
5216 7018238 6469048 6364333 6027990 5444762 5303559 5195881 4715472 4460155 4337357 4242463
5206 4242463 3517442 3306362 3892694 3638104 3543096 3596785 3547584 3318220 3680082 3347195
5196 3347195 2864665 2981925 3038913 2807366 2681779 3230408 3320536 3534535 3024970 2602126
5186 2602126 2528397 2534444 2663565 2852753 2651502 2846089 2680963 2579589 2586300 2378472
5176 2378472 2502888 2628948 2545482 2850036 2532967 2560695 2265524 2376546 2519860 2374986
5166 2374986 2595341 2290711 1983163 1712496 2336574 2439997 2453154 2078292 2022986 2229148
5156 2229148 2075501 2156049 2036549 2127044 2173107 2636073 2648918 2488801 2035044 1931056
5146 1931056 2210628 2050435 2002545 2028576 2175106 2112768 2324467 2292643 1949011 1757294
5136 1757294 2214424 2278561 2278112 2602155 2476906 2304538 2010956 2010443 2405992 2580255 2679265
5125 2679265 2430235 2288464 2202858 2271565 2213585 2387104 2394117 2269398 2554260 2359645
5115 2359645 2570979 2505325 2494760 2299788 2152221 2510971 3018953 2944651 2434571 2706768
5105 2706768 2800921 2413130 2595886 2581861 2525632 2467458 2335776 2327846 2851910 3369239 2816576
5094 2816576 2401850 2475404 2501021 2039030 2184274 2344872 2902814 2508084 2574911 2293699
5084 2293699 2190427 2118836 2516975 2860811 2863803 3021702 2520205 2639331 2963452 2905732
5074 2905732 2624534 2956088 2878701 3227062 2974663 2714085 2332709 2515436 2944315 2880820
5064 2880820 2529737 2579747 3075386 2870427 2624842 2319693 3007900 3301083 3046726 3061830
5054 3061830 2786847 2949870 3017489 2793335 2915579 2848874 2797109 3118131 2388356 2669633
5044 2669633 2652920 2515054 2835236 2514911 2737422 3246739 2999363 2873571 2986551 2956089
5034 2956089 3702885 3381129 3015868 3062769 2801740 2722739 3180480 3409162 2764175 3028143
5024 3028143 3522560 3056842 2992455 3561022 3814355 3880772 3708820 3730323 3584300 3874546
5014 3874546 4127593 3547125 3576026 3449795 3391485 3427016 3680432 3697709 3548827 4023061
5004 4023061 4107062 3453249 3676953 3977452 3855255 3918104 3783946 3805947 3947553 3879663
4994 3879663 3856172 3731408 3648201 3433288 3455095 3892109 4014062 3905207 4343609 4066818
4984 4066818 3901555 3937820 4055518 4158902 4292249 4378921 4166822 4277867 4561007 4443286
4974 4443286 4390582 4790440 4645051 4714841 4773061 4674055 4435294 4451425 4566914 4716945
4964 4716945 4767447 5102084 4979567 5175597 5410474 5227016 4994217 5256426 4902791 4736345
4954 4736345 4966356 5172598 5332884 5410837 5368191 5004229 5396396 5588515 5508537 5234602
4944 5234602 5005136 5230056 5242557 5237240 5438448 5164176 5038721 5324952 5587927 5429715
4934 5429715 4995387 5013577 5220773 5352762 5575483 5193663 5411767 5739661 6200706 6223712
4924 6223712 5735217 5222953 4986020 5654391 5824415 5807356 5558185 5866425 5514636 5298839
4914 5298839 5597341 5682180 5562205 5782925 5808995 5626849 5882796 6334075 6325772 5666029
4904 5666029 5306305 5539168 5866732 6245464 6042516 5771302 6150213 5763435 5713671 5537914
4894 5537914 5872812 6178504 6381262 6251148 5980116 5494986 5746663 6306645 6408662 6752908
4884 6752908 6447035 6166798 6267548 6146190 6444929 6604286 6609524 6449943 6381940 6660420
4874 6660420 6605341 6644194 6870765 6509412 6264084 6201560 6188941 6730290 6488398 6628064
4864 6628064 6618287 6942395 7158158 7123590 6988506 6662833 6903360 7369429 7883651 7730914
4854 7730914 7500922 7315113 7429344 7540904 7172585 7245192 8004615 8151321 7735023 7649004
4844 7649004 7969674 8024511 7681323 8439575 8189852 8176951 8304136 8322004 8276169 8325602
4834 8325602 8647558 8744749 9006494 9062184 9156527 9465954 9811612 9347476 9358054 9528128
4824 9528128 9529960 9536233 9682860 9766571 9731063 9700791 10172783 10165286 10068751 10161665 10454476
$$ [...]
##END NTUPLES=NMR SPECTRUM
##END=
