##TITLE=1H_EC-3311-x
 CDCl3
 8 sc, 
 5.8.2024
##JCAMPDX= 6.0         $$ Bruker NMR JCAMP-DX V2.0
##DATA TYPE= NMR SPECTRUM
##DATA CLASS= NTUPLES
##ORIGIN= UXNMR, Bruker Analytische Messtechnik GmbH
##OWNER= root
$$ XWIN-NMR		Version 3.5
$$ Mon Aug  5 14:07:49 2024 Russian Standard Time (UT+4h)  she@DPX200
##.OBSERVE FREQUENCY= 200.1313
##.OBSERVE NUCLEUS= ^1H
##.ACQUISITION MODE= SIMULTANEOUS
##.ACQUISITION SCHEME= undefined
##.AVERAGES= 8
##.DIGITISER RES= 18
##SPECTROMETER/DATA SYSTEM= spect
##.PULSE SEQUENCE= zg30
##.SOLVENT NAME= Acetone
##.SHIFT REFERENCE= (INTERNAL, Acetone, 0, 21.5321)
##AUDIT TRAIL= $$ (NUMBER, WHEN, WHO, WHERE, WHAT)
$$ ##TITLE= Audit trail, XWIN-NMR		Version 3.5
$$ ##JCAMPDX= 5.01
$$ ##ORIGIN= Bruker BioSpin GmbH
$$ ##OWNER= she
$$ F:/spectra/data/she/nmr/H-F/1/pdata/1/auditp.txt
$$ ##AUDIT TRAIL=  $$ (NUMBER, WHEN, WHO, WHERE, WHAT)
(   1,<2024-08-05 14:06:19.23 +0400>,<she>,<DPX200>,
      <created by zg, POWCHK disabled, PULCHK disabled
       configuration hash MD5:
       00 E9 B6 7A A2 85 ED C7 34 08 36 98 17 FE 4E 26
       data hash MD5: 16K
       67 DE 8D DD 36 0D C5 A2 FC 68 2E 03 2D E8 5A FC>)
(   2,<2024-08-05 14:06:40.98 +0400>,<she>,<DPX200>,
      <Start of raw data processing
       efp BC_mod = 2 LB = 0.24 FT_mod = 6 PKNL = 1 PHC0 = -25640.5 PHC1 = 18.38749 SI = 16K 
       data hash MD5: 16K
       BE 38 88 45 A5 E7 10 70 77 5C 42 25 B2 CF B1 7F>)
(   3,<2024-08-05 14:07:03.10 +0400>,<she>,<DPX200>,
      <pk PHC0 = 3.408393 PHC1 = -4.4 
       data hash MD5: 16K
       BA D7 FA 0C 84 35 87 96 A6 D0 27 FA A1 04 E1 D3>)
(   4,<2024-08-05 14:07:06.73 +0400>,<she>,<DPX200>,
      <abs ABSG = 5 
       data hash MD5: 16K
       4A 32 1F 46 B9 70 9A 5B 03 2D F8 B7 25 39 DA 95>)
$$ ##END=
$$ 
$$ hash MD5
$$ 58 8A 89 90 B8 F3 25 A0 B5 CE 70 5D A1 6B 0C 41
##$RELAX= 
##$RELAX= 
##$RELAX= 
##$RELAX= 
##$RELAX= 
##$RELAX= 
$$ Bruker specific parameters
$$ --------------------------
##$DU= <F:/spectra>
##$EXPNO= 1
##$NAME= <H-F>
##$PROCNO= 1
##$TYPE= <nmr>
##$USER= <she>
##$AMP= (0..31)
100 100 100 100 100 100 100 100 100 100 100 100 100 100 100 100 100 100 
100 100 100 100 100 100 100 100 100 100 100 100 100 100 
##$AQSEQ= 0
##$AQ_mod= 1
##$AUNM= <au_zg>
##$AUTOPOS= <>
##$BF1= 200.13
##$BF2= 200.13
##$BF3= 200.13
##$BF4= 200.13
##$BF5= 200.13
##$BF6= 200.13
##$BF7= 200.13
##$BF8= 200.13
##$BYTORDA= 1
##$CFDGTYP= 0
##$CFRGTYP= 5
##$CHEMSTR= <none>
##$CNST= (0..31)
1 1 145 1 1 1 1 1 1 1 1 1 1 1 1 1 1 1 1 1 1 1 1 1 1 1 1 1 1 1 1 1 
##$CPDPRG= <>
##$CPDPRG1= <>
##$CPDPRG2= <>
##$CPDPRG3= <>
##$CPDPRG4= <mlev>
##$CPDPRG5= <mlev>
##$CPDPRG6= <mlev>
##$CPDPRG7= <mlev>
##$CPDPRG8= <mlev>
##$CPDPRGB= <>
##$CPDPRGT= <>
##$D= (0..31)
0 1.2 0 0 0 0 0 0 0 0.06 0 0.03 0 0 0 0 0.0002 0 0 0 0 0 0 0 0 0 0 0 0 
0 0 0 
##$DATE= 1722852378
##$DBL= (0..7)
120 120 120 120 120 120 120 120 
##$DBP= (0..7)
150 150 150 150 150 150 150 150 
##$DBP07= 0
##$DBPNAM0= <>
##$DBPNAM1= <>
##$DBPNAM2= <>
##$DBPNAM3= <>
##$DBPNAM4= <>
$$ [...]
##$SUBNAM3= <"">
##$SUBNAM4= <"">
##$SUBNAM5= <"">
##$SUBNAM6= <"">
##$SUBNAM7= <"">
##$SUBNAM8= <"">
##$SUBNAM9= <"">
##$SW= 24.0689771365484
##$SWIBOX= (0..15)
0 0 2 0 0 0 0 0 0 0 0 0 0 0 0 0 
##$SW_h= 4816.95568400771
##$TD= 16384
##$TD0= 1
##$TE= 0
##$TE2= 300
##$TE3= 300
##$TEG= 300
##$TL= (0..7)
0 120 120 120 120 120 120 120 
##$TP= (0..7)
150 150 150 150 150 150 150 150 
##$TP07= 0
##$TPNAME0= <>
##$TPNAME1= <>
##$TPNAME2= <>
##$TPNAME3= <>
##$TPNAME4= <>
##$TPNAME5= <>
##$TPNAME6= <>
##$TPNAME7= <>
##$TPOAL= (0..7)
0.5 0.5 0.5 0.5 0.5 0.5 0.5 0.5 
##$TPOFFS= (0..7)
0 0 0 0 0 0 0 0 
##$TUNHIN= 0
##$TUNHOUT= 0
##$TUNXOUT= 0
##$USERA1= <user>
##$USERA2= <user>
##$USERA3= <user>
##$USERA4= <user>
##$USERA5= <user>
##$V9= 5
##$VALIST= <valist>
##$VCLIST= <CCCCCCCCCCCCCCC>
##$VD= 0
##$VDLIST= <DDDDDDDDDDDDDDD>
##$VPLIST= <PPPPPPPPPPPPPPP>
##$VTLIST= <TTTTTTTTTTTTTTT>
##$WBST= 1024
##$WBSW= 4
##$XGAIN= (0..3)
0 0 0 0 
##$XL= 0
##$YL= 0
##$YMAX_a= 321069
##$YMIN_a= -299960
##$ZGOPTNS= <>
##$ZL1= 120
##$ZL2= 120
##$ZL3= 120
##$ZL4= 120
##$ABSF1= 21.54094
##$ABSF2= -2.528267
##$ABSG= 5
##$ABSL= 3
##$ALPHA= 0
##$AQORDER= 0
##$ASSFAC= 0
##$ASSFACI= 0
##$ASSFACX= 0
##$ASSWID= 0
##$AUNMP= <proc_1d>
##$AZFE= 0.1
##$AZFW= 0.1
##$BCFW= 0
##$BC_mod= 2
##$BYTORDP= 0
##$COROFFS= 0
##$CY= -3
##$DATMOD= 1
##$DC= 0
##$DFILT= <>
##$DTYPP= 0
##$F1P= 0
##$F2P= 0
##$FCOR= 1
##$FTSIZE= 16384
##$FT_mod= 6
##$GAMMA= 0
##$GB= 0
##$INTBC= 1
##$INTSCL= 3.70164e-10
##$ISEN= 128
##$LB= 0.24
##$LEV0= 0
##$LPBIN= 0
##$MAXI= 10000
##$MC2= 0
##$MEAN= 0
##$ME_mod= 0
##$MI= 1.114404
##$NCOEF= 0
##$NC_proc= -7
##$NLEV= 6
##$NOISF1= 3.799351
##$NOISF2= 2.8
##$NSP= 0
##$NTH_PI= 0
##$NZP= 0
##$OFFSET= 21.53213
##$PC= 1
##$PHC0= -25637.09
##$PHC1= 13.98749
##$PH_mod= 1
##$PKNL= yes
##$PPARMOD= 0
##$PSCAL= 0
##$PSIGN= 0
##$REVERSE= no
##$SF= 200.129399265818
##$SI= 16384
##$SIGF1= 3
##$SIGF2= 2
##$SINO= 5.538805
##$SIOLD= 16384
##$SREGLST= <1H.CDCl3>
##$SSB= 0
##$STSI= 16384
##$STSR= 0
##$SW_p= 4816.95568400771
##$SYMM= 0
##$S_DEV= 0
##$TDeff= 16384
##$TDoff= 0
##$TI= <>
##$TILT= no
##$TM1= 0
##$TM2= 0
##$TOPLEV= 0
##$USERP1= <user>
##$USERP2= <user>
##$USERP3= <user>
##$USERP4= <user>
##$USERP5= <user>
##$WDW= 1
##$XDIM= 16384
##$YMAX_p= 367050136
##$YMIN_p= -784755
$$ End of Bruker specific parameters
$$ ---------------------------------
##NTUPLES= NMR SPECTRUM
##VAR_NAME=  FREQUENCY,     SPECTRUM/REAL,   SPECTRUM/IMAG
##SYMBOL=    X,             R,               I
##VAR_TYPE=  INDEPENDENT,   DEPENDENT,       DEPENDENT
##VAR_FORM=  AFFN,          ASDF,            ASDF
##VAR_DIM=   16384,         16384,           16384
##UNITS=     HZ,            ARBITRARY UNITS, ARBITRARY UNITS
##FACTOR=    0.29402158847633, 1,            1
##FIRST=     4309.21209926527, 0,            0
##LAST=      -507.743584742436, 0,           0
##MIN=       -507.743584742436, -784755,     0
##MAX=       4309.21209926527, 367050136,    0
$$ Real data points
##PAGE= N=1
##DATA TABLE= (X++(R..R)), XYDATA
$$ [...]
$$ plain form
5051 362107 91003 -139487 61102 251530 130754 409789 13620 -8385 -7446 76288 -27849
5040 -27849 151245 104476 -102555 -82100 1591 172521 109251 224627 500667 154542 384938
5029 384938 445373 317195 440776 299684 364555 112204 -24978 242865 345245 428195
5019 428195 556294 195760 123974 287206 403006 318517 69940 401669 420248 307661
5009 307661 375560 320661 103638 182890 685581 629474 394635 294630 319178 323719 -116052
4998 -116052 436578 286649 30301 404892 708689 365210 473820 575347 604307 527832
4988 527832 402120 638838 321896 212795 422642 286400 281296 245919 291708 347009 137500
4977 137500 400560 364728 401289 487581 248784 127822 105058 423306 447783 412532 436438
$$ packed form
5051C62107k71104k30490K00589J90428j20776K79035l96169k2005R39Q3734j04137
5040b7849J79094m6769k07031K0455Q3691J70930o3270J15376K76040l46125K30396
5029C84938O0435j28178J23581j41092O4871k52351j37182K67843J02380Q2950
5019D28195J28099l60534p1786J63232J15800q4489k48577L31729J8579j12587
5009C07661O7899n4899k17023P9252N02691n6107k34839j00005K4548M541m39771
4998a16052N52630j49929k56348L74591L03797l43479J08610J01527K8960p6475
4988E27832j25712K36718l16942j09101K09847j36242n104l5377M5789N5301k09509
4977A37500K63060l5832L6561Q6292k38797j20962k2764L18248K4477l5251K3906
$$ plain form
4966 436438 761452 537211 478035 372505 327970 629960 356142 321368 427528 693784
4956 693784 653512 732194 638345 426401 193919 453101 459010 667016 818444 1010474 804474
4945 804474 473363 568374 952374 884870 724383 673412 705249 532878 523904 454044 573813
4934 573813 541164 542607 645108 688213 509222 545365 366571 766521 664999 776521 451242
4923 451242 485140 892885 971119 778734 658843 846866 766364 1018997 1079463 759843
4913 759843 782968 915631 959236 674103 745672 1019775 883001 900004 963693 657779 817031
4902 817031 908573 515581 534612 387279 405324 538097 594509 756764 558516 626968 696247
4891 696247 765651 819383 721229 499021 419842 436784 804101 853610 755170 548835 781106
$$ packed form
4966D36438L25014k24241n9176j05530m4535L01990k73818l4774J06160K66256
4956F93784m0272P8682r3849k11944k32482K59182N909K08006J51428J92030k06000
4945H04474l31111R5011L84000o7504j60487n0971L1837j72371q974o9860J19769
4934E73813l2649J443J02501M3105j78991L6143j78794L99950j01522J11522l25279
4923D51242L3898M07745P8234j92385j19891J88023q0502K52633O0466l19620
4913G59843K3125J32663M3605k85133P1569K74103j36774J7003O3689l05914J59252
4902H17031R1542l92992J9031j47333J8045J32773N6412J62255j98248O8452O9279
4891F96247O9404N3732r8154k22208p9179J6942L67317M9509r8440k06335K32271
$$ plain form
4880 781106 612140 439820 678594 649009 897121 798498 803232 900760 1048024 727232 764223
4869 764223 840644 909419 1011249 978548 900891 1057412 973499 1031065 545922 861491 804607
4858 804607 670789 908957 1017550 880433 812587 692353 678857 866928 696334 499659
4848 499659 472000 646195 949086 1130735 982033 822330 818341 1097116 959844 1042795
4838 1042795 1139140 1309231 1382739 1092836 1127880 1171959 1036907 1035038 884534 813055 1270850
4827 1270850 1056050 1189184 1075365 1256846 1377984 1153159 1246866 1348097 1333811 1216385
4817 1216385 1325778 1368941 1313032 1396005 1448822 1414001 1409937 1393651 1627599 1759536 1818639
4806 1818639 1893192 1761144 1661420 1801150 2147365 2184871 1976308 1824645 1902482 2037068
$$ packed form
4880G81106j68966j72320K38774k9585K48112r8623M734R7528J47264l20792L6991
4869G64223P6421O8775J01830l2701p7657J56521q3913N7566m85143L15569n6884
4858H04607j33818K38168J08593j37117o7846j20234j3496J88071j70594j96675
4848D99659k7659J74195L02891J81649j48702j59703l989K78775j37272Q2951
4838A042795R6345J70091P3508k89903L5044M4079j35052j869j50504p1479M57795
4827A270850k14800J33134j13819J81481J21138k24825R3707J01231j4286j17426
4817A216385J09393M3163n5909Q2973N2817l4821m064j6286K33948J31937N9103
4806A818639P4553j32048r9724J39730L46215L7506k08563j51663P7837J34586
$$ plain form
4796 2037068 1983675 2047510 2031610 2018525 1925078 1849065 2128087 2078548 2416609 2354645 2077959
4785 2077959 2072410 2436991 2289743 2362235 2358897 2570812 2502545 2476189 2478685 2397994 2170275
4774 2170275 2091091 2448044 2436819 2324249 2362013 2094890 2252500 1973061 1745450 1775136
4764 1775136 1649148 1725458 1726292 2046211 2020909 1853465 1866351 1969095 2012603 1906304 2098004
4753 2098004 2155696 2033321 1768962 1505564 1648886 1664490 1832045 1650635 1549438 1212552
4743 1212552 1475772 1378704 1434229 1508105 1472995 1704932 1341881 1336088 1648708 1719786 1189057
4732 1189057 1056565 1215852 1354984 1583719 1570110 1474662 1331352 1753396 1505045 1291773
4722 1291773 1535859 1638706 1321039 1748308 1682217 1606551 1399007 1331432 1545436 1737697
$$ packed form
4796B037068n3393O3835j5900j3085r3447p6013K79022m9539L38061o1964k76686
4785B077959n549L64581j47248P2492l338K11915o8267k6356K496q0691k27719
4774B170275p9184L56953j1225j12570L7764k67123J57610k79439k27611K9686
4764A775136j25988P6310Q34L19919k5302j67444J2886J02744M3508j06299J91700
4753B098004N7692j22375k64359k63398J43322J5604J67555j81410j01197l36886
4743A212552K63220r7068N5525P3876l5110K31937l63051n793L12620P1078n30729
4732A189057j32492J59287J39132K28735j3609r5448j43310M22044k48351k13272
4722A291773K44086J02847l17667M27269o6091p5666k07544o7575K14004J92261
$$ plain form
4712 1737697 1557954 1387616 1497774 1572158 1570013 1540960 1409303 1724218 1721448 1712103 1368367
4701 1368367 1672441 1638127 1464981 1720108 1901638 2215288 1833360 1858962 1907658 1880233
4691 1880233 1885527 1721533 1831422 1898132 1900697 1915056 2266893 2444593 2404934 2162709 2280394
4680 2280394 2307531 2259393 2307904 1913481 2122397 2016110 2352056 2437647 2426754 2308691
4670 2308691 2409054 2573502 2618266 2516831 2397342 2822856 2940468 2936112 3203784 3079193
4660 3079193 2753198 3082707 3320077 3178165 3132406 3206674 3423162 3611772 3539767 3441600
4650 3441600 3725317 3918783 4022772 4041199 3928627 3868044 4085279 4228839 3999275 4418377
4640 4418377 4616465 4628721 5027303 4990988 5044695 5308105 5391261 5660415 5878968 6045656
$$ packed form
4712A737697j79743j70338J10158P4384k145k9053j31657L14915k770r345l43736
4701A368367L04074l4314j73146K55127J81530L13650l81928K5602M8696k7425
4691A880233N294j63994J09889O6710K565J4359L51837J77700l9659k42225J17685
4680B280394K7137m8138M8511l94423K08916j06287L35946Q5591j0893j18063
4670B308691J00363J64448M4764j01435j19489M25514J17612m356K67672j24591
4660C079193l25995L29509K37370j41912m5759P4268K16488J88610p2005r8167
4650C441600K83717J93466J03989J8427j12572o0583K17235J43560k29564M19102
4640D418377J98088J2256L98582l6315N3707K63410Q3156K69154K18553J66688
$$ plain form
4630 6045656 6216876 6338406 6756032 6858004 7185900 7319398 7779081 8279549 8523510 8915843
4620 8915843 8946789 9205697 9888407 10447074 11011614 11614210 12035876 12610472 13395388 13817203
4610 13817203 14432052 15396616 16176410 16916874 17845330 18721752 19934864 20882788 22032021
4601 22032021 23677583 25036849 26421295 28192566 29776366 31482315 33316359 35571508
4593 35571508 37469285 39259461 40844181 41815953 42925735 43662390 44638954 45145495 45585945
4584 45585945 46419773 47361563 47975100 48837377 50144105 51277864 52678872 54489682 56499291
4575 56499291 58246279 60618015 62749548 64584756 66170826 66931458 66502916 65582438 63954901
4566 63954901 61866219 59628238 57100888 55019198 52769116 51254901 49820402 48407906
$$ packed form
4630F045656J71220J21530M17626J01972L27896J33498M59683N00468K43961L92333
4620H915843L0946K58908O82710N58667N64540O02596M21666N74596P84916M21815
4610A3817203O14849R64564P79794P40464R28456Q76422J213112R47924J149233
4601B2032021J645562J359266J384446J771271J583800J705949J834044K255149
4593C5571508J897777J790176J584720R71772J109782P36655R76564N06541M40450
4584D5585945Q33828R41790O13537Q62277J306728J133759J401008J810810K009609
4575E6499291J746988K371736K131533J835208J586070P60632m28542r20478j627537
4566F3954901k088682k237981k527350k081690k250082j514215j434499j412496
$$ plain form
4558 48407906 47467436 46841776 46678378 46176479 45734881 45459480 44910268 43959815 42901139
4549 42901139 41464035 39644898 38038008 36115677 34305096 32148372 30189275 28251943
4541 28251943 26235252 25212601 24010358 22643910 21377439 20306012 19495810 18423476
4533 18423476 17339643 16446184 15956253 15651928 14976066 14296696 13851697 13666005 13302132
4524 13302132 12868049 12596227 12296910 12201558 12270667 12303333 12297414 12252541 11767288 11297535
4514 11297535 10588132 10062180 9644644 9110188 9079464 8988296 8688760 8323101 8138403 8388818
4504 8388818 8308033 8130659 7846952 7968518 7971951 8075611 8301527 8190044 7961696 7213602
4494 7213602 7026790 6920052 6862036 7174188 6869211 6406971 6243544 6076703 5986963 5932215
$$ packed form
4558D8407906r40470o25660j63398n01899m41598k75401n49212r50453j058676
4549D2901139j437104j819137j606890j922331j810581k156724j959097j937332
4541B8251943k016691j022651j202243j366448j266471j071427q10202j072334
4533A8423476j083833q93459m89931l04325o75862o79370m44999j85692l63873
4524A3302132m34083k71822k99317r5352O9109L2666n919m4873m85253m69753
4514A1297535p09403n25952m17536n34456l0724r1168k99536l65659j84698K50415
4504H388818q0785j77374k83707J21566L433J03660K25916j11483k28348p48094
4494G213602j86812j06738n8016L12152l04977m62240j63427j66841q9740n4748
$$ plain form
4484 5932215 5802029 5596251 5447164 5499150 5656030 5526168 5252315 5372876 5208377 5175929
4474 5175929 5621448 5361971 5346303 5388058 5671087 5286538 5001498 4983459 4803124 5126104
4464 5126104 5386650 5486149 5623923 5505143 5415000 5441266 5413456 5489526 5397478 5576408 5410314
4453 5410314 5372862 5762856 5627118 5370726 5565388 5423176 5429292 5619038 5560804 5488418
4443 5488418 5516216 5579220 5916364 6121657 6177487 6077731 6227834 6267453 6440862 6681318
4433 6681318 6538613 6817157 6928087 6997788 6889774 6899249 7084031 7004381 7330156 7437926
4423 7437926 7364366 7672645 7657382 7670285 7709264 7920719 8261017 8506853 8574676 8380654
4413 8380654 8525807 8836692 8946354 8958769 9259263 9287171 9079581 9431599 9581837 9721110
$$ packed form
4484E932215j30186k05778j49087N1986J56880j29862k73853J20561j64499l2448
4474E175929M45519k59477j5668M1755K83029l84549k85040j8039j80335L22980
4464E126104K60546R9499J37774j18780r0143K6266k7810P6070r2048J78930j66094
4453E410314l7452L89994j35738k56392J94662j42212O116J89746n8234p2386
4443E488418K7798O3004L37144K05293N5830r9756J50103L9619J73409K40456
4433F681318j42705K78544J10930O9701j08014R475J84782p9650L25775J07770
4423G437926p3560L08279j5263J2903L8979K11455L40298K45836O7823j94022
4413H380654J45153L10885J09662J2415L00494K7908k07590L52018J50238J39273
$$ plain form
4403 9721110 10123965 10178684 10364490 10598345 10694215 10944099 11497198 11505177 11494447 12150362
4393 12150362 12657111 12754854 12726951 13170430 13615483 14046558 14409483 14628381 14649337 15034820
4383 15034820 15810982 16116209 16148710 16727208 17735009 17879051 18524224 19410538 20220863
4374 20220863 20562345 21071570 21727558 22302909 23037656 23935377 24770453 25507282 26535893
4365 26535893 27672451 28650699 29459857 30778826 31609614 32561624 33964981 34774041 35853388
4356 35853388 36898955 37916092 38562998 39564452 40415447 41497593 42153092 42680693 43596073
4347 43596073 44301097 45343564 45910752 46676205 47613461 48579959 49346810 50267190 50778010
4338 50778010 51393987 51974748 51964071 52003972 52031607 51319382 50997815 50352107 49311292 48618375
$$ packed form
4403I721110M02855N4719J85806K33855R5870K49884N53099P979j0730O55915
4393A2150362N06749R7743k7903M43479M45053M31075L62925K18898K0956L85483
4383A5034820P76162L05227L2501N78498J007801J44042O45173Q86314Q10325
4374B0220863L41482N09225O55988N75351P34747Q97721Q35076P36829J028611
4365B6535893J136558R78248Q09158J318969Q30788R52010J403357Q09060J079347
4356C5853388J045567J017137O46906J001454Q50995J082146O55499N27601R15380
4347D3596073P05024J042467N67188P65453R37256R66498P66851R20380N10820
4338E0778010O15977N80761j0677L9901K7635p12225l21567o45708j040815o92917
$$ plain form
4328 48618375 47955593 47326752 46420630 45830913 44934517 44440014 43796993 42716251 42415799
4319 42415799 41730267 40928525 40420775 39593947 38917107 37912630 37294171 36625518 35749801
4310 35749801 35275083 34428807 33784436 33136961 32470454 32419100 32287449 32128504 31781384 31499117
4300 31499117 31359869 31556744 32044471 32089987 32221549 32658167 33414366 33581762 34503973 35194651
4290 35194651 36372777 37324410 38701292 40259863 41752494 43319609 45007318 46881296
4282 46881296 48780836 50462855 51706251 52644814 53414637 53937070 53920771 54012556 53893649
4273 53893649 54230995 54591682 54991406 55647153 56829617 57928299 59524740 61209430 62923669
4264 62923669 64954548 67120952 69488495 71123051 72367652 72645735 71764512 70408272
$$ packed form
4328D8618375o62782o28841r06122n89717q96396m94503o43021j080742l00452
4319D2415799o85532q01742n07750q26828o76840j004477o18459o68653q75717
4310C5749801m74718q46276o44371o47475o66507n1354j31651j58945l47120k82267
4300C1499117j39248J96875M87727M5516J31562M36618P56199J67396R22211O90678
4290C5194651J178126R51633J376882J558571J492631J567115J687709J873978
4282D6881296J899540J682019J243396R38563P69823N22433j6299R1785j18907
4273E3893649L37346L60687L99724O55747J182464J098682J596441J684690J714239
4264F2923669K030879K166404K367543J634556J244601K78083q81223j356240
$$ plain form
4256 70408272 68930641 67041069 65456228 63298222 61098927 59490270 57889076 56921615
4248 56921615 56185474 55624198 55171946 54832437 54193284 53952909 53577052 53213169 52876814
4239 52876814 52340432 51605195 50696861 49818422 48341092 46858693 44918800 42764235 41239773
4230 41239773 39895067 38624898 37421836 36263800 35123238 34294063 33382982 32573936 32127204
4221 32127204 31595909 31250168 31221561 31040116 30944457 31343194 31539185 31441769 31718592 31622318
4211 31622318 31402353 31372902 31627501 31991660 32138128 32599091 32984580 33707644 34377588 35271018
4201 35271018 36178206 36811364 37769116 38922305 40019810 40983860 41718671 42872970 44068842
4192 44068842 45546211 46897766 48521746 49994708 51154859 52931697 54316194 55787533
$$ packed form
4256G0408272j477631j889572j584841k158006k199295j608657j601194r67461
4248E6921615p36141n61276m52252l39509o39153k40375l75857l63883l36355
4239E2876814n36382p35237r08334q78439j477330j482399j939893k154565j524462
4230D1239773j344706j270169j203062j158036j140562q29175r11081q09046m46732
4221C2127204n31295l45741k8607j81445r5659L98737J95991r7416K76823r6274
4211C1622318k19965k9451K54599L64159J46468M60963L85489P23064O69944Q93430
4201C5271018R07188O33158R57752J153189J097505R64050P34811J154299J195872
4192D4068842J477369J351555J623980J472962J160151J776838J384497J471339
$$ plain form
4184 55787533 57289323 58844093 60577553 61904977 63380696 65126872 66886050 68251032
4176 68251032 69604990 70661898 71904659 72876754 73949877 74897650 75959081 77210594
4168 77210594 77866312 79159769 80185303 81381177 82043493 83150088 83925101 84389068 85063564
4159 85063564 85626750 85706682 85921972 86050293 85879054 86547752 87199931 87421475 88346840 89000094
4149 89000094 90301630 91762962 93558322 96058018 98752648 101733373 105227138 108213364
4141 108213364 110139801 110029458 108370059 105538072 103083576 101240622 99684522 98901333
4133 98901333 98072985 97608785 96711891 95443454 94218797 92449826 90701316 89543890 88156767
4124 88156767 86267482 84560438 82435782 80057245 78039987 75909696 73883454 72240430
$$ packed form
4184E5787533J501790J554770J733460J327424J475719J746176J759178J364982
4176F8251032J353958J056908J242761R72095J073123R47773J061431J251513
4168G7210594O55718J293457J025534J195874O62316J106595P75013M63967O74496
4159H5063564N63186P9932K15290J28321j71239O68698O52179K21544R25365O53254
4149H9000094J301536J461332J795360K499696K694630K980725L493765K986226
4141A08213364J926437j10343j659399k831987k454496j842954j556100p83189
4133I8901333q28348m64200q96894j268437j224657j768971j748510j157426j387123
4124H8156767j889285j707044k124656k378537k017258k130291k026242j643024
$$ plain form
4116 72240430 70613496 68418392 66187206 64228638 62255702 60281857 58354721 56597493
4108 56597493 54765361 52963994 50859672 48760294 46839426 44483586 42286660 40281287
4100 40281287 38733548 37053769 35448931 33874783 32775471 31266708 30220381 28974972
4092 28974972 28212577 27677319 26577369 25782798 24784262 24020919 23259051 22513841 21774079
4083 21774079 21202081 20650292 20060824 19476756 18534214 18221258 17785547 17228536 16955749
4074 16955749 16716194 16306277 16026421 15835925 15692625 15226126 14717620 14279596 14246045 14242949
4064 14242949 14063478 13680609 13022025 13190862 13037426 12721446 12469960 12120534 12038830 11831052
4054 11831052 11606794 11349722 11149993 11102885 11492281 11629346 11827086 11708511 11434596 11762215
$$ packed form
4116G2240430j626934k195104k231186j958568j972936j973845j927136j757228
4108E6597493j832132j801367k104322k099378j920868k355840k196926k005373
4100D0281287j547739j679779j604838j574148j099312j508763j046327j245409
4092B8974972p62395n35258j099950p94571r98536p63343p61868p45210p39762
4083B1774079n71998n51789n89468n84068r42542l12956m35711n57011k72787
4074A6955749k39555m09917k79856j90496j43300m66499n08506m38024l3551l096
4064A4242949j79471l82869o58584J68837j53436l15980k51486l49426q1704k07778
4054A1831052k24258k57072j99729m7108L89396J37065J97740j18575k73915L27619
$$ plain form
4044 11762215 12186541 12784862 13123414 13586371 14297916 15052886 15056090 14393114 13498221 12500666
4034 12500666 11814658 11303633 10677305 10095347 9619324 9555218 9269856 8991310 8913404 8959453
4024 8959453 8531741 8336862 8278557 8304179 8152605 7683730 7641599 7731208 8040985 7860458
4014 7860458 7825896 7848885 7754479 7436035 7363059 7291186 7203066 7461815 7559409 7403684 7208740
4003 7208740 7265930 7295672 7203361 7622383 7599847 7783763 7665043 7877702 7871418 7552933 7217813
3992 7217813 7365396 7182693 6825114 6871220 6732149 6442620 6615975 6830841 6807570 7015236
3982 7015236 6917497 7066000 7245781 7268943 7453892 7672512 7989153 8640119 9063322 9554816
3972 9554816 9637291 9533987 8965748 8497499 8044650 7764314 7180432 6931763 6763527 6815399
$$ packed form
4044A1762215M24326N98321L38552M62957P11545P54970L204o62976q94893r97555
4034A2500666o86008n11025o26328n81958m76023o4106k85362k78546p7906M6049
4024H959453m27712j94879n8305K5622j51574m68875m2131Q9609L09777j80527
4014G860458l4562K2989r4406l18444p2976p1873q8120K58749R7594j55725j94944
4003G208740N7190K9742r2311M19022k2536J83916j18720K12659o284l18485l35120
3992G217813J47583j82703l57579M6106j39071k89529J73355K14866k3271K07666
3982G015236r7739J48503J79781K3162J84949K18620L16641O50966M23203M91494
3972I554816Q2475j03304n68239m68249m52849k80336n83882k48669j68236N1872
$$ plain form
3962 6815399 6313335 6049705 6272556 6319488 6638313 6527707 6552094 6786654 7161684 7207698
3952 7207698 7165518 7728712 8504098 9080703 9138908 8760926 8280835 7476626 7059663 7085916
3942 7085916 6646622 6141727 6199669 6143537 6055282 6169916 5724443 5465821 5503649 5643333
3932 5643333 5573064 5654304 5394197 5391032 5574416 5615242 5897466 5800017 6007242 5954562 5764054
3921 5764054 5691002 5395833 5242950 5290489 5301438 5332458 5206057 5098698 4696769 4584461
3911 4584461 4632503 4790895 4525197 4613042 4697133 4666324 4883702 4888977 4705514 4330682 4489967
3900 4489967 4625340 4627655 4549990 4704471 4804791 4733398 4798663 4890424 4567849 4592999 4955185
3889 4955185 5083398 5064864 5179001 4932409 4897767 5073753 5061302 5154382 5286054 5119655
$$ packed form
3962F815399n02064k63630K22851M6932L18825j10606K4387K34560L75030M6014
3952G207698m2180N63194P75386N76605N8205l77982m80091q04209m16963K6253
3942G085916m39294n04895N7942n6132q8255J14634m45473k58622L7828J39684
3932E643333p0269Q1240k60107l165J83384M0826K82224r7449K07225n2680j90508
3921E764054p3052k95169j52883M7539J0949L1020j26401j07359m01929j12308
3911D584461M8042J58392k65698Q7845Q4091l0809K17378N275j83463l74832J59285
3900D489967J35373K315p7665J54481J00320p1393O5265R1761l22575K5150L62186
3889D955185J28213j8534J14137k46592l4642J75986j2451R3080J31672j66399
$$ plain form
3879 5119655 5204597 5237451 5063336 5123379 5103962 5340271 5349262 5378885 5247107 5248782 5706279
3868 5706279 5465326 5096883 5107343 5457421 5304209 5315281 5446649 5525288 5608725 5591896
3858 5591896 5622365 5644617 5619997 5963878 5955193 5691950 5459952 5578736 5788221 6025539
3848 6025539 6132983 5988290 6074808 6036771 5958068 6056914 6033926 6291159 6381359 6327677 6533104
3837 6533104 6700702 6836101 6484006 6700360 6721871 6849824 6879280 6821234 6998695 6920398
3827 6920398 7301270 7537493 7222432 7393665 7485976 7545001 8026347 8201852 8475380 8512453
3817 8512453 8415331 8804999 8830947 8751694 9092908 9369374 9472070 9706864 9577888 9713331
3807 9713331 9955733 10292469 10667044 10962892 11404029 11800527 11960917 12170280 12496366 12907982
$$ packed form
3879E119655Q4942L2854j74115O0043j9417K36309Q991K9623j31778J675M57497
3868E706279k40953l68443J0460L50078j53212J1072J31368P8639Q3437j6829
3858E591896L0469K2252k4620L43881q685k63243k31998J18784K09485K37318
3848F025539J07444j44693Q6518l8037p8703R8846k2988K57233R0200n3682K05427
3837F533104J67598J35399l52095K16354K1511J27953K9456n8046J77461p8297
3827F920398L80872K36223l15061J71233R2311N9025M81346J75505K73528L7073
3817H512453r7122L89668K5948p9253L41214K76466J02696K34794j28976J35443
3807I713331K42402L36736L74575K95848M41137L96498J60390K09363L26086M11616
$$ plain form
3797 12907982 13176002 13601684 14134821 14429070 14868904 15352809 15504439 16401686 16854210
3788 16854210 17105254 17350310 17658024 18505522 19238984 20128533 20695189 21329584 22040304
3779 22040304 22407819 22769348 23493786 24148846 24808550 25205166 26205857 27132987 27723981
3770 27723981 28412274 29061955 29692155 30420519 31373359 31911607 32317881 32816711 33642281
3761 33642281 34121910 34546347 35044091 35592977 36070227 36356102 36872738 37278968 37634545
3752 37634545 37771948 37979633 38494831 38206035 38392656 38824674 38974137 38785554 38600176
3743 38600176 38657960 38407104 38394321 38508710 38419202 38413836 38040345 37707398 36858758 36460885
3733 36460885 36008098 35378161 35222246 34831398 34071683 33158517 32712161 31938424 30986419
$$ packed form
3797A2907982K68020M25682N33137K94249M39834M83905J51630Q97247M52524
3788A6854210K51044K45056L07714Q47498P33462Q89549N66656O34395P10720
3779B2040304L67515L61529P24438O55060O59704L96616J000691R27130N90994
3770B7723981O88293O49681O30200P28364R52840N38248M06274M98830Q25570
3761C3642281M79629M24437M97744N48886M77250K85875N16636M06230L55577
3752C7634545J37403K07685N15198k88796J86621M32018J49463j88583j85378
3743C8600176N7784k50856j2783J14389q9508n366l73491l32947q48640l97873
3733C6460885m52787o29937j55915l90848p59715r13166m46356p73737r52005
$$ plain form
3724 30986419 30661678 30326809 29700173 28927799 28222376 27441741 26452884 26134591 25647321
3715 25647321 25013979 24281832 23196646 22425429 22042447 21365650 20660779 19764373 19324240
3706 19324240 18956567 18117630 17602532 17388741 16947500 16312436 15757261 15677679 14832749 14622389
3696 14622389 14414165 13986467 13428579 13354780 13290116 13070440 13036324 12907206 12494783 12188881
3686 12188881 12224451 12108645 12181615 12103672 12343576 12111269 11822389 11712293 11671525 11647188
3676 11647188 11635642 11572629 11673951 11637636 11955519 11866256 12001225 12132367 12207816 12155945
3666 12155945 12462930 12727683 13059536 13397053 13606923 14196477 14576167 14755508 15635415
3657 15635415 16652317 18062019 19616526 21078365 21038458 19796517 18255561 16931126
$$ packed form
3724C0986419l24741l34869o26636p72374p05423p80635r88857l18293m87270
3715B5647321o33342p32147j085186p71217l82982o76797p04871q96406m40133
3706A9324240l67673q38937n15098k13791m41241o35064n55175p9582q44930k10360
3696A4622389k08224m27698n57888p3799o4664k19676l4116j29118m12423l05902
3686A2188881L5570j15806P2970p7943K39904k32307k88880j10096m0768k4337
3676A1647188j1546o3013J01322l6315L17883q9263J34969J31142P5449n1871
3666A2155945L06985K64753L31853L37517K09870N89554L79690J79341Q79907
3657A5635415J016902J409702J554507J461839l9907j241941j540956j324435
$$ plain form
3649 16931126 16449325 15610034 14743305 14157418 13741516 13403994 13289571 13388855 13543302 13243304
3639 13243304 13008085 13053178 13342210 13233677 13407180 13505183 13806684 14062151 14293945 14455339
3629 14455339 14837144 15174417 15455386 15746555 16376404 16618171 16778028 17192412 17930261
3620 17930261 18571811 18963691 19367731 20197751 20743276 21498761 22534914 23548612 24471202
3611 24471202 25491387 26596118 28449340 30165776 31599916 33145981 34459766 36084954
3603 36084954 37872849 39571166 41544130 43410088 45298620 46817696 48547887 50453499
3595 50453499 51974091 53148122 54235888 55398130 56623705 58095403 59195292 60818229
3587 60818229 62150358 63412379 65144076 67309560 69220901 71435275 73623079 75530989
$$ packed form
3649A6931126m81801q39291q66729n85887m15902l37522j14423R9284J54447k99998
3639A3243304k35219M5093K89032j08533J73503R8003L01501K55467K31794J61394
3629A4455339L81805L37273K80969K91169O29849K41767J59857M14384P37849
3620A7930261O41550L91880M04040Q30020N45525P55485J036153J013698R22590
3611B4471202J020185J104731J853222J716436J434140J546065J313785J625188
3603C6084954J787895J698317J972964J865958J888532J519076J730191J905612
3595E0453499J520592J174031J087766J162242J225575J471698J099889J622937
3587F0818229J332129J262021J731697K165484J911341K214374K187804J907910
$$ plain form
3579 75530989 77368784 78946584 80093751 80854511 81053807 80944032 80305595 79096908 78037220
3570 78037220 77225135 76219012 75302366 74429070 73916234 74544256 74395570 74909820 75836283
3561 75836283 77054227 78721647 80087472 81810400 83628322 85125858 86288728 87085654
3553 87085654 87657534 87225814 86313067 85408709 84087917 82564081 81360502 80294479 78925578
3544 78925578 78383591 77982385 78166291 78744752 79621625 81211799 83005129 84647243 86403992
3535 86403992 88317116 89843029 90403742 91059325 91126460 89829487 88086608 86163736 83688610
3526 83688610 80632729 77484657 75066505 72890471 70882687 68812689 67468584 65881328
3518 65881328 65117447 64666582 63695029 62929125 61957684 60501974 58871178 57080136 54664411
$$ packed form
3579G5530989J837795J577800J147167P60760J99296j09775o38437j208687j059688
3570G8037220q12085j006123r16646q73296n12836O28022j48686N14250R26463
3561G5836283J217944J667420J365825J722928J817922J497536J162870P96926
3553H7085654N71880m31720r12747r04358j320792j523836j203579j066023j368901
3544G8925578n41987m01206J83906N78461Q76873J590174J793330J642114J756749
3535H6403992J913124J525913N60713O55583O7135j296973j742879j922872k475126
3526H3688610l055881l148072k418152k176034k007784k069998j344105j587256
3518F5881328p63881m50865r71553p65904r71441j455710j630796j791042k415725
$$ plain form
3509 54664411 51885258 48801415 45899967 43075118 40561156 38112375 35719377 33728019
3501 33728019 31747859 29941542 28568734 27120875 25875580 25051810 23701595 22698687
3493 22698687 21744872 20718541 20177072 19542845 18746898 18273056 17463740 17141680 16744671
3484 16744671 16251485 15844143 15522966 15173628 14903164 14666494 14182557 13846813 13413250
3475 13413250 13118046 12758397 12501968 12461372 12255926 12199747 11903434 11717638 11600078 11460999
3465 11460999 11259445 10964975 10903585 10606355 10520567 10365493 10644620 10419158 10310435 10055138
3455 10055138 10092531 10256751 10057583 10041727 9839066 9916097 9859895 9845094 9669338 9681300
3445 9681300 9853803 9626838 9698484 9562805 9453224 9642504 9443118 9476566 9164762 9388823
$$ packed form
3509E4664411k779153l083843k901448k824849k513962k448781k392998j991358
3501C3728019j980160j806317j372808j447859j245295q23770j350215j002908
3493B2698687r53815j026331n41469o34227p95947m73842q09316l22060l97009
3484A6744671m93186m07342l21177l49338k70464k36670m83937l35744m33563
3475A3413250k95204l59649k56429m0596k05446n6179k96313j85796j17560j39079
3465A1460999k01554k94470o1390k97230q5788j55074K79127k25462j08723k55297
3455A0055138L7393J64220j99168j5856k02661P7031n6202j4801j75756J1962
3445I681300J72503k26965P1646j35679j09581J89280j99386L3448l11804K24061
$$ plain form
3435 9388823 9550529 9529249 9562844 9593813 9737603 9565935 9718664 9562619 9580988 9587862 9800234
3424 9800234 9993529 9987534 10237407 10169371 10178893 10275210 10250037 10143627 10213301 10496106 10622370
3413 10622370 10319480 10587098 10524894 10385305 10327926 10231844 10531826 10264751 10243274 10459140
3403 10459140 10665951 10423247 10696438 10560565 10883249 10951488 11170234 11132179 10952115 11221717
3393 11221717 11337589 11336366 11509800 11820106 11781093 11870357 11668414 11768341 11804890 11676020
3383 11676020 11899002 12085707 12180078 12094622 12176785 12058520 12098307 12270827 12185954 12006705
3373 12006705 12238687 12424730 12524866 12391764 12334903 12640474 12691955 12769824 12783912 12659717
3363 12659717 12877030 12982045 12864149 12984924 12930930 13074249 13153593 13109173 12839546 12752509
$$ packed form
3435I388823J61706k1280L3595L0969J43790j71668J52729j56045J8369O874K12372
3424I800234J93295n995K49873o8036R522R6317k5173j06410O9674K82805J26264
3413A0622370l02890K67618o2204j39589n7379r6082K99982k67075k1477K15866
3403A0459140K06811k42704K73191j35873L22684O8239K18746l8055j80064K69602
3393A1221717J15872j223J73434L10306l9013Q9264k01943R9927L6549j28870
3383A1676020K22982J86705R4371q5456Q2163j18265L9787J72520q4873j79249
3373A2006705K31982J86043J00136j33102n6861L05571N1481P7869J4088j24195
3363A2659717K17313J05015j17896J20775n3994J43319P9344m4420k69627q7037
$$ plain form
3353 12752509 12756327 12495073 12925050 13340914 13434201 13070568 12837475 12587297 12465610 12506599
3343 12506599 12844306 12792401 12675185 12718028 12449687 12604213 12507194 12221470 12545392 12325230
3333 12325230 12472068 12310936 12199261 12166026 12165386 12079374 12372011 12033199 12214864 12342113
3323 12342113 11945120 11757474 11427111 11464128 11629567 11755715 12080458 12254043 11969472 12065497
3313 12065497 11788240 11824649 11805225 11904381 11722310 11783434 11941175 11843691 11874221 11580497
3303 11580497 12176575 12362108 12065028 12338264 12156624 11982462 12356637 12467145 12249146
3294 12249146 12291416 12361767 12398607 12589559 13154170 13148534 12979832 12690501 12905861 12927414
3284 12927414 13326973 13293316 13648984 13618259 14038454 13881129 14021001 14240186 14385180 14636090
$$ packed form
3353A2752509L818k61254M29977M15864R3287l63633k33093k50178j21687M0989
3343A2506599L37707n1905j17216M2843k68341J54526r7019k85724L23922k20162
3333A2325230J46838j61132j11675l3235o40q6012K92637l38812J81665J27249
3323A2342113l96993j87646l30363L7017J65439J26148L24743J73585k84571R6025
3313A2065497k77257L6409j9424R9156j82071O1124J57741r7484L0530k93724
3303A1580497N96078J85533k97080K73236j81640j74162L74175J10508k17999
3294A2249146M2270P0351L6840J90952N64611n636j68702k89331K15360K1553
3284A2927414L99559l3657L55668l0725M20195j57325J39872K19185J44994K50910
$$ plain form
3274 14636090 14571852 15102843 15248177 15552639 16290454 16819606 17286573 17339839 17918959 18254000
3264 18254000 18385447 18914674 19526519 20044273 20544155 21141388 21696144 22481813 23144822
3255 23144822 24089913 24710612 25283269 26437864 27006700 28249818 29252937 30131409 30905088
3246 30905088 31623589 32890181 34076987 35147463 36564995 37440161 38525828 39692266
3238 39692266 40825959 41698501 42958031 44446683 45673704 46863804 46905377 47362915 48113645
3229 48113645 48502455 48681862 49466337 49867139 50530922 50986279 51553706 51732701 51604573
3220 51604573 52459337 52716034 53644536 54674428 56098797 57690089 60416834 63965816 68977906
3211 68977906 76194325 87414356 101926626 120842185 122032493 103096373 85913552
$$ packed form
3274A4636090o4238N30991J45334L04462P37815N29152M66967N3266N79120L35041
3264A8254000J31447N29227O11845N17754M99882N97233N54756P85669O63009
3255B3144822R45091O20699N72657J154595N68836J243118J003119Q78472P73679
3246C0905088P18501J266592J186806J070476J417532Q75166J085667J166438
3238C9692266J133693Q72542J259530J488652J227021J190100M1573M57538P50730
3229D8113645L88810J79407P84475M00802O63783M55357N67427J78995j28128
3220E1604573Q54764K56697R28502J029892J424369J591292K726745L548982N012090
3211F8977906P216419J1220031J4512270J8915559J190308j8936120j7182821
$$ plain form
3204 85913552 72427592 62654408 55060775 49472043 44572681 40888382 37727920 35285284
3196 35285284 32663066 30668950 28579974 27407459 26411477 24988332 23751931 22852641
3188 22852641 21793110 21008442 20232778 19654935 18962093 18481121 17788011 17181502 16291837
3179 16291837 15939677 15322021 15099684 14230044 13887819 13619123 13336585 12897328 12337429
3170 12337429 11675942 11630799 11517986 11511429 11264469 10651754 10508768 10151799 9821358 9855569
3160 9855569 9533327 9444266 9518226 9235783 9216947 9155769 8754626 8933400 8673123 8925319
3150 8925319 8839880 8355428 8497028 8299303 8167429 8220302 8461504 8354101 8199194 8310186
3140 8310186 8353190 8113162 8091286 8223777 8250150 8140478 8068782 7724193 8331951 8407793
$$ packed form
3204H5913552j3485960r773184p593633n588732m899362l684299l160462k442636
3196C5285284k622218j994116k088976j172515r95982j423145j236401q99290
3188B2852641j059531p84668p75664n77843o92842m80972o93110o06509q89665
3179A6291837l52160o17656k22337q69640l42225k68696k82538m39257n59899
3170A2337429o61487m5143j12813o557k46960o12715j42986l56969l30441L4211
3160I855569l22242q9061P3960k82443j8836o1178m01143J78774k60277K52196
3150H925319q5439m84452J41600j97725j31874N2873K41202j07403j54907J10992
3140H310186M3004k40028k1876J32491K6373j09672p1696l44589O07758P5842
$$ plain form
3130 8407793 8491095 8533565 8197507 8359026 8584565 8366994 8658433 8834205 8601921 8900571
3120 8900571 9095514 8833106 9013041 8842413 9097050 9123636 9218322 9620121 9782954 9943497
3110 9943497 10154641 10144065 10408098 10481952 10685099 11323028 11264401 11403143 11695499 11747957
3100 11747957 12054083 12641687 13050411 13223065 13445070 13888115 14410947 14739235 15255360
3091 15255360 15583791 15892323 16270126 17006477 17462895 18382942 19241196 19649479 20416973
3082 20416973 21352695 21904058 22533514 23285630 24063019 24954375 25550546 26587620 27424394
3073 27424394 28177378 29209355 30186433 31197608 32333119 33337958 34327446 35137627 36390040
3064 36390040 37613592 38708645 39788825 40769207 41883443 42844026 44327716 45455157
$$ packed form
3130H407793Q3302M2470l36058J61519K25539k17571K91439J75772k32284K98650
3120H900571J94943k62408J79935j70628K54637K6586R4686M01799J62833J60543
3110I943497K11144j0576K64033P3854K03147O37929n8627J38742K92356N2458
3100A1747957L06126N87604M08724J72654K22005M43045N22832L28288N16125
3091A5255360L28431L08532L77803P36351M56418R20047Q58254M08283P67494
3082B0416973R35722N51363O29456P52116P77389Q91356N96171J037074Q36774
3073B7424394P52984J031977R77078J011175J135511J004839R89488Q10181J252413
3064C6390040J223552J095053J080180R80382J114236R60583J483690J127441
$$ plain form
3056 45455157 46917004 48009662 49119811 50542542 52240533 53713452 54464114 55873175
3048 55873175 57034905 57926710 59009433 60231425 61421375 62223547 63256432 64257584
3040 64257584 65468099 66605777 67340258 68174794 69253508 71090916 72400869 73816253
3032 73816253 75510664 77141689 79032547 80458989 81953433 83790066 85183710 86633810
3024 86633810 88299969 89519130 90576282 92026778 93171846 94245613 95494573 96572916
3016 96572916 97716608 98784201 99984585 101333130 102481472 103783699 104413610 104915306
3008 104915306 105293465 105593108 105600714 105595382 105690615 105761068 106091101 106470521 106902491 107148264
2998 107148264 107892747 108299352 108833931 109377720 109707086 109641790 109853726 110042650 110014857 109859915
$$ packed form
3056D5455157J461847J092658J110149J422731J697991J472919P50662J409061
3048E5873175J161730Q91805J082723J221992J189950Q02172J032885J001152
3040F4257584J210515J137678P34481Q34536J078714J837408J309953J415384
3032G3816253J694411J631025J890858J426442J494444J836633J393644J450100
3024H6633810J666159J219161J057152J450496J145068J073767J248960J078343
3016I6572916J143692J067593J200384J348545J148342J302227O29911N01696
3008A04915306L78159K99643P606n332R5233P0453L30033L79420M31970K45773
2998A07148264P44483M06605N34579N43789L29366o5296K11936J88924k7793j54942
$$ plain form
2988 109859915 109575615 109364810 109263667 109318147 109975803 110579285 111533960 112395947 113641056
2979 113641056 115063346 116140534 117031124 118079120 118672611 119051328 119249554 119414936 119396797
2970 119396797 118529140 117642616 116605288 114831904 112500365 109854556 107001372 104200434
2962 104200434 101202889 98196360 94659794 91300203 87839808 84162375 80751540 77312983
2954 77312983 74128449 71178437 68261534 65417493 62911081 60414053 58038583 55438920
2946 55438920 53162748 51253242 49430306 47720927 45888971 44174382 42587726 41388857
2938 41388857 40482615 39371206 37996443 37106710 35756052 34629090 33577785 32438220
2930 32438220 31425780 30658913 29977662 29444115 28674296 27826971 27451160 27165207 26415720
$$ packed form
2988A09859915k84300k10805j01143N4480O57656O03482R54675Q61987J245109
2979A13641056J422290J077188Q90590J047996N93491L78717J98226J65382j8139
2970A19396797q67657q86524j037328j773384k331539k645809k853184k800938
2962A04200434k997545l006529l536566l359591l460395l677433l410835l438557
2954G7312983l184534k950012k916903k844041k506412k497028k375470k599663
2946E5438920k276172j909506j822936j709379j831956j714589j586656j198869
2938D1388857r06242j111409j374763q89733j350658j126962j051305j139565
2930C2438220j012440p66867o81251n33547p69819q47325l75811k85953p49487
$$ plain form
2921 26415720 26219984 26061546 25667932 25197770 24997937 25244233 24847641 24521581 24758600
2912 24758600 24742996 24785542 24361575 24361557 24333863 24565363 24760803 24909985 25004370 25182295 25588416
2901 25588416 25840613 26031673 26212629 26840757 27122933 27692881 28205115 28414735 28534974
2892 28534974 29075731 29747542 30199638 30849866 31763458 32617621 33178864 33785736 34419774
2883 34419774 35282290 36156676 37342466 38352496 39361571 40247275 40942941 42314555 43389353
2874 43389353 43885787 44757860 45709456 46356121 47149382 48738265 49719438 50693857 51950440
2865 51950440 53146628 54639010 56292922 58372419 60211387 62109576 64178261 66821865
2857 66821865 69186724 71313871 74220615 76798184 79558627 82147503 84806676 87764324
$$ packed form
2921B6415720j95736j58438l93614m70162j99833K46296l96592l26060K37019
2912B4758600j5604M2546m23967j8k7694K31500J95440J49182R4385J77925M06121
2901B5588416K52197J91060J80956O28128K82176N69948N12234K09620J20239
2892B8534974N40757O71811M52096O50228R13592Q54163N61243O06872O34038
2883C4419774Q62516Q74386J185790J010030J009075Q85704O95666J371614J074798
2874D3389353M96434Q72073R51596O46665P93261J588883R81173R74419J256583
2865E1950440J196188J492382J653912K079497J838968J898189K068685K643604
2857F6821865K364859K127147K906744K577569K760443K588876K659173K957648
$$ plain form
2849 87764324 90595564 93180561 95507711 98058963 100419012 102804047 105090749 107382353
2841 107382353 109857076 112215997 114335700 116073626 117745281 118925820 119755440 119907934
2833 119907934 119556197 118453840 117293184 115375891 113398475 110744767 107360607 103718882
2825 103718882 100134459 96830766 92978727 88918452 85315798 81532953 77718304 74220275
2817 74220275 70812705 67515338 64394923 61804235 59421758 56935894 54454926 52573797
2809 52573797 50453086 48340855 46843103 45427625 43971626 42812091 41401996 40347941
2801 40347941 39180068 38418434 37330967 36495140 35610189 35222384 34453807 33960550 33104844
2792 33104844 32839842 32414469 31911277 30985411 30701390 30577677 29742022 29006212 28583856
$$ packed form
2849H7764324K831240K584997K327150K551252K360049K385035K286702K291604
2841A07382353K474723K358921K119703J737926J671655J180539Q29620J52494
2833A19907934l51737j102357j160656j917293j977416k653708l384160l641725
2825A03718882l584423l303693l852039m060275l602654l782845l814649l498029
2817G4220275l407570l297367l120415k590688k382477k485864k480968j881129
2809E2573797k120711k112231j497752j415478j455999j159535j410095j054055
2801D0347941j167873p61634j087467q35827q84951l87805p68577m93257q55706
2792C3104844k65002m25373n03192r25866k84021j23713q35655p35810m22356
$$ plain form
2783 28583856 27831490 27360735 26948959 26192091 25370126 24631171 24043175 23233278 22547668
2774 22547668 22155268 21701553 21066799 20700079 20456923 19899974 19389595 19066204 19131356 18644367
2764 18644367 18274292 18234970 18223498 17724715 17210180 17223659 17186981 17129798 16758202 16830542
2754 16830542 16516986 16471136 16548795 16578920 16602015 16611632 16387661 16068943 15910373 16055058
2744 16055058 16235168 15987425 15935564 16204505 16256784 16180367 16195505 16109735 16074412 16057295 15872472
2733 15872472 15999051 16211563 16238035 16340461 16211541 16221044 16522115 16475362 16643452 16868232
2723 16868232 16944778 17314473 17536157 17542287 17930850 18376010 18587297 18835834 19020837 19228480
2713 19228480 19465883 20018284 20451950 20512631 20837469 21341325 22134210 22879830 23584131 23920839
$$ packed form
2783B8583856p52366m70755m11776p56868q21965p38955n87996q09897o85610
2774B2547668l92400m53715o34754l66720k43156n56949n10379l23391O5152m86989
2764A8644367l70075l9322j1472m98783n14535J3479l6678n7183l71596P2340
2754A6830542l13556m5850P7659L0125K3095R617k23971l18718j58570J44685
2744A6055058J80110k47743n1861K68941N2279p6417J5138q5770l5323j7117j84823
2733A5872472J26579K12512K6472J02426j28920R503L01071m6753J68090K24780
2723A6868232P6546L69695K21684O130L88563M45160K11287K48537J85003K07643
2713A9228480K37403N52401M33666O0681L24838N03856P92885P45620P04301L36708
$$ plain form
2703 23920839 24778326 25381650 26101687 26638001 27367689 28119426 28811439 29396767 30081835
2694 30081835 30514456 31334992 31997590 32584049 32880408 33498482 34043217 34891619 35460908
2685 35460908 36185981 36575613 37197379 37898279 38469285 39308434 40355089 41336719 42340270
2676 42340270 43537412 44838895 46054915 47322941 48947901 50777195 52811265 54898460
2668 54898460 57106151 59536988 62109646 64377526 67173788 70102537 73223720 76832090
2660 76832090 80684583 84591474 88540138 92904914 97544806 101947414 106112811 109914870
2652 109914870 113675038 117350452 120817946 124279749 127806553 130764545 133465323 136190051
2644 136190051 138593357 140340834 141669008 142289965 142813256 142479725 141493138 139974409 138329084
$$ packed form
2703B3920839Q57487O03324P20037N36314P29688P51737O92013N85328O85068
2694C0081835M32621Q20536O62598N86459K96359O18074N44735Q48402N69289
2685C5460908P25073L89632O21766P00900N71006Q39149J046655R81630J003551
2676D2340270J197142J301483J216020J268026J624960J829294K034070K087195
2668E4898460K207691K430837K572658K267880K796262K928749L121183L608370
2660G6832090L852493L906891L948664M364776M639892M402608M165397L802059
2652A09914870L760168L675414L467494L461803L526804K957992K700778K724728
2644A36190051K403306J747477J328174O20957N23291l33531r86587j518729j645325
$$ plain form
2635 138329084 136379843 134401071 132275213 130090976 127425519 125102773 122327241 119256941
2627 119256941 116181782 112856516 109586152 106173915 103433650 100439251 98001360 95778118
2619 95778118 94113429 92176464 90464863 89080873 88004517 87343511 86720002 86231498 86004736
2610 86004736 85912415 86334078 86558592 86660793 87230251 87870047 88496119 88874699 90201825
2601 90201825 91441827 93092692 94961470 97420770 100062324 103828286 107312478 111010434
2593 111010434 113791406 116529876 118934726 120208032 120420211 120051218 119681136 118638725
2585 118638725 117879988 116868984 114947795 112451534 109081190 105245667 101701408 97532095
2577 97532095 92568754 87874646 83617229 79298390 75574688 72047712 68940862 66371720
$$ packed form
2635A38329084j949241j978772k125858k184237k665457k322746k775532l070300
2627A19256941l075159l325266l270364l412237k740265k994399k437891k223242
2619I5778118j664689j936965j711601j383990j076356o61006o23509m88504k26762
2610H6004736r2321M21663K24514J02201N69458O39796O26072L78580J327126
2601I0201825J240002J650865J868778K459300K641554L765962L484192L697956
2593A11010434K780972K738470K404850J273306K12179l68993l70082j042411
2585A18638725p58737j011004j921189k496261l370344l835523l544259m169313
2577I7532095m963341m694108m257417m318839l723702l526976l106850k569142
$$ plain form
2569 66371720 64224268 62028490 60615511 59264949 58046142 57121717 56673958 56582266 56615092
2560 56615092 56408659 56606412 56784652 57496119 58710159 60179686 60919793 60586502 60407106
2551 60407106 60133081 59681975 59465131 59818622 60376783 60689512 61659445 63237279 64819412
2542 64819412 66857905 68622912 71139684 73575478 76761974 79857520 83517932 87594265
2534 87594265 91735788 96458881 101303082 105776217 109867470 112964312 114394307 114679342
2526 114679342 113206535 111387933 108381234 105076220 100783055 95423539 89643076 83757769
2518 83757769 79104052 74923180 71075695 67643040 64571942 61815700 59118261 56828119
2510 56828119 55082063 53155594 51123049 49394256 48130477 46730614 45279019 44401458
$$ packed form
2569F6371720k147452k195778j412979j350562j218807r24425m47759r1692L2826
2560E6615092k06433J97753J78240P11467J214040J469527P40107l33291j79396
2551F0407106k74025m51106k16844L53491N58161L12729R69933J577834J582133
2542F4819412K038493J765007K516772K435794L186496L095546L660412M076333
2534H7594265M141523M723093M844201M473135M091253L096842J429995K85035
2526A14679342j472807j818602l006699l305014m293165n359516n780463n885307
2518H3757769m653717m180872l847485l432655l071098k756242k697439k290142
2510E6828119j746056j926469k032545j728793j263779j399863j451595q77561
$$ plain form
2502 44401458 43992495 42822412 40322176 37851963 35164302 33234402 31686557 30148955
2494 30148955 28866139 27791015 27000247 25927767 25032737 24269955 23274279 22571635 22110742
2485 22110742 21604725 20715831 20138440 19503566 18891839 18671920 18226024 17924917 17897264 17478402
2475 17478402 16789847 16649689 16454062 16244679 16049377 15935776 15502894 15329873 15189292
2466 15189292 15036360 14980251 14939343 14616821 14631024 14722994 14565230 14420054 14109834 13718982
2456 13718982 13677889 13644128 13538467 13697896 13393785 13036363 13047054 13058721 12886426 12806098
2446 12806098 12655848 12757124 12471213 12779383 12617349 12543804 12552516 12681529 12548227 12885278
2436 12885278 12737140 12685349 13031237 12794745 12844329 12635677 12805980 12857078 12728203 12530902
$$ packed form
2502D4401458m08963j170083k500236k470213k687661j929900j547845j537602
2494C0148955j282816j075124p90768j072480q95030p62782r95676p02644m60893
2485B2110742n06017q88894n77391o34874o11727k19919m45896l01107k7653m18862
2475A7478402o88555j40158j95627k09383j95302j13601m32882j73021j40581
2466A5189292j52932n6109m0908l22522J4203R1970j57764j45176l10220l90852
2456A3718982m1093l3761j05661J59429l04111l57422J0691J1667j72295q0328
2446A2806098j50250J01276k85911L08170j62034p3545Q712J29013j33302L37051
2436A2885278j48138n1791L45888k36492M9584k08652J70303N1098j28875j97301
$$ plain form
2426 12530902 12680337 12638646 12731167 12736804 13047046 13145229 13086203 13441269 13339584 13260701 13246198
2415 13246198 13356371 13373593 13540373 13797417 14027134 14345295 14488971 14417088 14140889 14540133
2405 14540133 14732985 14876707 15272219 15603583 15785533 15730195 15696372 16080832 16631984 17306836
2395 17306836 17524439 18149304 18748396 19143856 19523626 19701567 20408038 20665414 21327954
2386 21327954 21870761 22243963 22775231 23730329 24660177 25124784 25731803 26717166 27546236
2377 27546236 28242270 29382373 30375147 31519133 33010574 34693257 36210236 37490917
2369 37490917 39136254 40778225 42791287 45123374 47595421 50038673 52831465 55773479
2361 55773479 58444490 61608439 64845122 68317230 72456441 76907597 81214217 86119389
$$ packed form
2426A2530902J49435m1691R2521N637L10242R8183n9026L55066j01685p8883j4503
2415A3246198J10173J7222J66780K57044K29717L18161J43676p1883k76199L99244
2405A4540133J92852J43722L95512L31364J81950n5338l3823L84460N51152O74852
2395A7306836K17603O24865N99092L95460L79770J77941P06471K57376O62540
2386B1327954N42807L73202N31268R55098R29848M64607O07019R85363Q29070
2377B7546236O96034J140103R92774J143986J491441J682683J516979J280681
2369C7490917J645337J641971K013062K332087K472047K443252K792792K942014
2361E5773479K671011L163949L236683L472108M139211M451156M306620M905172
$$ plain form
2353 86119389 90789244 95608061 100063490 104312158 108216277 112237818 116392347 120778507
2345 120778507 125682353 131095697 136540750 142821614 150044757 158176609 167332213 177006559
2337 177006559 188340352 201098695 215166737 230963344 248752349 269154982 292037708
2330 292037708 316216612 338446437 355226211 365445589 367050136 358061675 340574054
2323 340574054 318714745 295487700 273720638 253497459 235403401 219828867 206464946
2316 206464946 194631834 183959073 174396262 165983309 158691037 152495171 147608274 143895478
2308 143895478 140935643 138415079 136082000 133169770 129594123 124466214 118195781 110929402
2300 110929402 103406257 96501333 89981375 84135709 78403557 73453385 69275300 65675577
$$ packed form
2353H6119389M669855M818817M455429M248668L904119M021541M154529M386160
2345A20778507M903846N413344N445053O280864P223143Q131852R155604R674346
2337A77006559J1333793J2758343J4068042J5796607J7789005K0402633K2882726
2330B92037708K4178904K2229825J6779774J0219378J604547q988461j7487621
2323C40574054k1859309k3227045k1767062k0223179j8094058j5574534j3363921
2316B06464946j1833112j0672761r562811q412953p292272o195866m886897l712796
2308A43895478k959835k520564k333079k912230l575647n127909o270433p266379
2300A10929402p523145o904924o519958n845666n732152m950172m178085l599723
$$ plain form
2292 65675577 62173330 58766031 55736341 53187242 50831464 48385556 45938510 43679528
2284 43679528 41686897 39246589 37674944 36527388 35019468 33606874 32132503 31176700
2276 31176700 29576075 28402138 27660542 26336824 25455887 24826967 24028952 23515394 22487376
2267 22487376 21572705 20991891 19984136 19549149 18863620 18361904 17756760 17292606 17057189
2258 17057189 16259884 15620010 15192719 14895179 14905794 14382858 13908348 13505352 13003969 12884606
2248 12884606 12639266 12570147 12166251 11904063 11758008 11522172 11266568 11259470 11152911 10785505
2238 10785505 10133213 9979731 9946245 9703179 9463549 9150919 9066599 8592115 8442470 8607646
2228 8607646 8326284 8257425 8230915 8147426 7895514 7705354 7093888 6929648 6762688 6855565
$$ packed form
2292F5675577l502247l407299l029690k549099k355778k445908k447046k258982
2284D3679528j992631k440308j571645j147556j507920j412594j474371r55803
2276C1176700j600625j173937p41596j323718q80937o28920p98015n13558j028018
2267B2487376r14671n80814j007755m34987o85529n01716o05144m64154k35417
2258A7057189p97305o39874m27291k97540J0615n22936m74510m02996n01383j19363
2248A2884606k45340o9119m03896k62188j46055k35836k55604p098j06559l67406
2238A0785505o52292j53482l3486k43066k39630l12630q4320m74484j49645J65176
2228H607646k81362o8859k6510q3489k51912j90160o11466j64240j66960R2877
$$ plain form
2218 6855565 6874127 6805312 6501821 6637684 6546422 6387586 6049006 6087961 6134172 5618728
2208 5618728 5734105 5355034 5634501 5557076 5375927 5123897 5115368 5159104 4803993 4590996
2198 4590996 4837022 4805205 4518557 4666668 4303932 4355452 4091995 4028818 3985665 3832261
2188 3832261 3956656 3636542 3717520 3626019 3982926 3668421 3457818 3295465 3529595 3450174
2178 3450174 3337079 3258090 3561461 3886029 3664777 3501299 3444143 3402806 3425174 3141966
2168 3141966 2989989 3029034 2998030 2893694 2805389 2906947 2698182 2548065 2935232 3166124
2158 3166124 2958221 2915439 3162751 2827063 3040783 2980779 3004222 3165239 2759948 2676385
2148 2676385 2830047 2918864 2840589 2831191 2837219 2735277 2856095 2988134 3318885 3174824 2889549
$$ packed form
2218F855565J8562o8815l03491J35863r1262j58836l38580L8955M6211n15444
2208E618728J15377l79071K79467p7425j81149k52030q529M3736l55111k12997
2198D590996K46026l1817k86648J48111l62736N1520k63457o3177m3153j53404
2188C832261J24395l20114Q0978r1501L56907l14505k10603j62353K34130p9421
2178C450174j13095p8989L03371L24568k21252j63478n7156m1337K2368k83208
2168C141966j51977L9045l1004j04336q8305J01558k08765j50117L87167K30892
2158C166124k07903m2782K47312l35688K13720o0004K3443J61017m05291q3563
2148B676385J53662Q8817p8275r398O028j01942J20818J32039L30751j44061k85275
$$ plain form
2137 2889549 2914258 2762086 2905270 2764883 2791171 2893550 2951613 2873677 3028864 3250440
2127 3250440 3210519 2894674 2982611 2843749 3115173 3467059 3250060 3428485 3352426 3472510
2117 3472510 3821744 3672352 3779750 3444681 3550358 3646737 3151436 3046524 2981138 3138529
2107 3138529 2913728 2708843 2841007 2877935 2757531 2603291 2424008 2502719 2432608 2290064
2097 2290064 2271222 2364977 2364921 2192352 2365271 2143052 2067222 2059401 2033886 2463136 2205105
2086 2205105 1816065 1756401 1989271 2013732 2098100 2243978 1961429 1761833 1741146 1881924
2076 1881924 1723250 1812217 1744035 1802269 1584301 1350996 1398138 1382261 1050198 1426680
2066 1426680 1378850 1612400 1262286 1237673 1397071 1404449 1655364 1515904 1274508 1297965
$$ packed form
2137B889549K4709j52172J43184j40387K6288J02379N8063p7936J55187K21576
2127C250440l9921l15845Q7937j38862K71424L51886k16999J78425p6059J20084
2117C472510L49234j49392J07398l35069J05677R6379m95301j04912o5386J57391
2107C138529k24801k04885J32164L6928j20404j54240j79283P8711p0111j42544
2097B290064j8842R3755n6j72569J72919k22219p5830p821k5515M29250k58031
2086B205105l89040n9664K32870K4461Q4368J45878k82549j99596k0687J40778
2076A881924j58674Q8967o8182N8234k17968k33305M7142j5877l32063L76482
2066A426680m7830K33550l50114k4613J59398P378K50915j39460k41396K3457
$$ plain form
2056 1297965 1126571 1376763 1403860 1107178 1218211 961680 975640 887203 1080491 1302638
2046 1302638 1014241 1033681 1092813 993342 975808 1137434 1028399 932890 903702 1113446 1039283
2035 1039283 1042947 1076279 1074459 1267314 755897 854026 918521 876272 886139 899346 1133575
2024 1133575 1275581 1414103 1356035 905737 919337 922307 727119 873322 1021258 1107321
2014 1107321 1004760 1088433 1148505 696418 900713 914928 1221425 938855 940538 857928 1005892
2003 1005892 954747 1164961 993328 835400 787468 763450 580688 798208 814772 462718
1993 462718 611587 1024423 889294 634963 779021 600379 713764 579069 605987 466017
1983 466017 737212 815564 450753 341921 675693 754749 586918 874772 864620 607093
$$ packed form
2056A297965j71394K50192K7097k96682J11033k56531J3960q8437J93288K22147
2046A302638k88397J9440N9132r9471j7534J61626j09035r5509k9188K09744p4163
2035A039283L664L3332j820J92855n11417R8129O4495m2249R867J3207K34229
2024A133575J42006J38522n8068m50298J3600K970j95188J46203J47936Q6063
2014A107321j02561Q3673O0072m52087K04295J4215L06497k82570J683q2610J47964
2003A005892n1145K10214j71633j57928m7932k4018j82762K17520J6564l52054
1993D62718J48869M12836j35129k54331J44058j78642J13385j34695K6918j39970
1983D66017K71195P8352l64811j08832L33772P9056j67831K87854j0152k57527
$$ plain form
1973 607093 819960 845406 894975 796858 697508 943551 729718 486024 276567 412538
1963 412538 583282 555595 786418 858397 550481 496156 440662 503781 505020 264411 390292
1952 390292 357097 603762 732614 889773 558209 705382 626579 511188 843461 865906
1942 865906 756195 586347 611571 886780 603162 686752 868325 725789 379667 746314
1932 746314 888557 978384 853779 786924 680537 632106 962673 827273 739090 685313 671467
1921 671467 334720 445563 544908 678138 377109 748912 810332 661868 567376 248749
1911 248749 714774 662970 444603 342463 341735 726968 551103 372181 300344 350717 519802
1900 519802 527584 467234 473248 737327 741896 464404 464488 329871 177014 658118 384538 124803
$$ packed form
1973F07093K12867K5446M9569r8117r9350K46043k13833k43694k09457J35971
1963D12538J70744k7687K30823P1979l07916n4325n5494O3119J239k40609J25881
1952C90292l3195K46665J28852J57159l31564J47173p8803j15391L32273K2445
1942H65906j09711j69848K5224K75209k83618Q3590J81573j42536l46122L66647
1932G46314J42243Q9827j24605o6855j06387m8431L30567j35400q8183n3777j3846
1921F71467l36747J10843R9345J33230l01029L71803O1420j48464r4492l18627
1911B48749M66025n1804k18367j02140p28L85233j75865j78922p1837N0373J69085
1900E19802P782o0350O014K64079M569k77492Q4j34617j52857M81104k73580k59735
$$ plain form
1888 124803 376807 374852 383199 311362 734569 722212 571935 474486 494138 482889 502964
1877 502964 332526 601745 795778 476515 471275 115594 337301 586553 489794 408019
1867 408019 496678 523895 620835 430844 791893 651944 363155 573228 264693 212019
1857 212019 363137 488481 248996 356900 335407 364681 387620 324415 341154 640188 637704
1846 637704 330679 173345 598165 357407 239580 418928 374242 471081 532463 480164
1836 480164 567885 689478 742505 1044896 568341 609044 686847 622739 324872 220851 534171
1825 534171 610606 590125 661224 1029929 980937 1016304 706129 383050 423327 336359 384247
1814 384247 422675 661202 538876 392562 599496 602551 458709 539854 589296 593636 523445
$$ packed form
1888A24803K52004j955Q347p1837M23207j2357j50277r7449J9652j1249K0075
1877E02964j70438K69219J94033l19263n240l55681K21707K49252r6759q1775
1867D08019Q8659K7217R6940j89991L61049j39949k88789K10073l08535n2674
1857B12019J51118J25344k39485J07904k1493K9274K2939o3205J6739K99034k484
1846F37704l07025j57334M24820k40758j17827J79348m4686R6839O1382n2299
1836D80164Q7721J21593N3027L02391m76555M0703P7803o4108k97867j04021L13320
1825E34171P6435k0481P1099L68705m8992L5367l10175l23079M0277q6968M7888
1814C84247L8428K38527j22326j46314K06934L055j43842Q1145M9442M340p0191
$$ plain form
1803 523445 442894 514190 488549 432085 623469 670394 798888 761724 672232 654639 726164
1792 726164 747956 552717 577037 715214 904781 1041376 939150 928342 1481647 1131570
1782 1131570 891984 1080579 1309475 1218457 1099553 1288782 1421362 1208772 1494590 1574048
1772 1574048 1478270 1911003 1922784 1767681 1844333 1915128 2060262 2198135 2679292 2993801
1762 2993801 2643179 2884742 3132042 3559677 3812190 4020352 4550007 5120057 5338013 5402135
1752 5402135 5710135 6005310 6393314 6916002 6877299 7168007 7800597 8226943 8742035 9497588
1742 9497588 10362423 11389040 12402748 13427713 14257817 15285018 16897554 18903935 21385568
1733 21385568 25170028 30157346 36907521 45406878 56592734 55121311 43915029 35044755
$$ packed form
1803E23445q0551P1296k5641n6464J91384M6925J28494l7164q9492j7593P1525
1792G26164K1792j95239K4320J38177J89567J36595j02226j0808N53305l50077
1782A131570k39586J88595K28896r1018j18904J89229J32580k12590K85818P9458
1772A574048r5778M32733J1781j55103P6652P0795J45134J37873M81157L14509
1762B993801l50622K41563K47300M27635K52513K08162N29655N70050K17956O4122
1752E402135L08000K95175L88004N22688l8703K90708O32590M26346N15092P55553
1742I497588Q64835J026617J013708J024965Q30104J027201J612536K006381K481633
1733B1385568L784460M987318O750175Q499357J1185856j471423j1206282q870274
$$ plain form
1725 35044755 28154858 23199679 19481437 16860714 14434116 12716988 11455940 10814073
1717 10814073 9981636 8940713 7736455 6914045 6297422 5742293 5252961 5077789 4913656
1708 4913656 4277085 3958960 3756375 3411549 3550468 3046002 2595502 2771134 3313797 2992118
1698 2992118 2761093 2234492 2380198 2387044 2396969 2131861 2042416 1861858 1644445 1973459
1688 1973459 1522983 1386805 1515087 1264712 1237978 1607772 1465032 1086063 1154570 1336315
1678 1336315 1078538 976604 1354068 1340636 1237666 1197325 1017115 832965 741596 364410
1668 364410 699471 609671 807426 847506 895745 701896 415462 472654 686956 580812
1658 580812 290920 636178 615815 492634 747238 622698 589536 817905 609210 244540
$$ packed form
1725C5044755o889897m955179l718242k620723k426598j717128j261048o41867
1717A0814073q32437j040923j204258q22410o16623n55129m89332j75172j64133
1708D913656o36571l18125k02585l44826J38919n04466m50500J75632N42663l21679
1698B992118k31025n26601J45706O846R925k65108q9445j80558k17413L29014
1688A973459m50476j36178J28282k50375k6734L69794j42740l78969O8507J81745
1678A336315k57777j01934L77464j3432j02970m0341j80210j84150r1369l77186
1668C64410L35061q9800J97755M0080M8239j93849k86434N7192K14302j06144
1658E80812k89892L45258k0363j23181K54604j24540l3162K28369k08695l64670
$$ plain form
1648 244540 214266 373436 396797 716766 522039 528714 174279 147164 383563 374009 702597
1637 702597 449016 329098 225097 284339 340562 501150 308245 340572 407186 310889 120603
1626 120603 345409 177187 232593 236842 401096 732100 445470 320112 298934 400331
1616 400331 422632 499829 58016 -55928 264625 76962 39024 163988 278048 313316
1606 313316 -68141 219753 88694 410893 533686 273443 435286 139064 278192 305457
1596 305457 352179 501448 203358 248014 355066 224574 359614 137351 241195 182027
1586 182027 -62685 19521 164338 365774 156504 246217 158736 25768 273167 379912
1576 379912 165847 190893 188100 444566 190223 353782 332686 217198 453996 382985 63679
$$ packed form
1648B44540l0274J59170K3361L19969j94727O675l54435k7115K36399r554L28588
1637G02597k53581j19918j04001N9242N6223J60588j92905L2327O6614r6297j90286
1626A20603K24806j68222N5406M249J64254L31004k86630j25358k1178J01397
1616D00331K2301P7197m41813j13944L20553j87663l7938J24964J14060L5268
1606C13316l81457K87894j31059L22199J22793k60243J61843k96222J39128K7265
1596C05457M6722J49269k98090M4656J07052j30492J35040k22263J03844n9168
1586A82027k44712Q2206J44817K01436k09270Q9713q7481j32968K47399J06745
1576C79912k14065K5046k793K56466k54343J63559k1096j15488K36798p1011l19306
$$ plain form
1565 63679 295506 288641 284757 151030 90014 -714 48180 222336 183252 89168 73313 58112
1553 58112 122353 240554 298432 41607 77089 228460 473841 93729 -286235 -127715
1543 -127715 110247 149489 343936 149130 335234 106476 -90046 260733 299486 241856
1533 241856 18834 -11596 290729 240303 132947 498735 421234 702593 633647 546363 321191
1522 321191 316903 164559 186873 157984 93587 401803 242606 -101672 143524 505630 288890
1511 288890 381787 45537 -54800 237165 24589 46916 27153 -174614 125098 -72437
1501 -72437 -123576 -4215 -4755 389975 -7561 -144671 269034 27902 -111517 -50149 25559
1490 25559 -56437 107450 312864 240318 -8511 -130607 243628 204518 100247 120063 109572
$$ packed form
1565F3679K31827o865l884j33727o1016r0728M8894J74156l9084r4084j5855j5201
1553E8112O4241J18201N7878k56825L5482J51371K45381l80112l79964J58520
1543a27715K37962L9242J94447j94806J86104k28758j96522L50779L8753n7630
1533B41856k23022l0430L02325n0426j07356L65788p7501K81359o8946q7284k25172
1522C21191m288j52344K2314k8889o4397L08216j59197l44278K45196L62106k16740
1511B88890R2897l36250j00337K91965k12576K2327j9763k01767K99712j97535
1501g2437n1139J19361n40L94730l97536j37110M13705k41132j39419O1368P5708
1490B5559q1996J63887K05414p2546k48829j22096L74235l9110j04271J9816j0491
$$ plain form
1479 109572 -17525 192297 256698 78483 -17240 147257 -202254 142460 163116 -72662
1469 -72662 105600 120999 122501 162027 202700 77396 -112993 -1951 11446 5829 25465
1458 25465 169967 -164416 75092 393888 179354 -93130 -129973 242449 45434 -8722
1448 -8722 24513 -93889 176801 328250 100201 -138895 149148 308020 396912 70570
1438 70570 -44040 128076 145921 -20090 -69632 38679 305794 196782 243648 40782
1428 40782 199904 37323 -198202 -302239 -156003 -91361 -6293 152904 -142557 -24008
1418 -24008 110838 -69433 237145 284748 78625 -148988 -75780 15740 349843 425283 341459
1407 341459 42779 -150759 140036 210418 196027 182798 176808 33550 275156 -145103 191004
$$ packed form
1479A09572j27097K09822O4401j78215r5723J64497l49511L44714K0656k35778
1469g2662J78262J5399J502L9526M0673j25304j90389J11042J3397n617J9636
1458B5465J44502l34383K39508L18796k14534k72484l6843L72422j97015n4156
1448h722L3235j18402K70690J51449k28049k39096K88043J58872Q8892l26342
1438G0570j14610J72116J7845j66011m9542J08311K67115j09012M6866k02866
1428D0782J59122j62581k35525j04037J46236O4642Q5068J59197k95461J18549
1418b4008J34846j80271L06578M7603k06123k27613P3208R1520L34103P5440q3824
1407C41459k98680j93538K90795P0382j4391j3229n990j43258K41606m20259L36107
$$ plain form
1396 191004 331925 494979 219630 157311 144163 44610 37967 -234 276418 220183 35511
1385 35511 240875 215794 -254597 -136405 55458 -187591 27163 100035 309405 155422
1375 155422 163338 -156002 4301 206988 164397 -114665 -200866 -412058 -219243 -344406
1365 -344406 -436640 -218700 -93285 -119029 8776 76535 -82784 -199209 -140536 -13724
1355 -13724 101721 404427 287606 246147 331910 -174102 -80346 15094 -25991 27210 -213929
1344 -213929 -258534 -155598 24913 100114 -10022 -9528 163702 69854 77066 -25795 -116745
1333 -116745 73724 70242 143943 310368 224623 234396 158358 166836 183339 189660 -12902 188251
1321 188251 150263 -5642 -86636 -110104 148928 106669 -12715 -29860 76726 87790 98629
$$ packed form
1396A91004J40921J63054k75349o2319j3148r9553o643l8201K76652n6235j84672
1385C5511K05364k5081m70391J18192J91863k43049K14754P2872K09370j53983
1375A55422P916l19340J60303K02687m2591k79062q6201k11192J92815j25163
1365c44406r2234K17940J25415k5744J27805O7759j59319j16425N8673J26812
1355a3724J15445L02706j16821m1459Q5763n06012R3756R5440m1085N3201k41139
1344b13929m4605J02936J80511P5201j10136M94J73230r3848P212j02861r0950
1333a16745J90469l482P3701J66425q5745R773p6038Q478J6503O321k02562K01153
1321A88251l7988j55905q0994k3468K59032m2259j19384j7145J06586J1064J0839
$$ plain form
1310 98629 157748 91714 123761 -66114 57445 -129831 208209 367979 218047 -33187
1300 -33187 -20368 80480 22155 88497 38583 -38031 80891 15643 126757 144926 147601
1289 147601 121821 207733 305280 225098 114558 22049 44588 374825 135063 -91308 42176
1278 42176 -119232 -8571 -170888 37755 211031 35583 198551 423068 120749 -87475
1268 -87475 357489 295508 164673 194484 270185 332843 228511 91425 -150692 -387751 -225919
1257 -225919 38391 -62886 43991 273610 -31143 -3987 277719 351370 361824 398302
1247 398302 2812 25663 -43746 -177786 115843 105855 198687 360722 144211 30993 3697
1236 3697 -48611 -112407 -148721 101075 -104421 -24078 -128863 155735 65634 -224904 139440
$$ packed form
1310I8629N9119o6034L2047j89875J23559j87276L38040J59770j49932k51234
1300c3187J2819J00848n8325O6342m9914p6614J18922o5248J11114J8169K675
1289A47601k5780Q5912R7547q0182j10540r2509K2539L30237k39762k26371J33484
1278D2176j61408J10661j62317K08643J73276j75448J62968K24517l02319k08224
1268h7475M44964o1981j30835K9811P5701O2658j04332j37086k42117k37059J61832
1257b25919K64310j01277J06877K29619l04753K7156K81706P3651J0454L6478
1247C98302l95490K2851o9409j34040K93629r988R2832J62035k16511j13218k7296
1236C697n2308o3796l6314K49796k05496Q0343j04785K84598r0101k90538L64344
$$ plain form
1225 139440 305448 7960 81453 171456 485961 16952 56678 -95856 -214088 123347
1215 123347 35124 1809 -57876 -17641 47853 6674 -175593 -60893 197338 34554 69760
1204 69760 -223709 -80145 -148786 84423 -181262 -208031 62906 -152163 -68914 -289851
1194 -289851 -39202 183589 82349 -133323 -213105 -142845 28087 -210914 -35584 -110659
1184 -110659 -49322 -177739 -399140 -434904 -92978 -54922 96181 24223 74952 -49796 35399
1173 35399 18345 -205460 -8949 -145860 150359 59806 38512 103108 -153520 -147192 95173
1162 95173 140821 72224 -34631 -196474 -182934 -25268 -48630 -174501 35503 146122 -7881
1151 -7881 -34972 -13873 45673 -51041 18336 60455 -2444 -30840 82136 -157427 33237
$$ packed form
1225A39440J66008k97488P3493R0003L14505m69009L9726j52534j18232L37435
1215A23347q8223l3315n9685M0235O5494m1179j82267J14700K58231j62784L5206
1204F9760k93469J43564o8641K33209k65685k6769K70937k15069Q3249k20937
1194b89851K50649K22791j01240k15672p9782P0260J70932k39001J75330p5075
1184a10659O1337j28417k21401l5764L41926L8056J51103p1958N0729j24748Q5195
1173C5399j7054k23805J96511j36911K96219r0553k1294O4596k56628O328K42365
1162I5173M5648o8597j06855j61843J3540J57666k3362j25871K10004J10619j54003
1151g881k7091K1099N9546r6714O9377M2119o2899k8396J12976k39563J90664
$$ plain form
1140 33237 222194 -373849 -179028 -173914 158367 90217 149128 246102 226049 225751 -55710
1129 -55710 -158253 -331312 89477 66194 98437 44631 -364557 -133638 -83723 -120209 -69818
1118 -69818 -126095 -49762 -211414 -145192 -49113 99359 -2016 -17597 89998 -90520 28316
1107 28316 309600 12375 -378679 -226960 -134728 -110318 -136304 88849 122155 115216 -118634
1096 -118634 -161997 -259467 -162250 -119449 -8747 -205835 -72928 -204550 -45608 -65357 -31595
1085 -31595 179027 261190 125679 -293089 214364 225592 174082 345476 103301 194864 149291
1074 149291 32398 -14033 -128037 -118268 -167389 -217252 -210897 -49789 40408 -101294 -89652
1063 -89652 -82057 -194913 78586 -213749 -170772 11854 -22877 89244 285076 231305 167320
$$ packed form
1140C3237J88957n96043J94821N114L32281o8150N8911R6974k0053k98k81461
1129e5710j02543j73059M20789k3283L2243n3806m09188K30919M9915l6486N0391
1118f9818n6277P6333j61652O6222R6079J48472j01375j5581J07595j80518J18836
1107B8316K81284k97225l91054J51719R2232K4410k5986K25153L3306o939k33850
1096a18634m3363r7470R7217M2801J10702j97088J32907j31622J58942j9749L3762
1085c1595K10622Q2163j35511m18768N07453J1228n1510J71394k42175R1563m5573
1074A49291j16893m6431j14004R769m9121m9863O355J61108R0197j41702J1642
1063h9652P595j12856K73499k92335M2977J82626l4731J12121J95832n3771o3985
$$ plain form
1052 167320 272645 79093 -77797 18518 -188162 86840 138755 289048 108158 -170654
1042 -170654 304729 91763 196659 528247 246187 112965 -76499 121060 241490 226759
1032 226759 330881 435785 122864 308883 167585 15562 -124811 -7849 66148 -47149
1022 -47149 -89212 -68042 75836 122896 7957 -216397 -118248 16750 227188 -139108 121647
1011 121647 206090 182984 223240 -22016 242475 84756 -32727 -232734 -145317 -203403 65562
1000 65562 172142 -221758 50590 -183821 -151627 -87308 -559757 -95240 239025 264775
990 264775 -12685 -94894 127670 120584 347272 203058 82176 -73390 24347 100448 93032
979 93032 160531 79968 50966 63612 252486 266960 223783 -190916 99713 327946 -44238
$$ packed form
1052A67320J05325j93552j56890R6315k06680K75002N1915J50293j80890k78812
1042a70654M75383k12966J04896L31588k82060j33222j89464J97559J20430j4731
1032B26759J04122J04904l12921J86019j41298j52023j40373J16962P3997j13297
1022d7149m2063K1170J43878M7060j14939k24354R8149J34998K10438l66296K60755
1011A21647Q4443k3106M0256k45256K64491j57719j17483k00007Q7417n8086K68965
1000F5562J06580l93900K72348k34411L2194O4319m72449M64517L34265K5750
990B64775k77460q2209K22564p086K26688j44214j20882j55566R7737P6101p416
979I3032O7499q0563k9002J2646J88874J4474m3177m14699K90629K28233l72184
$$ plain form
968 -44238 96817 132457 143951 36479 222062 228206 -33420 25290 -405872 -77666 156184
957 156184 -163835 -33872 -182136 76565 -120957 -120751 -42795 60768 118260 131438 59130
946 59130 126856 125078 96974 55442 44166 82108 -46088 -73490 -149346 -297684 -510542 -494687
934 -494687 -283200 -10579 86938 -12112 -29941 -167664 -98908 -114646 -371468 -442715 -27525
923 -27525 -20833 -339401 -52994 -63537 -157177 94361 -91103 -280440 -34976 76003 33676
912 33676 263921 143129 -70707 -24421 -217549 -205494 -51692 4289 6252 -157159 -21503
901 -21503 103145 89031 112542 -78151 161809 -60278 -128965 41733 70462 332159 323138
890 323138 -3678 -23426 216153 147149 36861 -141945 -116924 -31510 78757 -34402 -101975
$$ packed form
968d4238J41055L5640J1494j07472J85583O144k61626N8710m31162L28206K33850
957A56184l20019J29963j48264K58701j97522K06P7956J03563N7492J3178p2308
946E9130O7726j778k8104m1532j1276L7942j28196k7402p5856j48338k12858J5855
934d94687K11487K72621R7517r9050j7829j37723O8756j5738k56822p1247M15190
923b7525O692l18568K86407j0543r3640K51538j85464j89337K45464J10979m2327
912C3676K30245j20792k13836M6286j93128J2055J53802N5981J963j63411J35656
901b1503J24648j4114K3511j90693K39960k22087o8687J70698K8729K61697r021
890C23138l26816j9748K39579o9004j10288j78806K5021Q5414J10267j13159o7573
$$ plain form
879 -101975 -21907 105674 -47611 -231574 97227 -405115 -543715 13105 85352 101763
869 101763 11117 -82759 -60838 81679 39987 -87177 -152534 122439 -36103 63544 -64627
858 -64627 127478 -91637 8 180646 -204451 -296476 -436679 -326560 85461 37640 -226037
847 -226037 -46956 -209928 -23447 226106 163780 -113820 55218 -29864 105322 -96476
837 -96476 -401486 -378632 -63051 -27685 -260419 -274440 -176701 -156919 22748 31517 -150968
826 -150968 55820 155324 164781 223348 -78497 -34788 -129135 44384 -115192 136812 154959
815 154959 -11486 248304 235615 167085 -42701 -18824 -260277 -129277 -69274 139849 78530
804 78530 207006 128470 -60926 28165 274872 286966 577564 428082 516356 186285 100934
$$ packed form
879a01975Q0068J27581j53285j83963L28801n02342j38600N56820P2247J6411
869A01763r0646r3876K1921J42517m1692j27164o5357K74973j58542R9647j28171
858f4627J92105k19115R1645J80638l85097r2025j40203J10119M12021m7821k63677
847b26037J79081j62972J86481K49553o2326k77600J69038q5082J35186k01798
837i6476l05010K2854L15581L5366k32734j4021R7739J9782J79667Q769j82485
826a50968K06788R9504R457N8567l01845M3709r4347J73519j59576K52004J8147
815A54959j66445K59790j2689o8530k09786K3877k41453J31000O0003K09123o1319
804G8530J28476p8536j89396Q9091K46707J2094K90598j49482Q8274l30071q5351
$$ plain form
793 100934 120899 -95599 -187642 88671 224949 -70095 -253063 -524853 -279337 -262432
783 -262432 -298160 49857 136207 206246 100105 1218 -144297 -90326 154989 -144034 -147344
772 -147344 -213979 -105470 80983 221660 219075 -10595 160063 -26896 -50459 -139149 -295884
761 -295884 109245 280500 354855 309939 48116 167908 71807 -298435 -336167 58389 74236
750 74236 26719 8595 18625 -143709 -487967 -126160 -135031 -151284 -298934 -282708 -109626
739 -109626 232793 -106511 -184284 -5641 -33692 -72619 107171 -283639 33563 -158988
729 -158988 74240 -182454 -92871 223295 358312 419962 381998 -33528 141383 177521 113779
718 113779 -30032 228548 226445 23494 106692 222032 61443 -24074 -72862 -18024 120306
$$ packed form
793A00934J9965k16498r2043K76313J36278k95044j82968k71790K45516J6905
783b62432l5728L48017Q6350P0039j06141r8887j45515N3971K45315k99023l310
772a47344o6635J08509J86453J40677k585k29670J70658j86959k3563q8690j56735
761b95884M05129J71255P4355m4916k61823J19792r6101l70242l7732L94556J5847
750G4236m7517j8124J0030j62334l44258L61807q871j6253j47650J6226J73082
739a09626L42419l39304p7773J78643k8051l8927J79790l90810L17202j92551
729a58988K33228k56694Q9583L16166J35017O1650l7964m15526J74911L6138o3742
718A13779j43811K58580k103k02951Q3198J15340j60589q5517m8788N4838J38330
$$ plain form
707 120306 213354 425436 267238 336676 -26041 -80356 -75991 137780 -62180 -278316 -362964
696 -362964 7538 -240612 -244558 -210490 -202766 -28240 -102632 -167495 -38052 -9093 -174948
685 -174948 -160728 -3129 -63337 50085 -229189 -171587 -65522 -103365 -160968 -50413 -171917
674 -171917 16751 -2027 -123194 31970 -40509 -310429 -222613 -166659 -316029 -191662 -151064
663 -151064 -80743 122063 -29782 -255510 180381 193841 54385 -61389 -135373 131240
653 131240 672 -132411 -88868 -340320 -374957 18657 121970 -8554 -158223 7549
643 7549 -11668 108723 -280121 -182136 -57307 181455 -64768 10871 -43091 -130747 -38629
632 -38629 -140444 -111148 -247821 -148185 88524 187861 -529 108900 147078 175583 11127
$$ packed form
707A20306R3048K12082j58198O9438l62717n4315M365K13771j99960k16136q4648
696c62964L70502k48150l946L4068P724J74526p4392o4863J29443K8959j65855
685a74948J4220J57599o0208J13422k79274N7602J06065l7843n7603J10555j21504
674a71917J88668j8778j21167J55164p2479k69920Q7816N5954j49370J24367M0598
663a51064P0321K02806j51845k25728M35891J3460j39456j15774p3984K66613
653A31240j30568j33083M3543k51452l4637L93614J03313j30524j49669J65772
643G549j9217J20391l88844R7985J24829K38762k46223P5639n3962q7656R2118
632c8629j01815K9296j36673R9636K36709R9337j88390J09429L8178K8505j64456
$$ plain form
621 11127 -105775 -151243 -95365 -58833 -168931 16102 -311177 -367230 -262952 -52576 57388
610 57388 122335 45402 -75950 86114 -197948 -205038 -70141 -184632 -68550 70277 141029
599 141029 181489 -126937 14035 82730 -201931 12982 363498 238961 -165884 232366
589 232366 40515 138 -19485 -171290 29799 237645 51829 81737 -133792 38080
579 38080 -126081 -80738 273233 297784 -73699 -245883 -9256 -256599 10171 211307
569 211307 206402 -205983 -40221 76713 40539 -104791 -48528 -260622 -303820 -311434 -173247
558 -173247 147276 153719 -124033 -66341 -32706 -219032 -319283 -448628 -157308 -38325 -504379
547 -504379 -316218 -328435 -66880 -274269 -304076 -254624 -22930 -3949 219194 45476 41384
$$ packed form
621A1127j16902m5468N5878L6532j10098J85033l27279n6053J04278K10376J09964
610E7388O4947p6933j21352J62064k84062p090J34897j14491J16082J38827P0752
599A41029M0460l08426J40972O8695k84661K14913L50516j24537m04845L98250
589B32366j91851m0377j9623j51805K01089K07846j85816K9908k15529J71872
579C8080j64161M5343L53971K4551l71483j72184K36627k47343K66770K01136
569B11307m905m12385J65762J16934l6174j45330N6263k12094m3198p614J38187
558a73247L20523O443k77752N7692L3635j86326j00251j29345K91320J18983m66054
547e04379J88161j2217K61555k07389k9807M9452K31694J8981K23143j73718m092
$$ plain form
536 41384 -102612 -196414 -169150 -219951 -179036 5642 -25208 114354 19141 -7269 141461
525 141461 171337 -53552 43148 208532 -57979 -163286 -176528 -124151 -127700 77583 401181
514 401181 256585 17767 73622 278706 -48776 -240322 -153525 277586 190181 -253783
504 -253783 -28611 395970 -16296 -21575 -18093 -120805 -136936 -219333 -136313 -248509 42096
493 42096 -147985 -16182 -97747 -48155 -382477 -236764 -109004 -56861 -119627 -215938 -212080
482 -212080 -65366 43509 7193 -109601 -242210 -22943 29601 -75673 -234966 15291
472 15291 215810 -265563 -245612 -142297 -181772 -43109 -153552 -449621 -372270 -140176 -75610
461 -75610 -43953 -109104 239830 352619 60433 121720 76267 -419870 -147118 -141662 87810
$$ packed form
536D1384j43996r3802K7264n0801M0915J84678l0850J39562r5213k6410J48730
525A41461K9876k24889R6700J65384k66511j05307j3242N2377l549K05283L23598
514D01181j44596k38818N5855K05084l27482j91546Q6797M31111q7405m43964
504b53783K25172M24581m12266n279L482j02712j6131q2397Q3020j12196K90605
493D2096j90081J31803q1565M9592l34322J45713J27760N2143o2766r6311L858
482b12080J46714J08875l6316j16794j32609K19267N2544j05274j59293K50257
472A5291K00519m81373J9951J03315l9475J38663j10443k96069P7351K32094O4566
461g5610L1657o5151L48934J12789k92186O1287m5453m96137K72752N456K29472
$$ plain form
450 87810 -246891 -400817 -193040 -304695 -61611 -338012 151660 -217646 -158835 -35171
440 -35171 -256687 -63695 52827 -10619 -187095 -169627 -319767 -276413 -144208 142838 -126307
429 -126307 -423095 -69112 -113213 139744 33796 117365 -56291 445848 101387 -174196
419 -174196 112395 58148 92061 -15813 47403 4227 -195968 5939 70758 -31296 -241840
408 -241840 -40361 -141712 -4749 -45405 55675 112983 -62452 -84977 16898 -10756 90889
397 90889 267586 53446 17371 228854 -58441 3395 213505 -99642 58480 -29651 -320337
386 -320337 -28226 216948 225209 424850 361562 288684 -125733 -55100 -187331 90962 -77009
375 -77009 89657 48051 -214495 -75178 144704 159847 66019 -165908 -90999 249907 56777
$$ packed form
450H7810l34701j53926K07777j11655K43084k76401M89672l69306N8811J23664
440c5171k21516J92992J16522o3446j76476J7468j50140M3354J32205K87046k69145
429a26307k96788L53983m4101K52957j05948Q3569j73656N02139l44461k75583
419a74196K86591n4247L3913j07874O3216m3176k00195K01907O4819j02054k10544
408b41840K01479j01351J36963m0656J01080N7308j75435k2525J01875k7654J01645
397I0889J76697k14140l6075K11483k87295O1836K10110l13147J58122q8131k90686
386c20337K92111K45174Q261J99641o3288p2878m14417P0633j32231K78293j67971
375g7009J66666m1606k62546J39317K19882J5143r3828k31927P4909L40906j93130
$$ plain form
364 56777 -93709 -52470 49467 254966 38921 46013 -111123 -184588 -193086 28422 74476
353 74476 -25897 116608 -92540 -118103 -123825 -145502 -79324 334589 149917 -251622 -314574
342 -314574 -219708 -34064 156624 -68152 200674 335758 31174 -72941 -42011 -102277
332 -102277 -31742 107374 329588 -49213 198684 247637 29901 284757 143456 -46559
322 -46559 -5934 73785 131854 70640 -146451 -66418 -149994 84394 137993 225909 113393
311 113393 53592 -297255 -308515 42372 157197 -26600 184117 -84503 123767 180800
301 180800 -416735 -275791 -336838 -146533 26048 -31480 -26067 -688 6263 61014 353530
290 353530 73054 196550 101892 -212246 -21611 98043 -115376 -45025 -47933 203497 116632
$$ packed form
364E6777j50486M1239J01937K05499k16045P092j57136p3465q498K21508M6054
353G4476j00373J42505k09148k5563n722k1677O6178M13913j84672m01539o2952
342c14574R4866J85644J90688k24776K68826J35084l04584j04115L0930o0266
332a02277P0535J39116K22214l78801K47897M8953k17736K54856j41301j90015
322d6559M0625P9719N8069o1214k17091Q0033q3576K34388N3599Q7916j12516
311A13393n9801l50847j1260L50887J14825j83797K10717k68620K08270N7033
301A80800n97535J40944o1047J90305J72581n7528N413K5379O951N4751K92516
290C53530k80476J23496r4658l14138J90635J19654k13419P0351k908K51430q6865
$$ plain form
279 116632 270067 380207 -190550 -217789 -196605 293588 125739 2612 93067 -64531
269 -64531 -85349 20682 166522 91148 23223 192795 -84770 -242034 -80446 -53259 70691
258 70691 -302326 -143456 -206027 -353854 -238365 -7698 -86408 5005 214455 -18670 -287138
247 -287138 153981 253127 59226 171043 168896 -84183 -250390 -280198 -313923 -42291 -49465
236 -49465 -152158 -262424 -480908 -290937 54054 -280385 -445059 -300645 -160576 43037
226 43037 81859 28275 218984 355524 100187 -195267 165506 210754 -45292 -211798 -110730
215 -110730 -26255 35124 -284261 51669 152043 -245128 -138378 -84430 57550 -91130
205 -91130 322922 91441 -105488 -193612 -208977 95258 82973 -120304 -114760 204038 109390
$$ packed form
279A16632J53435J10140n70757k7239K1184M90193j67849j23127R0455j57598
269f4531k0818J06031J45840p5374o7925J69572k77565j57264J61588K7187J23950
258G0691l73017J58870o2571j47827J15489K30667p8710R1413K09450k33125k68468
247b87138M41119R9146j93901J11817k147k53079j66207k9808l3725K71632p174
236d9465j02693j10266k18484J89971L44991l34439j64674J44414J40069K03613
226D3037L8822n3584J90709J36540k55337k95454L60773M5248k56046j66506J01068
215a10730Q4475O1379l19385L35930J00374l97171J06750N3948J41980j48680
205i1130M14052k31481j96929q8124j5365L04235j2285k03277N544L18798r4648
$$ plain form
194 109390 211098 93543 231515 -84320 -39624 116379 189936 176317 22101 14549 49013
183 49013 -200536 -85516 -46936 20993 65229 75884 92122 -25375 -34614 -19402 3629 260385
171 260385 37194 -164604 -114810 -96560 -27558 177993 165591 94926 212208 -66082 -264569
160 -264569 -37379 -125597 -221551 -75048 -381877 -84369 -150065 -23087 50286 -30869 35324
149 35324 -102856 -64313 -108477 44894 -100152 -44521 -214696 -80125 183971 -17232 139265
138 139265 206422 117282 -103326 3399 -74169 -206421 -180889 -42592 100675 246778 182837
127 182837 294320 66434 -175561 -101459 -233955 -15262 180602 106447 -81770 -105913
117 -105913 -143770 -210443 -147833 205260 -190460 -161052 -419550 -231762 38068 35114 282165
$$ packed form
194A09390J01708j17555J37972l15835M4696J56003P3557j3619j54216p552L4464
183D9013k49549J15020L8580O7929M4236J0655J6238j17497r239J5212K3031K56756
171B60385k23191k01798M9794J8250O9002K05551j2402p0665J17282k78290j98487
160b64569K27190q8218r5954J46503l06829K97508o5696J26978P3373q1155O6193
149C5324j38180L8543m4164J53371j45046N5631j70175J34571K64096k01203J56497
138A39265O7157q9140k20608J06725p7568j32252K5532J38297J43267J46103o3941
127A82837J11483k27886k41995P4102j32496K18693J95864p4155j88217k4143
117a05913l7857o6673O2610L53093l95720K9408k58498J87788K69830k954K47051
$$ plain form
106 282165 157239 153845 -74111 -207119 -154665 -134534 -482864 -93302 -44270 -31540 215995
95 215995 -25198 -55579 302752 121320 -262858 -80079 109463 -51611 63619 13113
85 13113 -243954 -179064 -147839 -117660 29792 -80639 -212701 -205680 -125185 -56844 157551
74 157551 15240 31763 167822 81510 30292 -97004 -103012 72206 214770 -4761 -126935
63 -126935 -55568 -136825 -219165 -119661 -53525 -46048 19884 -223038 -314464 -284450 -73232 -86624
51 -86624 -39518 52674 106996 30399 -219096 -170428 -243258 -238978 -32290 17731 -95447 -166503
39 -166503 -210864 -93078 -56152 125101 -46771 -245646 -130780 -67474 -24778 76281 52542
28 52542 -21165 37968 106194 -55257 -327127 -70582 -210149 -302802 -97783 -39145 78278
$$ packed form
106B82165j24926l394k27956j33008N2454K0131l48330L89562M9032J2730K47535
95B15995k41193l0381L58331j81432l84178J82779J89542j61074J15230n0506
85A3113k57067O4890L1225L0179J47452j10431j32062P021Q0495O8341K14395
74A57551j42311J6523J36059q6312n1218j27296o008J75218J42564k19531j22174
63a26935P1367q1257q2340R9504O6136P477O5932k42922r1426L0014K11218j3392
51h6624M7106R2192N4322p6597k49495M8668p2830M280K06688N0021j13178p1056
39a66503m4361J17786L6926J81253j71872j98875J14866O3306M2696J01059k3739
28E2542p3707N9133O8226j61451k71870K56545j39567r2653K05019N8638J17423
$$ plain form
17 78278 -12715 -202471 -111598 -48329 28691 12641 21428 -16925 72563 -101119 39346 -42281
5 -42281 -76650 -67874 -68840 99889 -40501
0 -40501
$$ packed form
17G8278r0993j89756R0873O3269P7020j6050Q787l8353Q9488j73682J40465q1627
5d2281l4369Q776r66J68729j40390
0d0501
$$ Imaginary data points
##PAGE= N=2
##DATA TABLE= (X++(I..I)), XYDATA
$$ plain form
16383 -3521431 -3557731 -3762759 -3540456 -3514764 -3593722 -3626707 -3589051 -3354497 -3264440 -3372199
16373 -3372199 -3508974 -3143923 -3033283 -3030629 -3056189 -3202301 -2998064 -3048581 -3029292 -2893631
16363 -2893631 -2861082 -2615299 -2752085 -2749279 -2771901 -2841047 -2612211 -2568810 -2628145 -2567758 -2394505
16352 -2394505 -2429532 -2301965 -2364118 -2357845 -2318770 -2257599 -2315884 -2075096 -2152871 -2227496 -2128195
16341 -2128195 -2045661 -2075131 -1909916 -1665350 -1746764 -1950592 -2308040 -1984330 -1853611 -1706123
16331 -1706123 -1635512 -1640415 -1631556 -1422961 -1294256 -1290197 -1258752 -1309780 -1430657 -1503161 -1216751
16320 -1216751 -1311477 -1454130 -1234701 -993083 -847526 -996250 -1142545 -1165717 -1035145 -1159471
16310 -1159471 -874910 -795879 -614623 -543035 -625492 -932231 -608926 -630447 -597112 -419034
$$ packed form
16383c521431l6300k05028K22303K5692p8958l2985L7656K34554R0057j07759
16373c372199j36775L65051J10640K654k5560j46112K04237n0517J9289J35661
16363b893631L2549K45783j36786K806k2622o9146K28836M3401n9335O0387J73253
16352b394505l5027J27567o2153O273L9075O1171n8285K40788p7775p4625R9301
16341b128195Q2534k9470J65215K44566q1414k03828l57448L23710J30719J47488
16331a706123P0611m903Q859K08595J28705M059L1445n1028j20877p2504K86410
16320a216751r4726j42653K19429K41618J45557j48724j46295k3172J30572j24326
16310a159471K84561P9031J81256P1588q2457l06739L23305k1521L3335J78078
$$ plain form
16300 -419034 -440768 -397283 -619144 -335482 -442782 -476567 -334562 -160816 -97255 -131022
16290 -131022 -155752 -245733 -564646 -348401 -19906 -263092 -27914 -87799 -10482 176054
16280 176054 122198 156269 -51992 -23605 212014 246873 235134 422291 395924 569617 432749
16269 432749 210125 415625 301284 242781 597826 671356 612852 666570 718684 798310 758173
16258 758173 615620 633829 617716 846462 716945 696886 708077 861691 819926 920657
16248 920657 1005308 1092169 974120 902718 807552 1035514 1032682 1108390 1075006 1039601 1355648
16237 1355648 1539630 1335528 1019225 885765 1133870 1330970 1147404 1085086 1210361 1479323
16227 1479323 1531862 1302567 1267579 1213816 1370077 1522684 1381675 1399104 1369243 1391895
$$ packed form
16300d19034k1734M3485k21861K83662j07300l3785J42005J73746O3561l3767
16290a31022k4730q9981l18913K16245L28495k43186K35178n9885P7317J86536
16280A76054n3856L4071k08261K8387K35619L4859j1739J87157k6367J73693j36868
16269D32749k22624K05500j14341n8503L55045P3530n8504N3718N2114P9626m0137
16258G58173j42553J8209j6113K28746j29517k0059J1191J53614m1765J00731
16248I20657Q4651Q6861j18049p1402r5166K27962k832P5708l3384l5405L16047
16237A355648J83982k04102l16303j33460K48105J97100j83566o2318J25275K68962
16227A479323N2539k29295l4988n3763J56261J52607j41009J7429k9861K2652
$$ plain form
16217 1391895 1472029 1772869 1833736 1753304 1775216 1827262 1744459 1864153 1890980 2098006 1705696
16206 1705696 1627004 1830177 2126240 1885747 1709488 1798974 1971913 1990053 1862902 1890589
16196 1890589 1981460 2022894 2051165 1997212 1904505 1894957 2031493 2092826 2099614 2186123 2065917
16185 2065917 2051171 2134388 2009702 2072036 2017206 2252002 2471604 2344244 2386328 2330582
16175 2330582 2331958 2232068 2343133 2493239 2252567 2441286 2231959 2167891 2201375 2209295 2219587
16164 2219587 2217569 2284177 2386179 2547440 2655271 2671772 2254010 2456036 2409655 2571588
16154 2571588 2570653 2356588 2407251 2416725 2560636 2484401 2282290 2421179 2403304 2218156 2252934
16143 2252934 2322633 2353338 2429026 2412896 2654560 2489099 2479236 2515052 2612325 2862585 2465069
$$ packed form
16217A391895Q0134L00840O0867q0432K1912N2046q2803J19694K6827K07026l92310
16206A705696p8692K03173K96063k40493j76259Q9486J72939J8140j27151K7687
16196A890589R0871M1434K8271n3953r2707r548J36536O1333O788Q6509j20206
16185B065917j4746Q3217j24686O2334n4830K34796K19602j27360M2084n5746
16175B330582J376r9890J11065J50106k40672J88719k09327o4068L3484P920J0292
16164B219587k018O6608J02002J61261J07831J6501m17762K02026m6381J61933
16154B571588r35k14065N0663R474J43911p6235k02111J38889j7875j85148L4778
16143B252934O9699L0705P5688j6130K41664j65461r863L5816R7273K50260l97516
$$ plain form
16132 2465069 2919329 2839666 2857672 2837829 2793663 2658403 2192824 2628119 2716187 2592931
16122 2592931 2731748 2496238 2683759 2885553 2937433 2867383 2719390 2589884 2717756 2695558
16112 2695558 2757397 2752489 2589799 2665508 2604775 2609644 2636580 2548160 2658014 2714363 2883124
16101 2883124 2752834 2722872 2598792 2557989 2746784 2726325 2878731 2845280 2934316 2926903 2981007
16090 2981007 3012023 3092552 2978386 3008889 2719649 2980528 3354626 3003633 2717998 2820090
16080 2820090 2936225 3096054 3183794 2854653 3092859 2988888 2641358 2883456 2813637 2680124
16070 2680124 2582705 2791380 2939356 2933760 2944860 2914239 2671631 2683442 3062530 3185538
16060 3185538 2725114 2645050 2882339 3111691 2896767 2914903 3196375 2896692 2866257 2961158
$$ packed form
16132B465069M54260p9663J8006j9843m4166j35260m65579M35295Q8068j23256
16122B592931J38817k35510J87521K01794N1880p0050j47993j29506J27872k2198
16112B695558O1839m908j62690P5709o0733M869K6936q8420J09854N6349J68761
16101B883124j30290k9962j24080m0803J88795k0459J52406l3451Q9036p413N4104
16090B981007L1016Q0529j14166L0503k89240K60879L74098l50993k85635J02092
16080B820090J16135J59829Q7740l29141K38206j03971l47530K42098o9819j33513
16070B680124r7419K08675J47976n596J1100l0621k42608J1811L79088J23008
16060C185538m60424q0064K37289K29352k14924J8136K81472k99683l0435R4901
$$ plain form
16050 2961158 3028817 2946268 3253537 2915085 2937671 3090267 3085564 3446539 3137623 3175269
16040 3175269 2871253 2872018 2827233 3006786 3013840 2901443 2876089 3041920 3004589 2950088 2897281
16029 2897281 2969781 2886510 2976911 2721387 2724635 2913987 2934032 2832747 2795172 3106987 3065500
16018 3065500 2780089 2844120 2733316 2849465 2679213 2803632 2760674 2880711 3322229 3157908
16008 3157908 3202418 2966590 3001476 2863545 3238653 3139649 2945034 3070407 3062893 2755045
15998 2755045 2958193 3180052 2975704 3099295 3116955 2871024 2737348 3039415 2670261 2711318
15988 2711318 2951046 2799193 2934139 3092913 2919935 2757807 2913005 2582226 2697520
15979 2697520 2935226 3015251 3150461 2901412 2775943 2882101 2897864 3151332 3086418 2974505
$$ packed form
16050B961158O7659q2549L07269l38452K2586J52596m703L60975l08916L7646
16040C175269l04016P65m4785J79553P054j12397k5354J65831l7331n4501n2807
16029B897281P2500q3271R0401k55524L248J89352K0045j01285l7575L11815m1487
16018C065500k85411O4031j10804J16149j70252J24419m2958J20037M41518j64321
16008C157908M4510k35828L4886j37931L75108r9004j94615J25373p514l07848
15998B755045K03148K21859k04348J23591J7660k45931j33676L02067l69154M1057
15988B711318K39728j51853J34946J58774j72978j62128J55198l30779J15294
15979B697520K37706Q0025J35210k49049j25469J06158J5763K53468o4914j11913
$$ plain form
15969 2974505 2915495 3115159 3207644 3356050 3024941 3038097 3014165 2875293 2990181 2684037
15959 2684037 2993571 3008068 2780738 2707183 2955540 3240738 2960520 2813792 2888398 2757122
15949 2757122 3096312 3235832 3137820 3199352 2955575 2795940 2897362 2646710 2911968 3322695
15939 3322695 2886349 2989648 2935361 2772253 2693132 2678436 2650658 2809269 2980094 3365055
15929 3365055 3124938 3158776 3082402 3102217 3036580 3031346 2946889 2926887 2923028 2924271 3043476
15918 3043476 3025030 2905959 2952884 2998530 3208465 2963343 2624946 2831109 2941374 3017968
15908 3017968 2820161 2634093 3040469 2883507 2912271 2771048 2793718 3002959 2875435 2729690
15898 2729690 2819937 3179408 2989889 2911320 2979373 2796299 2769487 2714143 2726841 2698953 2837246
$$ packed form
15969B974505n9010J99664R2485J48406l31109J3156k3932j38872J14888l06144
15959B684037L09534J4497k27330p3555K48357K85198k80218j46728P4606j31276
15949B757122L39190J39520r8012O1532k43777j59635J01422k50652K65258M10727
15939C322695m36346J03299n4287j63108p9121j4696k7778J58611J70825L84961
15929C365055k40117L3838p6374J9815o5637n234q4457k0002l859J243J19205
15918C043476j8446j19071M6925M5646K09935k45122l38397K06163J10265P6594
15908C017968j97807j86068M06376j56962K8764j41223K2670K09241j27524j45745
15898B729690R0247L59471j89519p8569O8053j83074k6812n5344J2698k7888J38293
$$ plain form
15887 2837246 2908850 2697657 2895529 3007884 2974661 2968282 2946123 2903177 2929024 2896047 2840292
15876 2840292 2892346 2995573 2903185 3156114 3286368 3410053 3008440 3067690 3006721 2874370
15866 2874370 2970195 3177948 3104915 2954929 3069357 2975467 2880949 3086000 2981723 3024793
15856 3024793 2998887 3043721 3151516 3048693 2756886 2952329 2979359 2988613 2984594 3078067 3409965
15845 3409965 3127834 3026168 3101798 2885022 2953309 2974444 3048622 2980516 3182778 2950101
15835 2950101 2714970 2706011 2969753 3270679 2774669 2667323 2891274 3061948 2992756 3109312
15825 3109312 3188262 3117384 3059456 3138597 3093084 3158014 3104771 3111362 3204018 3171433 3299823
15814 3299823 2966724 2999119 3154710 3057523 2981666 2571560 2768510 2839308 2739499 3000699
$$ packed form
15887B837246P1604k11193J97872J12355l3223o379k2159m2946K5847l2977n5755
15876B840292N2054J03227r2388K52929J30254J23685m01613N9250o0969j32351
15866B874370R5825K07753p3033j49986J14428r3890r4518K05051j04277M3070
15856C024793k5906M4834J07795j02823k91807J95443K7030R254m019R3473L31898
15845C409965k82131j01666P5630k16776O8287K1135P4178o8106K02262k32677
15835B950101k35131q959K63742L00926m96010j07346K23951J70674o9192J16556
15825C109312P8950p0878n7928P9141m5513O4930n3243O591R2656l2585J28390
15814C299823l33099L2395J55591r7187p5857m10106J96950P0798r9809K61200
$$ plain form
15804 3000699 2930666 3096552 3112056 3089659 2869588 3133647 3198641 3136200 2958394 3006389
15794 3006389 3354936 2990862 2892862 3162309 3018094 2915099 3080616 2933582 2704477 2884486
15784 2884486 2964377 2922642 2981636 3011229 2902598 2913636 3164014 3009666 2695679 3036949
15774 3036949 2986965 3117020 2981086 2796574 2860831 3072288 3192761 3030216 3148910 3041378
15764 3041378 2967495 3398792 3346790 3255540 3234839 3104854 2998581 3006792 2908602 2606230 2761588
15753 2761588 3070034 3021585 2939714 3056342 3058367 3174143 3136212 3270317 2938739 3079314
15743 3079314 2887385 2709592 2669010 2927848 2961125 3040687 3030422 2986696 2796647 2987797
15733 2987797 3090356 3081066 3189410 3400675 3231783 3165432 2926628 3140377 3308210 2995240
$$ packed form
15804C000699p0033J65886J5504k2397k20071K64059O4994o2441j77806M7995
15794C006389L48547l64074r8000K69447j44215j02995J65517j47034k29105J80009
15784B884486P9891m1735N8994K9593j08631J1038K50378j54348l13987L41270
15774C036949m9984J30055j35934j84512O4257K11457J20473j62545J18694j07532
15764C041378p3883M31297n2002r1250k0701j29985j06273Q211r8190l02372J55358
15753B761588L08446m8449q1871J16628K025J15776l7931J34105l31578J40575
15743C079314j91929j77793m0582K58838L3277P9562j0265m3726j90049J91150
15733B987797J02559r290J08344K11265j68892o6351k38804K13749J67833l12970
$$ plain form
15723 2995240 3143812 3143600 3040778 3175027 3455945 2932600 2958393 3201458 3137311 3112017
15713 3112017 3311392 3105864 2859126 2975293 3037478 2512060 2411125 2847411 2743242 2788498
15703 2788498 2887060 3171513 3145943 3204556 2948366 2602258 2781339 3145380 3094725 3019699
15693 3019699 3157105 3229931 3142336 3168970 2724292 2982749 2953762 3185539 3215586 3184430
$$ packed form
15723B995240J48572k12j02822J34249K80918n23345K5793K43065o4147k5294
15713C112017J99375k05528k46738J16167O2185n25418j00935M36286j04169M5256
15703B788498R8562K84453k5570N8613k56190l46108J79081L64041n0655p5026
15693C019699J37406P2826q7595K6634m44678K58457k8987K31777L0047l1156
$$ [...]
##END NTUPLES=NMR SPECTRUM
##END=
