##TITLE=1H_EC-3311(2)
 CDCl3
 8 sc, 
 31.7.2024
##JCAMPDX= 6.0         $$ Bruker NMR JCAMP-DX V2.0
##DATA TYPE= NMR SPECTRUM
##DATA CLASS= NTUPLES
##ORIGIN= UXNMR, Bruker Analytische Messtechnik GmbH
##OWNER= root
$$ XWIN-NMR		Version 3.5
$$ Wed Jul 31 13:51:42 2024 Russian Standard Time (UT+4h)  she@DPX200
##.OBSERVE FREQUENCY= 200.1315
##.OBSERVE NUCLEUS= ^1H
##.ACQUISITION MODE= SIMULTANEOUS
##.ACQUISITION SCHEME= undefined
##.AVERAGES= 8
##.DIGITISER RES= 18
##SPECTROMETER/DATA SYSTEM= spect
##.PULSE SEQUENCE= zg30
##.SOLVENT NAME= DMSO
##.SHIFT REFERENCE= (INTERNAL, DMSO, 0, 20.7652)
##AUDIT TRAIL= $$ (NUMBER, WHEN, WHO, WHERE, WHAT)
$$ ##TITLE= Audit trail, XWIN-NMR		Version 3.5
$$ ##JCAMPDX= 5.01
$$ ##ORIGIN= Bruker BioSpin GmbH
$$ ##OWNER= she
$$ F:/spectra/data/she/nmr/H-F/1/pdata/1/auditp.txt
$$ ##AUDIT TRAIL=  $$ (NUMBER, WHEN, WHO, WHERE, WHAT)
(   1,<2024-07-31 13:50:13.64 +0400>,<she>,<DPX200>,
      <created by zg, POWCHK disabled, PULCHK disabled
       configuration hash MD5:
       00 E9 B6 7A A2 85 ED C7 34 08 36 98 17 FE 4E 26
       data hash MD5: 16K
       02 D2 6B 51 66 41 F2 65 7E E6 B2 06 37 F7 40 E0>)
(   2,<2024-07-31 13:50:20.31 +0400>,<she>,<DPX200>,
      <Start of raw data processing
       efp BC_mod = 2 LB = 0.24 FT_mod = 6 PKNL = 1 PHC0 = -25634.29 PHC1 = 10.18749 SI = 16K 
       data hash MD5: 16K
       A7 B7 6E 83 07 CA 16 7B 97 CF C5 B1 80 F1 4F 9D>)
(   3,<2024-07-31 13:50:40.68 +0400>,<she>,<DPX200>,
      <pk PHC0 = -4.872333 PHC1 = 5 
       data hash MD5: 16K
       FD BB 86 81 BA 3B 09 41 86 A9 08 DF A8 B6 6D D1>)
(   4,<2024-07-31 13:50:44.26 +0400>,<she>,<DPX200>,
      <abs ABSG = 5 
       data hash MD5: 16K
       9B 11 A8 BC 31 A1 5D 46 A1 BD 75 36 2A CF 83 92>)
$$ ##END=
$$ 
$$ hash MD5
$$ 7A 29 C9 8B 15 E3 ED D9 AA FD D1 7A F6 6B 63 B7
##$RELAX= 
##$RELAX= 
##$RELAX= 
##$RELAX= 
##$RELAX= 
##$RELAX= 
$$ Bruker specific parameters
$$ --------------------------
##$DU= <F:/spectra>
##$EXPNO= 1
##$NAME= <H-F>
##$PROCNO= 1
##$TYPE= <nmr>
##$USER= <she>
##$AMP= (0..31)
100 100 100 100 100 100 100 100 100 100 100 100 100 100 100 100 100 100 
100 100 100 100 100 100 100 100 100 100 100 100 100 100 
##$AQSEQ= 0
##$AQ_mod= 1
##$AUNM= <au_zg>
##$AUTOPOS= <>
##$BF1= 200.13
##$BF2= 200.13
##$BF3= 200.13
##$BF4= 200.13
##$BF5= 200.13
##$BF6= 200.13
##$BF7= 200.13
##$BF8= 200.13
##$BYTORDA= 1
##$CFDGTYP= 0
##$CFRGTYP= 5
##$CHEMSTR= <none>
##$CNST= (0..31)
1 1 145 1 1 1 1 1 1 1 1 1 1 1 1 1 1 1 1 1 1 1 1 1 1 1 1 1 1 1 1 1 
##$CPDPRG= <>
##$CPDPRG1= <>
##$CPDPRG2= <>
##$CPDPRG3= <>
##$CPDPRG4= <mlev>
##$CPDPRG5= <mlev>
##$CPDPRG6= <mlev>
##$CPDPRG7= <mlev>
##$CPDPRG8= <mlev>
##$CPDPRGB= <>
##$CPDPRGT= <>
##$D= (0..31)
0 1.2 0 0 0 0 0 0 0 0.06 0 0.03 0 0 0 0 0.0002 0 0 0 0 0 0 0 0 0 0 0 0 
0 0 0 
##$DATE= 1722419413
##$DBL= (0..7)
120 120 120 120 120 120 120 120 
##$DBP= (0..7)
150 150 150 150 150 150 150 150 
##$DBP07= 0
##$DBPNAM0= <>
##$DBPNAM1= <>
##$DBPNAM2= <>
##$DBPNAM3= <>
##$DBPNAM4= <>
##$DBPNAM5= <>
$$ [...]
##$SUBNAM3= <"">
##$SUBNAM4= <"">
##$SUBNAM5= <"">
##$SUBNAM6= <"">
##$SUBNAM7= <"">
##$SUBNAM8= <"">
##$SUBNAM9= <"">
##$SW= 24.0689530833862
##$SWIBOX= (0..15)
0 0 2 0 0 0 0 0 0 0 0 0 0 0 0 0 
##$SW_h= 4816.95568400771
##$TD= 16384
##$TD0= 1
##$TE= 0
##$TE2= 300
##$TE3= 300
##$TEG= 300
##$TL= (0..7)
0 120 120 120 120 120 120 120 
##$TP= (0..7)
150 150 150 150 150 150 150 150 
##$TP07= 0
##$TPNAME0= <>
##$TPNAME1= <>
##$TPNAME2= <>
##$TPNAME3= <>
##$TPNAME4= <>
##$TPNAME5= <>
##$TPNAME6= <>
##$TPNAME7= <>
##$TPOAL= (0..7)
0.5 0.5 0.5 0.5 0.5 0.5 0.5 0.5 
##$TPOFFS= (0..7)
0 0 0 0 0 0 0 0 
##$TUNHIN= 0
##$TUNHOUT= 0
##$TUNXOUT= 0
##$USERA1= <user>
##$USERA2= <user>
##$USERA3= <user>
##$USERA4= <user>
##$USERA5= <user>
##$V9= 5
##$VALIST= <valist>
##$VCLIST= <CCCCCCCCCCCCCCC>
##$VD= 0
##$VDLIST= <DDDDDDDDDDDDDDD>
##$VPLIST= <PPPPPPPPPPPPPPP>
##$VTLIST= <TTTTTTTTTTTTTTT>
##$WBST= 1024
##$WBSW= 4
##$XGAIN= (0..3)
0 0 0 0 
##$XL= 0
##$YL= 0
##$YMAX_a= 666099
##$YMIN_a= -703370
##$ZGOPTNS= <>
##$ZL1= 120
##$ZL2= 120
##$ZL3= 120
##$ZL4= 120
##$ABSF1= 20.77111
##$ABSF2= -3.298054
##$ABSG= 5
##$ABSL= 3
##$ALPHA= 0
##$AQORDER= 0
##$ASSFAC= 0
##$ASSFACI= 0
##$ASSFACX= 0
##$ASSWID= 0
##$AUNMP= <proc_1d>
##$AZFE= 0.1
##$AZFW= 0.1
##$BCFW= 0
##$BC_mod= 2
##$BYTORDP= 0
##$COROFFS= 0
##$CY= -3
##$DATMOD= 1
##$DC= 0
##$DFILT= <>
##$DTYPP= 0
##$F1P= 0
##$F2P= 0
##$FCOR= 1
##$FTSIZE= 16384
##$FT_mod= 6
##$GAMMA= 0
##$GB= 0
##$INTBC= 1
##$INTSCL= 3.70164e-10
##$ISEN= 128
##$LB= 0.24
##$LEV0= 0
##$LPBIN= 0
##$MAXI= 10000
##$MC2= 0
##$MEAN= 0
##$ME_mod= 0
##$MI= 1.114404
##$NCOEF= 0
##$NC_proc= -5
##$NLEV= 6
##$NOISF1= 3.799351
##$NOISF2= 2.8
##$NSP= 0
##$NTH_PI= 0
##$NZP= 0
##$OFFSET= 20.76524
##$PC= 1
##$PHC0= -25639.16
##$PHC1= 15.18749
##$PH_mod= 1
##$PKNL= yes
##$PPARMOD= 0
##$PSCAL= 0
##$PSIGN= 0
##$REVERSE= no
##$SF= 200.129752736569
##$SI= 16384
##$SIGF1= 3
##$SIGF2= 2
##$SINO= 5.538805
##$SIOLD= 16384
##$SREGLST= <1H.CDCl3>
##$SSB= 0
##$STSI= 16384
##$STSR= 0
##$SW_p= 4816.95568400771
##$SYMM= 0
##$S_DEV= 0
##$TDeff= 16384
##$TDoff= 0
##$TI= <>
##$TILT= no
##$TM1= 0
##$TM2= 0
##$TOPLEV= 0
##$USERP1= <user>
##$USERP2= <user>
##$USERP3= <user>
##$USERP4= <user>
##$USERP5= <user>
##$WDW= 1
##$XDIM= 16384
##$YMAX_p= 495853048
##$YMIN_p= -202861
$$ End of Bruker specific parameters
$$ ---------------------------------
##NTUPLES= NMR SPECTRUM
##VAR_NAME=  FREQUENCY,     SPECTRUM/REAL,   SPECTRUM/IMAG
##SYMBOL=    X,             R,               I
##VAR_TYPE=  INDEPENDENT,   DEPENDENT,       DEPENDENT
##VAR_FORM=  AFFN,          ASDF,            ASDF
##VAR_DIM=   16384,         16384,           16384
##UNITS=     HZ,            ARBITRARY UNITS, ARBITRARY UNITS
##FACTOR=    0.29402158847633, 1,            1
##FIRST=     4155.74228979384, 0,            0
##LAST=      -661.213394213869, 0,           0
##MIN=       -661.213394213869, -202861,     0
##MAX=       4155.74228979384, 495853048,    0
$$ Real data points
##PAGE= N=1
##DATA TABLE= (X++(R..R)), XYDATA
$$ [...]
5861b0901N2715n1950R6209j5082p4513L8599p4816o6687M5576O1630K6778l188
$$ -20901 31814 -20136 76073 60991 -13522 25077 -49739 -116426 -70850 -9220 17558 14370
5849A4370J6070N4495j3895p5377K0553j4221j3739M8686l3241k6086J9027J4083
$$ 14370 30440 84935 71040 -4337 16216 1995 -11744 36942 3701 -22385 -3358 10725
5837A0725Q1756J0305n235r639r0710m1402P4612k1090k5177K2093k0628M4678
$$ 10725 92481 102786 97551 87912 -2798 -44200 30412 9322 -15855 6238 -14390 30288
5825C0288j8693n0711M1555N5454M632M7412m7649j8658n1663K0201k1950O5637
$$ 30288 11595 -39116 2439 57893 62525 109937 62288 43630 -8033 12168 -9782 55855
5813E5855j4682j0894K6949m2503n3306N2102L9688P261k3357o3869M5235n3732
$$ 55855 41173 30279 57228 14725 -38581 13521 53209 60470 37113 -26756 18479 -35253
5801c5253k4224Q478P9385R9723o5704o840m7259J5214o431j0350K6354k3841
$$ -35253 -59477 -50999 28386 128109 62405 55565 8306 23520 17089 6739 33093 9252
5789I252K5523M4900m4810P6461j6068j9298k2596o3609j6117K4023N5078j3592
$$ 9252 34775 79675 34865 111326 95258 75960 53364 -10245 -26362 -2339 52739 39147
5777C9147L4267M1777r662m4604K9390n7541O3253Q764n9868o794K3949K6262
$$ 39147 73414 115191 105529 60925 90315 32774 96027 104791 44923 38129 62078 88340
5765H8340N3797K0680j1989k2264J3709j1667m7407p5738o296M8921m911M4069
$$ 88340 142137 162817 150828 128564 142273 130606 83199 7461 1165 50086 45175 89244
5753H9244J6881l4157n7123J9161j692k2722N1115k3542R037l3909o9312J3056
$$ 89244 106125 71968 14845 34006 32314 9592 60707 37165 46202 12293 -57019 -43963
5741d3963O9649N4938J2699p6371j1854R7440m2009n8688M7256l6233m8802J42263
$$ -43963 25686 80624 93323 16952 5098 102538 60529 1841 49097 12864 -35938 106325
5729A06325l9905m3908k4468r8057L4879J31204m9424l1501N3553j7091J3731
$$ 106325 66420 22512 -1956 -100013 -65134 66070 16646 -14855 38698 21607 35338
5718C5338j23404l4145M5405M0776J2223L8940m4578K6992Q2581l4619j6250M9265
$$ 35338 -88066 -122211 -76806 -36030 -23807 15133 -29445 -2453 80128 45509 29259 78524
5706G8524l2054o4489R4060m7515K7085J6978o8577K7291j0829k4950J3465L5319
$$ 78524 46470 -18019 76041 28526 55611 72589 4012 31303 20474 -4476 8989 44308
5694D4308j5865j5906K6577Q1329l4355k6830J4085o4692O9995o103J3797l8460
$$ 44308 28443 12537 39114 120443 86088 59258 73343 8651 78646 72543 86340 47880
5682D7880j1407k524M4488N0277j8297l5630j8380k4482K741m2765J5920N8951
$$ 47880 36473 33949 78437 128714 110417 74787 56407 31925 34666 -8099 7821 66772
5670F6772J1121L8940m6014n3714M8782L6854n8203N9720n8088L066p4173J4782
$$ 66772 77893 116833 70819 17105 65887 102741 44538 104258 46170 49236 -24937 -10155
5658a0155o618L6907m18O1401K3370o6206N521L9136o7815m4691P6835r029p2686
$$ -10155 -16773 20134 19716 81117 104487 38281 43802 82938 15123 -29568 47267 38238 -34448
5645c4448j7073K267P1753o0183P4040N6610r9732O4292K8609l4474n7093n6347
$$ -34448 -51521 -49254 22499 -37684 36356 92966 -6766 57526 86135 51661 -5432 -61779
5633f1779O0191k0933N099J8396M5788m444J994j3782l3714J5914K4731p1271
$$ -61779 -1588 -22521 -17422 974 46762 42318 44312 30530 -3184 12730 37461 -33810
5621c3810M3155P3119l4465j2851j5746n0554L2720R1311Q270l9626p993L9453
$$ -33810 9345 82464 47999 35148 19402 -31152 1568 92879 101149 61523 53530 92983
5609I2983L334j6295R875Q5241r8662J6614p5203L4444j8103L8410k0877K9736
$$ 92983 96317 80022 89897 175138 76476 93090 17887 52331 34228 72638 51761 81497
5597H1497q850k8311J9110N9899m3279o664l0280p3374O5436k3361M7235K4564
$$ 81497 72647 44336 63446 123345 80066 73402 43122 -30252 35184 11823 59058 83622
5585H3622l0749L3766N299M925R703m896n2332P2683l6618m3737k1239M5590k5543
$$ 83622 52873 86639 91938 96863 106566 101670 49338 122021 85403 41666 20427 66017 40474
5572D0474k9318L4645K0714L2863k3023K9203n6336m0425r895J28691k1088l2563
$$ 40474 11156 45801 66515 99378 76355 105558 49222 8797 -1098 127593 106505 73942
5560G3942P276J1695l7096k2421P3695Q7156l5655R679l0658l9217o006k6782
$$ 73942 81218 92913 55817 33396 107091 194247 158592 168271 137613 98396 92390 65608
5548F5608Q2039p4100n6196J5151l6832J3743j1258K2708P4770r0408N4578L5318
$$ 65608 147647 73547 17351 32502 -4330 9413 -1845 20863 95633 5225 59803 95121
5536I5121M269J678j0194L4922k9861m6714K0265K5184m1495m0349P1718J6521
$$ 95121 99390 101068 90874 125796 95935 49221 69486 94670 53175 12826 84544 101065
5524A01065J1316p874K096p923M91L728M6017o2239l0791M2334l0068J0339L0720
$$ 101065 112381 104507 106603 98680 99171 102899 148916 86677 55886 98220 68152 78491 109211
5511A09211m002r7746P8296o696M1206N866M211l3510k4927m3016O8047J649q3972
$$ 109211 105209 7463 85759 79063 120269 126135 130346 96836 71909 28893 96940 98589 14617
5498A4617M6298Q6930j5834l0719m1743N6537M4134l5755m6591k1903O9667J3946
$$ 14617 60915 147845 132011 101292 59549 116086 160220 124465 77874 55971 125638 139584
5486A39584q6933M6044j1503m2945O4008o7844P9189k3844m6262J3867N9342j4997
$$ 139584 52651 98695 87192 44247 108255 40411 119600 95756 49494 63361 122703 107706
5474A07706n7932N4170m8039J4302l1163N1580k4265J3895P5732q3009l3961O4340
$$ 107706 49774 103944 55905 70207 39044 90624 66359 80254 155986 72977 39016 103356
5462A03356J6960K6884K9459K2086k1039q4464K5844M7477Q5368o2561m3577L5804
$$ 103356 120316 147200 176659 198745 177706 93242 119086 166563 251931 189370 145793 181597
5450A81597L6022l4532k0240M2844O1423j15424j8792N7475K4532R132L975k7368
$$ 181597 217619 183087 162847 205691 267114 151690 132898 190373 214905 224037 228012 200644
5438B00644L4668q792Q692M7106O191K9854o1864l5589K310L3716k1926m1947
$$ 200644 235312 226520 235212 282318 288509 318363 256499 220910 223220 256936 235010 193063
5426A93063n6778K7415M542J4810p948m3151K5458l7074J3219J7594M7564P0704
$$ 193063 136285 163700 168242 183052 175104 131953 157411 120337 133556 151150 198714 269418
5414B69418o9504l8933n5608J4357M3035o1515J5008K7245n2035O9536j8809m3317
$$ 269418 199914 160981 105373 119730 162765 101250 116258 143503 91468 161004 142195 98878
5402I8878Q413M3871N343J367J120K4170M334m3842J12028q4221J4422O709n3628
$$ 98878 107291 151162 156505 157872 158992 183162 187496 143654 255682 171461 185883 192592 138964
5389A38964K9645j6815L301Q966J0902k0884Q0098k3729k5507j8763O3875k1671
$$ 138964 168609 151794 155095 164061 174963 154079 234177 210448 184941 166178 230053 208382
5377B08382l0713j204R158m6860M0978L0229o6435k6201N6657k9105k2803L2283
$$ 208382 177669 176465 185623 138763 179741 209970 143535 117334 173991 144886 122083 154366
5365A54366j8994R160N3888l5550o0644N5214R529K7528J04935r5077l9288L2786
$$ 154366 135372 144532 198420 162870 102226 157440 166969 194497 299432 204355 165067 197853
5353A97853o0036j5466j6296J5239J6262N2986N1778L0070q528l9812l3703j9459
$$ 197853 137817 122351 106055 121294 137556 190542 242320 272390 263862 224050 190347 170888
5341A70888k624P6354k5337R8118j00827L451p0025O7770J4195k5487J8205J05680
$$ 170888 168264 244618 219281 317399 216572 220023 149998 217768 231963 206476 224681 330361
5329C30361L9612p3680k1548j761O8R0232m7701l630P8352m1706q5306K0241N9797
$$ 330361 369973 296293 274745 272984 273052 363284 315583 311953 390305 348599 263293 283534 343331
5316C43331j8900k0211j9822J6460M9509Q2795J2298o0651j3445J9315j0646j270
$$ 343331 324431 304220 284398 300858 350367 433162 445460 384809 371364 390679 380033 378763
5304C78763P2138M8668J3215K9277q5510n1304L704J5982R983r3740j8514K8166
$$ 378763 450901 499569 512784 542061 456551 405247 408951 424933 434916 341176 322662 350828
5292C50828m1869k9195P2074L3464n2958j7336n0718J21715Q5242m0551P538J362
$$ 350828 308959 279764 351838 385302 332344 315008 264290 386005 471247 430696 438234 439596
5280D39596n8422L4456q8732O92N9456l152j3628j6590j22928R9152N9047L886
$$ 439596 381174 415630 326898 327590 387046 383894 370266 353676 230748 329900 388947 392833
5268C92833l6112K1738n4681l1395P5017N936n0924m9656n5172j3921Q8050K8959
$$ 392833 356721 378459 323778 292383 367400 373336 322412 272756 217584 203663 291713 320672
5256C20672r1620M9999P0426N6087k6147P137l9165N6204n690o1576N8906K4145
$$ 320672 229052 279051 349477 405564 379417 386554 347389 403593 397903 336327 395233 419378
5244D19378j6054n5294M8537r578L4831n9724J7573P9658K1285k0511q1046J3797
$$ 419378 403324 348030 396567 386989 421820 362096 379669 459327 480612 460101 379055 392852
5232C92852J1409P2684l2901O6558j02202J8494J18921m3532J8198m1779L062
$$ 392852 404261 476945 444044 510602 408400 426894 545815 502283 520481 478702 481764
5221D81764p588J409K8270M9656r5547L4813J5761J975K6405j2083r528Q538N7191
$$ 481764 474176 475585 503855 553511 457964 492777 508538 510513 536918 524835 515307 523845 581036
5208E81036l9409p7820l1049J946N2011J4633M8782N428K6205J8902q1797j1728
$$ 581036 541627 463807 432758 434704 486715 501348 550130 555558 581763 600665 518868 507140
5196E07140N7964Q213k5437j603O1897p6033M1158k8641k831R8222l1391J4591
$$ 507140 565104 573317 547880 546277 608174 532141 573299 544658 541827 640049 608658 623249
5184F23249k04n578k4346Q7503K5777L8877M4302m0032q8890K6334N7225k2148
$$ 623249 623045 617467 593121 680624 706401 745278 789580 749548 660658 686992 744217 722069
5172G22069k564K1143J17668m9607Q2890P257l7963Q2917L3616m9873K7357m2933
$$ 722069 719505 740648 858316 808709 891599 898856 860893 943810 977426 927553 954910 911977
5160I11977J1351J47943M1939j31666N7807R5705P5132n434n2371K1013J40247
$$ 911977 923328 1071271 1113210 981544 1039351 1135056 1210188 1204754 1152383 1173396 1313643
5149A313643P091l138P0417Q683J32014O0078Q7959Q7629l2340K7793J02393N9043
$$ 1313643 1320734 1317596 1388013 1396696 1528710 1588788 1676747 1764376 1732036 1759829 1862222 1921265
5137A921265J25157P6072N7151R5829J62814J47561K25916J57590J50420J77315
$$ 1921265 2046422 2122494 2179645 2275474 2438288 2585849 2811765 2969355 3119775 3297090
5127C297090J40705K50901K61481L52271M27188M19939M44432P97805O97902N79694
$$ 3297090 3437795 3688696 3950177 4302448 4729636 5149575 5594007 6391812 7089714 7669408
5117G669408L97190j20563l46636l64328m86571k69935l8947r5583N5301N6443
$$ 7669408 8066598 7946035 7599399 7235071 6748500 6478565 6439618 6344035 6399336 6455779
5107F455779P1807K80807L72597M28066N05934O78602Q40050J143371J293171
$$ 6455779 6527586 6808393 7180990 7609056 8114990 8793592 9633642 10777013 12070184
5098A2070184J392688J209323M21329o96979j413315j483722j273577r96489p95207
$$ 12070184 13462872 14672195 15093524 14396545 12983230 11499508 10225931 9229442 8434235
5089H434235o01561l86644l01713k89702j14454j24643M1152Q7230K08156K67129
$$ 8434235 7832674 7446030 7144317 6854615 6740161 6615518 6656670 6743900 6952056 7219185
5079G219185M76073O13521O11861L05355j64518o93052q91499q02807p16459o87427
$$ 7219185 7695258 8308779 8920640 9225995 9061477 8368425 7476926 6674119 5957660 5270233
5069E270233m86197l67692l57462l40860k99186k05227k48259k68946q3773j66997
$$ 5270233 4784036 4416344 4058882 3718022 3418836 3213609 2965350 2696404 2612631 2445634
5059B445634j14256j23156j18092o9918j04479p5005l1229j21103p5657j1845
$$ 2445634 2331378 2208222 2090130 2020212 1915733 1840728 1809499 1688396 1612739 1600894
5049A600894o9147j7864q5794o2573O0642q0170p971p3551P1524L9463K7973j939
$$ 1600894 1531747 1513883 1428089 1365516 1426158 1345988 1338017 1264466 1335990 1375453 1403426 1401487
5037A401487p9582J1017q9012l1308j9022j4429O225n7840l6283J6904l624l4855
$$ 1401487 1321905 1332922 1243910 1212602 1193580 1179151 1185376 1127536 1091253 1108157 1104533 1069678
5025A069678n1977J29968Q315k300K6227j5417n6102P8041l0225j10944m0796
$$ 1069678 1017701 1147669 1155984 1153684 1179911 1164494 1108392 1186433 1156208 1045264 1004468
5014A004468l1353M9617M8556J7356R177k4356L4192K563j7745k0492M2537k4750
$$ 1004468 973115 1022732 1071288 1088644 1097821 1073465 1107657 1110220 1092475 1071983 1114520 1089770
5002A089770N5555O9909K3378j0915q2480l9960n4411N6589N067m4736r07K2189
$$ 1089770 1145325 1215234 1238612 1227697 1145217 1105257 1050846 1107435 1112502 1067766 1066859 1089048
4990A089048n3497j9586N0570J2320j8818l3172N4691Q1495k6139J39759J48106
$$ 1089048 1035551 1015965 1066535 1078855 1060037 1026865 1081556 1163051 1136912 1276671 1424777
4979A424777j11222o3724j49374k1617M3031l4108m8075K0306J5183J4712m2189
$$ 1424777 1313555 1249831 1100457 1078840 1121871 1087763 1039688 1059994 1075177 1089889 1047700
4968A047700j3757M2158p036K6354m9394J692M7291R9464M7826N5428L8588q1428
$$ 1047700 1033943 1076101 1069065 1095419 1046025 1047717 1095008 1194472 1242298 1297726 1336314 1254886
4956A254886J8581j4234q4056p4424l7604L797Q512N5770K7479l0268m4199r036
$$ 1254886 1273467 1259233 1175177 1100753 1063149 1066946 1075458 1131228 1158707 1128439 1084240 1075204
4944A075204L4274K9023J2880j7009j8379P4314Q7113K7145m3515o5853q007k4972
$$ 1075204 1109478 1138501 1151381 1134372 1115993 1190307 1277420 1304565 1261050 1195197 1187190 1162218
4932A162218R6411j9007J4296R117N236J9303o5462M6652K7400K1174l245j0723
$$ 1162218 1258629 1239622 1253918 1263035 1268271 1287574 1222112 1268764 1296164 1317338 1314093 1303370
4920A303370O6257L7516k0230M4003m5527m0176L8492J08523n3354j2378J04197
$$ 1303370 1369627 1407143 1386913 1430916 1385389 1345213 1383705 1492228 1438874 1426496 1530693
4909A530693j3063P5298Q126M6459j2269R615j898M9713N1631L5092J24436n659
$$ 1530693 1517630 1592928 1601054 1647513 1635244 1644859 1642961 1692674 1744305 1779397 1903833 1898174
4897A898174m2422N0431K5267o0519R606J12218m1495m841L5027J05367J8276
$$ 1898174 1855752 1906183 1931450 1870931 1880537 1992755 1951260 1946419 1981446 2086813 2105089
4886B105089K9436L2400j9536K8095O6635J16501P6027M0734K0983K6843M8569
$$ 2105089 2134525 2166925 2147389 2175484 2242119 2358620 2434647 2475381 2496364 2523207 2571776
4875B571776N8849m3387L5680J7850n7905N3650L6758j2325L7892M799O8179p197
$$ 2571776 2630625 2587238 2622918 2640768 2582863 2636513 2673271 2660946 2698838 2703637 2771816 2764619
4863B764619J0178Q5046L1452M6910N7535L0529L9710J2073K7569R2983O3720
$$ 2764619 2774797 2859843 2891295 2938205 2995740 3026269 3065979 3078052 3105621 3198604 3262324
4852C262324j3954P8522J8610p2585L0499N6381M7392L8589K4910J03003R120
$$ 3262324 3248370 3326892 3345502 3272917 3303416 3359797 3407189 3445778 3470688 3573691 3582811
4841C582811K7144N6104O6549J9540J05638K0110J39562Q1410J11965J10083J20228
$$ 3582811 3609955 3666059 3732608 3752148 3857786 3877896 4017458 4098868 4210833 4320916 4441144
4830D441144J21422P2879R6682R7183P4568J04764J59920O7959J29840O6562J52687
$$ 4441144 4562566 4635445 4732127 4829310 4903878 5008642 5168562 5236521 5366361 5432923 5585610
4819E585610J10065O5830J24640J57693K01618J99607J44883J61928J49378K19992
$$ 5585610 5695675 5761505 5886145 6043838 6245456 6445063 6589946 6751874 6901252 7121244
4809G121244L31489K16425J48923R3463K48021K69912L36501L50305L48954M01184
$$ 7121244 7452733 7669158 7818081 7911544 8159565 8429477 8765978 9116283 9465237 9866421
4799I866421L54113L73679L67963M86471N92678O91144P76135J111036J109058
$$ 9866421 10220534 10594213 10962176 11448647 12041325 12732469 13508604 14619640 15728698
4790A5728698R62946M77626r4045m81062o03686m38011k84752q3068J28318J58510
$$ 15728698 16691644 17169270 17075225 16594163 15990477 15552466 15267714 15184646 15312964 15471474
4780A5471474K67171N45829M16133N22262O57930Q24241J076176J312870J597123
$$ 15471474 15738645 16284474 16700607 17222869 17880799 18705040 19781216 21094086 22691209
4771B2691209J964138K142695J448697K42208p57262j107747j018793p13728l76681
$$ 22691209 24655347 26798042 28246739 28488947 27731685 26623938 25605145 24891417 24514736
4762B4514736k22301k4220K64925M61488O67695O50145P08923R11230R15979J116152
$$ 24514736 24292435 24268215 24533140 24994628 25662323 26312468 27021391 27932621 28848600 29964752
4752B9964752J215320J261285J422960J453074J306637R92446O51317N43803O33476
$$ 29964752 31180072 32441357 33864317 35317391 36624028 37616474 38267791 38811594 39445070
4743C9445070P39692J049543J141953J299747J414104J595460J605685J750777
$$ 39445070 40184762 41234305 42376258 43676005 45090109 46685569 48291254 50042031
4735E0042031J850476J815374K013753J992093K064581K203069K217476K125068
$$ 50042031 51892507 53707881 55721634 57713727 59778308 61981377 64198853 66323921
4727F6323921K156103J976687J760100J371045J041441Q48930M59670j8484m07392
$$ 66323921 68480024 70456711 72216811 73587856 74629297 75478227 75937897 75919413 75512021
4718G5512021q51767j209847j521005j912155k090644k121004k564273k764850
$$ 75512021 74660254 73450407 71929402 70017247 67926603 65805599 63241326 60476476
4710F0476476k768123k831663k532801k439856k409187k269912k104222j939453
$$ 60476476 57708353 54876690 52343889 49904033 47494846 45224934 43120712 41181259
4702D1181259j739606j552636j549333j471220j379230j323230j297982j314243
$$ 41181259 39441653 37889017 36339684 34868464 33489234 32166004 30868022 29553779
4694B9553779j194198j033286r90737j018227p88436q19201o73262o41510n59415
$$ 29553779 28359581 27326295 26335558 25317331 24528895 23709694 23036432 22394922 21835507
4685B1835507m53911m43143n14852l95220k68125k45569p7217j46351j12150q1610
$$ 21835507 21381596 20938453 20423601 20028381 19760256 19514687 19437470 19291119 19178969 19097359
4675A9097359J9816L3713M9031J77038M8742J34580K56520K43210L37411L88737
$$ 19097359 19117175 19150888 19199919 19376957 19425699 19560279 19816799 20060009 20397420 20786157
4665B0786157M59175O17742Q30781J162610J217103R39379N15983n4735l27825
$$ 20786157 21245332 21863074 22693855 23856465 25073568 26012947 26528930 26474195 26146370
4656B6146370k62199Q229K44306M23998N30181N61059P43329R40681J170337J593358
$$ 26146370 25884171 25892400 26136706 26560704 27090885 27651944 28395273 29335954 30506291 32099649
4646C2099649K181833K755318L194465L638141L572816L155601K578698J589983
$$ 32099649 34281482 37036800 40231265 43869406 47442222 50597823 53176521 54766504
4638E4766504N3366j447517k759048l496212l575484l424556l340008l095181
$$ 54766504 54819870 53372353 50613305 47117093 43541609 40117053 36777045 33681864
4630C3681864k804079k432951j846716j423775q48642m55061j90959k63660p06380
$$ 33681864 30877785 28444834 26598118 25174343 24325701 23870640 23679681 23416021 22709641
4621B2709641j254800j665712j584430j373610j213230j079112r08717q33147
$$ 22709641 21454841 19789129 18204699 16831089 15617859 14538747 13630030 12796883
4613A2796883p95596p28231o83605n17630m22200m27895m98330m01408k95277
$$ 12796883 12001287 11273056 10589451 10071821 9649621 9221726 8723396 8321988 8026711
4604H026711k40138k78104l82018l17582k89744k55519j50541k43951k42206k70242
$$ 8026711 7786573 7508469 7126451 6808869 6519125 6263606 6113065 5869114 5626908 5356666
4594E356666j50491j69905j89058j18937j10887j83391j44717j09442j57062p0123
$$ 5356666 5206175 5036270 4847212 4728275 4617388 4433997 4289280 4179838 4022776 3952653
4584C952653j01517j11357n0675j06162j18689k0753j33914l5579n3153j83671
$$ 3952653 3851136 3739779 3689104 3582942 3464253 3443500 3309586 3274007 3220854 3037183
4574C037183m0586k5037m2069o9180j5936m5634q3012O2488j16330L6237P3882
$$ 3037183 2996597 2971560 2929491 2860311 2844375 2798741 2715729 2778217 2661887 2698124 2772006
4563B772006p6790J9601k6351p583j07046k3883o7734n0229k4374o6553q1221
$$ 2772006 2695216 2714817 2688466 2680883 2573837 2549954 2482220 2431991 2407617 2341064 2259843
4552B259843r0195j3382l2940K1134j09994j4788l0761l8269k763K1549j14782
$$ 2259843 2169648 2156266 2123326 2144460 2034466 2019678 1988917 1950648 1947885 1969434 1854652
4541A854652m2795J279l9999M8164k5261O2621l2592l2781M1788J869P3768J7533
$$ 1854652 1811857 1813136 1773137 1821301 1796040 1858661 1826069 1793288 1835076 1836945 1910713 1928246
4529A928246M6960J4896j29761j27723m2888q4101p189j7508l731m6814r854j3808
$$ 1928246 1975206 1990102 1860341 1732618 1689730 1605629 1598440 1580932 1577201 1530387 1520533 1506725
4517A506725j1501j342j08085q6649O1667k051j4471J4957k2204j4502k2179k6792
$$ 1506725 1495224 1493882 1385797 1299148 1360815 1358764 1344293 1359250 1337046 1322544 1300365 1273573
4505A273573n2121L4814K858L3072o1325K3428j1521L2660J3819O3270J04715
$$ 1273573 1221452 1256266 1259124 1292196 1230871 1254299 1242778 1275438 1289257 1352527 1457242
4494A457242r737m5837j07376j30572j1468M771k7012k6401j222J000o8405l0207
$$ 1457242 1447505 1401668 1294292 1163720 1152252 1157023 1130011 1103610 1102388 1103388 1034983 1004776
4482A004776j0896l6225j1349P5354J5703K9647O4223r495n7403k272l9248J62260
$$ 1004776 993880 957655 946306 1021660 1037363 1067010 1131233 1121738 1064335 1062063 1022815 1185075
4470A185075K7404N2690r3560n9913m5960o6707J6588r3395k7023p1084k0963
$$ 1185075 1212479 1265169 1171609 1111696 1065736 999029 1015617 922222 895199 824115 803152
4459H03152M5187n189K7459j2902l4414L498k596Q8616o0384N420k8899n6180
$$ 803152 848339 843150 870609 857707 823293 826791 824195 912811 852427 857847 828948 772768
4447G72768N7592K2536M0804k9135l6149M9957j5800k9514m8850m3167K836P6130
$$ 772768 830360 852896 893700 864565 828416 878373 862573 833059 784209 741042 743878 820008
4435H20008J3376j23390L9771L8162k2530j7821J1115K4125j664M9625n677m3018
$$ 820008 833384 709994 749765 787927 765397 747576 758691 782816 781152 830777 825100 782082
4423G82082k3653Q897j7955O285R1523L9605p7235L6099J1752l6511Q804J2779
$$ 782082 758429 767326 749371 755656 847179 886784 809549 845648 857400 820889 829693 842472
4411H42472k5113l1550m8693N8787n389O7010P1705J592J1589j6804K3193m6853
$$ 842472 817359 785809 737116 795903 790514 857524 929229 930821 942410 925606 948799 901946
4399I01946o7315j9572M5588Q3163l3760n5343K6054M2284P265J20423L7413N1758
$$ 901946 834631 815059 860647 943810 910050 854707 880761 923045 930310 1050733 1088146 1139904
4387A139904m076j1545r8802j3940j6441Q984j00664j38630M6966m0394K1452
$$ 1139904 1135828 1124283 1025481 1011541 995100 1004084 903420 764790 811756 771362 792814
4376G92814l8503p1790N286M3200Q249r550k4594j06892l475M9708P4437k6467
$$ 792814 754311 682521 687807 731007 739256 729706 705112 598220 594745 644453 718890 692423
4364F92423m9451M9101p4998p262N7835J2775K1120J6848k6310j3316n889L0632
$$ 692423 642972 692073 617075 609813 667648 680423 701543 718391 692081 678765 672876 703508
4352G03508n1939N3195M6079J1786J8028J4049K952K5834N4075R5885K8373m0453
$$ 703508 651569 704764 750843 762629 780657 794706 797658 823492 877567 973452 1001825 961372
4340I61372k9440j9354K18n5210j5697j1947j38933O5822P3065o2427J8419l9606
$$ 961372 931932 912578 912796 857586 841889 829942 691009 756831 829896 767469 785888 746282
4328G46282M6023j5042J5249L1569m9013k4945P1130J4810K244o6000k2386l730
$$ 746282 792305 777263 792512 824081 775068 750123 821253 836063 838307 772307 749921 746191
4316G46191k6002N5090N503n6918N7790N4979l0135J0618k9101L0990j4511M6113
$$ 746191 720189 775279 780782 723864 781654 836633 806498 817116 788015 819005 804494 850607
4304H50607J8774M5814l3318M6100m537L8831k0783J1936k6964l1396J07855K3910
$$ 850607 869381 915195 881877 927977 923440 962271 941488 953424 926460 895064 1002919 1026829
4292A026829M0253m9282J2630k8902K8261k6431L179N6537M3690n890M1796L6872
$$ 1026829 1067082 1017800 1030430 1001528 1029789 1003358 1006537 1063074 1106764 1100874 1142670 1179542
4280A179542j08872l097J03790j4076j6695L1790k9967P6364j8278K8052j5151
$$ 1179542 1070670 1067573 1171363 1157287 1140592 1172382 1142415 1218779 1200501 1228553 1213402
4269A213402R142M3738j5410P4404j4203N304N3994o0296Q395O0826K4419n7055
$$ 1213402 1222544 1266282 1250872 1325276 1311073 1316377 1370371 1310075 1318470 1379296 1403715 1346660
4257A346660m5850O0875M6687K915M8797m1497Q1418J2105M246J1783R774O760
$$ 1346660 1300810 1361685 1408372 1411287 1460084 1418587 1500005 1512110 1516356 1528139 1537913 1544673
4245A544673L5587n773P852L7951O7609J7559r0160L9597P5688J6589J2564l1830
$$ 1544673 1580260 1574487 1582339 1620290 1687899 1705458 1615298 1654895 1730583 1747172 1759736 1727906
4233A727906L9934k9486P695K7776J0057o7547l9659P3429N0384M3624Q277O380
$$ 1727906 1767840 1738354 1746049 1773825 1783882 1716335 1676676 1750105 1800489 1844113 1852390 1858770
4221A858770R9840L6588K8712R5401j0299J20649K7530K7381P4131R1522Q1671
$$ 1858770 1958610 1995198 2023910 2119311 2109012 2229661 2257191 2284572 2358703 2450225 2531896
4210B531896J17293L4947P3451R7194P0510J26979J46555J34192J50247K15571
$$ 2531896 2649189 2684136 2757587 2854781 2925291 3052270 3198825 3333017 3483264 3698835
4200C698835P8942K39191L06302L35179L78286L15718L93338M14008L99005L01957
$$ 3698835 3777777 4016968 4323270 4658449 5036735 5352453 5745791 6159799 6558804 6860761
4190F860761L37695J01289K16412K86094K85490M22261L78614M52249M31116L75630
$$ 6860761 7198456 7299745 7516157 7802251 8087741 8510002 8888616 9340865 9771981 10147611
4180A0147611M39940N22688O10931P76448Q41433R91892R42152R38278J088685
$$ 10147611 10587551 11110239 11721170 12497618 13339051 14330943 15273095 16211373 17300058
4171A7300058J227790J288864J564390J915158K318537K925594L709249M889012
$$ 17300058 18527848 19816712 21381102 23296260 25614797 28540391 32249640 37138652
4163C7138652O232968Q191622J0728554J1408777M568657n047988j0810037j0878107
$$ 37138652 43371620 51563242 62291796 73700573 78269230 73221242 62411205 51533098
4155E1533098q508586o839115n432872m262026l146206k586269j913133j443496
$$ 51533098 43024512 36185397 30752525 26490499 23344293 20758024 18844891 17401395
4147A7401395j187600q76978q46971o66320n09497m28549m00582l20356k22927
$$ 17401395 16213795 15336817 14489846 13823526 13314029 12885480 12484898 12164542 11941615
4138A1941615j65704n7222O6852J42525J42188J07996K57147L39692L76687N37563
$$ 11941615 11775911 11718689 11785541 11928066 12070254 12178250 12435397 12775089 13151776 13689339
4128A3689339M94399N36796O16125P34931P68032P77722Q65886R29414N62048
$$ 13689339 14183738 14720534 15336659 16071590 16839622 17617344 18483230 19412644 19974692
4119A9974692O4759l46228n70133m31929k93190r2266R1065L85701M52599M76000
$$ 19974692 20039451 19693223 19123090 18691161 18397971 18305705 18396770 18782471 19235070 19711070
4109A9711070O39545P71752J060356J183030J137982J107360J021597N68799n541
$$ 19711070 20350615 21122367 22182723 23365753 24503735 25611095 26632692 27201491 27195950
4100B7195950q57785j486048j743806j750885j321481r52924q66392n44036l37475
$$ 27195950 26338165 24852117 23108311 21357426 20035945 19083021 18216629 17672593 17335118
4091A7335118j45953K2711K52711L46193N53437P33209R35910Q46191M62783j1575
$$ 17335118 17189165 17211876 17464587 17810780 18364217 19097426 20033336 20879527 21342310 21330735
4081B1330735o37238q94304j048425j007419r08395r78927q56249o58008n83865
$$ 21330735 20693497 19799193 18750768 17743349 16834954 15856027 14999778 14341770 13757905
4072A3757905m73091l32503j50077j07082K4538J76792K23399L15447L99354L61556
$$ 13757905 13284814 12952311 12802234 12695152 12719690 12896482 13119881 13435328 13834682 14196238
4062A4196238L79910K21059J46178R6333o6467k50726l82039m84441n87465o14458
$$ 14196238 14576148 14797207 14943385 15039718 14973251 14722525 14340486 13856045 13268580 12654122
4052A2654122n17254n33507m78500k99560l36051j87047j69884q7401r2493j02383
$$ 12654122 12136868 11603361 11124861 10825301 10489250 10302203 10132319 10044918 9952425 9850042
4042I850042j22949j55288k41325k08962l28711l43637m83198n60252m89595m92100
$$ 9850042 9727093 9571805 9330480 9121518 8792807 8449170 7965972 7405720 6916125 6424025
4032F424025m51619l63010l69001m09018l26350l04946k56911j68232j50415j60107
$$ 6424025 5972406 5609396 5240395 4831377 4505027 4200081 3943170 3774938 3624523 3464416
4022C464416j77979j98050j26800j84688q5526q7754o0937j27831r7945o6568
$$ 3464416 3286437 3088387 2961587 2776899 2691373 2603619 2542682 2414851 2316906 2250338
4012B250338n8495j1760l6179K1239j05921L2565k4915j09473o2009n2360l9067
$$ 2250338 2191843 2180083 2143904 2165143 2059222 2091787 2066872 1957399 1895390 1843030 1803963
4001A803963o3673l4524o1234j702l0487q6870p4249n6317N266J0027L3785k9860
$$ 1803963 1740290 1705766 1644532 1642830 1612343 1525473 1451224 1394907 1400173 1410200 1443985 1414125
3989A414125p5037J0408n0753j02562K8850K7278k6850j39101M9522n3004q2407
$$ 1414125 1339088 1349496 1298743 1196181 1225031 1252309 1225459 1086358 1135880 1082876 1000469
3978A000469q53Q087j0966k7002l1365n8469K8786k6785p534O115j8919q20K2716
$$ 1000469 999616 1007703 996737 969735 938370 879901 908687 881902 874368 880483 861564 860744 883460
3965H83460k5650k3359j6264N2395O1264o8364J9505k339o1823Q022l1745m7991
$$ 883460 857810 834451 818187 870582 931846 863482 882987 880648 818825 826847 795102 747111
3953G47111Q2369n7070L0755M7788p2722Q3625l8163K02j9360j6449K4497R5417
$$ 747111 829480 772410 803165 850953 778231 861856 823693 823895 804535 788086 812583 908000
3941I08000p1110j975P4397K6470K3828p085L9708K4069j0096J30382O722q8661
$$ 908000 836890 834915 909312 935782 959610 952525 992233 1016302 1006206 1136588 1143310 1054649
3929A054649K0547O7624k0384m9039q3480j1745n4033k6133l2499M2051J6072
$$ 1054649 1075196 1142820 1122436 1073397 989917 978172 924139 898006 865507 907558 923630
3918I23630j06386L5006m1738N6925K4430n3791o7351k7501R3858m512p0348r0049
$$ 923630 817244 852250 810512 867437 891867 838076 770725 743224 837082 832570 762222 672173
3906F72173j6653N8187m4597m972M0738O9010K658p1512K0759l1459J1371l2326
$$ 672173 655520 713707 669110 664138 704876 773886 776544 705032 725791 694332 705703 673377
3894F73377L3378R594P547Q484M699l1910N559q5251M4963m796M9189R411K7192
$$ 673377 706755 716349 723896 732380 737079 705169 710728 625477 670440 665644 714833 724244 751436
3881G51436K8104o2367m211M653M3069J727j3774J6841k3844P360Q542N9964L1950
$$ 751436 779540 717173 712962 717615 760684 762411 748637 765478 741634 748994 757536 817500 849450
3868H49450j39862J07563M261k596K7160j7146j1912Q62L5138L730L3643m4389
$$ 849450 709588 817151 821412 818816 845976 828830 816918 817780 852918 856648 890291 845902
3856H45902m7163K3392O2033J1064n9083K4939p540q0950l2578Q6628N3779L3953
$$ 845902 798739 822131 884164 895228 836145 861084 853544 772594 740016 826644 880423 914376
3844I14376P4491k0156o1516m1478m5914J04063K2519J6274l5381P7059l5068
$$ 914376 988867 968711 907195 865717 819803 923866 946385 962659 927278 1004337 969269
3833I69269k8036O191o487M9068K8797l4558k3707J2248K2077P531o769M6498
$$ 969269 941233 947424 940937 990005 1018802 984244 960537 972785 994862 1002393 995624 1042122
3821A042122O3050q0197L0636J09166p6679P4469r376k6782P2237M2365n8493
$$ 1042122 1105172 1024975 1055611 1164777 1088098 1162567 1153191 1126409 1198646 1241011 1182518
3810A182518j1031M7070j5706L9088L8305L9242L4095k0792k4079l000M1616N2728
$$ 1182518 1171487 1218557 1202851 1241939 1280244 1319486 1353581 1332789 1308710 1305710 1347326 1400054
3798A400054L9804K5588p7898P5772K4432L8284J10755q740j8694K7436K004O6770
$$ 1400054 1439858 1465446 1387548 1463320 1487752 1526036 1636791 1628051 1609357 1636793 1638797 1705567
3786A705567P538j153L1226L7111K2800k4225K8819R8102O5572J4847J0710m1118
$$ 1705567 1713105 1711952 1743178 1780289 1803089 1778864 1807683 1905785 1971357 1986204 1996914 1955796
3774A955796Q1982J61633N7138N4153M1933K925Q1224N7655O0009J83583J33686
$$ 1955796 2037778 2199411 2256549 2310702 2352635 2355560 2436784 2494439 2554448 2738031 2871717
3763B871717N9057P3047J15583J58616O8819P6306J81468J18330K17281K27489
$$ 2871717 2930774 3003821 3119404 3278020 3346839 3423145 3604613 3722943 3940224 4167713
3753D167713K09533K26273K08342K38473K09949K88425K77756L52857M34633L39891
$$ 4167713 4377246 4603519 4811861 5050334 5260283 5548708 5826464 6179321 6613954 6953845
3743F953845M30093N40026M57488M84912M94580N75540M86081N42270P35364Q05008
$$ 6953845 7383938 7923964 8381452 8866364 9360944 9936484 10422565 10964835 11700199 12505207
3733A2505207Q86427J166607J097049J106024J082732P04787N22202O01330P45138
$$ 12505207 13391634 14558241 15655290 16761314 17844046 18548833 19071035 19672365 20417503
3724B0417503R65514J315809J611594J787898J772741J568207R27235L31811j04803
$$ 20417503 21383017 22698826 24310420 26098318 27871059 29439266 30366501 30698312 30593509
3715C0593509j84132Q6239N25397J024436J332108J643721J569724R75613j04162
$$ 30593509 30409377 30495616 31021013 32045449 33377557 35021278 36591002 37566615 37462453
3706C7462453r66843j350300j400482j043103p15764j19185L50465M01210J43175
$$ 37462453 36495610 35145310 33744828 32701725 31985961 31866776 32217241 32618451 32761626
3697C2761626l22291j082293j656253j940401j882111j622063j219916r48422
$$ 32761626 32439335 31357042 29700789 27760388 25878277 24256214 23036298 22087876
3689B2087876o41324m97033p05979p63396j161838j273743j402787j259048j031060
$$ 22087876 21446552 20949519 20243540 19480144 18318306 17044563 15641776 14382728 13351668
3680A3351668r51471p19870o44741o34377n01755m92041n93949o65125n58294
$$ 13351668 12400197 11680327 11035586 10401209 9899454 9407413 8813464 8148339 7590045
3671G590045n22845m66835m01041m40813k34699k59271k38048j89161k22959k30375
$$ 7590045 7067200 6600365 6199324 5758511 5523812 5264541 5026493 4837332 4614373 4383998
3661D383998j75183k12535j55839j65427j24098J5062r2763r6979j38352o0905
$$ 4383998 4208815 3996280 3840441 3675014 3550916 3565978 3473215 3376236 3237884 3176979
3651C176979j31303j3504p9983q0772l8378l742o9055o3176j6494j17765m7795
$$ 3176979 3045676 3032172 2952189 2871417 2833039 2829297 2760242 2697066 2680572 2562807 2515012
3640B515012M5921m0812k3548L0547n5280o802n3187j9152l7092O552J45N7791
$$ 2515012 2560933 2520121 2496573 2527120 2471840 2465038 2411851 2392699 2355607 2362159 2362304 2420095
3628B420095m9662K3403Q034o7349L2251m7922M6175J23664j3537J9545L240L1788
$$ 2420095 2370433 2393836 2401870 2334521 2366772 2318850 2365025 2488689 2475152 2494697 2497937 2529725
3616B529725M4807K6245J11480N2523j3012R3173O5919J16053J2746R2846J02861
$$ 2529725 2574532 2600777 2712257 2764780 2751768 2844941 2910860 3026913 3039659 3132505 3235366
3605C235366J05911K02354M6691J48401J15124Q3960O7100J49851P9304L9306
$$ 3235366 3341277 3543631 3590322 3738723 3853847 3937807 4004907 4154758 4234062 4273368
3595D273368J45276J88840J40345K06387Q8509J55891J61154J71039J23461K1388
$$ 4273368 4418644 4607484 4747829 4954216 5042725 5198616 5359770 5530809 5654270 5675658
3585E675658K37310K16318J69917J27212O5492K21567J32486R5049R2644K06523
$$ 5675658 5912968 6129286 6299203 6426415 6491907 6713474 6845960 6941009 7033653 7240176
3575G240176K41525J35976L55926L42176L22868J92562Q3215Q1084J09130J23442
$$ 7240176 7481701 7617677 7973603 8315779 8638647 8831209 8914424 8995508 9104638 9228080
3565I228080j364Q2161J12917J92948P6489J7777R0588J39352J61325L6677J06383
$$ 9228080 9226716 9308877 9421794 9614742 9691231 9709008 9799596 9938948 10100273 10136950 10243333
3554A0243333J78119J96138L11883L56198M32697K87704K75076K38889K05157
$$ 10243333 10421452 10617590 10929473 11285671 11718368 12006072 12281148 12520037 12725194
3545A2725194J84962J75042J73497J5253J22035J03334P5582N3873l1063k137
$$ 12725194 12910156 13085198 13258695 13273948 13395983 13499317 13574899 13628772 13597709 13595572
3535A3595572J14346O9042J21496J24493Q0606L5085k9067m3275k1816o8361Q62
$$ 13595572 13709918 13778960 13900456 14024949 14105555 14140640 14111573 14068298 14046482 13978121 13978983
3524A3978983K9411N9774k4417L4k7606m1561r3663p0610j46085j40861j59138
$$ 13978983 14008394 14068168 14043751 14043785 14016179 13974618 13880955 13810345 13664260 13523399 13364261
3513A3364261q1286j95242l45734k96012m39133m67917m33410k70410k82910j11025
$$ 13364261 13282975 13087733 12741999 12445987 12006854 11538937 11105527 10835117 10552207 10441182
3503A0441182m0952r9805o3764j44411j19691j92726j71357j37730j29804j67538
$$ 10441182 10400230 10300425 10236661 10092250 9972559 9779833 9608476 9470746 9340942 9173404
3493I173404p3166j227j38075j71330k63585k44158l66915k48596k33107k32064
$$ 9173404 9100238 9099011 8960936 8789606 8526021 8281863 7914948 7666352 7433245 7201181
3483G201181j27368j99495j46684j30601j36191k19063k08481j10223r7537j58745
$$ 7201181 7073813 6874318 6727634 6597033 6460842 6241779 6033298 5923075 5825538 5666793
3473E666793r3257j40788j00012j45054k07610o8924k12195j82546m4752j54962
$$ 5666793 5573536 5432748 5332736 5187682 4980072 4911148 4698953 4516407 4471655 4316693
3463D316693l8220r4293j34321q9697o5820M3625j21456j27328m7759j03532k9037
$$ 4316693 4278473 4184180 4049859 3960162 3894342 3937967 3816511 3689183 3641424 3537892 3508855
3452C508855n8338m8935p2095p8704p7042J4581p8975n9744L2608k8029j0590
$$ 3508855 3450517 3401582 3329487 3250783 3173741 3188322 3109347 3049603 3082211 3054182 3043592
3441C043592m2582l1003m7805K169J2111j1291p029L1813j551L1022k1367l9309
$$ 3043592 3001010 2970007 2922202 2924371 2936482 2925191 2918162 2949975 2948424 2979446 2958079 2918770
3429B918770K4361q970P8199l5444N3298L5897k5193O2922k3570q108n5856M1790
$$ 2918770 2943131 2934161 3012360 2976916 3030214 3066111 3040918 3103840 3080270 3072162 3016306 3058096
3417C058096M8823O3531m895o8570K9802R7127k7070l661L4586P0644J02563m1945
$$ 3058096 3106919 3170450 3165555 3096985 3126787 3223914 3196844 3193183 3227769 3298413 3400976 3359031
3405C359031O623L4646Q8028N4167n2237K1345k9534O5960Q5269M6575N7710J27277
$$ 3359031 3365654 3400300 3488328 3542495 3490258 3511603 3482069 3548029 3633298 3679873 3737583 3864860
3393C864860K6893P3111J6190l8571J42767J50330L7761N5071J6009J70101L9302
$$ 3864860 3891753 3964864 3981054 3942483 4085250 4235580 4273341 4328412 4344421 4514522 4553824
3382D553824R4852k949J1109Q3254P1802L6282l0378J15022L5526J07358J03401
$$ 4553824 4648676 4645727 4656836 4740090 4811892 4848174 4817796 4932818 4968344 5075702 5179103
3371E179103J13221J01840R8194o706P7925J48232J2426O9401J03442N2692Q4800
$$ 5179103 5292324 5394164 5492358 5485652 5563577 5711809 5724235 5793636 5897078 5949770 6034570
3360F034570Q3152J65670J38863J53466J03440J49155K89891K18176K28536K85024
$$ 6034570 6117722 6283392 6422255 6575721 6679161 6828316 7118207 7336383 7564919 7849943
3350G849943K66442K38448L53886L80133M43027M24994L73854M58105M71732M57117
$$ 7849943 8116385 8354833 8708719 9088852 9531879 9956873 10330727 10788832 11260564 11717681
3340A1717681L98292M83393N00202M06848M68584O37539N70356O20732O17492
$$ 11717681 12115973 12599366 13099568 13506416 13975000 14612539 15182895 15803627 16421119
3331A6421119O75690P32613Q19209Q11149Q74992Q87731J043440J214546J170721
$$ 16421119 17096809 17829422 18648631 19459780 20334772 21222503 22265943 23480489 24651210
3322B4651210J472135J673346J726619J988689K381656K689527L158173L645523
$$ 24651210 26123345 27796691 29523310 31511999 33893655 36583182 39741355 43386878
3314D3386878M311418M974718N567060N936138N982011N488707M506708L238701
$$ 43386878 47698296 52673014 58240074 64176212 70158223 75646930 80153638 83392339
3306H3392339J870078O22039m59916r54251r20463n18907k22346j3579n6849p56157
$$ 83392339 85262417 85884456 85424540 84470289 83549826 83030919 82808573 82794994 82738145 81981988
3296H1981988j713474k916060m007294m937022n620821n880736n740572n299715
$$ 81981988 80268514 77352454 73345160 68408138 62787317 56906581 51166009 45866294
3288D5866294m679908m012335l448322k871031k400178k141107j730265j439841
$$ 45866294 41186386 37174051 33725729 30854698 28454520 26313413 24583148 23143307
3280B3143307j302481j016945q33528r03354p45674n42918m60863l48269l53794
$$ 23143307 21840826 20823881 19990353 19086999 18341325 17798407 17337544 16989275 16635481
3271A6635481l14825k32475j66812o4215j29935k0176k3922n4996L0901l6342
$$ 16635481 16320656 16088181 15921369 15857154 15727219 15707043 15683121 15628125 15659026 15622684
3261A5622684O5801M6516J52508K28803K32715L21312L94341L67192N34213N52888
$$ 15622684 15688485 15735001 15887509 16116312 16349027 16670339 17064680 17431872 17966085 18518973
3251A8518973O60891P57534R51850J022136R96184R63297O73262N32911L34739
$$ 18518973 19179864 19937398 20889248 21911384 22907568 23870865 24544127 25077038 25411777
3242B5411777l2266r8651j65601j52624K1037J71856J66717J14394O2115j73299
$$ 25411777 25379511 25280860 25115259 24962635 24983672 25155528 25322245 25436639 25498754 25325455
3232B5325455l52532m92822o77330p97564p90275o62526n25129l95026k03459
$$ 25325455 24972923 24480101 23802771 23005207 22214932 21552406 21027277 20632251 20428792
3223B0428792q3529j8656K12472K40845L99490N68411O15831P35458R83544J166079
$$ 20428792 20345263 20326607 20539079 20779924 21179414 21747825 22363656 23099114 24082658 25248737
3213B5248737J235411J448967J559258J494534J292251R72707O48447J31100k08728
$$ 25248737 26484148 27933115 29492373 30986907 32279158 33251865 33900312 34031412 33822684
3204C3822684l52870m39284m10047k67925r2702N34K40671M92278O18921P82876
$$ 33822684 33469814 33030530 32620483 32352558 32259856 32260390 32501061 32993339 33612260 34395136
3194C4395136R08800J012251J179622J405473J486231J573315J848068K077810
$$ 34395136 35303936 36316187 37495809 38901282 40387513 41960828 43808896 45886706
3186D5886706K211531K385905K717206K782464K936968L262300L483812L858933
$$ 45886706 48098237 50484142 53201348 55983812 58920780 62183080 65666892 69525825
3178F9525825M390924M954216N871938O882439P847572Q771931R552329R649615
$$ 69525825 73916749 78870965 84742903 91625342 99472914 108244845 117797174 127446789
3170A27446789R173792P976654O424838M583786K845581J366227P2699p29177
$$ 127446789 136620581 144597235 151022073 155605859 158451440 159817667 159890366 159161189
3162A59161189r88802q31258k63550K49078P45847J181470J394119J159765O32487
$$ 159161189 158172387 157341129 157077579 157326657 158072504 159253974 160648093 161807858 162440345
3153A62440345j6989p68375j503089k078552k466925k440377j849924j116836
$$ 162440345 162423356 161654981 160151892 158073340 155606415 153166038 151316114 150199278
3145A50199278Q8583J531173K958348M234972N265427N697467N771477N308651
$$ 150199278 150287861 151819034 154777382 159012354 164277781 169975248 175746725 181055376
3137A81055376M782197M294694L930471L582173L411264L310339K946959K371114
$$ 181055376 185837573 190132267 194062738 197644911 201056175 204366514 207313473 209684587
3129B09684587J286822k29574j953314l542796m799878n743183o233202o285161
$$ 209684587 210971409 210741835 208788521 205245725 200445847 194702664 188469462 182184301
3121A82184301o300962o210127o197057o349674o671130o897582p096524p052251
$$ 182184301 175883339 169673212 163476155 157126481 150455351 143557769 136461245 129408994
3113A29408994o628629o044903n083127m263198l373039k668334j999605j717770
$$ 129408994 122780365 116735462 111652335 107389137 104016098 101347764 99348159 97630389
3105I7630389j716115j820816k211730k775155l105869l150257l132601k844890
$$ 97630389 95914274 94093458 91881728 89106573 86000704 82850447 79717846 76872956
3097G6872956k643924k386237k101496j936669j894303j857847j919348j992966
$$ 76872956 74229032 71842795 69741299 67804630 65910327 64052480 62133132 60140166
3089F0140166k086750k192207k289212k300440k102178j915277j864857j660074
$$ 60140166 58053416 55861209 53571997 51271557 49169379 47254102 45389245 43729171
3081D3729171j458926j242200r86635p89775m19981p50726j602600k036531k040491
$$ 43729171 42270245 41028045 40041410 39251635 38831654 38080928 36478328 34441797 32401306
3072C2401306j560542j481952j162978j065731q35017p23759o58167m39809l16848
$$ 32401306 30840764 29358812 28195834 27130103 26295086 25571327 24913160 24473351 24156503
3063B4156503j93337j08914k315J35712K18372N39581P11452J035320O29456j82446
$$ 24156503 23963166 23854252 23851937 23987649 24206021 24745602 25457054 26492374 27121830 26939384
3053B6939384n14785m51207k65851k88185j76565m0175k3359Q77J65281K61616
$$ 26939384 26424599 25973392 25707541 25419356 25242791 25202616 25179257 25180134 25345415 25607031
3043B5607031L15851M07833M55513M48538N16668M03459J96619J28498K09489
$$ 25607031 25922882 26330715 26786228 27234766 27751434 28154893 28351512 28480010 28689499
3034B8689499K80070M57745O11691P68748P73821J064766J196856J392628J560489
$$ 28689499 28969569 29427314 30039005 30807753 31581574 32646340 33843196 35235824 36796313
3025C6796313J893995K074800K425462K874599L280745L663177M264907N015742
$$ 36796313 38690308 40765108 43190570 46065169 49345914 53009091 57273998 62289740
3017F2289740N961358O897072P730459Q594339Q907970Q767696P723215O077379
$$ 62289740 68251098 75148170 82878629 91472968 100380938 109148634 116871849 122949228
3009A22949228L761754J157238j811818m678330o862432q392292q978731q917390
$$ 122949228 126710982 127868220 126056402 121378072 114515640 106123348 97144617 88227227
3001H8227227q540101p696863o660710n721627m858259m173172l526084l140720
$$ 88227227 79687126 71990263 65329553 59607926 54749667 50576495 47050411 43909691
2993D3909691k913771k683803k470092k490821k230886k101947j922315j741548
$$ 43909691 40995920 38312117 35842025 33351204 31120318 29018371 27096056 25354508
2985B5354508j568018j448691j234275j004748j019870q10155p65438p40336o10559
$$ 25354508 23786490 22337799 21103524 20098776 19078906 18268751 17503313 16762977 16152418
2976A6152418m85907n14772l97349l83591l34464k69455k86958j83300j93185
$$ 16152418 15666511 15151739 14754390 14370799 14036335 13766880 13479922 13296622 13103437
2967A3103437j71833k59013j25893j91228k13868j79652j76108j56474j80564
$$ 13103437 12931604 12672591 12546698 12355470 12141602 11961950 11785842 11629368 11448804
2958A1448804k03621j06739j36918p6202n6991l2939j8678p5670j14980j31197
$$ 11448804 11245183 11138444 11001526 10925324 10868333 10835394 10816716 10741046 10626066 10494869
2948A0494869j58374j85122k56972j83752r0279j69816j73969j26711j03475j16771
$$ 10494869 10336495 10151373 9894401 9710649 9620370 9450554 9276585 9149874 9046399 8929628
2938H929628r9379r2653p1535k00147j66669r1200J8384q1756J8490j3342J1536
$$ 8929628 8830249 8737596 8666061 8465914 8299245 8208045 8226429 8144673 8163163 8149821 8161357
2927H161357Q8093m872P0910k53P3909Q5550O7201Q1322J57921Q5681Q6454J06894
$$ 8161357 8249450 8244578 8315488 8315235 8389144 8474694 8541895 8623217 8781138 8866819 8953273 9060167
2915I060167J10873J36063R9894O0729Q505Q9500M4525n7783J69840K7181K4241
$$ 9060167 9171040 9307103 9406997 9467726 9476231 9565731 9610256 9552473 9722313 9749494 9773735
2904I773735k827J19500L9181O113j0897J7299R8353Q2633M8315J69467K44337
$$ 9773735 9770908 9890408 9929589 9935702 9924805 9942104 10040457 10123090 10171405 10340872 10585209
2893A0585209O6094K09323K27748K39302K14360L20226K70451L13532L85149M50595
$$ 10585209 10651303 10860626 11088374 11327676 11542036 11862262 12132713 12446245 12831394 13281989
2883A3281989M41896M74077M17305N05578N52494N83378O33157O67558O80567
$$ 13281989 13723885 14197962 14615267 15120845 15673339 16256717 16889874 17557432 18237999
2874A8237999Q03389Q18469R96120J226355J098119J174386J447429J541993J913727
$$ 18237999 19041388 19859857 20855977 22082332 23180451 24354837 25802266 27344259 29257986
2865B9257986K071015K421536K589482K765330K592217K363808K113911J754792
$$ 29257986 31329001 33750537 36340019 39105349 41697566 44061374 46175285 47930077
2857D7930077J472113J498356J941779K430997K887729L073357L192161L297786
$$ 47930077 49402190 50900546 52842325 55273322 58161051 61234408 64426569 67724355
2849F7724355L310885L423446L626208L890550M411276N010256N858460O713567
$$ 67724355 71035240 74458686 78084894 81975444 86386720 91396976 97255436 103969003
2841A03969003P565768Q565122R768405J1173323J2923849J5150355J7670441
$$ 103969003 111534771 120099893 129868298 141041621 153965470 169115825 186786266
2834A86786266K1288127K6742532L4117917M3616369N5211832O3724259N2342986
$$ 186786266 208074393 234816925 268934842 312551211 367763043 431487302 483830288
2827D83830288J2022760l2743436n5696113n5453139m5459788l4623443k4445476
$$ 483830288 495853048 463109612 407413499 351960360 306500572 271877129 247431653
2820B47431653j5947784j0692196j0909170j5529249j9645529k0185741j8074599
$$ 247431653 231483869 220791673 209882503 194353254 174707725 154521984 136447385
2813A36447385j5257426j2660834j0592067q918766p617963o598826n661022n036105
$$ 136447385 121189959 108529125 97937058 89018292 81400329 74801503 69140481 64104376
2805F4104376m418721l995560l608833l226055k797763k584468k395425k214108
$$ 64104376 59685655 55690095 52081262 48855207 46057444 43472976 41077551 38863443
2797C8863443j924367j606475j427899j432705j538404j595862j462592j574846
$$ 38863443 36939076 35332601 33904702 32471997 30933593 29337731 27875139 26300293
2789B6300293j377289j248827j175109j086384r76192r02058q75397q40494p19608
$$ 26300293 24923004 23674177 22499068 21412684 20436492 19534434 18659037 17818543 17098935
2780A7098935p33059o22828o22231n34964n03405n46863n34596m64939l96424
$$ 17098935 16365876 15743048 15120817 14585853 14082448 13535585 13000989 12536050 12139626
2771A2139626l46274l73138m09894l90475l72222l58964l15905k35943k20626
$$ 12139626 11793352 11420214 11010320 10619845 10247623 9888659 9572754 9336811 9116185
2762I116185m17517j88148k18423k60871j79731k22479l21241k40554k42331k68352
$$ 9116185 8698668 8510520 8292097 8031226 7851495 7629016 7307775 7067221 6824890 6556538
2752F556538j85275k88629j10428j41706j53348j32689j50987j59454j65080m8370
$$ 6556538 6371263 6082634 5972206 5830500 5677152 5544463 5393476 5234022 5068942 5020572
2742E020572j30475q9252j44541o8435l2030j02612j7173p0269j25069m5550q4632
$$ 5020572 4890097 4800845 4656304 4587869 4555839 4453227 4436054 4365785 4240716 4195166 4110534
2731D110534j35863r7622o2909j02247j92210k0749L1369m6402r2008n4243n2239
$$ 4110534 3974671 3877049 3814140 3711893 3519683 3498934 3530303 3483901 3391893 3337650 3285411
2720C285411j26727j07255n9842r772n6532j23302n9832n5676j29065j6696k8550
$$ 3285411 3158684 3051429 2991587 2981815 2925283 2801981 2742149 2686473 2557408 2540712 2512162
2709B512162p8082j4408p447j17021o6656j1975j3278j1882L0734k9385q194j01742
$$ 2512162 2434080 2419672 2412225 2295204 2228548 2216573 2203295 2191413 2222147 2192762 2184568 2082826
2697B082826j26245n1210j07007J3519o9556M2426n8046n0807n3354m324N6626
$$ 2082826 1956581 1905371 1798364 1811883 1742327 1784753 1726707 1675900 1622546 1618222 1674848
2686A674848l1571K6594r3967k0652N1447p1350R6247J2980j2918o8829J0324
$$ 1674848 1643277 1669871 1575904 1555252 1606699 1535349 1631596 1644576 1631658 1562829 1573153
2675A573153j5423j233p1568J9352M126k4018l1087N8535p6323O282p1961k6063
$$ 1573153 1557730 1556497 1484929 1504281 1508407 1484389 1453302 1511837 1435514 1441796 1369835 1343772
2663A343772l632k5635k5803k5834k5511k5095N3351r0016O2695j9885j6273n4109
$$ 1343772 1340140 1314505 1288702 1262868 1237357 1212262 1265613 1175597 1238292 1218407 1202134 1148025
2651A148025J39898j9978j6160j034p4474M1543l1161l7616j3903J8555L7007
$$ 1148025 1287923 1267945 1251785 1250751 1176277 1217820 1186659 1149043 1135140 1153695 1190702
2640A190702l6653N9026L7479l7078l5495q30O269L24k2913N5074R8317L1918
$$ 1190702 1154049 1213075 1250554 1213476 1177981 1177151 1183420 1183744 1160831 1215905 1314222 1346140
2628A346140O0035k5875P7993Q6133L7226J7353O3448J27825J60822K11479J78840
$$ 1346140 1406175 1380300 1458293 1544426 1581652 1599005 1662453 1790278 1951100 2162579 2341419
2617B341419L13926L04002J68331o7731j57151k18400l22568k48331j12144p6307
$$ 2341419 2655345 2959347 3127678 3059947 2902796 2684396 2361828 2113497 2001353 1925046
2607A925046j14738q7815j31963q3714r2771j22412q1202q8780k6166q4660r4562
$$ 1925046 1810308 1722493 1590530 1506816 1414045 1291633 1210431 1121651 1095485 1010825 916263
2596I16263M0269p3623r7791m7664N6034o844p7160N1012o0769n0869Q891j4205
$$ 916263 956532 882909 785118 737454 793488 786644 709484 760496 699727 648858 657749 643544
2584F43544n7613Q2893l1435m4274R189o8168M8582M7260o7160n3471l7643L6883
$$ 643544 585931 668824 637389 593115 602304 534136 582718 629978 562818 509347 471704 508587
2572E08587Ok0881o0630r624o879q2736K1191J3615j7514l4304O7575o0383l5295
$$ 508587 508593 487712 427082 417458 410579 327843 349034 362649 345135 310831 378406 318023 282728
2559B82728J0596j7330O9680k822P73L5756j01457j0990O314n8809K8257N5724
$$ 282728 293324 275994 345674 342852 343625 379381 277924 266934 273248 214439 242696 298420
2547B98420o8763K9874l1531M7504k9162l0683J015J4979k489o4738O9866n3438
$$ 298420 229657 259531 228000 275504 246342 215659 216674 231653 229164 164426 234292 180854
2535A80854p2713j2950J61789P2877j00418P4390k5291j1249K951j0161o4687
$$ 180854 108141 95191 256980 329857 229439 303829 278538 267289 270240 260079 195392
2524A95392l5211m4021O2564N0602j09285k8377N5665k5538L9314L1797J9696
$$ 195392 160181 116160 178724 229326 120041 91664 147329 121791 161105 192902 212598
2513B12598K9962m7600j5597j7838m5709J506P3462K4322k4774j7312o6376m926
$$ 212598 242560 194960 179363 161525 115816 117322 190784 215106 190332 173020 106644 101718
2501A01718J07753k4751p1r4128O5464L4472l2155N659j4121q7104J3794Q036
$$ 101718 209471 184720 184649 90521 155985 190457 158302 163961 149840 62736 76530 84566
2489H4566J6022p3529J24537O729l5109L7642k1407k2575N691P1189m2748K0478
$$ 84566 100588 27059 151596 158325 123216 160858 139451 116876 122567 193756 151008 171486
2477A71486Q902o5155m6263n1644N4196L0630l1774p598M5342k5236q573j6330
$$ 171486 180388 115233 68970 17326 71522 102152 70378 62780 108122 82886 74313 57983
2465E7983L7094o0698j8995R0360K1427j1924q1789k2731P7851o8912j6278J3028
$$ 57983 95077 34379 15384 105744 127171 115247 33458 10727 88578 19666 3388 16416
2453A6416M1297Q8773Q475m347M0572k4347R246o1085J3557K1618r951r1526p3895
$$ 16416 57713 146486 154961 150614 191186 166839 176085 115000 128557 150175 140224 48698 -25197
2440b5197O9132M1154j09787j1426R4113L8946q745n22L6603j23288K1944k6585
$$ -25197 43935 85089 -24698 -36124 57989 96935 88190 87668 124271 983 22927 -3658
2428c658j313m9247J11572m0726K4185k8028k4923o2091N5282J7316N2516l6131
$$ -3658 -4971 -54218 57354 16628 40813 12785 -12138 -74229 -18947 -1631 50885 14754
2416A4754K5315J4790n9901J3601L523j7218M8073N4079l6624K3325K7095J1293
$$ 14754 40069 54859 -5042 8559 12082 -5136 42937 97016 60392 83717 110812 122105
2404A22105k5892l3515J6344l0714Q070L687l4533O7537k0238l225p8115Q427
$$ 122105 96213 62698 79042 48328 56398 60085 25552 93089 72851 69626 -8489 -62
2392f2J1122r153Q3575k130n0065M1588L2392k0834j8067n8203K954J474P3962
$$ -62 11060 1907 85482 83352 33287 74875 107267 86433 68366 10163 13117 14591 88553
2379H8553k5371j1864k8432K1270m3680J5506N1016p0372o1830k3949N7385M4826
$$ 88553 63182 51318 22886 44156 476 15982 66998 -3374 -65204 -89153 -31768 13058
2367A3058k3196q6089K4780Q3437K0404m003K442n6173O9759M287m4018j4666
$$ 13058 -10138 -96227 -71447 11990 32394 28391 30833 -25340 44419 48706 4688 -9978
2355i978K5404k874L638J8004k9366J4588P8150j9465m21n9442O243L5506R463
$$ -9978 15426 12552 16190 34194 4828 19416 97566 78101 77680 18238 24481 59987 69450
2342F9450n955N293q4778Q1214q0940n830J11847N0758j10498k5296K5961K4502
$$ 69450 63495 68788 -15990 65224 -15716 -21546 90301 141059 30561 5265 31226 55728
2330E5728J9327M8272L663l5961K4705J7837r483j8382k1734J0314K4850j3206
$$ 55728 75055 123327 126990 91029 115734 133571 124088 105706 83972 94286 119136 105930
2318A05930j1520l2516l7201M1174J16599r3379K4829l431j4543N3600N5347l265
$$ 105930 94410 61894 24693 65867 182466 89087 113916 110485 95942 149542 204889 201624
2306B01624l1887J4921K804j8025N4354K2169L1948O8397J5596J4699J4184k2252
$$ 201624 169737 184658 187462 169437 223791 245960 277908 346305 361901 376600 390784 368532
2294C68532Q151K0186N9841P746N1062Q890N5660N1274J04409Q0340O5478J60163
$$ 368532 376683 396869 456710 464456 515518 524408 580068 631342 735751 816091 881569 1041732
2282A041732N9636O0346R7956j774m6482Q1472Q3107J6422N2373J25520P4395
$$ 1041732 1101368 1161714 1259670 1257896 1211414 1292886 1375993 1392415 1444788 1570308 1644703
2271A644703P9124R6396Q4704J18935J54544J94350J37501L11387J69446L19891
$$ 1644703 1723827 1820223 1904927 2023862 2178406 2372756 2510257 2821644 2991090 3310981
2261C310981L27488L98666K71316K88893L67369O03123P14472J050909J468994
$$ 3310981 3638469 4037135 4308451 4597344 4964713 5567836 6282308 7333217 8802211
2252H802211J904122K820203M416091K160945k037373l722267l292699k133316
$$ 8802211 10706333 13526536 17942627 20103572 18066199 14343932 11051233 8917917
2244H917917j704858j279707j055745o35067n34238k70494k38286l06454l75677
$$ 8917917 7213059 5933352 4877607 4242540 3708302 3437808 3199522 2893068 2517391
2235B517391k72151l18957j33039n7270k84539p636p3635j17930o4099j54476
$$ 2517391 2245240 1926283 1793244 1735974 1451435 1443799 1370164 1252234 1188135 1033659
2225A033659r2004p2996L0778l3489o6551r3242J13o3740n7547m3970P709l8808
$$ 1033659 941655 868659 899437 865948 799397 706155 706268 642528 584981 541011 548720 509912
2213E09912o692o0869N43n7030p4405K3782L0394p881m2984l5573n7174m2355
$$ 509912 503220 442351 442894 385864 311459 335241 365635 357754 314770 279197 222023 179668
2201A79668J3428J4708o2704j435K2191k9062J6873m1888O0660r997l010o0044
$$ 179668 193096 207804 145100 143665 165856 136794 153667 111779 172439 162442 159432 99388
2189I9388m0375l0808r862k202O5910o954K0078j04685P4833N4472m7816l869
$$ 99388 59013 28205 18343 16141 82051 75097 95175 -9510 65323 119795 71979 68110
2177F8110m8824j5916K0472j642K3176L555j5686M1974L1722m4919q595j5706
$$ 68110 19286 3370 23842 22200 45376 48931 33245 75219 106941 62022 53427 37721
2165C7721L8536l646q0162p5144K26L3064L5633K5613O3300r961p4638J8112o8039
$$ 37721 76257 72611 -7551 -82695 -82469 -49405 -13772 11841 75141 65180 -9458 8654 -59385
2152e9385O0035N8282n9872o279J2992n0381Q1134q64k0368J7838J3970k6651
$$ -59385 650 58932 -940 -7219 5773 -44608 36526 35662 15294 33132 47102 20451
2140B0451R157k9860M9951o0462k5563J2587J6925r027k4734L5074M464p2229
$$ 20451 29608 -252 49699 -10763 -36326 -23739 -6814 -15841 -40575 -5501 -1037 -73266
2128g3266J8022k5333J4235J5356q159L8189j7606q4776Q0243N2818k1458m7153
$$ -73266 -55244 -80577 -66342 -50986 -59145 -20956 -38562 -123338 -43095 9723 -11735 -58888
2116e8888M813m0934J2739K4216j26685N3373J16432n2370p6491K3426N0071L4249
$$ -58888 -54075 -95009 -82270 -58054 -184739 -131366 -14934 -67304 -143795 -120369 -70298 -36049
2104c6049K2497j9157r871p954n872N3893l8582J4736L232q9566n4829O7484Q7530
$$ -36049 -13552 -32709 -42580 -50534 -56406 -2513 -41095 -26359 -23127 -112693 -167522 -100038 -12508
2091a2508r805J3499j4183j2401q0686O8466l5116J016l6155P7217L0305l1387
$$ -12508 -22313 -8814 -22997 -35398 -116084 -47618 -82734 -81718 -117873 -40656 -10351 -41738
2079d1738j2579p6215L4343L0376J3703J451Q187O6559r3818N6725N0592j32254
$$ -41738 -54317 -130532 -96189 -65813 -52110 -50659 -42472 24087 -69731 -13006 37586 -94668
2067i4668J3484K8041j7215L4229J2045o0056L0913L1077l7140K5165L7515p0617
$$ -94668 -81184 -53143 -70358 -36129 -24084 -84140 -53227 -22150 -59290 -34125 3390 -67227
2055f7227r651M6440n4301L5552M8872L8187j9888m092R6560j33602j5014M7433
$$ -67227 -76878 -30438 -84739 -49187 -315 37872 17984 13892 110452 -23150 -38164 9269
2043I269o0511K4735L6134m5140K0915l715n170p9971k7214K3819J6604M0448
$$ 9269 -51242 -26507 9627 -35513 -14598 -18313 -23483 -103454 -130668 -106849 -90245 -49797
2031d9797l0297Q6585k0365j05362O993Q8407Q341j2539o4644o366K9401M0075
$$ -49797 -80094 6491 -13874 -119236 -112243 -23836 -15495 -28034 -92678 -99044 -69643 -29568
2019b9568M2524o8557K4331l734J5872j6895q843K665l4375O816Q058n0730Q9437
$$ -29568 12956 -55601 -31270 -35004 -19132 -36027 -44870 -42205 -76580 -69764 -61706 -112436 -22999
2006b2999n6608J36010j13681L4914K1527n9655k1833k9131O7912r7121m9599
$$ -22999 -79607 56403 -57278 -22364 -837 -60492 -82325 -111456 -43544 -140665 -190264
1995a90264J06676J9275k2637j6808O2775N7018m7520j2477L479P46n1290k9820
$$ -190264 -83588 -64313 -86950 -103758 -40983 16035 -31485 -43962 -40483 -39737 -91027 -120847
1983a20847L7520M5609l1166o5942N1485M8283l7350L84l7025M627N6116L8143
$$ -120847 -83327 -37718 -68884 -134826 -83341 -35058 -72408 -72024 -109049 -104422 -48306 -10163
1971a0163p8608N489M7035k5817j477j9474k3013K6577N6739J5653q38j1564O0371
$$ -10163 -88771 -83282 -36247 -62064 -63541 -83015 -106028 -79451 -22712 -7059 -7897 -19461 40910
1958D0910j10961K9563m098k3254J9538r8553P5722p535K0095L2022o9132j5265
$$ 40910 -70051 -40488 -44586 -67840 -48302 -146855 -71133 -78668 -58573 -26551 -95683 -110948
1946a10948N1703r264L0782J9312l7133q1383N9487Q2242j8951j09373K9554O4506
$$ -110948 -59245 -68509 -37727 -18415 -55548 -136931 -77444 4798 -14153 -123526 -93972 -29466
1934b9466p918M8095L790q7111K7159m910M5085l5107J9823m6692K6497J8135
$$ -29466 -37384 10711 14501 -72610 -45451 -50361 -5276 -40383 -20560 -67252 -40755 -22620
1922b2620o5361K8734P279p671l2121o873j6586l8512J1113N7341L7894j4884
$$ -22620 -87981 -59247 -51968 -59639 -91760 -98633 -115219 -153731 -142618 -85277 -47383 -62267
1910f2267L0992k0834n3636Q7130p9430J4520M7610l5017L4145m3861K2407N4608
$$ -62267 -31275 -52109 -105745 -18615 -98045 -83525 -35915 -70932 -36787 -80648 -58241 -3633
1898c633l1702k1263m8343m651L4555K3522q933J1255k0021O6005q157m4832m5277
$$ -3633 -35335 -56598 -104941 -109592 -75037 -51515 -60448 -49193 -69214 -3209 -11366 -56198 -101475
1885a01475m1304J03286r9263N0778N2812k7580j8303J2447k3569Q2984l8277
$$ -101475 -142779 -39493 -138756 -87978 -35166 -62746 -81049 -68602 -92171 -9187 -47464
1874d7464o2187K6699n5161R1800K7767j7947N9453r1440p6546J1263M8112L7214
$$ -47464 -109651 -82952 -138113 -46313 -18546 -36493 22960 -68480 -145026 -133763 -85651 -48437
1862d8437r6858N1227P2506k714k0984J0295m5453K6996J9262j0209N7464N054
$$ -48437 -145295 -94068 -21562 -24276 -45260 -34965 -80418 -53422 -34160 -44369 13095 18149
1850A8149m2995J0456q8069k658P8962M325r3462Q4859l6483L3269P706n8635
$$ 18149 -24846 -14390 -102459 -105117 -26155 -21830 -115292 -30433 -66916 -33647 -25941 -84576
1838h4576K753P6253P932k2100k4409n2156K4920J057N6006j0089J0967Q91K5546
$$ -84576 -81823 -5570 2362 -19738 -44147 -96303 -71383 -70326 -14320 -24409 -13442 -12551 12995
1825A2995o4475K9530p432L273R111K8589l3494no4575k6388P484M110J9248J8825
$$ 12995 -51480 -21950 -29382 -26109 -16998 11591 -21903 -21908 -86483 -112871 -105387 -101277 -82029 -63204
1811f3204J076k2663J4105j0591Q110o4172J15789k570r8041j0641O5039J5302
$$ -63204 -62128 -84791 -70686 -81277 -73167 -137339 -21550 -24120 -122161 -132802 -67763 -52461
1799e2461O068J2563j4951r149J0002k996K5243m3585p253l231M5682K0488o6901
$$ -52461 -46393 -33830 -48781 -57930 -47928 -50924 -25681 -69266 -76519 -79750 -34068 -13580 -80481
1786h0481o0139j3201J10259K874K5573M8940l4774j1654j5179l6208K8220L4125
$$ -80481 -140620 -153821 -43562 -40688 -15115 33825 -949 -12603 -27782 -63990 -35770 -1645
1774a645k4142N1500L746j16043K8310O7654m4336J2240L2397m3547k9171j7836
$$ -1645 -25787 25713 29459 -86584 -58274 9380 -34956 -22716 9681 -33866 -63037 -80873
1762h0873M106Q141p6910N7219L8953k2854N3400j9182j2367L6537K2912n9578
$$ -80873 -76767 -68626 -145536 -88317 -49364 -72218 -18818 -38000 -50367 -13830 9082 -50496
1750e0496N1338l27j9506r9280l666M0039J8871k6675N5498R290O292k8001N7428
$$ -50496 842 515 -18991 -118271 -121937 -81898 -63027 -89702 -34204 -24914 -18622 -46623 10805
1737A0805p2390K5518P1511j04080j903L4072L9536m8583p499o2681m232M2815
$$ 10805 -61585 -36067 35444 -68636 -70539 -36467 3069 -45514 -53013 -115694 -119926 -77111
1725g7111J4938j5205n3823J9765J8719O1417L4487J753l0413j3159P4238m9982
$$ -77111 -62173 -77378 -131201 -111436 -92717 -31300 3187 4940 -25473 -38632 35606 -14376
1713a4376K0583o0722n2399P3939K5858q1442l895R0836j1251L1420J3394m4818
$$ -14376 6207 -54515 -106914 -32975 -7117 -88559 -92454 -1618 -12869 18551 31945 -12873
1701a2873k2257j01590P2501M2617Q371n1152j1119K479k0324R9116m3652k8587
$$ -12873 -35130 -136720 -64219 -21602 -13231 -64383 -75502 -73023 -93347 5769 -37883 -66470
1689f6470l1452j7046J4646Q1429p7188k7349Q9337J7725j4034m861k8248P978
$$ -66470 -97922 -114968 -100322 -18893 -96081 -123430 -34093 -16368 -30402 -35263 -63511 -55533
1677e5533K6007O8204k2856p5305K407o115j9739R015n038k6722J6666J0036N3662
$$ -55533 -29526 38678 15822 -59483 -57076 -63191 -82930 -73915 -78953 -105675 -89009 -78973 -25311
1664b5311j6223j113P950m777J1405l6286l6211M5882o4659N2675n3578m3380
$$ -25311 -41534 -42647 -34697 -39474 -28069 -64355 -100566 -54684 -119343 -66668 -120246 -163626
1652a63626l9235J18334J02377j9194l3511J1358j5678n2273L9917M2326j922
$$ -163626 -202861 -84527 17850 -1344 -34855 -23497 -39175 -91448 -51531 -9205 -11127
1641a1127N8063K757n179j39589K7640P3687n5825k7087L0216J3849J5604p052
$$ -11127 46936 49693 44514 -95075 -67435 6252 -49573 -76660 -46444 -32595 -16991 -24043
1629b4043o825l103K7493J3976k8072k4082m3351P4527j8436m2559m8723R8155
$$ -24043 -30868 -33971 -6478 7498 -20574 -44656 -88007 -13480 -31916 -74475 -123198 -25043
1617b5043j889m120m4125L4147j0979O5516j5928l2159M849n2214j5935K0681
$$ -25043 -26932 -31052 -75177 -41030 -52009 13507 -2421 -34580 -29731 -81945 -97880 -77199
1605g7199P5591l120k9804k8420O9099j5021m3897K4960r9396K2899L4115l265
$$ -77199 -1608 -4728 -34532 -62952 6147 -8874 -52771 -27811 -127207 -104308 -70193 -73458
1593g3458J5718k426l3038O3183P0425p9809L4103j9548n892n828j1305n615J781
$$ -73458 -57740 -60166 -93204 -30021 40404 -39405 -5302 -24850 -30742 -36570 -47875 -53490 -51709
1580e1709N3415Q415J348N7905j38010O095j6962M9814M0900l9890K7350n8260
$$ -51709 1706 10121 11469 69374 -68636 -62541 -79503 -29689 11211 -28679 -1329 -59589
1568e9589q2840J4275L1138p0340N6403j727M1244L5823k9015J905N7713j6415
$$ -59589 -142429 -128154 -97016 -167356 -110953 -112680 -71436 -35613 -64628 -62723 -5010 -21425
1556b1425m0763L887n2453l931J8968M3477L3799N8304q0771L5689j5669j13697
$$ -21425 -62188 -58301 -110754 -114685 -95717 -52240 -18441 39863 -40908 -5219 -20888 -134585
1544a34585N2694j5783l783N0060R857M882k6265m2318O6799m6333O0338k9924
$$ -134585 -81891 -97674 -101457 -51397 -41540 -36658 -62923 -105241 -38442 -84775 -24437 -54361
1532e4361M3288m7392J27800p0078p7136K2283j08739P7509O0810N1953p3707
$$ -54361 -11073 -58465 69335 -743 -77879 -55596 -164335 -86826 -26016 25937 -47770
1521d7770r642l9645k941K4123j22595J50780l3559o2684K6378M9565l0689K6861
$$ -47770 -57412 -97057 -99998 -75875 -198470 -47690 -81249 -143933 -117555 -67990 -98679 -71818
1509g1818J0002N4207o1543K6668P9052Q767r8183k8654j1248k5407J37993n598
$$ -71818 -61816 -7609 -69152 -42484 36568 45335 -52848 -81502 -92750 -118157 19836 14238
1497A4238L3438m6012o6128J1614N4813o7502r203n722J2098l9180M7172K1312
$$ 14238 47676 1664 -64464 -52850 1963 -65539 -74742 -80464 -68366 -107546 -60374 -39062
1485c9062J785K908M2716q4939j6809M9837N873M7845k7224o3527J7705L058M1309
$$ -39062 -37277 -34369 8347 -76592 -93401 -43564 -37691 10154 -17070 -80597 -62892 -59834 -18525
1472a8525m0588N3273K5881K3063j14026j5662L4846l1340M901J07196J67J7158
$$ -18525 -59113 -5840 20041 43104 -70922 -86584 -51738 -83078 -78177 29019 29186 46344
1460D6344N0538p7119l5782m2548J8388n8546N9155j1175k1431K4083l6687j4276
$$ 46344 96882 19763 -16019 -58567 -40179 -98725 -39570 -50745 -72176 -48093 -84780 -99056
1448i9056N8870n097l978K0900k0467K6624n588Q461m7411L815q992P1094j8094
$$ -99056 -40186 -45283 -49261 -28361 -48828 -22204 -27792 -19331 -66742 -62927 -71919 -825 -18919
1435a8919n1869L8968K0709m5915l0228O6693N0570p3185J7826L1981J3011k3966
$$ -18919 -70788 -31820 -11111 -57026 -87254 -20561 30009 -43176 -25350 6631 19642 -4324
1423d324K9489n7299m2584P0036o9264O6900k2712O4884o0363r826l9174L5868
$$ -4324 25165 -32134 -74718 -4682 -73946 -7046 -29758 35126 -25237 -35063 -74237 -38369
1411c8369J1210q9991J6514K8600O127Q811J7014M0958J5448j207n9203j2573
$$ -38369 -27159 -117150 -100636 -72036 -65909 -57098 -40084 874 16322 15115 -44088 -56661
1399e6661J1800J907L5412L7978j7523o6626j0510J6606k3101Q5758m3127n733
$$ -56661 -44861 -42954 -7542 30436 12913 -53713 -64223 -47617 -70718 15040 -28087 -33820
1387c3820k6977k0985P6195n9770M2696k1214L0563m4583Q0754P077j00421M6496
$$ -33820 -60797 -81782 -5587 -65357 -22661 -43875 -13312 -57895 22859 29936 -70485 -23989
1375b3989l3013l4639j0438M0980l7964J9685L938m7030N4206J3031M7609k0066
$$ -23989 -57002 -91641 -102079 -61099 -99063 -79378 -75440 -122470 -68264 -55233 -7624 -27690
1363b7690L2938o9073l0891k1554R2168N3533m5929N1509J2708K7539r1827m0653
$$ -27690 5248 -63825 -94716 -116270 -24102 29431 -16498 35011 47719 75258 -16569 -57222
1351e7222O1783n7030R714o671k8069m1611N7468Q4720m8423K0490L6406p4030
$$ -57222 4561 -52469 -42755 -49426 -77495 -119106 -61638 23082 -25341 -4851 31555 -42475
1339d2475M5879K176k0872k157N1096k3828o1389m0479k8840Q7357j9106l0623
$$ -42475 3404 5580 -15292 -17449 33647 9819 -51570 -92049 -120889 -33532 -52638 -83261
1327h3261l4611L6930k1256N661P8231Q061m8134L031Q6201j13515M7027O33O7931
$$ -83261 -117872 -80942 -102198 -96537 -18306 -10245 -58379 -55348 30853 -82662 -35635 -35002 32929
1314C2929m234n5049J1896l3358J1024R118j0781K932l3915K5405K9969l836K2088
$$ 32929 28695 -26354 -14458 -47816 -36792 -27674 -38455 -35523 -69438 -44033 -14064 -17900 4188
1301D188o2735Q315r486J27451o7547L1452j1214l4895l0656R4381J2056l7344
$$ 4188 -58547 -50232 -59718 67733 186 31638 20424 -14471 -45127 49254 61310 23966
1289B3966k3396N2950J6447o6329p5277M9566J1157J139J158r051k2872j2300
$$ 23966 570 53520 69967 3638 -71639 -22073 -10916 -9777 -8619 -17670 -40542 -52842
1277e2842N7496n8006j3536Q2698l0227l7634K9290K0664O7898m5412q67l508
$$ -52842 4654 -53352 -66888 15810 -14417 -52051 -22761 -2097 65801 20389 19522 16014
1265A6014l0038J8011m302k1148J2767K9521J3008l5348l5233L6164n214K4985
$$ 16014 -14024 3987 -315 -21463 -8696 20825 33833 -1515 -36748 -584 -5798 19187
1253A9187l0349J5041M4304l7955n6636l9077m6609Q7131q972j2545O4388m5965
$$ 19187 -11162 3879 48183 10228 -46408 -85485 -132094 -44963 -53935 -66480 -2092 -48057
1241d8057j2270L4774L0203K2189n7223m5037O0946k5944M91O20l5866R9192L0201
$$ -48057 -60327 -25553 4650 26839 -30384 -75421 -14475 -40419 -39928 -39308 -75174 24018 54219
1228E4219n4220q953J6082L3213j7123p3913l3423n523K6168O7975K7292J3047
$$ 54219 -1 -8954 7128 40341 23218 -50695 -84118 -89641 -63473 4502 31794 44841
1216D4841J995q018q4614k6661R1587j3266J5094K3741m837m6758l5265L3013
$$ 44841 46836 38818 -45796 -72457 19130 5864 20958 44699 39862 -6896 -42161 -9148
1204i148K437P0111k7288L8597q8550K2347j8803l0124K4299R1165o8475M0839
$$ -9148 -6711 63400 36112 74709 -13841 8506 -10297 -40421 -16122 75043 6568 47407
1192D7407p2091O3438J0303j9198k6928l9648J5981n2196M5358J3605O0010m2851
$$ 47407 -24684 38754 49057 29859 2931 -36717 -20736 -72932 -27574 -13969 46041 3190
1180C190L3988p24j1692n6259l2632J9256L5327o1856K0015m5614j1472O4642
$$ 3190 37178 36454 24762 -31497 -64129 -44873 -9546 -71402 -51387 -97001 -108473 -43831
1168d3831K3491P2828j608K8220q3581O221Q622K7872J2321o2180m0669n4817
$$ -43831 -20340 52488 50880 79100 -4481 1740 10362 38234 50555 -11625 -52294 -107111
1156a07111M3356J9522M011k300M4910J4652l1779k0348M230q051j0160m7434
$$ -107111 -63755 -44233 -40222 -42522 2388 17040 -14739 -35087 -30857 -38908 -49068 -96502
1144i6502Q8714R8117j14599l1922M4830j2359J1768j2905K6158K3696N6254q8325
$$ -96502 -7788 90329 -24270 -56192 -11362 -23721 -11953 -24858 1300 24996 81250 -7075
1132g075L6568k5343k9470Q5650r2487n3955N5161K6582K6799Q488J2239j32526
$$ -7075 29493 4150 -25320 60330 -32157 -86112 -30951 -4369 22430 30918 43157 -89369
1120h9369l8700M7859M5956P538j0322o086k9924N0613P038j5971k0483p813k0188
$$ -89369 -128069 -80210 -34254 -26716 -37038 -43124 -73048 -22435 -15397 -31368 -51851 -59664 -79852
1107g9852J9448L5818J1606k1327N9240m1719m2L9216k3578k1817M2017n1396
$$ -79852 -60404 -24586 -12980 -34307 24933 -16786 -16828 22388 -1190 -23007 19010 -32386
1095c2386j3822M6469L2768J127J3967p9098P4337n6940K1278k798P255M3222
$$ -32386 -46208 261 33029 34156 48123 -30975 43362 -13578 7700 4902 12157 55379
1083E5379p4071K2359l0348n565M7826N4152l3589N04j9404j2026M5263p968l6788
$$ 55379 -18692 3667 -26681 -32246 15580 69732 36143 36647 17243 5217 50480 42512 5724
1070E724j8856J442j2927m7597N7009N3622q4406J2384M0417L4793m0300L8872
$$ 5724 -13132 -11690 -24617 -72214 -15205 38417 -45989 -33605 6812 41605 1305 40177
1058D0177M906p8804L073L2283m3530n8357R4316M139K5536m7045L160M0121M9808
$$ 40177 45083 -33721 -30648 1635 -41895 -100252 -5936 -1797 23739 -23306 -20146 19975 69783
1045F9783o8975o3740r034Q4962n3478n5370J4059O7717L984l6023R9384j789
$$ 69783 808 -62932 -71966 12996 -40482 -95852 -81793 -14076 -10092 -46115 53269 51480
1033E1480j30720L0923k5221N0966K4814R6369m4777n1694j5383Q971k6198L5631
$$ 51480 -79240 -48317 -73538 -22572 2242 98611 53834 2140 -13243 -4272 -30470 5161
1021E161M3079n8900P5594k3297K9538r4142Q8033j0122j5508n4579k2596P2679
$$ 5161 48240 -10660 64934 41637 71175 -22967 65066 54944 39436 -15143 -37739 34940
1009C4940q9871J7359J7299M4687l3881N016K7257M1439n4430J4421R338k6610
$$ 34940 -54931 -37572 -20273 24414 -9467 -4451 22806 64245 9815 24236 33574 6964
997F964J4054J9556K0955p5908N5517l2658r4k7789M357M161P127n3998Q9673
$$ 6964 21018 40574 61529 -14379 41138 8480 8386 -19403 -15046 -10885 -3758 -57756 31917
984C1917k8975L3716l2126k0994K0000Q1168n4422p6602q0036Q2257P6753r488
$$ 31917 2942 36658 4532 -16462 3538 84706 30284 -46318 -126354 -44097 32656 23168
972B3168L609j2304P217q5176N7153k823K6938j20295J20475L56K9018n812q1581
$$ 23168 26777 14473 21690 -63486 -6333 -9156 17782 -102513 17962 18318 47336 41524 -40057
959d0057j4036Q2077J3782m5697p447P315J6079o05m1040K225O2185l6743j7670
$$ -40057 -54093 27984 41766 -3931 -11378 -4063 12016 11411 -29629 -27404 34781 -1962 -19632
946a9632k8090Q303L9791p2009N0211N9124j0810L8687p5413j5788M545Q1655
$$ -19632 -47722 -39419 372 -71637 -21426 37698 26888 65575 -9838 -25626 -21081 60574
934F0574M499m8570M891J6902N735q1526L2880K5656k1949n2205J8600P295N0223
$$ 60574 65073 16503 21394 38296 44031 -37495 -4615 21041 -908 -53113 -34513 -27218 23005
921B3005K1751m4251j006J8261J2621r95m1352m884J3859J7251K0925K7086K9958
$$ 23005 44756 505 -501 17760 30381 29386 -11966 -16850 -2991 14260 35185 62271 92229
908I2229j3615j9461q3520J1173L2194n734J726J7966N0172l7940n9798L7712
$$ 92229 78614 59153 -24367 -13194 19000 13266 14992 32958 83130 45190 -14608 23104
896B3104K9023J2416k4750k2711N6985l7330k9052L305o2544J9557L6096P4117
$$ 23104 52127 64543 39793 17082 74067 36737 7685 10990 -51554 -31997 4099 78216
884G8216q3409L6578L6108N5603r1501m4334J8183o2018L4116O9077m6443j6034
$$ 78216 -5193 31385 67493 123096 31595 -12739 5444 -56574 -22458 46619 176 -15858
872a5858L6917K963N6290l9466J2984k7879r204o533l0474N4730j0592l4341N1325
$$ -15858 21059 24022 80312 40846 53830 25951 16747 10214 -20260 34470 23878 -10463 40862
859D0862l4431L4621j8489k9367J5039M5557j7594M3020K3323j23261L6937O9560
$$ 40862 6431 41052 22563 -6804 8235 53792 36198 79218 102541 -20720 16217 85777
847H5777l0539n553K3035j5417m3225K5087o820J122K0293p5431P2404q0512Q3065
$$ 85777 55238 49685 72720 57303 14078 39165 32345 33467 53760 -21671 50733 -29779 53286
834E3286N3884K5193q7301l2929J4760m2387K6196k5335N5067J7098J4884o9567
$$ 53286 107170 132363 45062 12133 26893 -15494 10702 -14633 40434 57532 72416 2849
822B849J8909N3141m0799k9995J5357j2030K750L2676l3928N8634q5872k1312
$$ 2849 21758 74899 34100 4105 19462 7432 10182 42858 8930 67564 -18308 -39620
810c9620N1165k192n1517J3798q517N8580M3015o4749L7866j3053K7411m7822
$$ -39620 11545 9353 -42164 -28366 -36883 21697 64712 -37 37829 24776 52187 4365
798D365o306J0369K7818m1254O9093n0848j01178Q0552k856p707o3150L4379M5505
$$ 4365 -1941 8428 36246 -5008 64085 13237 -87941 -7389 -10245 -17952 -81102 -46723 -1218
785a218l2272M5584K6449p6146K4424L2573l6391M8388k0514M6828N1218j4759
$$ -1218 -33490 12094 38543 -37603 -13179 19394 -16997 31391 10877 57705 108923 94164
773I4164k4501l1308j9740l7972p5693N4395R2815K0963m8597q340O6739m4419
$$ 94164 69663 38355 18615 -19357 -95050 -40655 52160 73123 24526 16186 82925 38506
761C8506k6330L4341j589j3286Q909N5078m5742K6925m9092p0482P6197M1164
$$ 38506 12176 46517 44928 31642 40551 95629 49887 76812 27720 -42762 33435 74599
749G4599k8015m5793K4365k9764M5881O432j8099O36n5970P0074J7679K2066r5195
$$ 74599 46584 791 25156 -4608 41273 47705 29606 30242 -25728 44346 62025 84091 -11104
736a1104O7547J9391P944k1480M9271K9719m1511p817l4887k4232L8045M928j36995
$$ -11104 56443 75834 83778 62298 111569 141288 99777 91960 57073 32841 70886 75814 -61181
723f1181O344Q7000P7768j6410m0864L4768j12220N8730K3511j088p5548n8074
$$ -61181 -54837 32163 109931 93521 52657 87425 -24795 33935 57446 56358 -19190 -77264
711g7264Q1569M4160N8750k4456n7173p742J8726J7970K5136k8941J4242Q306
$$ -77264 4305 48465 107215 82759 25586 17844 36570 54540 79676 50735 64977 73283
699G3283m6218m770K2440Q0088l5890m06L2484j11217j5679L7423L478m3501J4157
$$ 73283 27065 22295 44735 124823 88933 88527 121011 9794 -5885 31538 35016 -8485 5672
686E672J1026N9569q4027N6614p4069o660K9625j5779O393j2162J00068j560O186
$$ 5672 16698 76267 -7760 48854 -25215 -31875 -2250 -18029 -11636 -23798 76270 74710 80896
673H0896J032Q31o3532K1386K0323K564k3903q2971K1669L7608m3582K1349Q3780
$$ 80896 81928 82759 19227 40613 60936 63500 39597 -43374 -21705 15903 -27679 -6330 77450
660G7450q2177n9005Q8349K0058M539M8379m0067k072m563N6901k5549r0466K6045
$$ 77450 -4727 -63732 24617 44675 49214 97593 57526 55454 50891 107792 82243 -8223 17822
647A7822R6763p9887k1520L0369m6803j5212L7315L1924N8883l97o9239n6157
$$ 17822 114585 34698 13178 43547 -3256 -18468 18847 50771 109654 109257 40018 -16139
635a6139M6765P383j2058K5967m1749m9137J28858J1654j3164J5130m0787n8062
$$ -16139 30626 38009 25951 51918 10169 -38968 89890 101544 88380 103510 62723 4661
623D661l3777L1866P3902K9126r6033j7388l0401N4190M7034n5407O4895m3323
$$ 4661 -29116 2750 76652 105778 9745 -7643 -38044 16146 63180 7773 72668 29345
611B9345K5329l3880m5113O4916L337j2961j3927M2645M3326j9504p6734N2667
$$ 29345 54674 20794 -24319 40597 43934 30973 17046 59691 103017 83513 6779 59446
599E9446L9304k2312p5263l586L3515n9456O1259L8770m8095M0349j3157n309
$$ 59446 98750 76438 1175 -2411 31104 -28352 32907 71677 23582 63931 50774 45465
587D5465O9466n1209L607J6713l1997o3765O7298j5619k6725q708j08361J01764
$$ 45465 114931 63722 67329 84042 52045 -11720 55578 39959 13234 4526 -103835 -2071
575b071N5163m6294j3041L2374o6416N9347L1141j1002J5123k8559O701P77M3729
$$ -2071 53092 6798 -6243 26131 -40285 19062 50203 39201 54324 25765 32466 33243 76972
562G6972m5331j1780L6896L57L0705R5059Q043l6685n7430l8141P997k6471K2270
$$ 76972 31641 19861 56757 57114 87819 182878 190921 154236 96806 58665 66662 40191 62461
549F2461J379k4894M5822p7636l3425O0147n2547J6690K4847K6641j3063K6486
$$ 62461 63840 38946 84768 7132 -26293 33854 -18693 -2003 22844 49485 36422 62908
537F2908Q653j50M080J276l6223m468M9227k4250K173N5503p2566J04q9249M6698
$$ 62908 71561 71411 75491 76767 40544 36076 85303 61053 63226 118729 46163 46267 -42982 3716
523C716j7266n673j5674R2955M1742n8778j8249J12890Q770l7972j5128l0671
$$ 3716 -13550 -19223 -34897 58058 99800 41022 22773 135663 144433 106461 91333 60662
511F0662L3024O983q7048O66L5922J821M5899J5870p7889j6653K6922l5309j2140
$$ 60662 93686 100669 13621 14287 50209 52030 97929 113799 35910 19257 46179 10870 -1270
498a270O2376O5573k6832n1044m8207j1302j3555J6189o213R8195n1071L2891
$$ -1270 61106 126679 99847 48803 596 -10706 -24261 -8072 -14285 83910 32839 65730
486F5730o0178L5110N7487k9703m5615l2875J500n67l9196L5532L8253j7738O2267
$$ 65730 5552 40662 98149 68446 22831 -10044 -8544 -9111 -48307 -12775 25478 7740 70007
473G0007m7128k390M6817M9020p8289k1924M1006K9609M7358n9241q3143j1639
$$ 70007 22879 20489 67306 116326 38037 16113 57119 86728 134086 74845 -8298 -19937
461a9937J6826k3074k428J3048K1483n2396J28756p2456l4960O4969O091p209
$$ -19937 -3111 -26185 -28613 -15565 5918 -46478 82278 9822 -25138 39831 45922 38713
449C8713N6485o8254K3673O4449l9172J0730o0662N0454k8579R546R819N5892
$$ 38713 95198 26944 50617 115066 75894 86624 25962 76416 47837 57383 67202 123094
437A23094p6721O151N1207k1685J1955m3444L2960n9557n390R4065l5245o0845
$$ 123094 46373 52524 103731 82046 94001 50557 83517 23960 18570 112635 77390 16545
425A6545K168O7452l3369k4990K4339O458o3416L1380J34861o2603q688k0594
$$ 16545 18713 86165 52796 27806 52145 58603 -4813 26567 161428 98825 90137 69543
413F9543k8863j5517l7506N0612l0836J9166k2909M4338j9599l963n0486N5992
$$ 69543 40680 25163 -12343 38269 7433 26599 3690 48028 28429 24466 -26020 29972
401B9972l4079k9960Q2037q5193M5016M4613J03167j9018j40154P3986R6335j66037
$$ 29972 -4107 -34067 47970 -37223 7793 52406 155573 136555 -3599 70387 166722 685
389F85M71M2632p0844L8704m5003J4163O9549N1581L0666n8719j004m0990N321
$$ 685 1156 43788 -27056 11648 -33355 -19192 50357 101938 132604 73885 72881 31891 37212
376C7212l175j5731m74N2140k1044l8451k3359Q6695J6634o7434j706J0706K8862
$$ 37212 34037 18306 17832 69972 48928 10477 -12882 73813 90447 23013 21307 32013 60875
363F0875l2861L6835M9553o5123k5044L221J5967n2130O4604K5895M5733q1006
$$ 60875 28014 64849 114402 49279 24235 27456 43423 -8707 55897 81792 127525 46519
351D6519j18633J01267M2056P956J2801r1133L1412K8878l3839n239K0964J5498
$$ 46519 -72114 29153 71209 79165 91966 833 32245 61123 27284 22045 43009 58507
339E8507j8798m4296J6833O0868n1426j2222K7803K2584j20485J9716j5271J4114
$$ 58507 39709 -4587 12246 73114 21688 9466 37269 59853 -60632 -40916 -56187 -42073
327d2073K7736J9815K9222o5144L8170M6508j9298j0811k5043p894J650N1459
$$ -42073 -14337 5478 34700 -30444 7726 54234 34936 24125 -918 -8812 -7162 44297
315D4297L2701n6597K1559K345K3434l726O7856j9726n3296r5506J7227l002K3892
$$ 44297 76998 20401 41960 44305 67739 64013 131869 112143 58847 -36659 -19432 -22434 1458
302A458R0764o7265j2359K9276j3187L8640J6808Q601o4258J7001J0238p635m3214
$$ 1458 92222 24957 12598 41874 28687 67327 84135 92736 28478 45479 55717 48082 4868
289D868J7409N0432l8003P9049q6791M4540l7087K6387L285J27l3061N4702l8920
$$ 4868 22277 72709 34706 113755 26964 71504 34417 60804 64089 64216 31155 85857 46937
276D6937m5883L1990l6779K5045L1229l2101m491l8982J20928N1266j16533j2005
$$ 46937 1054 33044 -3735 21310 52539 20438 15947 -23035 97893 149159 32626 20621
264B0621k7382P061P418j1355m5909Q9888K9957n0159J765L0964P576o5347P2549
$$ 20621 -6761 300 7718 -3637 -49546 40342 70299 20140 21905 52869 60445 -4902 67647
251F7647J1693j8079n7956K8565m7041K4737K1082J5944r9481R8978j9848n370
$$ 67647 79340 61261 3305 31870 -15171 9566 30648 46592 -52889 46089 26241 20871
239B0871K0415L2659K3939o4898L4305o2117J6391O0447l2682m4100L980j9416
$$ 20871 41286 73945 97884 32986 67291 5174 21565 82012 49330 5230 9210 -10206
227a0206j2075l7802R1401M3324Q642m2017j4793l5055N0338n8916Q0918K2334
$$ -10206 -22281 -60083 31318 74642 83284 41267 26474 -8581 41757 -17159 63759 86093
215H6093n2663J1737p361P464J09N4103M080j25599P5124m1398k2394L5685o301
$$ 86093 33430 45167 37806 45270 45379 99482 103562 -22037 53087 11689 -10705 24980 18679
202A8679J28K7785k525q1079N5662p2170N4070M0762n4201N2609l1989l8309N0090
$$ 18679 18807 46592 44067 -37012 18650 -53520 550 41312 -12889 39720 7731 -30578 19512
189A9512R1411K8833k5577r3518n767M9637K58m0213j0478J6465K1120k2263K3489
$$ 19512 110923 139756 114179 20661 14894 64531 64789 24576 14098 30563 51683 29420 52909
176E2909j2354k043K3226j8782n2989J9801J05043k9983p9469K1500J0456l2448
$$ 52909 40555 38512 61738 42956 -10033 9768 114811 84828 5359 26859 37315 4867
164D867P8760M1243p5369k4087K2828l2509j2206L5076j8660M9219L6110o7093
$$ 4867 83627 124870 49501 25414 48242 15733 3527 38603 19943 69162 105272 38179
152C8179m5234l7535L6861P5614j7718o829O2137o0316M8310l324Q236K2487k8957
$$ 38179 -7055 -44590 -7729 67885 50167 43338 105475 45159 93469 90145 98381 120868 91911
139I1911n9852K3518n2896m8417J05295j1652N9881k1082K0034J1295r2851O312
$$ 91911 32059 55577 2681 -45736 59559 47907 107788 86706 106740 118035 25184 31496
127C1496j0657n47M1542j276l3590N137n08J6601L1690R034Q410J650n8199l3607
$$ 31496 20839 20292 61834 60558 26968 32105 31597 48198 79888 88922 97332 98982 40783 7176
113G176L2000O240j3036p024L8205J0157k0582j9345j5486q098m2607N4314J6010
$$ 7176 39176 45416 32380 25356 63561 73718 53136 33791 18305 10207 -32400 21914 37924
100C7924N982K8633l205m0007n5034N8020J8472Q302j30737M0784P9554k2828
$$ 37924 43906 72539 69334 29327 -25707 32313 50785 59087 -71650 -30866 48688 25860
88B5860m7263j0261k5131L7662K4234K8828Q032K1684k7282J8160K9529k7633
$$ 25860 -21403 -31664 -56795 -19133 5101 33929 41961 63645 36363 54523 84052 56419
76E6419N2901k8384m6359M7669p768l1774k4594J9715j4770l2795j3396K239N0819
$$ 56419 109320 80936 34577 82246 74478 42704 18110 37825 23055 -9740 -23136 -20897 29922
63B9922l8432L3621K4811n7247N1538j3690K9659O7774p0239p921k0399L4729
$$ 29922 -8510 25111 49922 -7325 44213 30523 60182 127956 57717 49796 29397 64126
51F4126l3374j1781j1445N597L7608j3404N8912R628j03304J6604M1458L5153
$$ 64126 30752 18971 7526 13123 50731 37327 96239 105867 2563 19167 60625 95778
39I5778o1724l9670N3765j7945L1817K9861m5039j0145P986M948k2415j7046R67
$$ 95778 34054 -5616 48149 30204 62021 91882 46843 36698 44684 49632 27217 10171 11138
26A1138J6482p861L1154J1719L1831q722n9553J3437J0899j3104k8290K0409j2086
$$ 11138 27620 19759 50913 62632 94463 85741 26188 39625 50524 37420 9130 29539 17453
13A7453o0404R1437J4757N000Q933k8884K2809k4727m1835P1984J1410l2304l3812
$$ 17453 -42951 48486 63243 68243 77176 48292 71101 46374 4539 76523 87933 55629 21817
0B1817
$$ 21817
$$ Imaginary data points
##PAGE= N=2
##DATA TABLE= (X++(I..I)), XYDATA
16383a598095l3148n1275P9188O2559k2597K3611P1517k7190j8964N8744K6197
$$ -1598095 -1631243 -1682518 -1603330 -1540771 -1563368 -1539757 -1468240 -1495430 -1514394 -1455650 -1429453
16372a429453p670J7155L6316m681Q0093J2663J4227N070M8309k5987m1958R8423
$$ -1429453 -1437123 -1419968 -1383652 -1388333 -1308240 -1295577 -1281350 -1276280 -1227971 -1253958 -1295916 -1197493
16360a197493J633R105L1635r993M8566j3970K9386P4230k4991j5227R2801m3376
$$ -1197493 -1195860 -1186755 -1155120 -1165113 -1116547 -1130517 -1101131 -1026901 -1051892 -1067119 -974318 -1017694
16348a017694j4708K1157O2187K6352Q926Q781M3389k8587j4051M2298O2099M4074
$$ -1017694 -1032402 -1011245 -949058 -922706 -913780 -904999 -861610 -890197 -904248 -861950 -799851 -755777
16336g55777J5398m55M3255o5215j9333M9616K8763N3383M9119j3495L1639l6686
$$ -755777 -740379 -740834 -697579 -762794 -782127 -732511 -703748 -650365 -601246 -614741 -583102 -619788
16324f19788K6095l4131J5755M4150J2192K6240N1212Q089O0078M5629k5498M4077
$$ -619788 -593693 -627824 -612069 -567919 -555727 -529487 -478275 -470186 -410108 -364479 -389977 -345900
16312c45900l5117J3938K6956J487o785K3307N1573L7747k1857N374o095K0057
$$ -345900 -381017 -367079 -340123 -338636 -345421 -322114 -270541 -232794 -254651 -249277 -255372 -235315
16300b35315M6318M4891n7369N1444M5867Q725K1952k4951r109O4508k6803J5444
$$ -235315 -188997 -144106 -201475 -150031 -104164 -95439 -73487 -98438 -107547 -43039 -69842 -54398
16288e4398N1469N0555m7233K4531j6759k4547L3770J7646L5421J9024j5684N4616
$$ -54398 -2929 47626 393 24924 8165 -16382 17388 35034 70455 89479 73795 128411
16276A28411M6804j9204j8582J9293J8551J1422O4533L7161k501J1978K170n2089
$$ 128411 175215 156011 137429 156722 175273 186695 251228 288389 285888 297866 300036 247947
16264B47947L8401p002J1259N8013r7248Q287M0501Q964O2752j7699K2650L6800
$$ 247947 286348 279346 290605 348618 251370 259657 300158 309122 371874 354175 376825 413625
16252D13625N3804J6985j0359k0481L1728J1227r035J288K7832J2146l04j3038
$$ 413625 467429 484414 474055 453574 485302 496529 487494 488782 516614 528760 528456 515418
16240E15418R2471k9591l9277j0076j6350Q1172k1155P2200J2101R24J6300J374
$$ 515418 607889 578298 539021 528945 512595 593767 572612 644812 656913 657837 674137 675511
16228F75511k2582k6237M8044M5728k7391J3217L1393m0317L8303P6159m2471
$$ 675511 652929 626692 674736 720464 693073 706290 737683 697366 735669 811828 769357
16217G69357J6994m1107J9172J099m7917L0201K0445L8011m9589N3486L2306O2005
$$ 769357 786351 745244 764416 765515 717598 747799 768244 806255 756666 810152 842458 904463
16205I04463J4304p3975M294k9066P6786L798j9889k1151Q2621q5j3452k460J1991
$$ 904463 918767 844792 849086 820020 896806 900604 880715 859564 942185 942100 928648 926188 938179
16192I38179O2390j1562m918n1279M4339O7498j29342L0728L3928m7681R2767
$$ 938179 1000569 989007 984089 932810 977149 1044647 915305 946033 979961 932280 1025047
16181A025047k6376r810k766k3939L1063M4202k016K3345j6473M7343J0100r58
$$ 1025047 998671 988861 986095 962156 993219 1037421 1035405 1058750 1042277 1089620 1099720 1098762
16169A098762k7571l0076m121J4872L6394m254N3178m9312q63L0965J9930l7839
$$ 1098762 1071191 1041115 1036994 1051866 1088260 1084006 1137184 1087872 1087009 1117974 1137904 1100065
16157A100065K6323P4224o5783J8916O5225j567o4985J2292J913K9220o837m5315
$$ 1100065 1126388 1200612 1134829 1153745 1218970 1217403 1152418 1164710 1166623 1195843 1189006 1143691
16145A143691r576M9644J8860p1200J10327J9345L637M7343o5951K0246m9677
$$ 1143691 1134115 1183759 1202619 1131419 1241746 1261091 1264728 1312071 1246120 1266366 1216689
16134A216689k6015L5370M7146j0191K5910j8841m9925K5389k0148l7182j3169
$$ 1216689 1190674 1226044 1273190 1262999 1288909 1270068 1220143 1245532 1225384 1188202 1175033
16123A175033j9352P5246r104N747K7170q117O980K3528l8379L2023J4666K5161
$$ 1175033 1155681 1230927 1221823 1227570 1254740 1246623 1253603 1277131 1238752 1270775 1285441 1310602
16111A310602n2854n264O8552j5130j3227K9296k1859j1578J43293j11784m8124
$$ 1310602 1257748 1252484 1321036 1305906 1292679 1321975 1300116 1288538 1431831 1320047 1271923
16100A271923k0637K4580m4355O8216k563K4210k0677l073j1903l4717M1616M1569
$$ 1271923 1251286 1275866 1231511 1299727 1297164 1321374 1300697 1297624 1285721 1251004 1292620 1334189
16088A334189l4286J0801J4716n3621J9529P6863n1532m9005j8956r272L8099
$$ 1334189 1299903 1310704 1325420 1271799 1291328 1368191 1316659 1267654 1248698 1239426 1277525
16077A277525j968J00188j29293R285Q8148L9938j41770K4364J04495K2018l6991
$$ 1277525 1275557 1375745 1246452 1255737 1343885 1383823 1242053 1266417 1370912 1392930 1355939
16066A355939j7131J08929l1794p6906r279J9611k2793l6546J0037P2272K1291
$$ 1355939 1338808 1447737 1415943 1339037 1329758 1349369 1326576 1290030 1300067 1372339 1393630
16055A393630k8710m0068l1435J0021R505J3281J1833L2743k8786j7791N0189
$$ 1393630 1364920 1324852 1293417 1303438 1312943 1326224 1338057 1370800 1342014 1324223 1374412
16044A374412L33n3936p176M0803m6372l0010Q5512n2479L9623Q5305j08171O2423
$$ 1374412 1374745 1320809 1313633 1354436 1308064 1278054 1363566 1311087 1350710 1436015 1327844 1390267
16032A390267k7262l3750m4473L4168Q2188q6664j2364k3858K0873N4543j7959
$$ 1390267 1363005 1329255 1284782 1318950 1401138 1314474 1302110 1278252 1299125 1353668 1335709
16021A335709p082K0104k9397k582J8272j8729M1002l453j2490K9242L0874m6185
$$ 1335709 1328627 1348731 1319334 1316752 1335024 1316295 1357297 1353844 1341354 1370596 1401470 1355285
16009A355285n012m4276O7434O2627k8539j2487l7323J4389K4947Q056K8899K9221
$$ 1355285 1350273 1305997 1373431 1436058 1407519 1395032 1357709 1372098 1397045 1405101 1434000 1463221
15997A463221p7432m9630J781O417K1747K5433J5462o614n3434L3460L4684M2703
$$ 1463221 1385789 1336159 1337940 1344357 1366104 1391537 1406999 1400385 1346951 1380411 1415095 1457798
15985A457798q1927K123M0069P800m8862m5229K218n454M4992l2770L0924O8128
$$ 1457798 1375871 1377994 1418063 1425863 1377001 1331772 1333990 1328536 1373528 1340758 1371682 1439810
15973A439810J2392m1634o1410K3756k154k6916P8017N571K3787r9923m8076N7195
$$ 1439810 1452202 1410568 1349158 1372914 1370760 1343844 1421861 1427432 1451219 1351296 1303220 1360415
15961A360415m5042m0015N4393M4717n5952L5900j9978O7229n1824O1320q258
$$ 1360415 1315373 1275358 1329751 1374468 1318516 1354416 1334438 1401667 1349843 1411163 1402905
15950A402905m2504o862k1780l0160M6470m5282k9356O3896Q9906j5729O52J3931
$$ 1402905 1360401 1353539 1331759 1301599 1348069 1302787 1273431 1337327 1427233 1411504 1412156 1426087
15938A426087m4241k3370o4322Q0685o929N55L2168K8620l6386O844m6154j6327
$$ 1426087 1381846 1358476 1294154 1374839 1367910 1368465 1400633 1429253 1392867 1399711 1353557 1337230
15926A337230K5164K2628l8061M5426l7621j0907Q143j6432k745k963M0744Q1034
$$ 1337230 1362394 1385022 1346961 1392387 1354766 1343859 1352002 1335570 1332825 1329862 1370606 1451640
15914A451640j3370k0895k3851Q4841l7344m9246l5801j2125J2919m0562K9451
$$ 1451640 1438270 1417375 1393524 1478365 1441021 1391775 1355974 1343849 1356768 1316206 1345657
15903A345657K4073o2302M6097K4501j2284N4752l7830m2590N3576O4662n4760
$$ 1345657 1369730 1307428 1353525 1378026 1365742 1420494 1382664 1340074 1393650 1458312 1403552
15892A403552M1968k2760m932J5789j87108J41384J813j00489L9351O6283n2472
$$ 1403552 1445520 1422760 1417828 1433617 1246509 1387893 1389706 1289217 1328568 1394851 1342379
15881A342379o2465N759Q2213o841R918J00446n2187K7894M2898p0902o651J5372
$$ 1342379 1279914 1285673 1367886 1361045 1370963 1471409 1419222 1447116 1490014 1419112 1412461 1427833
15869A427833l3748n6541P0211K1651q681n4095K0303M4267j4329K7799p4486
$$ 1427833 1394085 1337544 1407755 1429406 1420725 1366630 1386933 1431200 1416871 1444670 1370184
15858A370184M4116Q164L9621J3739k9008n2241k968m3346P8158k0147j458r5070
$$ 1370184 1414300 1422464 1462085 1475824 1446816 1394575 1391607 1348261 1426419 1406272 1404814 1309744
15846A309744M2581J5576M3603m3815n4555N6624Q6882O581K0664l3329m7539
$$ 1309744 1352325 1367901 1411504 1367689 1313134 1369758 1456640 1463221 1483885 1450556 1403017
15835A403017O6984l5608n4176L9724N626o8634J3631K7104r842j7087M8228j625
$$ 1403017 1470001 1434393 1380217 1419941 1425567 1356933 1370564 1397668 1387826 1370739 1418967 1417342
15823A417342N299j3581k9418N4532J763p314m2478j3578m469N3191k0918N87
$$ 1417342 1422641 1409060 1379642 1434174 1435937 1428623 1386145 1372567 1368098 1421289 1400371 1400958
$$ [...]
##END NTUPLES=NMR SPECTRUM
##END=
