##TITLE=1H_EC-3311(1)
 CDCl3
 8 sc, 
 31.7.2024
##JCAMPDX= 6.0         $$ Bruker NMR JCAMP-DX V2.0
##DATA TYPE= NMR SPECTRUM
##DATA CLASS= NTUPLES
##ORIGIN= UXNMR, Bruker Analytische Messtechnik GmbH
##OWNER= root
$$ XWIN-NMR		Version 3.5
$$ Wed Jul 31 13:47:24 2024 Russian Standard Time (UT+4h)  she@DPX200
##.OBSERVE FREQUENCY= 200.1315
##.OBSERVE NUCLEUS= ^1H
##.ACQUISITION MODE= SIMULTANEOUS
##.ACQUISITION SCHEME= undefined
##.AVERAGES= 8
##.DIGITISER RES= 18
##SPECTROMETER/DATA SYSTEM= spect
##.PULSE SEQUENCE= zg30
##.SOLVENT NAME= DMSO
##.SHIFT REFERENCE= (INTERNAL, DMSO, 0, 20.7711)
##AUDIT TRAIL= $$ (NUMBER, WHEN, WHO, WHERE, WHAT)
$$ ##TITLE= Audit trail, XWIN-NMR		Version 3.5
$$ ##JCAMPDX= 5.01
$$ ##ORIGIN= Bruker BioSpin GmbH
$$ ##OWNER= she
$$ F:/spectra/data/she/nmr/H-F/1/pdata/1/auditp.txt
$$ ##AUDIT TRAIL=  $$ (NUMBER, WHEN, WHO, WHERE, WHAT)
(   1,<2024-07-31 13:45:42.39 +0400>,<she>,<DPX200>,
      <created by zg, POWCHK disabled, PULCHK disabled
       configuration hash MD5:
       00 E9 B6 7A A2 85 ED C7 34 08 36 98 17 FE 4E 26
       data hash MD5: 16K
       6E 0A 33 22 18 3C 84 B1 4B 8E E1 FE 8C 29 0F E0>)
(   2,<2024-07-31 13:46:06.70 +0400>,<she>,<DPX200>,
      <Start of raw data processing
       efp BC_mod = 2 LB = 0.24 FT_mod = 6 PKNL = 1 PHC0 = -25642.66 PHC1 = 16.58749 SI = 16K 
       data hash MD5: 16K
       A3 FA 1C 27 CC DD FD 14 C6 F1 DC 91 86 4E D3 49>)
(   3,<2024-07-31 13:46:27.65 +0400>,<she>,<DPX200>,
      <pk PHC0 = 8.369753 PHC1 = -6.4 
       data hash MD5: 16K
       50 D6 7D 64 0F 36 52 03 DB 70 5D C6 C0 AE 47 FB>)
(   4,<2024-07-31 13:46:31.82 +0400>,<she>,<DPX200>,
      <abs ABSG = 5 
       data hash MD5: 16K
       0C 4D 74 B0 B9 2E 54 62 50 AB F0 4D 1E 20 5E DE>)
$$ ##END=
$$ 
$$ hash MD5
$$ D3 70 13 2A B2 7D 78 55 F7 BD CC A2 AE F4 0B 18
##$RELAX= 
##$RELAX= 
##$RELAX= 
##$RELAX= 
##$RELAX= 
##$RELAX= 
$$ Bruker specific parameters
$$ --------------------------
##$DU= <F:/spectra>
##$EXPNO= 1
##$NAME= <H-F>
##$PROCNO= 1
##$TYPE= <nmr>
##$USER= <she>
##$AMP= (0..31)
100 100 100 100 100 100 100 100 100 100 100 100 100 100 100 100 100 100 
100 100 100 100 100 100 100 100 100 100 100 100 100 100 
##$AQSEQ= 0
##$AQ_mod= 1
##$AUNM= <au_zg>
##$AUTOPOS= <>
##$BF1= 200.13
##$BF2= 200.13
##$BF3= 200.13
##$BF4= 200.13
##$BF5= 200.13
##$BF6= 200.13
##$BF7= 200.13
##$BF8= 200.13
##$BYTORDA= 1
##$CFDGTYP= 0
##$CFRGTYP= 5
##$CHEMSTR= <none>
##$CNST= (0..31)
1 1 145 1 1 1 1 1 1 1 1 1 1 1 1 1 1 1 1 1 1 1 1 1 1 1 1 1 1 1 1 1 
##$CPDPRG= <>
##$CPDPRG1= <>
##$CPDPRG2= <>
##$CPDPRG3= <>
##$CPDPRG4= <mlev>
##$CPDPRG5= <mlev>
##$CPDPRG6= <mlev>
##$CPDPRG7= <mlev>
##$CPDPRG8= <mlev>
##$CPDPRGB= <>
##$CPDPRGT= <>
##$D= (0..31)
0 1.2 0 0 0 0 0 0 0 0.06 0 0.03 0 0 0 0 0.0002 0 0 0 0 0 0 0 0 0 0 0 0 
0 0 0 
##$DATE= 1722419141
##$DBL= (0..7)
120 120 120 120 120 120 120 120 
##$DBP= (0..7)
150 150 150 150 150 150 150 150 
##$DBP07= 0
##$DBPNAM0= <>
##$DBPNAM1= <>
##$DBPNAM2= <>
##$DBPNAM3= <>
##$DBPNAM4= <>
$$ [...]
##$SUBNAM3= <"">
##$SUBNAM4= <"">
##$SUBNAM5= <"">
##$SUBNAM6= <"">
##$SUBNAM7= <"">
##$SUBNAM8= <"">
##$SUBNAM9= <"">
##$SW= 24.0689530833862
##$SWIBOX= (0..15)
0 0 2 0 0 0 0 0 0 0 0 0 0 0 0 0 
##$SW_h= 4816.95568400771
##$TD= 16384
##$TD0= 1
##$TE= 0
##$TE2= 300
##$TE3= 300
##$TEG= 300
##$TL= (0..7)
0 120 120 120 120 120 120 120 
##$TP= (0..7)
150 150 150 150 150 150 150 150 
##$TP07= 0
##$TPNAME0= <>
##$TPNAME1= <>
##$TPNAME2= <>
##$TPNAME3= <>
##$TPNAME4= <>
##$TPNAME5= <>
##$TPNAME6= <>
##$TPNAME7= <>
##$TPOAL= (0..7)
0.5 0.5 0.5 0.5 0.5 0.5 0.5 0.5 
##$TPOFFS= (0..7)
0 0 0 0 0 0 0 0 
##$TUNHIN= 0
##$TUNHOUT= 0
##$TUNXOUT= 0
##$USERA1= <user>
##$USERA2= <user>
##$USERA3= <user>
##$USERA4= <user>
##$USERA5= <user>
##$V9= 5
##$VALIST= <valist>
##$VCLIST= <CCCCCCCCCCCCCCC>
##$VD= 0
##$VDLIST= <DDDDDDDDDDDDDDD>
##$VPLIST= <PPPPPPPPPPPPPPP>
##$VTLIST= <TTTTTTTTTTTTTTT>
##$WBST= 1024
##$WBSW= 4
##$XGAIN= (0..3)
0 0 0 0 
##$XL= 0
##$YL= 0
##$YMAX_a= 374787
##$YMIN_a= -370490
##$ZGOPTNS= <>
##$ZL1= 120
##$ZL2= 120
##$ZL3= 120
##$ZL4= 120
##$ABSF1= 20.21727
##$ABSF2= -3.851881
##$ABSG= 5
##$ABSL= 3
##$ALPHA= 0
##$AQORDER= 0
##$ASSFAC= 0
##$ASSFACI= 0
##$ASSFACX= 0
##$ASSWID= 0
##$AUNMP= <proc_1d>
##$AZFE= 0.1
##$AZFW= 0.1
##$BCFW= 0
##$BC_mod= 2
##$BYTORDP= 0
##$COROFFS= 0
##$CY= -3
##$DATMOD= 1
##$DC= 0
##$DFILT= <>
##$DTYPP= 0
##$F1P= 0
##$F2P= 0
##$FCOR= 1
##$FTSIZE= 16384
##$FT_mod= 6
##$GAMMA= 0
##$GB= 0
##$INTBC= 1
##$INTSCL= 3.70164e-10
##$ISEN= 128
##$LB= 0.24
##$LEV0= 0
##$LPBIN= 0
##$MAXI= 10000
##$MC2= 0
##$MEAN= 0
##$ME_mod= 0
##$MI= 1.114404
##$NCOEF= 0
##$NC_proc= -6
##$NLEV= 6
##$NOISF1= 3.799351
##$NOISF2= 2.8
##$NSP= 0
##$NTH_PI= 0
##$NZP= 0
##$OFFSET= 20.77111
##$PC= 1
##$PHC0= -25634.29
##$PHC1= 10.18749
##$PH_mod= 1
##$PKNL= yes
##$PPARMOD= 0
##$PSCAL= 0
##$PSIGN= 0
##$REVERSE= no
##$SF= 200.129751560869
##$SI= 16384
##$SIGF1= 3
##$SIGF2= 2
##$SINO= 5.538805
##$SIOLD= 16384
##$SREGLST= <1H.CDCl3>
##$SSB= 0
##$STSI= 16384
##$STSR= 0
##$SW_p= 4816.95568400771
##$SYMM= 0
##$S_DEV= 0
##$TDeff= 16384
##$TDoff= 0
##$TI= <>
##$TILT= no
##$TM1= 0
##$TM2= 0
##$TOPLEV= 0
##$USERP1= <user>
##$USERP2= <user>
##$USERP3= <user>
##$USERP4= <user>
##$USERP5= <user>
##$WDW= 1
##$XDIM= 16384
##$YMAX_p= 388357378
##$YMIN_p= -1388533
$$ End of Bruker specific parameters
$$ ---------------------------------
##NTUPLES= NMR SPECTRUM
##VAR_NAME=  FREQUENCY,     SPECTRUM/REAL,   SPECTRUM/IMAG
##SYMBOL=    X,             R,               I
##VAR_TYPE=  INDEPENDENT,   DEPENDENT,       DEPENDENT
##VAR_FORM=  AFFN,          ASDF,            ASDF
##VAR_DIM=   16384,         16384,           16384
##UNITS=     HZ,            ARBITRARY UNITS, ARBITRARY UNITS
##FACTOR=    0.29402158847633, 1,            1
##FIRST=     4156.91719094645, 0,            0
##LAST=      -660.038493061261, 0,           0
##MIN=       -660.038493061261, -1388533,    0
##MAX=       4156.91719094645, 388357378,    0
$$ Real data points
##PAGE= N=1
##DATA TABLE= (X++(R..R)), XYDATA
$$ [...]
5681d1606j29496J19656P9385n6666q0482l6183N0107J08927l8627L9479K8332
5670D2826L1242q0077L0602Q7072r3973j54538N463N4375J52846l3005p5250j9336
5658e1753J20863o4492M3685j6387k8136p2629j64778J68410M7602j20974K3200
5647a15389L1602j1593P9680j09929J23600o0940k6131k7647L054j15396J30787
5636i8302J98410l4836j47846l8799J5958J9587M8848o480l1907L3262m6757K3332
5624f5530M929N8313O5716q0120M8488P0304k20849N4134P4586J38398j26148
5613B2221o197n8876M6186K8596r5087R8598K36434k44660M6562k2837k33527
5602a82587N8679K8386K75681L6122j10463m6715j9195O3663j65183N1546J16653
$$ plain form
5681 -41606 -171102 -51446 27939 -28727 -109209 -145392 -95285 13642 -24985 14494 42826
5670 42826 74068 -6009 24593 111665 17692 -136846 -131383 -77008 75838 42833 -32417 -51753
5658 -51753 69110 4618 48303 31916 3780 -68849 -233627 -65217 -17615 -138589 -115389
5647 -115389 -83787 -95380 -15700 -125629 -2029 -62969 -89100 -116747 -113693 -229089 -98302
5636 -98302 100108 65272 -82574 -121373 -105415 -85828 -36980 -43460 -75367 -42105 -88862 -65530
5624 -65530 -60601 -2288 63428 -16692 31796 102100 -118749 -64615 9971 148369 22221
5613 22221 16024 -42852 3334 31930 -63157 35441 271875 27215 73777 50940 -182587
5602 -182587 -123908 -95522 180159 216281 105818 59103 39908 103571 -61612 -10066 106587
5591A06587p8634n4076j3280j2729N6611K9775j01328k3501J17616n069r958n900
5579F114j16383J67057J39028j9090r1319L0806P5356k11577M5362j90124o328
5568a71098J49123M1701l346j42009J36976N7982k8848n9758L7139N8915k9797
5557D6980K995J43623j21832J9088j07738j11832K2145J03074o7751J7192J1372
5546d2684J15416j3680l0185j45653K7489P7747M110J3858N9642J6572J07261
5535A89893r0765o9505m7740Q0671r7068k972N6071n4929O9523K7749j25873Q0920
5523A5975k719K2159l4265K0366p2703K1659P8752L4288K3718l40320K43558N291
5511A5759K913J27059k3364p0945K7696l3802k7911n786L9216j05308K7010L8419
$$ plain form
5591 106587 27953 -26123 -39403 -52132 4479 34254 -67074 -90575 27041 21972 12014 6114
5579 6114 -110269 56788 195816 176726 85407 116213 191569 -20008 25354 -164770 -171098
5568 -171098 -21975 19726 16380 -125629 11347 69329 40481 -19277 17862 76777 46980
5557 46980 49975 193598 71766 90854 -16884 -128716 -106571 -3497 -71248 -54056 -42684
5546 -42684 72732 59052 28867 -116786 -89297 -11550 -7440 6418 66060 82632 189893
5535 189893 99128 29623 -18117 62554 -34514 -37486 18585 -36344 33179 60928 -64945 15975
5523 15975 13256 35415 1150 21516 -51187 -29528 49224 83512 107230 -233090 10468 15759
5511 15759 18672 145731 122367 51422 79118 45316 17405 11619 50835 -54473 -27463 10956
5499A0956M5334m104O3164k0047M274L2035j15799r0775J55647j0967r279j1594
5487D8845O6401R8471j6416j99759N2845K9384j0793P8370L0011R93M0684R676
5475B28712j56932Q7013j30916j3983K06752n086k20201k2973N8466R2448J04575
5464B27875n2219j48360Q7595M2315Q475O595J7473J60426l5262K5236j13438
5453B26711O4430o8021n830J05147Q151O0980k7861m9114J17427Q3168k0988k7998
5441D66202r1410J38104L7446r4810L4995J03424l5766R0234k8073q7563J7561
5430E50344L1884j7305J3899K1060j21073O7850J0135l1610j57365j36106J46909
5419C78622N2219q1670n9729N9193O0550K6652r3474q7850J29325q9404R7538
$$ plain form
5499 10956 56290 52186 115350 95303 99577 131612 15813 -74962 80685 69718 60439 48845
5487 48845 115246 213717 197301 -2458 50387 79771 68978 147348 177359 178352 219036 228712
5475 228712 71780 158793 27877 13894 220646 215560 -4641 -27614 30852 123300 227875
5464 227875 175656 27296 114891 157206 165681 172276 189749 350175 314913 340149 226711
5453 226711 291141 223120 217290 322437 330588 391568 363707 314593 432020 515188 494200 466202
5441 466202 374792 512896 550342 455532 490527 593951 558185 648419 620346 532783 550344
5430 550344 582228 564923 578822 599882 478809 546659 556794 525184 367819 231713 378622
5419 378622 430841 349171 289442 348635 409185 435837 342363 254513 383838 294434 391972
5408C91972J07962j62597n117j55691l0896k2033J63834K9665J3234p1334N3376
5397C12375Q8056q0217j5587p1990j17866j83104L80873J2737r7725P2493j25207
5386A74838q8987m2332L6318J47337j4753r9491N2308J21889R326m9602k556n8493
5374A85802O3152K6961L5679L1889n7213n0554K2188o2195N226l4070K54245j47761
5362B73349P506n4712Q2005M0347j57375l2976J17298N6659K0794M4354j28984
5351B68265J16575M5099m5287l3779q4128O9402j17372M0853K21448p8972j18140
5340B83964J15454j5456r5911P2891K3529L9420o0936N2085n2164n3397l073k6542
5328B79864J52450j7541R7155Q0889q7627J05801p4301O2994P8018K9706m8040
$$ plain form
5408 391972 499934 337337 332220 176529 145633 123600 287434 317099 330333 258999 312375
5397 312375 400431 320214 304627 232637 114771 -68333 312540 325277 227552 300045 174838
5386 174838 85851 43519 79837 227174 212421 112930 165238 287127 296453 246851 244295 185802
5374 185802 248954 275915 311594 343483 286270 235716 257904 195709 200935 166865 421110 273349
5362 273349 280855 226143 308148 348495 191120 158144 275442 332101 352895 397249 268265
5351 268265 384840 429939 384652 350873 266745 336147 218775 259628 481076 402104 283964
5340 283964 399418 383962 288051 360942 384471 423891 362955 415040 362876 309479 306406 279864
5328 279864 432314 414773 511928 592817 505190 610991 536690 599684 677702 707408 659368
5317F59368j77J36778N8913l8851L1905q8076N689p2975J79686r9339r4087k493
5305F76341r4163N9613N1367J7108J11292o3956K3862p3390J21595N1797L8998
5294I20464O2358J99637J60674j23122p070j07124k48435K0426p9370J19317L7252
5283I55007q8726p562n3271j0782o0291K6650Q5905j1912m2375J51887k11299
5272G33231N7704J04051l2068j52932J4501p7610M7125M2583q6914l3122J14512
5261G31061o7323j51979J29321N5724l1780j32531K2692R4251N5403r5170J87614
5250G97283K0842l8750n8064o1703K8040O7493J09257k2557N6080p4221N8435
5239H82135j01311N4667n6869Q2883K96528K06110m3717j64875l2281R665p8712
$$ plain form
5317 659368 659191 795969 854882 816031 847936 759860 765549 692574 872260 772921 678834 676341
5305 676341 582178 641791 693158 710266 821558 757602 781464 708074 829669 881466 920464
5294 920464 982822 1182459 1343133 1220011 1212941 1105817 857382 877808 798438 917755 955007
5283 955007 866281 858719 805448 794666 734375 761025 846930 835018 792643 944530 733231
5272 733231 790935 894986 862918 709986 724487 646877 694002 736585 649671 616549 731061
5261 731061 663738 511759 641080 696804 665024 532493 555185 649436 704839 609669 797283
5250 797283 818125 779375 721311 659608 687648 755141 864398 841841 897921 823700 882135
5239 882135 780824 835491 778622 861505 1158033 1364143 1320426 1155551 1123270 1132935 1054223
5228A054223n6704J92852q290O8417M0610j02250O8842R7094L7056M0318Q129
5217A440297j53613l6680J01291M9320n3741o8923q1035J9943p6442J8627l9670
5206A119374Q8740Q1525r004J14092L0667j61900o1675p4389j82206J03643l1569
5195A017298n8735L2283M4067Q6470l5057p369J7076j1591m3321Q6218J49449
5184A276788O2529J27430l7831j31313p2942l889Q5820p7126L5400J22844L3302
5173A421012K51882K33839l23948j10026j2095J12220l0700J95677J81380j17408
5163A801833J17490N3026J31774O9979P0588J51527J5992M9442J42760J67274
5153B771685m3519O6331J10077l824J71172O7369P5282K50296J95470L4248O5507
$$ plain form
5228 1054223 997519 1190371 1182081 1250498 1291108 1188858 1257700 1354794 1391850 1432168 1440297
5217 1440297 1286684 1250004 1351295 1400615 1346874 1277951 1196916 1216859 1140417 1159044 1119374
5206 1119374 1208114 1289639 1280635 1394727 1425394 1263494 1201819 1127430 945224 1048867 1017298
5195 1017298 958563 990846 1034913 1121383 1086326 1078957 1096033 1084442 1041121 1127339 1276788
5184 1276788 1339317 1466747 1428916 1297603 1224661 1220772 1306592 1229466 1264866 1387710 1421012
5173 1421012 1672894 1906733 1582785 1472759 1460664 1572884 1542184 1737861 1919241 1801833
5163 1801833 1919323 1972349 2104123 2174102 2244690 2396217 2412209 2461651 2604411 2771685
5153 2771685 2728166 2794497 2904574 2900750 3071922 3139291 3214573 3464869 3660339 3694587 3760094
5142C760094J54620O8977J54754K93660K05349J01612J22103K52454J19671L14180
5132E547474R4963L50674K02166L73984M31240N06449L99123L73696Q49520P13626
5122I842915M96870O15897Q24891P57287J025913J247289J375059J767415J947468
5113A9901004K478431K807577K554535J382655O6876r82600j388801j139141j004255
5104B4676281l33819J2124N1429M48585M64288Q80259J167459J368729J980669
5095C0716004K534700L069490L821105M879484N514292M668213K092616j856175
5087E5439729m663026n183155m410367l301165k518825j789929j434400j233861
5079C0905001j061514r08916m73928l16542j53216K19801Q47125J557797K106673
$$ plain form
5142 3760094 3914714 3983691 4138445 4432105 4637454 4739066 4861169 5113623 5233294 5547474
5132 5547474 5642437 5993111 6195277 6569261 7000501 7506950 7906073 8279769 9129289 9842915
5122 9842915 10339785 10955682 11780573 12537860 13563773 14811062 16186121 17953536 19901004
5113 19901004 22379435 25187012 27741547 29124202 29191078 28208478 26819677 25680536 24676281
5104 24676281 24342462 24354586 24406015 24854600 25318888 26199147 27366606 28735335 30716004
5095 30716004 33250704 36320194 40141299 45020783 50535075 55203288 57295904 55439729
5087 55439729 50776703 45593548 41183181 37882016 35363191 33573262 32138862 30905001
5079 30905001 29843487 28934571 28460643 28144101 27990885 28210686 29057811 30615608 32722281
5070C2722281J996189J169538l98036k172517l131737l027754k458891j980429
5062B2718644j831291j482761j223228j126585j246127j283901j056124j043201
5054A2425426q29853p70221o06425n46694n71157n39642l79874n78058l67753
5045G235749k94058k06311l36388k03827k48518k57932j06544r2361K4455k5397
5035E488868J08069O0170J9519R4802J35863M4849l00796k00791m04061k95478
5025D751014j83150k73039k47714K0936m6703l3451o6090j96372q2557Q1515L4511
5014C758900J98896O120k3031R370o72j16368k65743n7657j77608r4553J4005
5003C251659m8367M0181q4796M8640J63528j34781j48961j58635j55531o0822
$$ plain form
5070 32722281 34718470 35888008 35489972 33317455 30185718 27157964 24699073 22718644
5062 22718644 20887353 19404592 18181364 17054779 15808652 14524751 13468627 12425426
5054 12425426 11595573 10825352 10218927 9672233 9101076 8561434 8181560 7603502 7235749
5045 7235749 6941691 6735380 6398992 6195165 5946647 5688715 5582171 5489810 5514265 5488868
5035 5488868 5596937 5657107 5676626 5771428 5907291 5952140 5651344 5450553 5046492 4751014
5025 4751014 4567864 4294825 4047111 4068047 4021344 3987893 3921803 3725431 3642874 3724389 3758900
5014 3758900 3957796 3963916 3940885 3950255 3949583 3833215 3567472 3509815 3332207 3237654 3251659
5003 3251659 3203292 3243473 3158677 3207317 3370845 3236064 3087103 2928468 2772937 2712115
4993B712115r7707r5460p2052l2410j79653p616M7662M770Q7794o4602n5601m767
4981B242473J55330J78913J46200J48636j71855k99421k12540q2236j84713j38679
4971A782108n608Q234J52685k2579k40909p1306K58198j66544Q0649J1493Q1818
4960A868239M5576K26655o4136n1729Q0918j95277M8088k37891j72975K9339r5208
4949A481599r620J5918j23733j72503k1438R8070K27853J7367k1322R1695m259
4938A579627m738Q4021J12627m4916k19457j6989l3359m3746M528j6011R7602
4927A499189J16929m7183j80152j17225K39090j3020j42582N6902M5837R3096
4917A550881J23393o2221j11050l4084J59771P3646n0073K1254P7932J22700j47392
$$ plain form
4993 2712115 2614408 2518948 2446896 2414486 2234833 2227217 2274879 2279649 2367443 2302841 2247240 2242473
4981 2242473 2397803 2576716 2722916 2871552 2699697 2400276 2187736 2105500 1920787 1782108
4971 1782108 1776500 1784734 1937419 1914840 1673931 1602625 1860823 1694279 1774928 1786421 1868239
4960 1868239 1913815 2140470 2076334 2024605 2105523 1910246 1958334 1720443 1547468 1576807 1481599
4949 1481599 1471979 1487897 1364164 1191661 1170223 1268293 1496146 1513513 1492191 1583886 1579627
4938 1579627 1574889 1658910 1771537 1726621 1507164 1490175 1456816 1413070 1417598 1401587 1499189
4927 1499189 1616118 1568935 1388783 1271558 1510648 1497628 1355046 1411948 1457785 1550881
4917 1550881 1674274 1612053 1501003 1466919 1626690 1700336 1650263 1671517 1749449 1872149 1724757
4906A724757k3077P0144R7034R6108j00728J704J88287k5308L2811L3739m2542
4895B052929K48956J180j2001J13151J90389n685O4596n6600j13324J71800j57988
4884B497403J32556J55733k883M1581P64Q6026K36174j08708J29919J89982j9098
4873C339449O9222K9820P4470J86846M037r9594J03678o7991j18540p3208P5134
4862C523323J71878j28452K7548m8301O7382P6355o5636R5824k3646J54921n1852
4851C799344r0193J28990J49645n7219R8626r7543k52939O4609Q6763n2556J16133
4840C893660N2668M8129j2721j183O1168J9855R7827k4962J55971Q140O6978J32149
4828D497679K85913K33483K31358K02746J08050J17200J45262J86657L05317J55929
$$ plain form
4906 1724757 1701680 1771824 1868858 1964966 1864238 1865942 2054229 2028921 2061732 2095471 2052929
4895 2052929 2301885 2303065 2291064 2404215 2594604 2588919 2653515 2596915 2483591 2655391 2497403
4884 2497403 2629959 2785692 2782809 2824390 2825154 2911180 3147354 3038646 3168565 3358547 3339449
4873 3339449 3408671 3438491 3512961 3699807 3703844 3604250 3707928 3639937 3521397 3448189 3523323
4862 3523323 3695201 3566749 3594297 3545996 3613378 3689733 3624097 3719921 3696275 3851196 3799344
4851 3799344 3709151 3838141 3987786 3930567 4029193 3931650 3678711 3743320 3830083 3777527 3893660
4840 3893660 3946328 3994457 3981736 3980553 4041721 4061576 4159403 4134441 4290412 4298552 4365530 4497679
4828 4497679 4783592 5017075 5248433 5451179 5559229 5676429 5821691 6008348 6313665 6469594
4818F469594J23162J97598N6789J00823K67027J74723K05696K15478L42817K49095
4808H402802K22937L44694M43963L29368L40520K71900M06020N49690M95091M95663
4798A2302648P21170N10395P19702O11978P88375R16901R73899R76515J059765
4789A9581348J608928J919166K239342K660741L414498L604544K947761J215273
4781C9191601q97869k225624k182173j856690j409979o69077l56201k8798O81319
4772C0246509J017886Q80416R54660J364708J657745K439259L352258M585297
4764D6498738N952315O270204L413485j138565m472324n576583n017572m401979
4756D1527719l629519k498197j836771j075307k88788J60015J20652J41372r5064
$$ plain form
4818 6469594 6592756 6790354 6847143 6947966 7214993 7389716 7595412 7810890 8153707 8402802
4808 8402802 8625739 8970433 9414396 9743764 10084284 10356184 10762204 11311894 11806985 12302648
4798 12302648 13023818 13534213 14253915 14865893 15654268 16571169 17545068 18521583 19581348
4789 19581348 21190276 23109442 25348784 28009525 31424023 35028567 37976328 39191601
4781 39191601 38293732 36068108 33885935 32029245 30619266 29950189 29593988 29565190 30246509
4772 30246509 31264395 32144811 33099471 34464179 36121924 38561183 41913441 46498738
4764 46498738 52451053 58721257 62134742 60996177 56523853 50947270 45929698 41527719
4756 41527719 37898200 35400003 33563232 32487925 32199137 32359152 32479804 32621176 32526112
4747C2526112j97547J81696Q77359J204919J242980Q84555J22530j304770k462705
4738C3075129k795571k544176k398652j768603j400858q81003n54424p13126o47882
4729A9370834o72606o88747p50217p85825o29134l69871n53172k24461j48554
4720A4548247k54255k13706m4095k64619m2293J40700L9346J44622N2845p1766
4710A4035026k19101j48288k97657k94620j24481j30662J14564J52807K30991
4701A3318579J88216K87966K53562K49980L95297K79508L83034L40916O25673
4692A6322731N27236M73646L96162K39738K60963j48180L17987M13811J95480
4683A8999574N24226M58993M01247L94033N91435R11973O94648R91647J019713
$$ plain form
4747 32526112 32328565 32510261 33387620 34592539 35835519 36720074 36842604 35537834 33075129
4738 33075129 30279558 27735382 25336730 23568127 22167269 21286266 20731842 20018716 19370834
4729 19370834 18698228 18009481 17259264 16473439 15844305 15474434 14921262 14696801 14548247
4720 14548247 14293992 14080286 14036191 13771572 13729279 13869979 13909325 14053947 14106792 14035026
4710 14035026 13815925 13667637 13369980 13075360 12950879 12820217 12934781 13087588 13318579
4701 13318579 13506795 13794761 14048323 14298303 14693600 14973108 15356142 15697058 16322731
4692 16322731 16849967 17323613 17719775 17959513 18220476 18072296 18390283 18804094 18999574
4683 18999574 19523800 19982793 20384040 20778073 21369508 22281481 22976129 23967776 24987489
4674B4987489J158682J320451J446371J473456J432820J655736J848216J991984
4666C7315205J947593J986489K204102K356458K699334L193591L397799M181498
4658E9282069M729740N437687N005696M017400K525639O12875n98586j121737
4650G9890783m69440M73954J299504K009487K376380K525496K383359L052981
4642I3542504M083639N777695P815613R675455J1496215J2801868J2658816J1354599
4634A69206404R802511P538406L543459j707020o451984j0308403j2222737j2070426
4626A47330210j1182205j0899369j0243127q848981p268643n576509l976230k568001
4618H6767145j167530p84638k068161m236795n824157o188108n601033n013946
$$ plain form
4674 24987489 26146171 27466622 28912993 30386449 31819269 33475005 35323221 37315205
4666 37315205 39262798 41249287 43453389 45809847 48509181 51702772 55100571 59282069
4658 59282069 64011809 69449496 74455192 78472592 80998231 81611106 81012520 79890783
4650 79890783 79421343 79895297 81194801 83204288 85580668 88106164 90489523 93542504
4642 93542504 97626143 103403838 111219451 120894906 132391121 145192989 157851805 169206404
4634 169206404 179008915 186547321 190090780 188383760 181931776 171623373 159400636 147330210
4626 147330210 136148005 125248636 115005509 106156528 98887885 93311376 89335146 86767145
4618 86767145 85599615 84814977 82746816 78510021 72685864 66497756 60896723 55882777
4610E5882777m289376l719671l329204l117340k720444k440795k042322j920441
4602C2303184j778899j459142j413386j193324j174002j243681r85971j182612
4594B1872167j129588r96339r36198r98420p63887o85805o69977o01798n95201
4585A4494954m63145n70452m55761n11539k90668l88421j71689k44328k17821
4576A1181130k63257k27547j39806l18169k86315j85047j89219k87098j79695
4567I104977k26490m2705K9081k60433j93629L2076J8079L7023K03394K03986
4557H905359L02663M67957M28006N58617O98382k5371n65085p26149r30721n62836
4547H550822n44684l72089l54866k13058l40732j58751O898k10155l7299k42626
$$ plain form
4610 55882777 51593401 47873730 44544526 41427186 38706742 36265947 34223625 32303184
4602 32303184 30524285 29065143 27651757 26458433 25284431 24040750 23054779 21872167
4594 21872167 20742579 19746240 18810042 17811622 17047735 16361930 15691953 15090155 14494954
4585 14494954 14031809 13461357 13005596 12494057 12203389 11814968 11643279 11398951 11181130
4576 11181130 10917873 10690326 10550520 10232351 9946036 9760989 9571770 9284672 9104977
4567 9104977 8878487 8835782 8864863 8604430 8410801 8442877 8460956 8497979 8701373 8905359
4557 8905359 9208022 9675979 10103985 10662602 11360984 11335613 10770528 10044379 9113658 8550822
4547 8550822 8006138 7634049 7279183 7066125 6725393 6566642 6573540 6363385 6326086 6083460
4537F083460n1228j33045j05498j8029n8321J30315j9126R9024O020k09115k3538
4526E700919K07827j24620l06851P2352K3074k80768j56473j62599q601r1822
4516D872438j88378K40419P6298J14769k0360P6138M069l09650m661P954j1847
4505D857189k95187p206n1754l17309P0318K8984q4533j7222m2670j36942J6144
4494D019812j0158K61742J65957J24093M40725M24417M08156M89097P6741j27615
4484F272967n69306n42741m32010l50917j67885l96606j79192j69772p5941r1933
4474C296664K6852p318K9174R5005N5036k8447p037L98917M68341M74999N60790
4463E362976N30008K71251k61400l55633n52215n80912k12800l25346k99385j78908
$$ plain form
4537 6083460 6032232 5899187 5793689 5775660 5717339 5847654 5828528 5927552 5933572 5724457 5700919
4526 5700919 5908746 5784126 5477275 5549627 5572701 5291933 5135460 4972861 4964260 4872438
4516 4872438 4684060 4924479 5000777 5115546 5095186 5171324 5175393 4865743 4861082 4869036 4857189
4505 4857189 4562002 4554796 4503042 4185733 4256051 4285035 4200502 4183280 4140610 4003668 4019812
4494 4019812 4009654 4271396 4437353 4561446 5002171 5426588 5834744 6323841 6400582 6272967
4484 6272967 5703661 5160920 4728910 4377993 4210108 3813502 3634310 3464538 3388597 3296664
4474 3296664 3323516 3316198 3345372 3440377 3495413 3466966 3459929 3858846 4327187 4802186 5362976
4463 5362976 5892984 6164235 5902835 5547202 4994987 4414075 4201275 3875929 3576544 3397636
4453C397636r0559j31493p3365k91273J05919J2028o4342n8700j30271J33334
4443B808914J0558N3422j5700K90540L39340Q3547L7037j20057j69943r9021j90058
4432C028579j42792j0537l4501k51578O8018J00173k09449o9256J64478j11918
4422B531217p5020k1925L0524q2823p0966K09771J0226J44362j16009j45897Q6192
4411B499652k3025K038R296L8251j8414K3648J07389o6167J11882J70849J4757
4400B870156j38079J981p287N0929j45941j19025o5182l0634k960n8399k4420
4389B331139j08414j35490m9699m6189K9099J61644R6729j08513R1147n1976Q8129
4378B297606P5610j22520K00727q7227j00930r9017j59356J5987K5454j24652
$$ plain form
4453 3397636 3307077 3175584 3102219 2810946 2916865 2928893 2864551 2805851 2675580 2808914
4443 2808914 2819472 2872894 2857194 3147734 3487074 3570621 3607658 3487601 3317658 3218637 3028579
4432 3028579 2885787 2875250 2840749 2589171 2657189 2757362 2547913 2478657 2643135 2531217
4422 2531217 2456197 2434272 2464796 2381973 2311007 2520778 2531004 2675366 2559357 2413460 2499652
4411 2499652 2476627 2478665 2487961 2526212 2507798 2531446 2638835 2572668 2684550 2855399 2870156
4400 2870156 2732077 2734058 2726771 2777700 2631759 2512734 2447552 2416918 2413958 2355559 2331139
4389 2331139 2222725 2087235 2037536 1991347 2020446 2182090 2278819 2170306 2261453 2209477 2297606
4378 2297606 2373216 2250696 2451423 2364196 2263266 2164249 2004893 2020880 2046334 1921682
4368A921682J47221r603k34244j25677l1852M2323K09405j12887j43294R458J06574
4357A779106J26718j55228j740J29807J8896m2342j02240O7846J47169M6975j19793
4346A895174L15653l9668l7470J33704p3519L8955J15933K01280J36262K04284
4336B890588L27446J05916J38450N04154L27826k55713n17660k99545k70669k59807
4326B690986k61589j84607k4860J3659r9456l766p52j19584q4520Q3497j42126
4315A866882Q0715o2980j21652J14725k9611M8615j94759j58355J40534j27789
4305A556325p2911J41054p103J03911L9546j08725K8951l9392j485K10771m0159
4294A810783M5163K1918r0942o9716J40267O3924P4307r8019Q9514j06196L697
$$ plain form
4368 1921682 2068903 2059300 1825056 1699379 1667527 1709850 1919255 1806368 1663074 1672532 1779106
4357 1779106 1905824 1750596 1748856 1878663 1897559 1855217 1752977 1820823 1967992 2014967 1895174
4346 1895174 2210827 2171159 2133689 2267393 2193874 2232829 2348762 2550042 2686304 2890588
4336 2890588 3218034 3323950 3462400 3966554 4294380 4038667 3521007 3221462 2950793 2690986
4326 2690986 2429397 2244790 2219930 2233589 2134133 2130367 2129615 2010031 1925511 2009008 1866882
4315 1866882 1947597 1884617 1762965 1877690 1848079 1896694 1701935 1543580 1684114 1556325
4305 1556325 1483414 1624468 1617365 1721276 1760822 1652097 1681048 1641656 1640171 1850942 1810783
4294 1810783 1855946 1877864 1786922 1717206 1857473 1921397 1995704 1897685 1987199 1881003 1884700
4283A884700O1621J86365R9952P8954n4254k6262l8167J69667l854J39983k5842
4272B472863M505Q0979j416P4028p4711K65021k14220Q8286J21086Q5761P9404
4261B981586j4478n235J11892l9424J81849J39894M0849J04887J53252p4221l9112
4250C541739l9397q6247n4954j86728P464K18351k5863R8327k36138L2458j4107
4239C254905m088P3238P4285o4884J5110N7192J49212j9145m6926R1406r3942
4228C486363k49798M856J50817j22775J1704K4798p1396n8229J21427P6854J12565
4217C487186j04610j52397n0832K04659L2851O670K4682j0181J09644M4232o4168
4206C527736J9691J29818l4064K25447P9527P9590j3712K01402M042p9626K09438
$$ plain form
4283 1884700 1946321 2132686 2232638 2311592 2257338 2231076 2192909 2362576 2358722 2498705 2472863
4272 2472863 2477368 2558347 2556931 2630959 2556248 2821269 2607049 2695335 2816421 2902182 2981586
4261 2981586 2967108 2961873 3073765 3034341 3216190 3356084 3396933 3501820 3655072 3580851 3541739
4250 3541739 3502342 3416095 3361141 3174413 3181877 3400228 3374365 3472692 3236554 3269012 3254905
4239 3254905 3250817 3324055 3398340 3333456 3348566 3405758 3554970 3535825 3488899 3580305 3486363
4228 3486363 3236565 3241421 3392238 3269463 3281167 3305965 3234569 3176340 3297767 3374621 3487186
4217 3487186 3382576 3230179 3179347 3384006 3416857 3423527 3448209 3438028 3547672 3591904 3527736
4206 3527736 3547427 3677245 3643181 3868628 3948155 4027745 4014033 4215435 4219477 4139851 4349289
4195D349289J04729N691J2279N4430N1901N1526K21314J34705p5162J23902j942
4184E032662K17382J65894J32612K03948n421L65702J04548K46844L39596M16773
4174G220540L35068M18307K48026M51063R66198R24174J524614K083511J410968
4165A5582469m27140j021845j223373j262576j039917o65742n60537l16369p4828
4156H990142K6047K12426K41964m0391K96746K56162K74178K87671M07545M25546
4146A1378036M60722M21610N06464O81322O98959Q99593Q59731M45793M68683
4137A6820913M65307N96274O38146P13244Q70676P88332J120545J310554J250954
4128B4574945J370845J524409J745275J887781J985419K252827K720929K725602
$$ plain form
4195 4349289 4454018 4459709 4471988 4526418 4578319 4629845 4851159 4985864 4910702 5034604 5032662
4184 5032662 5250044 5415938 5548550 5752498 5747077 6112779 6217327 6464171 6803767 7220540
4174 7220540 7555608 7973915 8221941 8673004 9639202 10563376 12087990 14171501 15582469
4165 15582469 15155329 14133484 12910111 11647535 10607618 9941876 9381339 9064970 8990142
4156 8990142 9016189 9228615 9470579 9430188 9726934 9983096 10257274 10544945 10952490 11378036
4146 11378036 11838758 12260368 12766832 13448154 14147113 15046706 15906437 16352230 16820913
4137 16820913 17286220 17882494 18520640 19233884 20104560 20892892 22013437 23323991 24574945
4128 24574945 25945790 27470199 29215474 31103255 33088674 35341501 38062430 40788032
4120D0788032K995924L279839L239689L739580L869970M012964L297337J364399
4112F6587734m61172j167739j022705q06091j21457N44454J389329J746880K120523
4103F8809756K498688K991918L525590M454505M535950M800910M283824K929068
4095I8830209R63692j749907m374706n729699n592555m909646l745956k929924
4087G0761508k028065j294677o69224j22895N34687J291384K129938K856701L243744
4078G6703101L197339K356734L71678j406569k928835l524872l714205l431417
4070F7622954l167787k952105k605775j936769j539094j165154q72531m91184
4062E2892555Q0584M31757Q18511J144052J388264J196614J045490R57555P11888
$$ plain form
4120 40788032 43783956 47063795 50303484 54043064 57913034 61925998 65223335 66587734
4112 66587734 66126562 64958823 63936118 63130027 63008570 63553024 64942353 66689233 68809756
4103 68809756 71308444 74300362 77825952 82280457 86816407 91617317 95901141 98830209
4095 98830209 99793901 98043994 93669288 87939589 82347034 77437388 73691432 70761508
4087 70761508 68733443 67438766 66769542 66646647 67181334 68472718 70602656 73459357 76703101
4078 76703101 79900440 82257174 82628852 81222283 78293448 74768576 71054371 67622954
4070 67622954 64455167 61503062 58897287 56960518 55421424 54256270 53383739 52892555
4062 52892555 52973139 53404896 54223407 55367459 56755723 57952337 58997827 59955382 60667270
4053F0667270L49244k95805j125120j627010j828051j902715j930732j733865
4045E0573216j824483j776187j222008j069178q18479q59353o48141n46393o33292
4036D1175702p83881p30554j031952j120353j309149j751485j997002j915227
4028C0536099k140867j813203j780574j566164j549688j514201j287464j154848
4020A7729090r63074r59232q77865q14401o84675o81723p23914o40603m04636
4011A0978967n19639o98073l89990l23002l08819k41661k67832l23199k80425
4002G626327R942p4835m9736k12078j90262j77388k42947l49933l22001l01599
3992E715490j94214j56496l7330k08733j25638N113k37499l37445k6624N6201
$$ plain form
4053 60667270 61016514 60720709 59595589 57968579 56140528 54237813 52307081 50573216
4045 50573216 48748733 46972546 45750538 44681360 43862881 43003528 42355387 41808994 41175702
4036 41175702 40391821 39661267 38629315 37508962 36199813 34448328 32451326 30536099
4028 30536099 28395232 26582029 24801455 23235291 21685603 20171402 18883938 17729090
4020 17729090 16766016 15806784 14928919 14114518 13429843 12748120 12024206 11383603 10978967
4011 10978967 10459328 9761255 9371265 9048263 8739444 8497783 8229951 7906752 7626327
4002 7626327 7636269 7561434 7511698 7299620 7109358 6931970 6689023 6339090 6017089 5715490
3992 5715490 5521276 5364780 5327450 5118717 4993079 4998192 4760693 4423248 4396624 4452825
3982D452825l2285r0560k63690q1970K215j84422j81612j18514k10620k26598
3972C064769J3254j2914j39688R0395r3715j14303k2358r3539L0068j28907L7994
3961B631056o220k08708q6110J624q7932j27958l6337K9825k2356j0465l3818
3950B042601R951n6157j49203j8304J7846p771n4184n608M0541r3827j38861J12847
3938A699871j36920J13990N119j28888J61756j6148j29865j11037N394l2771J77224
3927A607725n3400q1742J07484J80688k6946Q200k23721m9866O7219J1623N9005
3916A606269q6993p9668K3151j47232k2152J67882m4014l5343R6881K56141j04257
3905A630665j28407j32388P825o159n325M4751L0675J72590j44368k55508J84114
$$ plain form
3982 4452825 4420540 4329980 4066290 3984320 3986535 3802113 3620501 3501987 3291367 3064769
3972 3064769 3078023 3065109 2925421 3015816 2922101 2807798 2785440 2691901 2721969 2593062 2631056
3961 2631056 2624836 2416128 2330018 2331642 2243710 2115752 2079415 2109240 2086884 2076419 2042601
3950 2042601 2052552 1996395 1847192 1828888 1846734 1838963 1784779 1779171 1819712 1725885 1587024 1699871
3938 1699871 1562951 1676941 1682060 1553172 1714928 1698780 1568915 1457878 1463272 1430501 1607725
3927 1607725 1554325 1472583 1580067 1760755 1733809 1742009 1518288 1468422 1535641 1547264 1606269
3916 1606269 1519276 1439608 1462759 1315527 1293375 1461257 1417243 1381900 1478781 1734922 1630665
3905 1630665 1502258 1369870 1377695 1371536 1366211 1410962 1441637 1614227 1469859 1214351 1398465
3894A398465Q9527k3009P4426p1874p163J30960p5482o8612J56540j01360J35366
3883A637784Q2837q1005j03700K13893j32033o6125l4278k2545o0964Q6314J35492
3872A655670J43367j33960K3767p824j05855K7103L8428O7130k5827M4725k66314
3861A460410k9837P1443J8418n5123N7584K4786L1651K4438R4475k2696n7988
3850A617561R5466j8434r4076l6853Q6065L9388N0190J2438n5626n0981p8405
3839A566733J06470J7114P8991M2140M7229j46412j5603L5760N9656J01316Q3527
3828A976921j7389O640j07672N3160n8953O6815J02305q661r9731J42061j02035
3817A953461N4248K9853Q1233p2771m8555J08035J383O5585j91367Q1543o8033
$$ plain form
3894 1398465 1487992 1464983 1539409 1467535 1460372 1591332 1515850 1447238 1603778 1502418 1637784
3883 1637784 1720621 1639616 1535916 1749809 1617776 1551651 1517373 1494828 1433864 1520178 1655670
3872 1655670 1799037 1665077 1688844 1681020 1575165 1602268 1640696 1707826 1681999 1726724 1460410
3861 1460410 1430573 1502016 1520434 1465311 1522895 1547681 1579332 1603770 1698245 1675549 1617561
3850 1617561 1713027 1694593 1600517 1563664 1649729 1689117 1739307 1751745 1696119 1645138 1566733
3839 1566733 1673203 1690317 1769308 1811448 1858677 1712265 1696662 1732422 1792078 1893394 1976921
3828 1976921 1959532 1966172 1858500 1911660 1852707 1919522 2021827 2013166 1913435 2055496 1953461
3817 1953461 2007709 2037562 2118795 2046024 1997469 2105504 2106887 2172472 1981105 2062648 1994615
3806A994615J10558J943J02126J6432K1664J74199j8414j5350N0044r76O1958
3795B498799M1159j3614j26627m6738J36633O9609Q2055M5821O1284j44119P6933
3784B681195J38156J04113O7963j03565L6512P3087J33152J3253R0142m3798j4394
3773C175816P8969m1672R9188j19576N0035J1964L4247q5023P7425M4146N9893
3762C385412n588n3580J51733J20398j10659N957K42910J08611L6126J26524j09864
3751C897980J96421N7697j56782L6819O8942q6653J73392P0954K0222K2679j6531
3740D285140L16999O1260O1412O5684Q0966K29264J30494N8482K07186J72947
3730E669834K68146O8244L57719K1360M82419L78498L96531L04064N12694M92886
$$ plain form
3806 1994615 2105173 2107116 2209242 2225674 2247338 2421537 2403123 2387773 2437817 2436841 2498799
3795 2498799 2539958 2526344 2399717 2352979 2489612 2559221 2641276 2687097 2748381 2604262 2681195
3784 2681195 2819351 2923464 2991427 2887862 2924374 2997461 3130613 3143866 3234008 3190210 3175816
3773 3175816 3254785 3213113 3312301 3192725 3242760 3254724 3288971 3203948 3281373 3325519 3385412
3762 3385412 3379824 3326244 3477977 3598375 3487716 3493673 3736583 3845194 3881320 4007844 3897980
3751 3897980 4094401 4152098 3995316 4032135 4101077 4014424 4187816 4258770 4278992 4301671 4285140
3740 4285140 4602139 4663399 4724811 4790495 4871461 5100725 5231219 5289701 5496887 5669834
3730 5669834 5937980 6006224 6363943 6385303 6867722 7246220 7642751 7946815 8459509 8952395
3720H952395L27480O9600J99328L39785M61494O55527N43138P06806P51618N56160
3710A3563331N92508N67724L35699O73136Q85244R19727R83073J006606J160172
3701B0687220J009431N14920L64836J39862J01161K78556N80750R49041Q96941
3692B5522718J153649P88204K22895l01296o20938p08449n37381l43800m8472
3683B5127130J06071L39945J48499q3223o04309r83904j178444j211590j139604
3674B0520571p78955p41300n50401j44474l59326n87590q26507r50311j308279
3665A4273428q62784o62352n27062n70999k96890k85515m33682l95947m66582
3656I771615o70052l16326k10115k26760m57286l72822j19481k93260j88162j20196
$$ plain form
3720 8952395 9279875 9349475 9548803 9888588 10350082 11005609 11548747 12255553 13007171 13563331
3710 13563331 14155839 14723563 15059262 15732398 16617642 17537369 18520442 19527048 20687220
3701 20687220 21696651 22211571 22576407 22716269 22817430 23095986 23676736 24625777 25522718
3692 25522718 26676367 27464571 27687466 27386170 26765232 26056783 25519402 25175602 25127130
3683 25127130 25233201 25573146 25721645 25638422 25034113 24050209 22871765 21660175 20520571
3674 20520571 19741616 19000316 18449915 18305441 17946115 17358525 16532018 15581707 14273428
3665 14273428 13410644 12748292 12221230 11650231 11353341 11067826 10634144 10238197 9771615
3656 9771615 9101563 8785237 8575122 8348362 7891076 7518254 7398773 7105513 6917351 6797155
3646F797155k46650j75598j16864J14321k04794L3379O1682j70507j18814l4696
3636E938614M7424r9755n5859j05042k2130J22092K1011o7989J48555R7291n4776
3625E969436q613N0550J2633Q1746J22445M5101P8469M1284P7745J60730J89058
3614F820584k1767J19553l3686L01860K90337L9164R0304L63448J66142K41838
3604H377777M52589L03062K73352M86897O88077K90196N00363N46683K73985L73285
3594A2566266L83082L83126L89288M04468N57982M80803O28235Q10833N12619
3585A7116702O14770Q13002M61867M36694N01812Q00173P60058N95902O55264
3576B2756244O51316O35824O25892N13566O42033M64123P33701J016392J036525
$$ plain form
3646 6797155 6550505 6374907 6258043 6372364 6167570 6200949 6262631 6092124 5973310 5938614
3636 5938614 5986038 5886283 5830424 5725382 5703252 5825344 5846355 5778366 5926921 6024212 5969436
3625 5969436 5960823 6011373 6024006 6105752 6228197 6273298 6351767 6393051 6470796 6631526 6820584
3614 6820584 6798817 6918370 6884684 7186544 7476881 7516045 7606349 7969797 8135939 8377777
3604 8377777 8830366 9133428 9406780 9893677 10581754 10871950 11372313 11918996 12192981 12566266
3594 12566266 12949348 13332474 13721762 14126230 14684212 15165015 15793250 16604083 17116702
3585 17116702 17731472 18544474 19006341 19443035 19944847 20745020 21505078 22100980 22756244
3576 22756244 23407560 24043384 24669276 25182842 25824875 26288998 27022699 28039091 29075616
3567B9075616J232110J305435R93828O99270L82461L81061N43409L41154L87756
3558C5342100N34463M05599L22707N18040O79006K96331J81494K63427M48327
3549C8991494P17253P55825J170914J203075J442536J509088J190127R24762R53093
3540D8858167Q47565R07759O62991O37824M54742K36031K23208J88622K34400
3531E3251309Q7834J93160K28011L84688N58001L88519L55853J7165m06739k61812
3521E4795989l24558l20332l0902K76155n7830j83515k90520j96772k01100l11919
3511E3154696m49837o46682n89530r25571q77290q09917j137892j610073j695790
3502D4412114j437729j091499p77073p66622l30784m99309l86506m98620n49747
$$ plain form
3567 29075616 30307726 31613161 32606989 33306259 33688720 34069781 34613190 34954344 35342100
3558 35342100 35876563 36282162 36604869 37122909 37801915 38098246 38279740 38543167 38991494
3549 38991494 39708747 40464572 41635486 42838561 44281097 45790185 46980312 47905074 48858167
3540 48858167 49705732 50613491 51276482 51914306 52369048 52605079 52828287 53016909 53251309
3531 53251309 53339143 53532303 53760314 54145002 54703003 55091522 55447375 55464540 55057801 54795989
3521 54795989 54471431 54151099 54120197 54396352 54338522 54155007 53864487 53667715 53466615 53154696
3511 53154696 52704859 52058177 51468647 50543076 49665786 48855869 47717977 46107904 44412114
3502 44412114 42974385 41882886 41105813 40339191 40008407 39509098 39122592 38623972 38074225
3493C8074225n55715p31581m51686p15975p05150k06407k47924l76968l32670
3484C3750149o40348j069679j323256j150180q71661p19325p70075o65241n63018
3475B5977366o41513p01525p24328p09617n92396o90014o32916l47415l35552
3466B0602090l49343m89495l83155n21667q57152n32064m30404m97812m53710
3457A6087288n17609k60340j44760j48752r8752m49209l12952l20536k71591k47280
3447A3315507l09989k50812j16752k88808k01412l4728k72689m2068k6858q756
3437A1762635J0279J55858N981j02236J76461K26811Q2596R6751J61393L05608
3427A2882137J15642L3823P9081K38522L28761R0971M18242K28361K23167M24956
$$ plain form
3493 38074225 37518510 36786929 36335243 35619268 34914118 34707711 34459787 34082819 33750149
3484 33750149 33109801 32040122 30716866 29566686 28695025 27975700 27205625 26540384 25977366
3475 25977366 25335853 24634328 23910000 23200383 22607987 21917973 21285057 20937642 20602090
3466 20602090 20252747 19763252 19380097 18858430 18001278 17469214 17038810 16540998 16087288
3457 16087288 15569679 15309339 15164579 15015827 14917075 14467866 14154914 13834378 13562787 13315507
3447 13315507 13005518 12754706 12637954 12349146 12147734 12113006 11840317 11798249 11771391 11762635
3437 11762635 11772914 11928772 11934753 11832517 12008978 12235789 12318385 12415136 12576529 12882137
3427 12882137 12997779 13031602 13110683 13349205 13677966 13768937 14187179 14415540 14638707 15063663
3417A5063663L06019O3145L54221M53531L08034M70361J96211N24507K85121L49499
3407A8374312N37733M62626L46667L77884M40900M35571O37058M55092M41478
3398B2509321L86641M66888N06154M16664J82967N15647L98626K31854L25861
3389B5940623L36468J91491J28211K65998K436J0360k905R0871j61173j36706
3379B6665674j66979k05853k26692k77986l58196m03511k11273l47215n78581
3370B3889388m97133m51187m04154m19087n35173n15787n40816k90483n70794
3361A9664774k91901l92522m88481l20306o07831m81337m51675k64969k24728
3352A6141024l66304m26766k77720l27961j15301k92206l68640m39099k39207
$$ plain form
3417 15063663 15369682 15432827 15787048 16240579 16548613 17018974 17215185 17739692 18024813 18374312
3407 18374312 18912045 19374671 19721338 20099222 20540122 20975693 21612751 22067843 22509321
3398 22509321 22895962 23362850 23869004 24285668 24468635 24984282 25382908 25614762 25940623
3389 25940623 26277091 26468582 26596793 26862791 26865227 26875587 26872682 26963553 26802380 26665674
3379 26665674 26498695 26292842 26066150 25788164 25429968 25026457 24815184 24467969 23889388
3370 23889388 23392255 22941068 22536914 22117827 21582654 21066867 20526051 20235568 19664774
3361 19664774 19372873 18980351 18491870 18171564 17563733 17082396 16630721 16365752 16141024
3352 16141024 15774720 15347954 15070234 14742273 14626972 14334766 13966126 13527027 13287820
3343A3287820j91500q9188l20139o6676j16933j76852j08039l18770j10516o0301
3333A1728906j81194j42738k27407j73621J5369n6302k1850k22032j95299r4071
3323A0429761j59742j59654j43586j13854L6077j84131l6472k51705R197j20123
3313I305768o4280k16719N4220K1153k6758k97136r2238k6514j00911j76548M236
3302H384273J66341k7590l9494p8754M0452r948j10274M7918R7158P1267l5303
3291H506046J7736o7712n1211j8973J38314Q7168O1326R3518o8090J45852R2759
3280H936733L11077J90179J46663J46051J22035J19681L10118K13437L65851L52276
3270A1214101J49120K59347K11622K59055M91224M21626M02702M17968L90915
$$ plain form
3343 13287820 13096320 13007132 12686993 12620317 12503384 12326532 12218493 11899723 11789207 11728906
3333 11728906 11547712 11404974 11177567 11003946 11019315 10963013 10941163 10719131 10523832 10429761
3323 10429761 10270019 10110365 9966779 9852925 9889002 9704871 9668399 9416694 9425891 9305768
3313 9305768 9241488 9024769 9078989 9100142 9073384 8776248 8684010 8657496 8556585 8380037 8384273
3302 8384273 8550614 8523024 8483530 8404776 8445228 8435280 8325006 8372924 8470082 8541349 8506046
3291 8506046 8523782 8456070 8404859 8385886 8524200 8611368 8672694 8766212 8698122 8843974 8936733
3280 8936733 9247810 9437989 9584652 9730703 9852738 9972419 10282537 10495974 10861825 11214101
3270 11214101 11363221 11622568 11834190 12093245 12584469 13006095 13408797 13826765 14217680
3261A4217680K78916O31617O23332N76114N95303O80689Q19665Q31370R70239
3252B0224925Q88637J167951J158260J382874J559058J761646K061471K512697
3244C2717519K881761L137661L653107L901473L783713L441277K965885K109806
3236E8592202J161738J35129l46805n89855n54791l11677L09073M61381L35489
3227E9191884j80806p51024j422961k230605k836204l299162l389105l228561
3219D1853456k625656k117253j739574r57254o64568l77724j80791l43147m55090
3210C2392399n78536p66038o65476p89759q51165m29045l77428j75183k43103
3201B7516666m50526l90021o86932j015127j071001j328874j233265j216351j161590
$$ plain form
3261 14217680 14496596 15128213 15751545 16327659 16922962 17603651 18423316 19254686 20224925
3252 20224925 21113562 22281513 23439773 24822647 26381705 28143351 30204822 32717519
3244 32717519 35599280 38736941 42390048 46291521 50075234 53516511 56482396 58592202
3236 58592202 59753940 59889069 59542264 58952409 58397618 58085941 58395014 58856395 59191884
3227 59191884 59011078 58260054 56837093 54606488 51770284 48471122 45082017 41853456
3219 41853456 39227800 37110547 35370973 34413719 33749151 33371427 33190636 32847489 32392399
3210 32392399 31813863 31047825 30382349 29592590 28741425 28312380 27934952 27759769 27516666
3201 27516666 27066140 26676119 25989187 24974060 23903059 22574185 21340920 20124569 18962979
3192A8962979r52440p92310o50259m82892l65890m52517l60804l84219j05851
3183A4415797o7032j74984J1353j46282p5959J68651K6909J95273J68357J87790
3173A4709873K07602L0922L51729L80131J84193K90428L11145M18383N69430L56144
3163A7809980N08686N16211P29560P76199O70576P25333P41641Q46508Q02442
3154B4127136J068028R78801J148016R00930J132611J230215J461071J392088
3146C3438896J580989J672233J719850J941327K066044K550250K334078K313837
3138D9617504K507005K423624K501717K811613K748828L118738L506804M041900
3130G3277733M785266N616652O560460P786803Q659489R240136R096634Q696049
$$ plain form
3192 18962979 18010539 17218229 16567970 16085078 15719188 15266671 14905867 14521648 14415797
3183 14415797 14348765 14173781 14185134 14038852 13962893 14131544 14158453 14353726 14522083 14709873
3173 14709873 14917475 14948397 15300126 15680257 15864450 16154878 16466023 16884406 17453836 17809980
3163 17809980 18318666 18834877 19564437 20340636 21011212 21736545 22478186 23324694 24127136
3154 24127136 25195164 26173965 27321981 28222911 29355522 30585737 32046808 33438896
3146 33438896 35019885 36692118 38411968 40353295 42419339 44969589 47303667 49617504
3138 49617504 52124509 54548133 57049850 59861463 62610291 65729029 69235833 73277733
3130 73277733 78062999 83679651 90240111 98026914 106686403 115926539 125023173 133719222
3122A33719222P584326N980174M337932K974882K513391K626461L353791M155962
3114A67246141M556875M285726L238453J714284m57862k066776l199469l678950
3106A71638422k993390j956921p10970O30473J835243K290708J951985J276661
3098A73962211M0566q59795j807626k757035l127377l504218l859195m170059
3090A53917472l957979l802448l526571l634624l618737l749279m143615m497788
3082A22986431m817700m947665m886877m666052l957696k794220k187947j148590
3074I3579684J90457k62491k573737l457005k664893k199058l290084l680952
3066G5641921l382389l351155k896007k541029k021499j588010j427395j047064
$$ plain form
3122 133719222 141303548 147283722 151621654 154596536 157109927 159736388 163090179 167246141
3114 167246141 171803016 176088742 179327195 181041479 180583617 178516841 175317372 171638422
3106 171638422 168645032 166688111 165977141 166607614 168442857 170733565 172685550 173962211
3098 173962211 174002777 173142982 171335356 168578321 165450944 161946726 158087531 153917472
3090 153917472 149959493 146157045 142630474 138995850 135377113 131627834 127484219 122986431
3082 122986431 118168731 113221066 108334189 103668137 99710441 96916221 94728274 93579684
3074 93579684 93770141 93507650 90933913 87476908 84812015 82612957 79322873 75641921
3066 75641921 72259532 68908377 66012370 63471341 61449842 59861832 58434437 57387373
3058E7387373r90665j027997q69975l36516K59674J131854j64147k074875k862634
3049E0452092k513043j669640j104421o86651n04886q69995j226727j308496j171190
3040C9397043q97598p07384j89425j111142j636076j846689j467174j217403j051776
3031B9272376q90773m86505k32773k32338q4356K0460K93030K13260M07988M16092
3021B8696461M08322M87716O35334R38880Q88808K718o55687l46583k77789Q3053
3011C0861233K40394M60008Q69189J128750J488201J922840K187082K638961K954552
3002D4751210L039329K898804K703847K853640K900004K422488J939889J579696
2994F5088907J133698O04646R45097O15232L39300L95329k82128o32892j435797
$$ plain form
3058 57387373 56396708 55368711 54498736 54162220 54421894 55553748 55389601 53314726 50452092
3049 50452092 47939049 46269409 45164988 44478337 43973451 43103456 41876729 40568233 39397043
3040 39397043 38499445 37792061 37602636 36491494 34855418 33008729 31541555 30324152 29272376
3031 29272376 28381603 27895098 27662325 27429987 27345631 27366091 27659121 27872381 28280369 28696461
3021 28696461 29104783 29592499 30227833 31166713 32055521 32058239 31402552 31055969 30778180 30861233
3011 30861233 31101627 31561635 32430824 33559574 35047775 36970615 39157697 41796658 44751210
3002 44751210 47790539 50689343 53393190 56246830 59146834 61569322 63509211 65088907
2994 65088907 66222605 66827251 67772348 68387580 68726880 69122209 68840081 68207189 66771392
2985F6771392j867823k551628l137835l590885l610772l684107l527286l513112
2977D1287944l338933k938797k700312k686724k173801k051369j543262j533325
2969B2321421j440401r59361q69235p62463o81504n25752n37303l85792n95242
2960A5564368k95073o04913l36732j86290j77462q6785j42953L1129K667k6015
2950A3741941R4873N3032P2599K1589j50655j87668n2610j78644j88113j50545
2940A3075799n78329m96087l29862l86466j65911m01449m69311m26001l10879
2931I511504l65389j39486j47904l48002j54704l1485j80047k00091M4549k9305
2921G959640r7814M0301o2153p0955R1389K12922P8944Q8693Q6797K65385J54839
$$ plain form
2985 66771392 64903569 62351941 59214106 55623221 52012449 48328342 44801056 41287944
2977 41287944 37949011 35010214 32309902 29623178 27449377 25398008 23854746 22321421
2969 22321421 20881020 19921659 19052424 18289961 17608457 17082705 16545402 16159610 15564368
2960 15564368 15269295 14664382 14327650 14141360 13963898 13877113 13734160 13765289 13767956 13741941
2950 13741941 13836814 13889846 13962445 13984034 13833379 13645711 13593101 13414457 13226344 13075799
2940 13075799 12497470 12001383 11671521 11285055 11119144 10717695 10248384 9822383 9511504
2931 9511504 9146115 9006629 8858725 8510723 8356019 8324534 8144487 7944396 7988945 7959640
2921 7959640 7861826 7902127 7839974 7769019 7860408 8073330 8152274 8240967 8327764 8593149 8747988
2910H747988R4433Q5684N3695J25388L9910l7711k6950M4376j73291o500L2534
2899H979556J38419k32779j14155J01174J8289j4834r08K5995M6986n5487P7033
2888H969289J46367N2170L90248L9238K13982N795P0014J40415L47369J67976
2878A0542863J20802M63273N1489J98406M8538L31366L95536J10116K74210L90409
2868A2927008K36126L29915M57826L94455N01420K78019N45722M39817M59522
2859A6569830O33739N58611O41699P44481R83457R78183J076097J353716J544169
2850B5083982J779232J844387K130105K259762J789455J629335J227917Q88712
2842C8632887P99785O92157R80707J160985J310010J622022J853576K102043K271806
$$ plain form
2910 8747988 8842421 8928105 8981800 9107188 9147098 9109387 9082437 9126813 8953522 8947022 8979556
2899 8979556 9117975 8885196 8771041 8872215 8890504 8875670 8874762 8900757 8947743 8892256 8969289
2888 8969289 9115656 9167826 9558074 9597312 9811294 9817089 9887103 10027518 10374887 10542863
2878 10542863 10663665 11126938 11178427 11376833 11425371 11756737 12152273 12262389 12536599 12927008
2868 12927008 13163134 13493049 13950875 14345330 14846750 15124769 15670491 16110308 16569830
2859 16569830 17203569 17762180 18403879 19148360 20131817 21110000 22186097 23539813 25083982
2850 25083982 26863214 28707601 30837706 33097468 34886923 36516258 37744175 38632887
2842 38632887 39432672 40124829 41105536 42266521 43576531 45198553 47052129 49154172 51425978
2833E1425978K558648K757535L398083L664022M067511M486395N193734N637955
2825H3189861O301221P401013Q306528R728105J1043629J2749323J5295356J8572677
2817A72587713K3893541L1311688M0638547M8529974M6914424K4481491j2657719
2810C75699659m0398710m7808064m2935676l5426551k8927801k3321651j9185123
2803A37696083j6052948j3693112j1206070r198550p970086o663343n830724m857958
2795F2223292m308355l881447l139719k437176j918591j589376j302833j594226
2787D2051569k515011k640587k696333k460198k252648k000071j757566j421935
2779B4307220j290091j457247j086618j017517r46863r63755p16105p16375q29050
$$ plain form
2833 51425978 53984626 56742161 60140244 63804266 67871777 72358172 77551906 83189861
2825 83189861 89491082 96892095 105198623 114926728 125970357 138719680 154015036 172587713
2817 172587713 196481254 227792942 268431489 316961463 363875887 388357378 375699659
2810 375699659 335300949 287492885 244557209 209130658 180202857 156881206 137696083
2803 137696083 121643135 107950023 96743953 87545403 79575317 72911974 67081250 62223292
2795 62223292 57914937 54033490 50893771 48456595 46538004 44948628 43645795 42051569
2787 42051569 39536558 36895971 34199638 31739440 29486792 27486721 25729155 24307220
2779 24307220 23017129 21559882 20473264 19455747 18508884 17545129 16829024 16112649 15283599
2770A5283599o55873n84574n31520o60586n96864m28733m81170m28089n77682
2761A0338508k94409l71416l03872l40271k85226k33603l08460j87111l37869
2752G676271j71949k85009j89127k40347l08075j36323j85996r8427j33199k08779
2742E719040j36443l03965K1038j78754k30344l7468o9050k72926l0345m6970
2732D433813j27716q1355n6777j31641j74254Q2486o2794m8320j25238k20076
2722C488128j3575j67054M4142m9381j22883r2656p8547M4386j50879M4418j79506
2711B766593j92388l7969k5056J42371j01586K5239j68260j54400O1405k13613
2701B102336P2727n6118K2120Q8116j92592k550L3879q5359j3912J5010L1063
$$ plain form
2770 15283599 14627726 14043152 13511632 12851046 12254182 11825449 11344279 10916190 10338508
2761 10338508 10044099 9672683 9368811 9028540 8743314 8509711 8201251 8014140 7676271
2752 7676271 7504322 7219313 7030186 6789839 6481764 6345441 6159445 6061018 5927819 5719040
2742 5719040 5582597 5278632 5299670 5120916 4890572 4853104 4784054 4511128 4480783 4433813
2732 4433813 4306097 4224742 4167965 4036324 3862070 3944556 3881762 3833442 3708204 3488128
2722 3488128 3474553 3307499 3351641 3302260 3179377 3086721 3008174 3052560 2901681 2946099 2766593
2711 2766593 2574205 2536236 2511180 2653551 2551965 2577204 2408944 2254544 2315949 2102336
2701 2102336 2175063 2118945 2141065 2229181 2036589 2034039 2067918 1982559 1968647 1983657 2014720
2690B014720j37601m0207j19583M2442j30588p6691o8659l3142J65941j22304
2680A494328j40987o5283J04494J505n4852k45970m3389N9009j00533j2251j3751
2669I82320j47337r172R7910m589m687K2224n5436K4282L4839J14627j06979n4233
2657H93769m4412j3881L4485N2781m6705l8211n4523J78427j6753M2822N0113
2646A037912P6896r6552l4319J1969k3241m6568J0100j50960p0221K13399J09467
2635A037882j15293r5570M6284N6496j12337j4427j9299k6191L4415p446p8650
2624G05864l0262P6129K7130P9535P7855m7019J30788O1588j15005l3034n2702
2613H80867J15632P1024m8413N6022J19103j29085R3993J89112m5671J30704K77304
$$ plain form
2690 2014720 1877119 1836912 1717329 1759771 1629183 1552492 1483833 1450691 1616632 1494328
2680 1494328 1353341 1288058 1392552 1394057 1339205 1093235 1049846 1108855 1008322 996071 982320
2669 982320 834983 825811 923721 919132 914445 936669 881233 905515 940354 1054981 948002 893769
2657 893769 849357 835476 869961 922742 876037 837826 783303 961730 944977 987799 1037912
2646 1037912 1114808 1018256 983937 995906 972665 926097 936197 785237 715016 928415 1037882
2635 1037882 922589 827019 873303 929799 817462 803035 783736 757545 791960 784514 705864
2624 705864 675602 751731 778861 858396 936251 889232 1020020 1081608 966603 933569 880867
2613 880867 996499 1067523 1019110 1075132 1194235 1065150 1159143 1348255 1302584 1433288 1710592
2602A710592J95046L01493J34142J38475k25011k80229l15938j66333k64451N4086
2592A281872j74788j18809P1760p7531j64439m3151M7907K5408n8467K4607k48204
2581E66165r7646J86893Q950j00069J5567j13573J06812K496o9890j2914j3562
2570D79229j27323J47583j2237k6656l7344q5191L0062j9484j1918m1141Q3190
2559C78770l0645l3136N0083l3115k1997R828O7268o8304j32319n887j4793J46452
2547C12205q4003o6456m53J46096j26279P9573q146n4681m9015q2900Q8874o8762
2535H6053J36928J47371k8000q1665q5320k2213N1107Q8272l1768M1583j41064
2524A61284r0411J7840k6685P8170j5560p1938J9728O0550o9614J34835J742Q7109
$$ plain form
2602 1710592 1905638 2207131 2341273 2479748 2254737 1974508 1658570 1492237 1227786 1281872
2592 1281872 1107084 988275 1060035 982504 818065 774914 822821 848229 789762 814369 566165
2581 566165 468519 655412 664362 564293 579860 466287 573099 575595 505705 492791 479229
2570 479229 351906 499489 487252 460596 423252 338061 368123 348639 336721 295580 378770
2559 378770 348125 314989 365072 331957 309960 319788 387056 318752 186433 180546 165753 312205
2547 312205 228202 161746 161293 307389 181110 260683 252537 197856 148841 65941 154815 86053
2535 86053 222981 370352 342352 260687 175367 153154 204261 292533 260765 302348 161284
2524 161284 70873 88713 62028 140198 124638 52700 72428 132978 63364 198199 199941 287050
2512B87050o3579J17512m9333j52043Q6124L9436p981k46114P0417J45282j09147
2501A17624j15773J9401j4616J02535p7492O7677j23651q477M3996J34020p5331
2490F9913m5702J34045p8128p2549k9427K09581j19129n4318M4594R873J92719
2479B61472k5951q7607K2585l9148j12483r8336J14956N808K216K0478J05172
2468A69162J7957N7981j18097j96457j908K30034j8662J0944P236q3696J2898
2457H7392j52872M777P7635J60188r149n3940L0070J5454l8951L9466N0161n7213
2445A53018M6813Q6261j16243k7258m8369N3096l4387l1731K5712p537L1716l4798
2433I6293k07990K79665l049p4771m2040K2569J8134n3823n276L2428j5220J11370
$$ plain form
2512 287050 223471 340983 291650 139607 225731 265167 257186 11072 81489 226771 117624
2501 117624 1851 21252 6636 109171 31679 99356 -24295 -32772 11224 145244 69913
2490 69913 24211 158256 80128 7579 -21848 187733 68604 14286 58880 68753 261472
2479 261472 235521 147914 170499 131351 18868 -79468 35488 41296 43512 63990 169162
2468 169162 187119 245100 127003 -69454 -71362 158672 140010 150954 158190 74494 87392
2457 87392 -65480 -60703 16932 177120 167971 114031 144101 159555 120604 160070 210231 153018
2445 153018 199831 286092 169849 142591 94222 147318 112931 81200 106912 99375 131091 96293
2433 96293 -111697 167968 164919 90148 48108 70677 88811 34988 29712 62140 46920 158290
2421A58290j44389K4343O8402P8776j52542n0108J39547m8770j53437R5965k3170
2410g093M1617O292n2489Q224J68959j03966q2696M2621K9468l0922N8568K7174
2398A05757j14811K1408K19252J3541k64219R4427o6295m9344R2352J01324j07011
2387D6381J08477j53630P3927K0887l980N2828j02307q5479K05403j781j06352
2376E4374k7857j047J5586K4935r1917L8002j08212K773M4413J00386J27871j12189
2364F7118j07182R4306n2188J2344M9807j051m4081J38832L8477m3249M3678o9299
2352A27512L9618q6565K0472j3904j0930r4182l3283K91846j48483J30885o6408
2341A56578R3852j89398J6042O6707N9365n1096n3993J56887o4923o7635N7005
$$ plain form
2421 158290 13901 38244 106646 185422 32880 -17228 122319 73549 -79888 16077 -7093
2410 -7093 34524 40816 -11673 -3449 165510 61544 -21152 21469 50937 20015 78583 105757
2398 105757 -9054 12354 231606 245147 -19072 75355 9060 -40284 52068 153392 46381
2387 46381 154858 1228 75155 96042 92062 144890 42583 -42896 162507 160726 54374
2376 54374 26517 25470 41056 65991 -25926 12076 -96136 -93363 -48950 51436 179307 67118
2364 67118 -40064 54242 2054 14398 64205 63154 19073 157905 196382 153133 196811 127512
2352 127512 167130 80565 101037 87133 76203 -17979 -51262 240584 92101 222986 156578
2341 156578 250430 61032 77074 143781 203146 152050 98057 254944 190021 122386 179391
2330A79391N1659r2058J32307j11736l6847J74136o6034m6127M6625l4740L5774
2319B32350n0770O8567n0148j26563J20828j26172N777J11188n9348M0034O064
2308A71807n1404k6376K43756j12623J5757J7985J90657o9122q8950j4260J67159
2297D44386J60760j9842n3287j2463Q2598J40611r0249q714M3594k9243J64575
2286H22726J48601k5628M8666J88092L4234K11755M5112K78772J71952j16865
2276A807417J96144j3587m4951N6067N4713Q408J86006M30475P6182J21399J24886
2265C003159R6266L08620K83067L82328L48223L66747L33955M41871O78302N42423
2255F784961M36166N55940Q29959Q70950J309509J929087K507240L517644N006359
$$ plain form
2330 179391 231050 138992 271299 159563 122716 296852 230818 184691 231316 196576 232350
2319 232350 181580 250147 199999 73436 194264 68092 73869 185057 125709 165743 171807
2308 171807 120403 94027 337783 225160 240917 258902 449559 380437 291487 277227 444386
2297 444386 605146 585304 532017 519554 602152 742763 652514 643800 687394 658151 822726
2286 822726 971327 945699 994365 1182457 1216691 1428446 1473558 1752330 1924282 1807417
2276 1807417 2003561 1989974 1945023 2001090 2055803 2064211 2250217 2680692 2756874 2878273 3003159
2265 3003159 3099425 3408045 3691112 4073440 4421663 4788410 5122365 5564236 6242538 6784961
2255 6784961 7221127 7777067 8607026 9477976 10787485 12716572 15223812 18741456 23747815
2246B3747815P782268L845295m102031o331150n158913l468028l207741k297274
2238A0810241j566751j348944r99972p03114n56843n12414n13642n45134l44852
2229C718575l60395m21779l49378j95079j14802l4426j35741k17773k0811k04415
2219A663976n2034k61113J21492j4312k74936n954n1454j04512r2817l0531p1215
2208H26590r3847J41894r6963j10113P8829j45546M3587r7171j93634J39648j61038
2197C32236J3207J59553j03649j2054o124j81472J23977K18760j67173j3384j13379
2186B50498L4626j4981K1492J491l486n3493J02862j47399q2953O209M5267p9942
2174H0191j73778J56444J49886p6575j59968N6715K34559q43l525j34260L6022
$$ plain form
2246 23747815 31530083 35375378 31273347 24942197 19783284 16315256 13107515 10810241
2238 10810241 9243490 7894546 6894574 6191460 5634617 5122203 4608561 4063427 3718575
2229 3718575 3358180 2936401 2587023 2391944 2277142 2242716 2106975 1889202 1868391 1663976
2219 1663976 1611942 1350829 1472321 1458009 1183073 1177119 1125665 1021153 928336 897805 826590
2208 826590 732743 874637 777674 667561 746390 600844 644431 547260 353626 493274 332236
2197 332236 345443 504996 401347 389293 383169 201697 325674 544434 377261 363877 250498
2186 250498 285124 270143 291635 293126 289640 236147 339009 191610 108657 114866 160133 80191
2174 80191 -93587 62857 212743 136168 -23800 32915 267474 266631 263106 128846 164868
2163A64868q1463L6137p5366o302J05386O4439r6944j73654Q0623M847j71462
2152a48891R8947J70275j65439M705J49135j55938R2862P1885m9082p0612l0137
2141c2290j02589N2640j1127J00305q4971M9040L9029j9889P9836j32081r42q859
2129g1898J0271q908n1615P9172j6497l043J41260L3603q1988q9818M6238J13746
2117A00523p0932k765M485j30144J3868R9148K8563q89n6377l1071K5818j10111
2105a29884p3384N1580K14721n1629j25259J36905P0144k35881K802m1247O8386
2094a12746l0214N6872L261L0606J46503j5096k9211m0495o049o7992l3411J27347
2082B9375j29892J09443J40191j77116j53973J17267M8006r2514O0045K1259p7322
$$ plain form
2163 164868 83405 119542 44176 37874 143260 207699 110755 -62899 17724 22571 -148891
2152 -148891 -49944 120331 -45108 -40403 108732 -47206 45656 117541 68459 -2153 -32290
2141 -32290 -134879 -82239 -93366 6939 -78032 -28992 10037 -9852 69984 -62097 -63039 -71898
2129 -71898 -61627 -70535 -122150 -42978 -59475 -62518 78742 112345 30357 -59461 -13223 100523
2117 100523 29591 26826 31311 -98833 -84965 14183 42746 41857 -14520 -45591 -19773 -129884
2105 -129884 -203268 -151688 63033 11404 -113855 23050 93194 -142687 -139885 -181132 -112746
2094 -112746 -142960 -86088 -82827 -52221 94282 79186 49975 9480 3431 -64561 -97972 29375
2082 29375 -100517 8926 149117 -27999 -181972 -64705 -16699 -109213 -49168 -27909 -105231
2071a05231N0251p4808P5078k0299j1283o0n7004J12816J11011K8306r7806q4989
2059g4018m4073k5561Q4658p9125P2537K3086p1452k8511J50421o4922K3109N2907
2047A9056j26996o4352M7618N7080J22539m0390k8580q9128L9181P2242j07117
2036i8847o1119M0342O5569L206j33689J13742p5147K903j3573M6884K3308n8944
2024a45365k4596k1586P4158O7147P4555r6972K6954J21934j43487q1667O0263
2013h8662Q6458J54278j65001M3901q6470n9234J60549q4549K0076j04035M7251
2002g5438n9862o2067K37735L5648j23987L9391o0853J2669Q3414m7201m5650
1991f6201m8730O1005l0582m7897n353j17160q9868J51472J8374J35106j00715
$$ plain form
2071 -105231 -54980 -129788 -54710 -75009 -86292 -86352 -143356 -30540 80471 108777 10971 -74018
2059 -74018 -118091 -143652 -58994 -138119 -65582 -42496 -113948 -142459 7962 -56960 -33851 19056
2047 19056 -107940 -172292 -124674 -67594 54945 14555 -14025 -103153 -63972 8270 -98847
2036 -98847 -159966 -119624 -54055 -50849 -184538 -70796 -145943 -143040 -156613 -109729 -86421 -145365
2024 -145365 -169961 -191547 -117389 -50242 24313 -72659 -45705 76229 -67258 -148925 -88662
2013 -88662 -2204 152074 -12927 30974 -55496 -114730 45819 -38730 -18654 -122689 -75438
2002 -75438 -135300 -197367 40368 76016 -47971 -8580 -69433 -56764 26650 -20551 -66201
1991 -66201 -114931 -53926 -84508 -132405 -137758 -254918 -344786 -193314 -174940 -39834 -140549
1980a40549J901P5779J095m2704n1045p520O6986j11885J6664M6652l4523L4961
1968a44188N2368J06809j35762j15695r2014P5029J89639l5422J45479j53789
1958a07546P9752n3759L5251q3340M8856j09351Q8445M1853R4897R358M1718L3064
1946A19198k63900o9936J05671m6688k8953N6673m2516O7031n9705J48845r2364
1935a06644k4912M7204L1129m9050r3580J15121J07841n3535j93239J52070L2223
1924c5372j6498p8759o5077k7502J17834m7799O1756J6426k1497q5936m0944P0155
1912a53213j20600J04996K22721p3488q5990Q9355l2496j24057L0966L34m59j77589
1900c19520j06770L23217K8620j242Q6856k1927K2861j062q0823N1442L3037q8534
$$ plain form
1980 -140549 -138648 -62869 -61774 -104478 -155523 -163043 -96057 -207942 -191278 -144626 -179149 -144188
1968 -144188 -91820 14989 -120773 -236468 -328482 -253453 -63814 -99236 46243 -107546
1958 -107546 -27794 -81553 -46302 -129642 -80786 -190137 -101692 -59839 35058 44416 86134 119198
1946 119198 -144702 -214638 -108967 -155655 -184608 -127935 -170451 -103420 -163125 -14280 -106644
1935 -106644 -131556 -84352 -53223 -102273 -195853 -80732 27109 -26426 -219665 -67595 -35372
1924 -35372 -51870 -130629 -195706 -223208 -105374 -153173 -91417 -74991 -96488 -182424 -223368 -153213
1912 -153213 -273813 -168817 53904 -19584 -105574 -16219 -48715 -172772 -141806 -141472 -141931 -319520
1900 -319520 -426290 -103073 -74453 -75695 11161 -10766 12095 11033 -69790 -18348 14689 -73845
1888g3845K812R610J59883k54682m7129M0915m01J24498o0167n7160K1627J38756
1876D717J02251k22279L6906j3526j32790L9496K0930r797o3298K78801j24389
1865h2978R0842j45955K620q8511Q2913L9654J15908r4834m5131J03409P8085
1854E6022n6511r7336K7446P5104p3410j87701J60447P980j55928L361J11464
1843a29062P5170M1469m6264m5047O308j1518n4928O1945J9103M0856R8282k25307
1831a68993j2689J04490j127j53502N8837R3350R0697q7033j15625M6926Q4821
1820e9848M1301O6113l6472j26232j56934Q3535J0257K9688M2154K769k5218J882
1808a27005p9231Q679J74773j05833q0382P0290O5672J05425r250m408r7293N0606
$$ plain form
1888 -73845 -71033 -61423 98460 -156222 -203351 -162436 -162837 -38339 -98506 -155666 -134039 4717
1876 4717 106968 -115311 -78405 -91931 -224721 -185225 -164295 -174092 -237390 41411 -82978
1865 -82978 7864 -138091 -135471 -223982 -141069 -101415 14493 -80341 -125472 -22063 56022
1854 56022 -489 -97825 -70379 4725 -68685 -256386 -95939 -87959 -243887 -240526 -129062
1843 -129062 -53892 -12423 -58687 -103734 -97426 -108944 -163872 -101927 -82824 -41968 56314 -168993
1831 -168993 -181682 -77192 -78319 -231821 -172984 -79634 11063 -75970 -191595 -144669 -59848
1820 -59848 -18547 47566 11094 -115138 -272072 -188537 -178280 -148592 -106438 -103669 -128887 -127005
1808 -127005 -206236 -197557 -22784 -128617 -208999 -138709 -73037 32388 23138 18730 -78563 -27957
1796b7957J5239j8382l6805K5701O1799j5209j06289n4947O8179r1864N3986L562
1784a22987L8517N3126m1338J56748r7516r3829r0784K7882l6556j347j9799J52681
1772g5202L7499j5533o3963J3748M5530J5825J39591j79079l1686o1702M3186
1761a31786J01156l1031j81560l9329J27450M3027r1519Q0660p9657J41098K8848
1750c2643n203n0625o1631q6639J41840k8483M7888n4139J99965j65593l0792
1739a26055p1514O2762M1230p336m635p8768K44365j45912R7050K2463j65058
1728a31408o1196J16171J41037j72458Q0695q7615m3653J9366J92956P8216j47262
1717a5151k08757L5437K1433j3373O2816l2385P6654l8915k1105P8049O0201R0732
$$ plain form
1796 -27957 -12718 -31100 -67905 -42204 19595 4386 -101903 -156850 -88671 -180535 -126549 -122987
1784 -122987 -84470 -31344 -72682 84066 -13450 -107279 -198063 -170181 -206737 -208084 -227883 -75202
1772 -75202 -37703 -53236 -117199 -103451 -57921 -42096 97495 -81584 -113270 -174972 -131786
1761 -131786 -30630 -61661 -243221 -282550 -155100 -112073 -203592 -122932 -202589 -61491 -32643
1750 -32643 -37846 -88471 -150102 -236741 -94901 -123384 -75496 -129635 70330 -95263 -126055
1739 -126055 -197569 -134807 -93577 -100913 -105548 -184316 60049 -85863 11187 33650 -131408
1728 -131408 -192604 -76433 64604 -107854 -27159 -114774 -158427 -139061 53895 132111 -15151
1717 -15151 -223908 -188471 -167038 -180411 -117595 -149980 -73326 -112241 -133346 -55297 4904 95636
1705I5636J05658j56899l4217p8335K1064j9742o6478J17432j22881j10227J10947
1694a38042j9519j8190Q59J88182N2837j83042p931K10457m0684j28148N8862
1683b4359n5202J23610J2540m8439j36380N9032o2633N407J10568N4040M8762
1672H6946r6933o7787k0486J7598J34906m0773j05213k334J28453J2161j93502
1661a46964J07885K5687O582r0222o0351j16093J04725J59368r4984K3338J81839
1650A00810j08739j30733P0502P6833N0914j25891j72216Q236R7773J0954j28979
1639b50536M1085J34303l5645m656J57829m0686j80218p7877O7379J23834m9865
1628a15053k4451O5410Q17o5306J7396N286L3772l7070p0589N1219N5140m9751
$$ plain form
1705 95636 201294 44395 10178 -68157 -47093 -66835 -133313 -15881 -138762 -248989 -138042
1694 -138042 -157561 -175751 -174892 13290 66127 -116915 -124846 85611 44927 -83221 -24359
1683 -24359 -79561 44049 56589 8150 -128230 -69198 -131831 -126424 -15856 38184 86946
1672 86946 -9987 -77774 -98260 -80662 54244 13471 -91742 -94076 34377 46538 -146964
1661 -146964 -39079 -13392 -6810 -97032 -157383 -273476 -168751 -9383 -104367 -81029 100810
1650 100810 -7929 -138662 -68160 8673 59587 -66304 -238520 -230284 -132511 -121557 -250536
1639 -250536 -209451 -75148 -110793 -115449 42380 1694 -178524 -256401 -189022 -65188 -115053
1628 -115053 -139504 -74094 -73277 -138583 -121187 -115901 -82129 -119199 -189788 -138569 -83429 -133180
1616a33180n476J18181j45829O0316M0406J23968j5354l7781m5935l0848o7031
1605a38563L5909J5486j75962J09054k5711j2283J51135j0951O7909n5895N518
1594c4354j25885J69780l7620j68961j5335R3055N1937K8098m3091j33683K3025
1583a93034j3755K14922O1132j11n1127o1248O3690N6806m6037p6246m9536k9585
1571a24129R5815j6920K0525M3421m2640n4987k9753J163n859N8853J4120l5011
1559g5402q78J14299o3349k4592j04057J61332l1346j21423R109K1658Q4823J7436
1547a2390n3201k3488o7779J4515Q4021r4066J03781O1934m4045O2405j6375q4094
1535f8782J32061j07936l562O2992j07319K4826m4353J12669M8863p0267M1803
$$ plain form
1616 -133180 -138656 -20475 -166304 -105988 -65582 58386 43032 5251 -40684 -71532 -138563
1605 -138563 -102654 -87168 -263130 -154076 -179787 -192070 -40935 -51886 16023 -39872 -34354
1594 -34354 -160239 9541 -28079 -197040 -212375 -119320 -67383 -39285 -82376 -216059 -193034
1583 -193034 -206789 8133 69265 69154 18027 -43221 20469 77275 31238 -45008 -94544 -124129
1571 -124129 -28314 -45234 -24709 18712 -23928 -78915 -108668 -107505 -113364 -54511 -40391 -75402
1559 -75402 -76280 38019 -25330 -49922 -153979 7353 -23993 -145416 -136307 -114649 -29826 -12390
1547 -12390 -65591 -89079 -156858 -142343 -58322 -152388 -48607 13327 -30718 31687 15312 -68782
1535 -68782 63279 -44657 -48219 14773 -92546 -67720 -112073 596 49459 -20808 20995
1524B0995n1589M1706j42400n2779p377N4054k7014m4175n1365J64513N0243j697
1512d6885J9650p3696k8949K515j4112m4916Q885K03214N7232n694J46622j71743
1500E2123Q2119k3042l5426j18868K6429N5196p4101P599j35792j0769J48213
1489b6319r8864k7087J33437n7680J8191q3625j08051J73544N8713m2422q9338
1478a49501O6610K14707N3612j06960r791L6892n2147n1464j37954O2538O4523
1467h935j80193j750P0076J02337j1988J24174j33868n853j49979Q0190m5078
1456a60867J00757P9656K3918q3091J193L3877p1740l8192l7793Q4487l1685K5419
1444g4061M916J7065N0305K5446l1347p5148O0487j01234P5784J7117j56K4918
$$ plain form
1524 20995 -30594 11112 -131288 -184067 -191444 -137390 -164404 -208579 -259944 -95431 -45188 -46885
1512 -46885 -27235 -100931 -129880 -127365 -141477 -186393 -177508 25706 82938 77244 223866 52123
1500 52123 134242 111200 75774 -43094 -16665 38531 -35570 -27971 -163763 -174532 -26319
1489 -26319 -125183 -152270 -18833 -76513 -58322 -141947 -249998 -76454 -17741 -60163 -149501
1478 -149501 -82891 131816 185428 78468 68677 105569 53422 1958 -135996 -73458 -8935
1467 -8935 -189128 -190878 -120802 -18465 -30453 93721 -40147 -46000 -195979 -115789 -160867
1456 -160867 -60110 19546 43464 -39627 -38434 -4557 -76297 -114489 -152282 -67795 -99480 -74061
1444 -74061 -69145 -52080 -1775 23671 -7676 -82824 -22337 -123571 -47787 -30670 -30826 -5908
1432e908Q0133o5663M103J07539q8963J20139k25654R0365L8861o0738n7514P9840
1420A6540P026Q427n649p2431Q6687j9242m4449R2349j5423o9016M56j3482j70627
1407a98834P8611M6180K2359n1123J9427L9334J03640k790k8136R1772j31468
1396a1028J542L6834j04186M4970k9346J0880n0520J03734M5534l9026l7763o3702
1384i2077J51328j12123j10063J32874Q7364k8904p8151l7180M6066Q3333J5772
1373E8239J91j23125n167P353m19L7847r5371J50131l2617p5704m6921j20328
1361b45891O197O3306J75994j56004J64575q0608M7216R919J3611q597P1346j0730
1349E0334j30849N9035j18464O3609j8062J10899J9458j034p1759j05100J4872
$$ plain form
1432 -5908 74225 8562 12665 120204 31241 151380 -74274 16091 54952 -5786 -63300 16540
1420 16540 23566 31993 26344 -46087 40600 21358 -23091 69258 53835 -15181 -14725 -28207 -198834
1407 -198834 -120223 -74043 -51684 -102807 -83380 -44046 59594 56804 28668 120440 -11028
1396 -11028 -9486 27348 -76838 -31868 -61214 -50334 -100854 2880 48414 9388 -28375 -92077
1384 -92077 59251 -52872 -162935 -30061 57303 28399 -49752 -86932 -40866 42467 58239
1373 58239 58430 -64695 -69862 -62509 -62928 -25081 -120452 29679 -2938 -78642 -125563 -245891
1361 -245891 -239694 -176388 -394 -156398 8177 -72431 -25215 -15296 -1685 -10282 61064 50334
1349 50334 -80515 -21480 -139944 -76335 -94397 16502 35960 34926 -36833 -141933 -127061
1338a27061J52201l8564J05673k46150J12674k5812K4309o626k4564Q2140q8219
1327g9999k4657j6716K60103j39589k01951J34031J06142j05953q474O924p9602
1316a49741Q2331P3939j34837J56723J29405j85856P8173j1948m4489J38401o8913
1305F3188o4002j7399J03361o4528o8537J2685N9062P4496p6577Q3866j65759
1294f0144l7020J46213m9571j2429o7897M1695j29757J73062o772j9960j22326
1283a44906O6584l6165o7398p699K29854K8336j42010R3134l864n2836j7568j122
1271e5660N9335M5244k32910M9443K2890J60165q2701r1181J7548p9093n0885
1260b37805J31146O2898O5972j43401o7240J95351k8446p3181P3151k1636j949
$$ plain form
1338 -127061 25140 -13424 92249 -153901 -41227 -67039 -42730 -49356 -73920 8220 -79999
1327 -79999 -104656 -121372 138731 -858 -202809 -68778 37364 -68589 -77063 -70139 -149741
1316 -149741 -67410 6529 -128308 28415 157820 -28036 50137 38189 -6300 132101 63188
1305 63188 -814 -18213 85148 20620 -47917 -35232 23830 98326 21749 105615 -60144
1294 -60144 -97164 49049 -522 -12951 -80848 -39153 -168910 4152 -2620 -22580 -144906
1283 -144906 -78322 -114487 -181885 -189584 40270 68606 -73404 19730 15866 -36970 -54538 -55660
1271 -55660 3675 48919 -183991 -134548 -111658 48507 -34194 -125375 -107827 -186920 -237805
1260 -237805 -106659 -43761 22211 -121190 -188430 6921 -21525 -94706 -21555 -43191 -45140
1249d5140N8597J6054j13842O8403J7951J68442r7864j70077P6656j4072O9156
1238C4264j42331K1312l3749N3143K7783j40293N4868m6980J14700K497K1793
1227c2993j18944p018K3523N1686K1841N9494m6860m0666J69843k7754n4623P2168
1215F9697q3100R5344o7796p0825K4794l5512Q2475Q4666j13198j4966N3711p0444
1203d5154N4088J2232m0004j8491p1546j85286N0122Q1769M9056J3659M4095q2722
1191a38182J34412J7674M4604j06923j6996J18245p0971O766O2869o2160J18308
1180A07646P5519j63941J40596q6014m6803J0771k5764J59403k16361L397N1796
1169A0245K7860K1723q3563J14699o3186N1546l2288K5061M1326j70573p1470
$$ plain form
1249 -45140 13457 29511 -84331 -15928 2023 170465 72601 -97476 -20820 -34892 34264
1238 34264 -108067 -86755 -120504 -67361 -39578 -179871 -125003 -171983 -57283 -54786 -32993
1227 -32993 -151937 -158955 -135432 -83746 -61905 -2411 -49271 -89937 79906 52152 -2471 69697
1215 69697 -13403 81941 14145 -56680 -31886 -67398 15077 99743 -13455 -28421 25290 -45154
1203 -45154 8934 21166 -18838 -37329 -108875 -294161 -244039 -162270 -113214 -99555 -55460 -138182
1191 -138182 -3770 13904 58508 -48415 -65411 52834 -18137 -11371 51498 -10662 107646
1180 107646 183165 19224 159820 73806 27003 37774 12010 171413 -44948 -41551 10245
1169 10245 38105 59828 -23735 90964 27778 79324 47036 72097 113423 -57150 -128620
1158a28620J2686J99495q9350p60N6017m7007q7966m6259k7984K27280L4665p7791
1146B4406q2123M1157Q2801K5962q5374k6698m4357K2478L3933L1467M2508M1451
1134A07611P65o8009r1813N641P9965p8560o978L9057K7211m1386j9819r75J27299
1121H0009j15920L117J7704o2156p9433P838J99789q8495j04086Q6463O9687n6896
1109d2379r8096J97185j4020J28966o8969L0425n0021j57853J6651N8543m6133
1098d5701j70174J97588r4339k1368K37900r7827o1806P4681L2897k05603j38718
1087b92470K76907j01942R104M5299R2628j8751q3881K3915L8615j08762K8853
1076i0485J74505o5478J5657j4410K4775l6135J03010O4508k66882Q2032j7324
$$ plain form
1158 -128620 -115934 83561 -5789 -6549 49468 2461 -85505 -131764 -159748 67532 102197 24406
1146 24406 -57717 -16560 66241 92203 6829 -19869 -64226 -41748 -7815 23652 66160 107611
1134 107611 108376 40367 -51446 -45805 34160 -44400 -51378 -12321 14890 -26496 -46315 -47290 80009
1121 80009 -35911 -32794 -15090 -77246 -156679 -148841 50948 -37547 -141633 -55170 14517 -42379
1109 -42379 -140475 56710 42690 171656 102687 133112 83091 -74762 -58111 432 -45701
1098 -45701 -215875 -18287 -112626 -133994 103906 6079 -55727 18954 51851 -153752 -292470
1087 -292470 -15563 -117505 -108401 -63102 29526 10775 -73106 -49191 -10576 -119338 -90485
1076 -90485 84020 18542 34199 19789 44564 8429 111439 175947 -90935 -8903 -26227
1065b6227j50917R9744o4769J972P0339J23393p8814r2779J00762J46563o3137
1054F6130j05087k06299L0461R9907Q7519p5723P0815Q6197R836q237l4638j92154
1042a71273N0817J24972j32656L5513j05436P146J34137p464K4288M0679j91121
1031a90398R9008J08476K8470k8787j33840L9596L5638l8739o7788R4608j1356
1020f5112L6911l4415P6607j55123p4803J44960J61570N921o1641P0012m2098
1009F2789j85935K4900P528J3638j3402l7795O1666K0431l022p8223J54375O1574
997H8524K8625k559k1875m5279j12147R4613K0956M9521r0816q4825J35372l7661
985B2449N1314n7686P6677j06100j0560p8625J24661K5193o6644q6283j08123
$$ plain form
1065 -26227 -177144 -77400 -142169 -140197 -69858 53535 -25279 -118058 -17296 129267 66130
1054 66130 -38957 -245256 -214795 -114888 -27369 -103092 -32277 53920 63756 55519 20881 -171273
1042 -171273 -120456 4516 -128140 -92627 -198063 -190917 -56780 -64244 -39956 723 -190398
1031 -190398 -91390 17086 45556 16769 -117071 -77475 -41837 -80576 -148364 -53756 -65112
1020 -65112 -28201 -62616 13991 -141132 -215935 -70975 90595 96516 34875 104887 62789
1009 62789 -123146 -98246 -90718 -77080 -90482 -128277 -66611 -46180 -49202 -127425 26950 88524
997 88524 117149 114590 92715 47436 -64711 29902 50858 100379 9563 -75262 60110 22449
985 22449 73763 16077 92754 -13346 -23906 -102531 22130 47323 -19321 -105604 -213727
974b13727R0812J66564N7085L1804J3067p8938k5814j9384p865l5228J33151j9222
962I2305r8075j20370L7630K15755P3762q6900r6798n2680J31339N5891j45721
951F138O1374J9201M5398j24794P0425o6903j21760J434R8501n6811N8859J2507
939C569Q1883j84971k4196P1872P3669J1230q814J0951m5n7139J46058J13138
927B37205j81983k16800l2843J10894K6682O8012R1839M1143j9389R3543r0113
916A28190n411k27520K297J6063n0546K1940J01553P5078R0461j37061m3624J6950
904a1630J1097J00623k8180o354J3261q9814M5894J38377k00236r2085J37092
893A8045L3856P7071j39600M8156q5652l0434J87159J14981j49902j12291m704
$$ plain form
974 -213727 -122915 43649 100734 132538 145605 66667 40853 21469 13604 -21624 111527 92305
962 92305 -5770 -126140 -88510 127245 201007 114107 17309 -35371 95968 151859 6138
951 6138 67512 86713 132111 7317 77742 10839 -110921 -109487 -10986 -67797 -8938 3569
939 3569 85452 -99519 -123715 -51843 21826 33056 24242 35193 35148 -21991 124067 237205
927 237205 55222 -161578 -194421 -83527 -56845 11167 103006 144149 124760 218303 128190
916 128190 122779 -104741 -102444 -86381 -136927 -114987 -13434 61644 152105 15044 -28580 -11630
904 -11630 -533 100090 71910 65556 78817 -10997 34897 173274 -26962 -119047 18045
893 18045 51901 128972 -10628 37528 -48124 -78558 108601 223582 73680 -38611 -43315
882d3315j06809J51008M6928r5096K9616L0370j08406P2711o385j66701M1064
871a55015K37244M6533j61585j399O2896O1496j90209o8608J26891j3892j8692
860g4340J5274j49811J71725M4290j8917k9806P2426j9820o9582m8193J22168
849A5414J24697p0198O9268j79486J5436Q493o1829P2666P3742N9421o0689q8470
837b1535J28217m9890q7286M8478q0071o427J24143R6193q2726R8308j55535L6998
825D8867P4402j05428Q5337N0603o4818L1005j54277J49497q9816k6068Q7836
814H7140j7134p5372k4808J27253q1197n9068k1791M6908j55715J29829L6821
803g134M4263J80484o4086n2945J23459l0530j42861m0830K14043j10318l1430
$$ plain form
882 -43315 -150124 884 47812 -47284 -17668 12702 -95704 -22993 -29378 -196079 -155015
871 -155015 82229 128762 -32823 -34222 28674 90170 -100039 -168647 -41756 -55648 -74340
860 -74340 -59066 -208877 -37152 7138 -11779 -41585 30841 11021 -58561 -106754 15414
849 15414 140111 69913 139181 -40305 -24869 -16376 -78205 -5539 68203 127624 66935 -21535
837 -21535 106682 56792 -30494 17984 -62087 -68514 55629 151822 69096 167404 11869 48867
825 48867 123269 17841 103178 153781 88963 119968 -34309 115188 25372 -696 87140
814 87140 70006 -5366 -30174 97079 15882 -43186 -64977 -18069 -173784 -43955 -7134
803 -7134 37129 217613 153527 100582 224041 193511 50650 9820 223863 113545 82115
792H2115K1127m2768j4307N8820j78186n0218P2261J6524M8967j4362l529K7970
780B4414J4925J4198p3096M8524q6591K8964J44450j86282J28240K6684j40151
769e5721J38543r57j19823N5930J00438j37323k4311O7313K30650p0292k39162
758e4715p4865M4061n4416J25008R1054r9660L3144k2565J67097P150k38614J00256
746B2935K5590L3369L8514l7465m528n3564j04064R6462R4383j73441m510K4081
734d2238J63193n9677j4565L2223J3503P0941j11587P3672Q1456k07452J53352
723A52821o9344k9976O3162O4705L0393k07435O1297Q686m1870p674J10699j19541
711A5923o0556J24158r8501L6533o4175r4982J87493j9505L1076m3342r164L0578
$$ plain form
792 82115 103242 60474 46167 104987 -73199 -123417 -51156 -34632 14335 -27 -3556 24414
780 24414 39339 53537 -19559 28965 -57626 -28662 115788 -70494 57746 84430 -55721
769 -55721 82822 81865 -37958 17972 118410 -18913 -43224 24089 254739 184447 -54715
758 -54715 -129580 -85519 -139935 -14927 76127 -23533 9611 -12954 154143 161293 -77321 22935
746 22935 48525 81894 120408 82943 78415 24851 -79213 17249 111632 -61809 -66319 -42238
734 -42238 120955 61278 46713 78936 92439 163380 51793 125465 206921 -531 152821
723 152821 83477 53501 116663 181368 211761 4326 65623 74309 32439 24765 135464 15923
711 15923 -44633 79525 -18976 17557 -46618 -141600 45893 26388 57464 14122 4958 35536
699C5536j21026K37870m2816k5876K8094M1960k8810P86O2901j16216l4450J61098
687A99051P8657j10820k06590O1709R2359O9340j3974n2708j00348J57982r484
676A65174j73148n2181J8979J17785K4949j65117P6491R7042j25792M3407R5185
665A22774m7028k01038J54296j2990J32712r6476j5692R4533O3214j05083k1331
654F7891o4092L9170N1041m1021l6289R02P5064J3262p8283K779j9046J33990
642A45368k7216J0932l6970j81958K02651L4169O5924L4790k25803P635O1502
631I1024L8342j02433o4338O6160k4709J5574J05545j49846P1669P0741j4335
620A03394k0149k7500K972j03186J75322J42899n8464O262p7346j77269R1520
$$ plain form
699 35536 -85490 152380 109564 83688 111782 153742 124932 125718 188619 72403 37953 199051
687 199051 277708 166888 -39702 22007 114366 183706 169732 117024 16676 174658 165174
676 165174 -7974 -60155 -41176 76609 101558 -63559 12932 109974 -15818 27589 122774
665 122774 75746 -125292 29004 16014 148726 52250 36558 131091 194305 89222 67891
654 67891 3799 42969 94010 52989 16700 17602 92666 105928 27645 30424 11378 145368
642 145368 118152 129084 92114 -89844 112807 146976 212900 247690 21887 29522 91024
631 91024 129366 26933 -37405 28755 4046 19620 125165 -24681 46988 117729 103394
620 103394 83245 55745 58717 -44469 130853 273752 215288 221550 144204 -33065 58455
609E8455K11298m6061j88292J32119j60224m6946N6228N5160m8684M8692o2067
598I678O8569q971r1043O0935q9175J31787O1652M9455q0992q7585L0265r1767
586c7192O4330k2508r8679O0483R6938n4010Q8590p3337r933l6185J3218Q9637
574H1352j56507O1897J83008j40306R3088O4542O2173j96612O1512L3098L2777
563A80022j41122j98913K09354M1380Q2455n4637m2778O9459n1627L9796J4934
552A48323L7947N4163n511j18081j9534j30181L9176M2297J27043q9693K9492
541A15441j0010o8048j01179j25817K43282r594R7018j76928R0118j5471O8772
530A07584j08693N5651J02372j21234J71727j59871K6045P2358k827l5256o6594
$$ plain form
609 58455 269753 223692 35400 167519 7295 -39651 16577 71737 23053 71745 9678
598 9678 78247 69276 -21767 39168 -50007 81780 143432 192887 111895 24310 54575 -37192
586 -37192 27138 4630 -94049 -33566 63372 9362 97952 24615 14682 -21503 -8285 81352
574 81352 -75155 -13258 169750 29444 122532 187074 249247 52635 114147 147245 180022
563 180022 38900 -160013 49341 90721 173176 118539 75761 145220 93593 133389 148323
552 148323 186270 240433 234922 116841 97307 -32874 6302 48599 175642 85949 115441
541 115441 105431 37383 -63796 -189613 53669 44075 141093 -35835 54283 38812 107584
530 107584 -1109 54542 156914 35680 207407 47536 73581 145939 143112 107856 41262
519D1262o6108J92941o2939k9910k3953r1600K41277P5261J7894k40352M4919
508I8692J7618P9351o905n0135r0289J06473m9297m7595P8497K4448n7257J9671
496A23272r09q286m1766j08105J23269m4275n1856l3715J02434l8188j323J27051
484A47603K8735R8113j85079k9946K3892k14905O5073J81806R42j1508j6038J53338
472B42026q4368l0910M2407p2624j6343p7315p153L4111J9982J45030K0152p9986
460A35009k38919M3467J69395k0909N6690P7111N611j70054j07568K13638o8031
449I5440l3043O2365o927p6669R1817r4828m1552j38090P7606J82395p9878J13848
437A52484j54900K8691J32348j13957J04975J4973j11136o5075L3212O5252N9600
$$ plain form
519 41262 -24846 168095 105156 75246 51293 -40307 200970 276231 294125 53773 98692
508 98692 116310 195661 188756 138621 48332 154805 105508 57913 136410 160858 103601 123272
496 123272 122363 114077 72311 -35794 87475 43200 -8656 -42371 60063 21875 20552 147603
484 147603 176338 274451 89372 59426 83318 -131587 -66514 115292 116234 104726 88688 242026
472 242026 157658 126748 169155 96531 80188 2873 -4280 29831 49813 194843 214995 135009
460 135009 -103910 -60443 108952 88043 144733 221844 227455 57401 -50167 163471 95440
449 95440 62397 124762 117835 41166 132983 38155 -3397 -141487 -63881 118514 38636 152484
437 152484 -2416 26275 158623 44666 149641 164614 53478 -11597 21615 86867 146467
426A46467j17874p9129l1189J32645J10200k44300k6887J30639r54J54194j53298
415B0514J7467K5920Q010P8360j09787P8926p1885o263o650l4945M1775J16771
403A58213j7062R2621r9513J2957Q4134q2176j71528j887J66215Q7158l3394j26853
391F8885n8959K3964o982K8770M6990O7965m6409m2717P932n8286m0171J31393
379A22375p3795J71336k4022j31536j0824R8302j51815J95842P4049K7804j06804
368A90912Q8873k1690j51405l9980J26988L8485q6639j01618l7654R5383j22341
357b0686j2758J19474P7870o8688P9818q9353j5527L3663o8708Q5783q5402j08472
345g2986O1019P8531J40900o7064m4313m1605n6381J08774L9084j57401J10679
$$ plain form
426 146467 28593 -50536 -81725 50920 161120 -83180 -110067 20572 19618 173812 20514
415 20514 37981 63901 71911 150271 40484 119410 47525 41262 34612 -333 41442 158213
403 158213 141151 233772 134259 147216 231350 149174 -22354 -24241 141974 229132 195738 68885
391 68885 9926 33890 26908 55678 102668 170633 124224 81507 89439 31153 -9018 122375
379 122375 48580 219916 195894 64358 53534 151836 21 195863 269912 297716 190912
368 190912 279785 258095 106690 66710 193698 232183 145544 43926 6272 101655 -20686
357 -20686 -33444 86030 163900 95212 175030 85677 70150 103813 35105 120888 35486 -72986
345 -72986 -11967 66564 207464 140400 96087 54482 -1899 106875 145959 -11442 99237
334I9237j3319J1124R0215k1957L2290p5669k4434m1706N6931Q6100O4116k00448
322F2480j6867N9283j9594j7566P685k5173N3625N5315j22395L0761m3561j1287
310A2706L7266n2929O6660J44970n9728K6890L8184n3194j24899j27141J13071
299B1856O3449j78214O1124J05379L713J38037o3497j39859K1168N3396k1044
288F5508J51176k294j41610J17389N1598K5099j38556N4436l3174K9942J29433
277C08947j22299p6409n5208J11525J2393q9451L5512K3224q5875J12875J6971
266A92205j47874q1746N4028M0926j01166N6648O8185O5497j05902K327l5052
255H076J61407j9161n7806j27215R4859J64229J64j0486j22345p4180J12483n682
$$ plain form
334 99237 85918 97042 187257 165300 197590 121921 97487 55781 112712 198812 262928 62480
322 62480 45613 104896 85302 67736 75421 50248 103873 159188 36793 67554 23993 12706
310 12706 49972 -2957 63703 208673 148945 175835 214019 160825 35926 -91215 21856
299 21856 85305 -92909 -31785 73594 77307 215344 151847 11988 33156 86552 65508
288 65508 216684 214390 72780 190169 241767 266866 128310 182746 149572 179514 308947
277 308947 186648 110239 55031 166556 178949 89498 125010 148234 62359 175234 192205
266 192205 44331 -37415 16613 57539 -43627 13021 81206 146703 40801 43128 8076
255 8076 169483 150322 92516 -34699 60160 224389 224553 214067 91722 17542 130025 124343
243A24343l4274K9800K18664O1395j96615j8289j45452P419R1511o4080L297J00975
231A78694J4130o3644O6142R245n3472j11711J25874J30488o1415l6884Q238m2644
219A63041K0936l6335j0619L1927M9876j60432r7448k4689J5388N9433J2679J25290
207A49047o8985j7382p058M8563j2285l2345Q6014R1129p7360P9981M3317j20875
195A61761l9313m4025o6237k8856J62338k7358l5143P138l1657J10149L6729j10362
183I5164J1814J31331M2628j19565l9514r0338L5659l9337n9782Q428P4551j6581
171C4458j5810N8289m0349P3973J13787k8109r4106k2793r2048O6028p3902l9786
159f0368j9509K06708R8899r9502O294k1383J07256p5249P466j0231O1752K659
$$ plain form
243 124343 90069 119869 338533 399928 203313 185024 39572 46991 138502 74422 77719 178694
231 178694 192824 129180 195322 204567 151095 39384 165258 295746 234331 197447 205685 163041
219 163041 183977 147642 137023 168950 218826 58394 -39054 -63743 -48355 11078 23757 149047
207 149047 80062 62680 55622 104185 91900 59555 145569 236698 159338 239319 282636 161761
195 161761 122448 78423 12186 -16670 145668 118310 83167 90305 58648 168797 205526 95164
183 95164 106978 238309 280937 161372 121858 31520 67179 27842 -31940 -23512 51039 34458
171 34458 18648 76937 36588 110561 224348 196239 102133 79340 -12708 53320 -20582 -60368
159 -60368 -79877 126831 225730 126228 132522 111139 218395 143146 150612 140381 202133 204792
147B04792q5125J7566j92953J35631p4412O3995R8832l1626k0531L3726k5994
136A23901n090q5248K0379R8568N7895p6359k5534m1036Q8846q8090K6883L3592
124A28707p517J20948j81852l2461L4806L0012k1922K2369R1418r9166k867N8099
112A40574L206m636J4741o1295k0997J83796o4268p6361j925m254l2147J52332
100B28766J05414j54369q732K1533m9264l7319R3324P244o2349o0393M5296m3792
88H5359j1487O2107P5176J3831j05947K4697r571j10208P5649J46270L9057j08665
76A76268n1738l2250N0486O0839j13236j0799J55379o3108j06336l8012j5085
65A2408J36360J6575j07143R2083l3228r2866M6823Q5717m8608L0649m6752j2173
$$ plain form
147 204792 119667 137233 -55720 79911 5499 69494 168326 136700 116169 149895 123901
136 123901 118811 33563 53942 152510 210405 134046 108512 67476 156322 68232 95115 128707
124 128707 121190 242138 60286 27825 62631 92643 70721 93090 184508 85342 82475 140574
112 140574 143780 139144 153885 92590 71593 255389 191121 114760 112835 108581 76434 228766
100 228766 334180 179811 171079 192612 143348 106029 199353 206597 144248 83855 129151 85359
88 85359 73872 135979 211155 224986 119039 143736 134165 23957 99606 245876 284933 176268
76 176268 124530 92280 142766 203605 90369 79570 234949 171841 65505 27493 12408
65 12408 148768 165343 58200 150283 117055 24189 71012 156729 108121 138770 92018 79845
53G9845j0447l024L6689n7609R4773k5701N2376n9951K6381q9910O2770l8086
41F8106L2920p2219P0423R0192P165j15105R883k8999O3675Q7766j02221j7435
29I4151r858J32248o5906L787p2740L4045Q0798k4424N382m4591n2889L4676J6356
16A31035k9779J0886j2489O8454j0240l0018K7692L8692o7531q1405M9628O150
4A01075k7961K6205J23548n9379
0A63488
$$ plain form
53 79845 69398 66374 103063 45454 140227 114526 166902 106951 133332 43422 106192 68106
41 68106 101026 28807 99230 189422 196587 81482 91365 62366 126041 213807 111586 94151
29 94151 84293 216541 150635 154422 81682 115727 196525 172101 177483 132892 80003 114679 131035
16 131035 101256 112142 99653 168107 157867 127849 155541 194233 126702 45297 94925 101075
4 101075 73114 99319 222867 163488
0 163488
$$ Imaginary data points
##PAGE= N=2
##DATA TABLE= (X++(I..I)), XYDATA
16383b025142L8181J28423p16O8086N125n8512L7528L2100p487R1478K109n9777
16371a748604Q5371P6741k3468P2272m0789k7480J18045m5120M3073r837O1027
16360a438769J6240m8974P4538R4273o0260J51892l6090k8407J12936o171P3708
16349a095084o8347n4953J09375K3517J8907K7674l3600l6893R2311M8203J774
16338i67116R532o8540K4319N8261P2111J4578R446k8380R5663Q7576j30065J24591
16326f98024L8378j02651N2959M0559r363M3608l2271j2425J3432J17828m2248
16315e90218P0822K4330m9092O7136J68813q7108m2858j4228P2860m193R6131
16304b87605j9583m4895R3260o841Q5722l4733j9319P5756k724K7592l2639J2818
$$ plain form
16383 -2025142 -1986961 -1858538 -1859254 -1791168 -1786043 -1844555 -1807027 -1774927 -1782414 -1690936 -1688827 -1748604
16371 -1748604 -1663233 -1586492 -1609960 -1537688 -1578477 -1605957 -1487912 -1533032 -1489959 -1499796 -1438769
16360 -1438769 -1422529 -1471503 -1396965 -1302692 -1362952 -1211060 -1247150 -1275557 -1162621 -1168792 -1095084
16349 -1095084 -1163431 -1218384 -1109009 -1085492 -1066585 -1038911 -1072511 -1109404 -1017093 -968890 -967116
16338 -967116 -957584 -1026124 -1001805 -943544 -871433 -856855 -847409 -875789 -780126 -692550 -822615 -698024
16326 -698024 -659646 -762297 -709338 -668779 -678142 -634534 -666805 -679230 -665798 -547970 -590218
16315 -590218 -519396 -495066 -544158 -477022 -308209 -395317 -438175 -452403 -379543 -383736 -287605
16304 -287605 -307188 -352083 -258823 -265664 -179942 -214675 -233994 -158238 -160962 -133370 -166009 -153191
16292a53191l9902j3898J13509K1479p8203J4562M8037J2080J00258q583J7645
16281C3793J36314j11771o695N504k6877J12408j37107J16306k3585q5196J51542
16270A64636J14895k250J5139j6480K3309P7420R1078j77807m6888K8806J14180
16259C86038J00835j2813r3154J5973N6788j2179J12370O9961j22734Q7154L0930
16248F19169k814k8603O5039r6862q138m5115K4250J0546J0707J08933J29031
16237G86143l7754j19858P9992J15314k0484k5479O3672o6943N8835j3751L3302
16226H52989l57o9373L4126M4364J18107L5523p7895k5888q80P7234o3380J24894
16214A049464j10291P2719J51970r8915Q978j0086j6217R2969j12892q8604p731
$$ plain form
16292 -153191 -193093 -206991 -93482 -72003 -150206 -135644 -87607 -75527 24731 16148 33793
16281 33793 170107 58336 51641 57145 30268 142676 5569 121875 98290 13094 164636
16270 164636 279531 277281 292420 275940 299249 376669 467747 289940 243052 271858 386038
16259 386038 486873 474060 380906 396879 453667 441488 553858 623819 501085 588239 619169
16248 619169 616355 587752 652791 555929 547791 502676 526926 537472 548179 657112 786143
16237 786143 748389 628531 708523 823837 803353 777874 841546 774603 833438 819687 852989
16226 852989 852632 783259 817385 861749 979856 1015379 937484 911596 910716 987950 924570 1049464
16214 1049464 939173 1011892 1163862 1064947 1073925 1063839 1047622 1140591 1027699 939095 931364
16203I31364J21126m909K7913M1220l9687J33176p830K3469k9282j11436J41341
16192A226465n1705N1683O8630j51858O6356O569L2508j16155L6781J5081N2560
16181A236915N0395j47928O3484M4938N3872O1898O780q9653n3083J78772M2779
16170A449169K876j1453k10439J09057J37295j91547M9407J1736l931O1214p1776
16159A331608r830n7965L5195Q9815N911o2111R0073K8106M5106j146q7414K01678
16147A609026q0092l6548R978r6331R063k8704P1212j8888j12583r1950n1639
16136A182544K7682R0746L9073M4100M1429P8764j6506N1920r6824O7520R5373
16125A605821L5525j25887k33089J42570J26535j33408O9073p2232l9153P6093
$$ plain form
16203 931364 1052490 1047581 1075494 1116714 1077027 1210203 1202373 1225842 1196560 1085124 1226465
16192 1226465 1174760 1226443 1295073 1143215 1209571 1216140 1248648 1132493 1169274 1184355 1236915
16181 1236915 1287310 1139382 1202866 1247804 1301676 1363574 1370354 1280701 1227618 1406390 1449169
16170 1449169 1452045 1440592 1230153 1339210 1476505 1284958 1334365 1346101 1342170 1403384 1331608
16159 1331608 1321778 1263813 1299008 1388823 1394734 1332623 1422696 1450802 1495908 1494762 1407348 1609026
16147 1609026 1528934 1492386 1502364 1406033 1415096 1386392 1457604 1438716 1326133 1234183 1182544
16136 1182544 1210226 1300972 1340045 1384145 1425574 1504338 1487832 1539752 1442928 1510448 1605821
16125 1605821 1641346 1515459 1282370 1424940 1551475 1418067 1487140 1414908 1375755 1451848
16115A451848Q9673P2540O7608m3165K4462O6628p9063j8384r6947j8123k5822
16104A491255n1483J5717J27181K9989o4336K6564N2280j15984J7844n17m7715
16093A480795N3659R587J6907J5605r0776K4489o8124J19682p1117p165R1135
16082A574677J89949j34302J591n2237j0231m8557L7343K4446L1711k8762M4277
16071A629905l9806Q693L7353n2373R1915Q3134N0058p578n0785k7295O3685m8627
16059A738279j29237k4228M5728J39595n0181p3986j16542L7358R0489j34739
16049A522536K01129k0406q4798l8013K6K14921k2738N0048j37031m1949J47215
16038A790940j95268J24510q5273J97747L4507k30790k5365P7446L7116j94240
$$ plain form
16115 1451848 1541521 1614061 1681669 1638504 1662966 1729594 1650531 1632147 1535200 1517077 1491255
16104 1491255 1439772 1455489 1582670 1612659 1548323 1574887 1627167 1511183 1529027 1528510 1480795
16093 1480795 1534454 1544041 1560948 1576553 1485777 1510266 1442142 1561824 1490707 1483542 1574677
16082 1574677 1764626 1630324 1631915 1579678 1569447 1520890 1558233 1582679 1614390 1585628 1629905
16071 1629905 1590099 1598792 1636145 1583772 1675687 1758821 1808879 1801301 1750516 1723221 1786906 1738279
16059 1738279 1609042 1584814 1630542 1770137 1719956 1645970 1529428 1566786 1657275 1522536
16049 1522536 1723665 1703259 1618461 1580448 1580474 1795395 1772657 1822705 1685674 1643725 1790940
16038 1790940 1595672 1720182 1634909 1832656 1867163 1636373 1611008 1688454 1725570 1531330
16028A531330O9174n3281J05M4186m8640K71254j13872m49O2695m4113k4619J27665
16016A821435q8370O9954n44j44694r1528j44095J15809R4793N4844J439j4162
16005A674881n462J10817m7778q3344l5723N9617P6204j44714N1284J4028O0898
15994A730708k5787O4823r1307L1071j25592M5301J73267k103l3400J4311p2641
15983A708651p7989J0217Q952J04417j25644o1797J67977l5018R462o1165r7532
15972A550531P2525P9411l607j02484n7036Q2681O0917n2797l6039J45156m575
15961A734683m225o7808j19881m576J07501J09239o4363p0172q2561J44108M1349
$$ plain form
16028 1531330 1600504 1547223 1547328 1591514 1542874 1814128 1700256 1699807 1762502 1718389 1693770 1821435
16016 1821435 1733065 1803019 1802475 1657781 1566253 1422158 1537967 1632760 1687604 1689043 1674881
16005 1674881 1669419 1780236 1732458 1649114 1613391 1673008 1749212 1604498 1655782 1669810 1730708
15994 1730708 1704921 1769744 1678437 1709508 1583916 1629217 1802484 1800381 1766981 1781292 1708651
15983 1708651 1630662 1640879 1649831 1754248 1628604 1566807 1734784 1699766 1709228 1648063 1550531
15972 1550531 1623056 1702467 1698860 1596376 1539340 1622021 1682938 1630141 1594102 1739258 1734683
15961 1734683 1730458 1662650 1542769 1538193 1645694 1754933 1690570 1620398 1537837 1681945 1723294
$$ [...]
##END NTUPLES=NMR SPECTRUM
##END=
