##TITLE=1H_EC-3311-xnk
 CDCl3
 8 sc, 
 5.8.2024
##JCAMPDX= 6.0         $$ Bruker NMR JCAMP-DX V2.0
##DATA TYPE= NMR SPECTRUM
##DATA CLASS= NTUPLES
##ORIGIN= UXNMR, Bruker Analytische Messtechnik GmbH
##OWNER= root
$$ XWIN-NMR		Version 3.5
$$ Mon Aug  5 14:12:50 2024 Russian Standard Time (UT+4h)  she@DPX200
##.OBSERVE FREQUENCY= 200.1313
##.OBSERVE NUCLEUS= ^1H
##.ACQUISITION MODE= SIMULTANEOUS
##.ACQUISITION SCHEME= undefined
##.AVERAGES= 8
##.DIGITISER RES= 18
##SPECTROMETER/DATA SYSTEM= spect
##.PULSE SEQUENCE= zg30
##.SOLVENT NAME= Acetone
##.SHIFT REFERENCE= (INTERNAL, Acetone, 0, 21.5409)
##AUDIT TRAIL= $$ (NUMBER, WHEN, WHO, WHERE, WHAT)
$$ ##TITLE= Audit trail, XWIN-NMR		Version 3.5
$$ ##JCAMPDX= 5.01
$$ ##ORIGIN= Bruker BioSpin GmbH
$$ ##OWNER= she
$$ F:/spectra/data/she/nmr/H-F/1/pdata/1/auditp.txt
$$ ##AUDIT TRAIL=  $$ (NUMBER, WHEN, WHO, WHERE, WHAT)
(   1,<2024-08-05 14:11:20.67 +0400>,<she>,<DPX200>,
      <created by zg, POWCHK disabled, PULCHK disabled
       configuration hash MD5:
       00 E9 B6 7A A2 85 ED C7 34 08 36 98 17 FE 4E 26
       data hash MD5: 16K
       E2 9C FD 7C F9 BD DA FE 11 88 EC D8 18 45 E8 41>)
(   2,<2024-08-05 14:11:26.28 +0400>,<she>,<DPX200>,
      <Start of raw data processing
       efp BC_mod = 2 LB = 0.24 FT_mod = 6 PKNL = 1 PHC0 = -25637.09 PHC1 = 13.98749 SI = 16K 
       data hash MD5: 16K
       5F AB 60 B9 18 77 20 52 A2 76 1E A4 F8 D6 BA AE>)
(   3,<2024-08-05 14:11:41.43 +0400>,<she>,<DPX200>,
      <pk PHC0 = -0.1680166 PHC1 = 0 
       data hash MD5: 16K
       F9 7D 93 71 EE 71 79 48 E0 B4 76 B8 6C E6 08 AC>)
(   4,<2024-08-05 14:11:44.57 +0400>,<she>,<DPX200>,
      <abs ABSG = 5 
       data hash MD5: 16K
       69 7F 57 E4 96 37 E9 58 1A D8 00 36 FE 0D 44 58>)
$$ ##END=
$$ 
$$ hash MD5
$$ AD CF 4A 4E D6 74 98 6D 22 D1 AB 88 19 11 24 C7
##$RELAX= 
##$RELAX= 
##$RELAX= 
##$RELAX= 
##$RELAX= 
##$RELAX= 
$$ Bruker specific parameters
$$ --------------------------
##$DU= <F:/spectra>
##$EXPNO= 1
##$NAME= <H-F>
##$PROCNO= 1
##$TYPE= <nmr>
##$USER= <she>
##$AMP= (0..31)
100 100 100 100 100 100 100 100 100 100 100 100 100 100 100 100 100 100 
100 100 100 100 100 100 100 100 100 100 100 100 100 100 
##$AQSEQ= 0
##$AQ_mod= 1
##$AUNM= <au_zg>
##$AUTOPOS= <>
##$BF1= 200.13
##$BF2= 200.13
##$BF3= 200.13
##$BF4= 200.13
##$BF5= 200.13
##$BF6= 200.13
##$BF7= 200.13
##$BF8= 200.13
##$BYTORDA= 1
##$CFDGTYP= 0
##$CFRGTYP= 5
##$CHEMSTR= <none>
##$CNST= (0..31)
1 1 145 1 1 1 1 1 1 1 1 1 1 1 1 1 1 1 1 1 1 1 1 1 1 1 1 1 1 1 1 1 
##$CPDPRG= <>
##$CPDPRG1= <>
##$CPDPRG2= <>
##$CPDPRG3= <>
##$CPDPRG4= <mlev>
##$CPDPRG5= <mlev>
##$CPDPRG6= <mlev>
##$CPDPRG7= <mlev>
##$CPDPRG8= <mlev>
##$CPDPRGB= <>
##$CPDPRGT= <>
##$D= (0..31)
0 1.2 0 0 0 0 0 0 0 0.06 0 0.03 0 0 0 0 0.0002 0 0 0 0 0 0 0 0 0 0 0 0 
0 0 0 
##$DATE= 1722852680
##$DBL= (0..7)
120 120 120 120 120 120 120 120 
##$DBP= (0..7)
150 150 150 150 150 150 150 150 
##$DBP07= 0
##$DBPNAM0= <>
##$DBPNAM1= <>
##$DBPNAM2= <>
##$DBPNAM3= <>
##$DBPNAM4= <>
$$ [...]
##$SUBNAM3= <"">
##$SUBNAM4= <"">
##$SUBNAM5= <"">
##$SUBNAM6= <"">
##$SUBNAM7= <"">
##$SUBNAM8= <"">
##$SUBNAM9= <"">
##$SW= 24.0689771365484
##$SWIBOX= (0..15)
0 0 2 0 0 0 0 0 0 0 0 0 0 0 0 0 
##$SW_h= 4816.95568400771
##$TD= 16384
##$TD0= 1
##$TE= 0
##$TE2= 300
##$TE3= 300
##$TEG= 300
##$TL= (0..7)
0 120 120 120 120 120 120 120 
##$TP= (0..7)
150 150 150 150 150 150 150 150 
##$TP07= 0
##$TPNAME0= <>
##$TPNAME1= <>
##$TPNAME2= <>
##$TPNAME3= <>
##$TPNAME4= <>
##$TPNAME5= <>
##$TPNAME6= <>
##$TPNAME7= <>
##$TPOAL= (0..7)
0.5 0.5 0.5 0.5 0.5 0.5 0.5 0.5 
##$TPOFFS= (0..7)
0 0 0 0 0 0 0 0 
##$TUNHIN= 0
##$TUNHOUT= 0
##$TUNXOUT= 0
##$USERA1= <user>
##$USERA2= <user>
##$USERA3= <user>
##$USERA4= <user>
##$USERA5= <user>
##$V9= 5
##$VALIST= <valist>
##$VCLIST= <CCCCCCCCCCCCCCC>
##$VD= 0
##$VDLIST= <DDDDDDDDDDDDDDD>
##$VPLIST= <PPPPPPPPPPPPPPP>
##$VTLIST= <TTTTTTTTTTTTTTT>
##$WBST= 1024
##$WBSW= 4
##$XGAIN= (0..3)
0 0 0 0 
##$XL= 0
##$YL= 0
##$YMAX_a= 61790
##$YMIN_a= -51988
##$ZGOPTNS= <>
##$ZL1= 120
##$ZL2= 120
##$ZL3= 120
##$ZL4= 120
##$ABSF1= 21.53213
##$ABSF2= -2.537077
##$ABSG= 5
##$ABSL= 3
##$ALPHA= 0
##$AQORDER= 0
##$ASSFAC= 0
##$ASSFACI= 0
##$ASSFACX= 0
##$ASSWID= 0
##$AUNMP= <proc_1d>
##$AZFE= 0.1
##$AZFW= 0.1
##$BCFW= 0
##$BC_mod= 2
##$BYTORDP= 0
##$COROFFS= 0
##$CY= -3
##$DATMOD= 1
##$DC= 0
##$DFILT= <>
##$DTYPP= 0
##$F1P= 0
##$F2P= 0
##$FCOR= 1
##$FTSIZE= 16384
##$FT_mod= 6
##$GAMMA= 0
##$GB= 0
##$INTBC= 1
##$INTSCL= 3.70164e-10
##$ISEN= 128
##$LB= 0.24
##$LEV0= 0
##$LPBIN= 0
##$MAXI= 10000
##$MC2= 0
##$MEAN= 0
##$ME_mod= 0
##$MI= 1.114404
##$NCOEF= 0
##$NC_proc= -8
##$NLEV= 6
##$NOISF1= 3.799351
##$NOISF2= 2.8
##$NSP= 0
##$NTH_PI= 0
##$NZP= 0
##$OFFSET= 21.54094
##$PC= 1
##$PHC0= -25637.26
##$PHC1= 13.98749
##$PH_mod= 1
##$PKNL= yes
##$PPARMOD= 0
##$PSCAL= 0
##$PSIGN= 0
##$REVERSE= no
##$SF= 200.129397502503
##$SI= 16384
##$SIGF1= 3
##$SIGF2= 2
##$SINO= 5.538805
##$SIOLD= 16384
##$SREGLST= <1H.CDCl3>
##$SSB= 0
##$STSI= 16384
##$STSR= 0
##$SW_p= 4816.95568400771
##$SYMM= 0
##$S_DEV= 0
##$TDeff= 16384
##$TDoff= 0
##$TI= <>
##$TILT= no
##$TM1= 0
##$TM2= 0
##$TOPLEV= 0
##$USERP1= <user>
##$USERP2= <user>
##$USERP3= <user>
##$USERP4= <user>
##$USERP5= <user>
##$WDW= 1
##$XDIM= 16384
##$YMAX_p= 295825966
##$YMIN_p= -2558640
$$ End of Bruker specific parameters
$$ ---------------------------------
##NTUPLES= NMR SPECTRUM
##VAR_NAME=  FREQUENCY,     SPECTRUM/REAL,   SPECTRUM/IMAG
##SYMBOL=    X,             R,               I
##VAR_TYPE=  INDEPENDENT,   DEPENDENT,       DEPENDENT
##VAR_FORM=  AFFN,          ASDF,            ASDF
##VAR_DIM=   16384,         16384,           16384
##UNITS=     HZ,            ARBITRARY UNITS, ARBITRARY UNITS
##FACTOR=    0.29402158847633, 1,            1
##FIRST=     4310.97520996194, 0,            0
##LAST=      -505.980474045766, 0,           0
##MIN=       -505.980474045766, -2558640,    0
##MAX=       4310.97520996194, 295825966,    0
$$ Real data points
##PAGE= N=1
##DATA TABLE= (X++(R..R)), XYDATA
$$ [...]
7479 3900751 3266267 3313709 3533166 3043908 3336368 2607512 3018837 3726415 3664095 3762637
7469 3762637 3799445 3766927 3480142 3493672 3627221 3533714 3260351 4147900 4447679 5223898
7459 5223898 5370654 5430560 5838180 5322905 4999312 5776513 5710491 5433052 5906160 6320361
7449 6320361 5739160 5496332 5732225 5547608 5792494 6224468 6542643 7305561 7349123 6943740
7439 6943740 6646389 6950341 7177066 7795475 7723383 7630748 8434132 8523867 8746741 8662066
7429 8662066 8598810 8746695 9273690 9308195 9851650 10252946 10765020 10769318 10802329 11349400
7419 11349400 11420131 12267066 12179151 12523130 12733005 13547288 14182720 14363516 14938322 14841947
7409 14841947 15301608 15293487 15945456 16477119 16946494 17438293 18080348 18157055 18189701 19617534
7399 19617534 19841188 20558978 21285882 21657979 21444727 21597180 22793777 23552815 23967764
7390 23967764 24759558 25774665 26956634 26873527 27324691 28030001 28011134 28618878 28879335
7381 28879335 29144947 30355324 29939789 30401075 31186267 30929086 31489623 31776800 31982300
7372 31982300 31930147 31849755 31641961 31888658 32401346 32673035 32302025 31981531 31844977 31408950
7362 31408950 31306040 30932478 30670004 30261321 29929493 29978740 28945121 28380728 27899956
7353 27899956 27554222 26925365 26716859 26274056 25593348 25241074 24725977 23898550 23018968
7344 23018968 22148104 21618193 21913692 21366577 20563412 19827476 19217808 18395885 18050789
7335 18050789 18237139 17304705 17036972 16330946 15870164 15806653 15809976 14742748 14589876 14098299
7325 14098299 13849568 13378014 12647739 12927047 12038378 11860330 11444275 11610662 11378831
7316 11378831 10593005 9967478 9472764 9621058 9184375 8836275 8974409 8947667 9141530 9046484
7306 9046484 8993787 8264172 7857491 8319927 7473813 7570727 7301413 7328642 6595562 7051620
7296 7051620 6244945 6338785 6447406 6284206 5520600 5845504 5702447 5215072 5220377 4955321
7286 4955321 4810482 4971311 5046907 4794937 4897023 4563256 5288869 4882989 4899732 4655266
7276 4655266 4495997 3981524 4166421 3941519 4140382 3678314 3606318 3743222 4298573 3328079
7266 3328079 3079271 4333738 3603354 2932855 2770364 2731492 2793128 2293590 1780754 2860936
7256 2860936 3418067 3055644 3541562 3050409 2734025 2733729 2575748 2373813 2432841 2639926
7246 2639926 3250710 3494660 2516002 2596484 3088061 2774581 2519916 2709197 2480450 2075617
7236 2075617 2776956 2318823 2179329 1779156 1933310 1587613 1943382 1971797 1912561 1805983
7226 1805983 2065020 1959533 1430179 1130559 1425458 1809085 1936989 1916427 1648453 1314769
7216 1314769 1323596 1671154 1998415 2021895 1766956 1920688 1787132 1282185 1202454 1506452
7206 1506452 1926437 2158955 1746332 1535312 2187080 2336373 1908789 1799925 2613182 2641152
7196 2641152 2295747 2442554 2340988 2343470 1992926 1465420 1714086 1442727 1580132 1695915
7186 1695915 1540912 2011592 1631164 1971320 2212039 1471061 820605 1437630 1371860 1813865
7176 1813865 1985244 1716588 1292087 1621352 1522762 2077404 1946143 2002904 2099891 1295765
7166 1295765 1484653 1354137 784791 1173655 1321754 1316393 1219323 1335388 1209699 956885
7156 956885 1297543 1288062 552289 844714 169090 313284 779423 1000224 871220 1365577
7146 1365577 1042760 436439 705017 839345 1063501 281705 278955 1077345 907958 639129
7136 639129 726289 277493 572490 1094983 1020426 700310 481190 620620 597047 300581
7126 300581 89987 853729 716850 1018597 952906 538217 413770 999427 798272 357391
7116 357391 743430 986972 1203334 871737 270897 509170 29757 256567 765439 754438
7106 754438 1284885 1194993 615709 -324196 -26556 -49949 -249015 13106 769392 708574
7096 708574 713999 384509 616117 536979 641545 807932 416490 51501 467713 375536
7086 375536 183184 36514 -192656 698864 601916 148636 -134321 -200194 408095 439596
7076 439596 210256 214417 233888 188617 390386 279008 347743 1093181 823820 285465 544104
7065 544104 258480 703893 228306 106060 630713 562199 88032 542162 553693 793428
7055 793428 400117 409844 92632 -5074 -26492 266818 71620 451844 644578 723479 1192922
7044 1192922 588615 289741 206541 -193847 -554093 91501 807132 494672 -17601 364837
7034 364837 412951 554733 138399 846686 100232 -230098 81171 -254650 -165136 138076
7024 138076 498442 507342 100447 83949 562317 546635 437294 566936 -178448 -110587 160580
7013 160580 -25374 -196957 -11931 475925 418099 778409 1184788 1091890 733942 471307
7003 471307 1016657 54842 -43809 1052785 1040703 736328 934542 488102 426322 437747
6993 437747 507979 986510 1138482 1356841 983092 813477 823849 156743 267929 573461
6983 573461 79037 458048 286393 313483 581116 279963 501535 151454 -207226 20955
6973 20955 592109 1074317 785677 893482 1310512 1806663 1377378 1577993 1408673 847479
6963 847479 684635 985814 748438 559900 363213 128766 173576 589964 254760 -51489
6953 -51489 849169 537465 236652 496506 1021592 983506 763197 689792 595555 739611
6943 739611 176484 -166160 -599572 164301 286990 -65529 33041 403157 673110 545708
6933 545708 63194 525944 284292 -97185 -75479 112923 309856 130784 86518 192857
6923 192857 401753 646813 551405 427414 -179177 1705 282896 188144 -12655 29242
6913 29242 544944 76450 290683 -627634 99375 -138567 76540 535800 364343 258209
6903 258209 596650 30329 3144 -373441 -191830 -359817 -58850 257652 311385 293593
6893 293593 -106670 -133722 314208 142294 239969 -42207 -455357 -303305 127417 37117
6883 37117 341653 288089 110252 191933 382675 46622 146807 256523 379674 601965
6873 601965 280002 210083 -343199 84220 1348013 890347 37980 757241 223902 651249
6863 651249 -35648 258758 -117480 -588320 -651838 -222714 66900 -52172 -37953 -561000
6853 -561000 -157097 556751 617330 936394 886815 518778 289924 533653 851208 814317
6843 814317 739144 214117 -52449 -23016 464243 306154 533560 789928 762616 601535
6833 601535 404248 872726 347995 943180 630888 703533 485375 823305 1191035 1037954
6823 1037954 788971 1527595 1187860 1133076 1556985 1544279 1287230 767059 1179202 1539822
6813 1539822 1456685 1839977 1638888 1522514 2303698 2270364 1969207 1790374 2229859 2220609
6803 2220609 2230285 2150692 2495487 2279974 1734506 1485835 1688536 1922586 1774764 1888557
6793 1888557 1401373 1137466 1659028 1556961 1477425 595446 1231832 1108758 921694 1452182
6783 1452182 1995218 1703365 1579117 1710176 1780387 1482383 1500593 1489108 1253322 1250171
6773 1250171 1533774 586724 776922 1686922 1532495 1424858 1231899 900254 969549 1519669
6763 1519669 1486826 1395487 1538187 1307631 1162728 1947061 2194494 1524599 1119296 1343499
6753 1343499 1185093 1395767 1722701 1319759 1189990 1685351 729247 985072 1709932 1511002
6743 1511002 1162738 1289367 1322017 1556915 1571868 1233632 1063432 1264003 871895 1096394
6733 1096394 690107 910213 877472 463108 735484 559915 720277 1080823 1166341 729841
6723 729841 830762 1103693 1576670 1347161 637078 1376814 1678671 1609177 1047542 1290086
6713 1290086 1033607 858073 1371488 1171718 997826 1290003 1868270 1451871 1753650 1553347
6703 1553347 1857730 1621033 1579931 1720940 2085317 2513428 2489885 2978992 3473933 3669550
6693 3669550 4292852 5071976 5848934 6678926 7587381 7755359 8598144 8940687 9202152 9976747
6683 9976747 10815533 12157233 12450071 13889833 15459637 17143970 19861055 22871965 27156921
6674 27156921 31487260 38020183 47287341 60835875 78273600 86117922 77590707 63065417
6666 63065417 49714246 38384107 30500698 25406693 21746987 19043899 16930809 14714523
6658 14714523 13755493 12079742 11084847 9626280 8768905 9129547 9042905 8110071 7734353
6649 7734353 7568149 7360475 7167216 6322541 5890083 6176394 6051044 5497587 5224852 4708051
6639 4708051 4948193 5059514 4876399 5066768 4279963 3780380 4282268 4716906 4722841 4321465
6629 4321465 4343453 4339087 4269099 4180302 4272823 3564416 3505504 3295341 3028703 2628220 3106972
6618 3106972 3684131 3937848 3251278 3665160 4189102 4133120 4404276 3925155 3535532 3110169
6608 3110169 2948082 2999940 2632929 2743197 2750449 2944341 2967403 3133464 3348030 3288184
6598 3288184 3152714 2669035 2881753 2533931 2226166 2066855 2373231 2771945 2014432 1966252
6588 1966252 1662883 1526087 1086653 1270678 1538218 892352 1352722 1457709 1788442 2162882
6578 2162882 1960255 1603881 1739978 2013044 1562574 1490839 1588121 605259 1198943 1964868
6568 1964868 2221190 2927228 2659432 2518180 2914863 2644767 2694879 2217728 2135948 2558621
6558 2558621 2192496 2584048 2788068 2605721 1787457 2418982 2387506 1691290 1818891 1709792
6548 1709792 1407969 1167055 1693861 1955306 1941441 1449447 1757449 1695817 2014354 1780157
6538 1780157 2354342 2012918 1537761 1345886 1822807 2068097 1978343 2125989 2017666 1833391
6528 1833391 2383903 2242520 2003689 1934718 2242217 2179331 1913246 2148091 1730067 1032408
6518 1032408 1335810 1130269 492570 733660 751705 1011752 531682 923003 1021054 1316376
6508 1316376 858876 786940 1474708 1056400 552509 745453 479811 646022 988265 1002932
6498 1002932 494354 206194 581935 1109178 621208 490096 357832 -29655 -64641 -121237
6488 -121237 298126 365094 562270 785377 681098 773572 225821 170989 923138 660403
6478 660403 194774 -4321 110615 259217 302231 383223 595278 634342 293789 589641
6468 589641 717601 907839 1117394 773889 377544 38085 454359 240319 -173937 320915
6458 320915 88176 270518 271714 128304 678925 1315967 555850 442831 709675 14313
6448 14313 209000 598991 -44847 568994 1139602 1102266 361158 414270 839471 670075
6438 670075 374672 470203 608848 412703 714623 924527 1101655 1572764 1451751 1377057
6428 1377057 1539417 1077024 1425753 659004 816807 1748067 1821507 1411809 1664123 1394115
6418 1394115 1513714 1502516 1577671 1104434 1185082 1127821 408165 1283487 1238029 1409734
6408 1409734 972156 791415 1167816 772625 981846 1102986 1408676 1344785 1625346 1880242
6398 1880242 2080030 2062527 2033179 1629349 1459223 1836029 1977656 1717644 1695826 1898519
6388 1898519 1802880 1885859 1871048 1774959 1110134 1671477 1837704 1150231 1566440 1179712
6378 1179712 1257511 917180 805499 822380 645235 450676 420926 1470342 1403928 1691966
6368 1691966 1696273 834480 681229 1038015 1608450 1082521 836113 861614 642569 875943
6358 875943 518027 612251 1458295 1274598 887825 -339897 -242847 149806 427576 532709
6348 532709 822273 913203 -6434 -76108 107241 173615 230666 469743 139417 -622994
6338 -622994 -123959 -122168 -581271 -97948 218227 380293 -13298 -274699 -3809 438865
6328 438865 -393216 136401 176268 535548 366141 116379 -107599 77484 300376 276796
6318 276796 637179 633291 430282 158166 694621 716083 -190341 309518 473804 275334
6308 275334 549481 294084 320073 338145 38542 -320813 372453 372325 -409860 211562 113041
6297 113041 -301410 -629696 29899 232393 -82833 -278078 -1053893 -1094946 -417414 395917
6287 395917 62395 -122781 -175759 154354 -42265 288950 -25917 -332338 -178342 -765768
6277 -765768 -755441 -984705 -846131 -736139 -92244 268848 14697 -146636 -214762 -607753
6267 -607753 -137364 313382 479475 426271 717051 113346 -22362 -353417 -388501 -207518
6257 -207518 -247156 -141965 -400402 -196705 -330895 125575 -186853 53387 32802 -364958
6247 -364958 -416076 -523926 -569180 -517137 -18426 169750 -342746 -207421 -81277 38221
6237 38221 -130680 -481526 -88284 -1163 468496 299637 587724 577695 249843 355267
6227 355267 -362660 -520605 -741878 -300072 228988 367607 -343140 175498 28022 191212
6217 191212 142627 -563053 70540 -216444 -463053 -374945 -689195 -438256 -328245 111565
6207 111565 264973 -459146 -447656 -285549 -51445 45305 416303 437121 345763 292067 254666
6196 254666 6803 -137705 209003 -138466 -224300 -330089 -358426 -845477 -540920 -454851
6186 -454851 -408582 -372004 -718872 -897687 -365520 -213157 -593862 -403104 -220581 95391
6176 95391 354776 -112770 -62552 -397533 -800962 -924110 -433863 -779668 -926685 -319940
6166 -319940 241931 318982 -471604 -508613 -643576 -475654 40259 -294767 -139466 -450755
6156 -450755 -1308362 -1015774 -80161 433834 377468 113852 -529061 -27178 115681 179934
6146 179934 -254113 -61158 -260573 -545621 -353989 -768386 -370229 -26792 161237 77600
6136 77600 -134484 -497148 -460967 -440040 -294402 -427724 -555420 -386921 -502870 -520855
6126 -520855 -329675 586978 675706 81943 -86798 -618350 -861740 -492679 -303839 -281628
6116 -281628 -411529 -1033838 -525232 -621543 -1004943 -490146 -528424 -617730 -275748 -242919
6106 -242919 -538330 -309534 -530394 -482037 -261958 76449 -660027 -630984 -662616 -829511
6096 -829511 111133 203122 -23230 -195482 -283197 -269308 -287991 -411846 113138 149804 -336097
6085 -336097 -238176 -297109 -336331 28733 -264577 -612625 -295688 -309765 -333837 -677275 -84658
6074 -84658 -334185 -308343 -330147 -499343 -347972 -150643 -346134 -132150 159704 -159126
6064 -159126 -317715 90558 -88408 -418403 229738 497468 -36208 -147372 101685 -261023
6054 -261023 -766973 -454626 -472304 -629735 -245719 368830 -301282 -169890 -373943 -280397
6044 -280397 -381779 -288754 -66593 174277 405870 -193304 -172974 -116258 -132649 -548250
6034 -548250 -369197 -71073 -123025 112840 -271329 -244278 -244862 -315171 -298098 -19345 -319974
6023 -319974 -632670 -767798 -1107641 -900346 -826545 -602429 -627892 136136 -408088 75774
6013 75774 -429746 -680694 -418375 -407537 -870867 -726240 -265595 -456829 -111319 -899111
6003 -899111 -415173 -46123 149967 -67263 -750611 -327750 -401452 -729785 -72901 68639
5993 68639 -120987 -61216 132592 -311722 -105949 537279 -172218 -147692 61747 329724
5983 329724 262817 -191770 -248761 -398437 -261875 -48030 -759303 -359181 -778597 -76526
5973 -76526 704883 286757 -196121 -397364 36735 -536366 -827698 -171321 -63391 -115402
5963 -115402 288996 274484 401084 450280 486031 322293 -333061 -184760 -281629 -276704 -581607
5952 -581607 92317 -276395 -115637 -139098 -723848 -936591 -268203 -329989 -383145 -256649
5942 -256649 -462297 -293772 -404774 -108718 -130972 -109134 -667435 -684216 -273712 407840
5932 407840 317186 -214334 143757 500478 387567 53011 -763864 -1173908 -68226 -158218
5922 -158218 -280573 95683 -136421 -575383 -413571 -465067 -542322 -306193 -884236 -336163
5912 -336163 -99469 -312738 -198060 -424781 -45820 77522 -288750 -170304 85329 134357
5902 134357 114792 -214262 -221960 -138761 -910453 118990 313208 -664072 -487330 -318088
5892 -318088 -434192 192662 298030 10990 -289714 -404606 223481 260540 190601 -307131
5882 -307131 -185875 -248868 -201600 -322106 -635837 -316813 -340197 -36944 236067 -362209
5872 -362209 229439 -58219 228564 427453 229680 451591 -27831 229604 46212 -169653
5862 -169653 -273837 -249983 -263521 -698121 -639167 -567311 -417067 -188401 -494712 -675443
5852 -675443 -1192391 -622807 -93837 85760 -208443 247068 408754 505262 254466 278013
5842 278013 69105 495122 -331847 -716402 -235828 253983 -285074 -259364 -620063 -219273
5832 -219273 -318570 -922513 -566265 -127234 -118806 -755113 -1053084 -999584 -467101 -690332
5822 -690332 -153011 31070 -416085 -428595 87932 505742 -86670 -454727 -315475 134116
5812 134116 163208 -297670 -854365 -281092 54842 146411 -102623 83647 622004 -299420
5802 -299420 -771681 -533363 -689230 -12181 -332462 -533524 -287482 -740208 -696317 -344104
5792 -344104 -313759 -175638 71111 -652904 -912125 -858648 -301381 326440 -160579 -199967
5782 -199967 -271275 -240248 -259252 -394846 254751 88437 118550 -328873 328392 -168780
5772 -168780 -1277650 -1048163 -343128 -55639 -261059 -103339 -120752 341230 317840 -426908
5762 -426908 45456 745470 125695 -478914 222554 -84396 -304527 408205 -713805 -919181
5752 -919181 -422552 -705148 17999 -578879 -186837 -389597 -607186 -109075 -410008 -407608
5742 -407608 -224462 -116721 -30828 -296394 -29991 -83303 444054 -64888 -2992 117974
5732 117974 162143 539581 310050 269434 51293 132997 50860 -709407 -892985 -563580
5722 -563580 -633785 -273981 -93995 -382647 -195151 -347336 -318105 -314428 46059 -202368
5712 -202368 -41598 -20228 -249432 -536106 -450553 -399911 21193 491278 272015 -63059
5702 -63059 -94428 5220 -318436 -647921 -12286 -796772 -1641982 -439194 -228777 -379833
5692 -379833 -136957 -400821 -420328 -798082 -735371 -569259 -546280 -48010 -278034 -265763
5682 -265763 145606 117263 -60145 -568412 -309466 -540162 -636405 59233 -455674 -15839
5672 -15839 -500538 -31921 -93460 785669 573818 -162160 80230 -68341 -541750 320512
5662 320512 129456 -22329 12483 -290563 -428154 -134237 -178059 -376012 329041 161405
5652 161405 -475477 -1021318 -322937 167367 297504 71520 -112968 612660 335533 -147937
5642 -147937 -392198 -217772 -521120 -514866 -478680 -610006 -179 -315584 -568709 -280767
5632 -280767 -554011 -467336 -171491 -650711 -772835 -432305 -303232 -367377 -718358 -1074888
5622 -1074888 -983694 -605284 -405308 -804617 -387612 -321442 -586212 -345309 -308173 -262481
5612 -262481 -299445 -270995 -480170 108020 -101930 -484045 -354424 192501 -298225 -132816
5602 -132816 -9231 -550754 92823 -564353 -295946 -201341 102060 -49323 111468 135834
5592 135834 567956 -531657 -650164 -462460 -523301 -377209 -604872 -447602 -504992 -426663
5582 -426663 41140 112098 339896 568005 -18255 -44308 -398888 -57660 255143 411138
5572 411138 -665649 -401189 -64785 -978738 -1059911 -506380 -653867 -609767 -731124 -586712
5562 -586712 -188207 -475929 -678396 -160021 70770 -169388 -176024 -395112 -366709 -550939
5552 -550939 -589546 -283385 -106202 -459694 -307461 -225090 -107934 -332874 -294623 246151
5542 246151 3306 108289 -12786 192887 -261588 -90712 -552024 -31028 -769226 -73849
5532 -73849 168889 126220 -207226 -212136 464388 -79570 -378586 -767882 -476773 -83698
5522 -83698 -600078 -197912 19413 -60439 399721 120406 -94618 -449212 -198167 63372
5512 63372 -330241 -424535 -164054 -662353 -455759 -646408 -463176 -578409 90128 -316065
5502 -316065 -290177 -176149 -221118 -556374 -414776 -196216 -280120 321221 -148905 -429323
5492 -429323 410823 606941 385398 -204295 -507072 -63738 -69643 -278709 -666485 -402160
5482 -402160 39711 -370970 -382641 -578970 -221475 -513165 -573312 -261400 -87796 -444105
5472 -444105 130740 403904 81256 -46666 322216 114621 69839 357297 104683 36000
5462 36000 443441 102808 20210 69666 15642 263123 -596681 -631241 -323059 -227546 173951
5451 173951 179284 191624 -242199 -688000 -251754 -231589 -413900 -524468 -732238 -891147
5441 -891147 62793 -184684 -301476 143619 -248010 -298078 -295736 -73731 -680483 -955036
5431 -955036 -107294 31020 38466 -116352 -438892 -409748 -53135 -159607 -12607 -71029
5421 -71029 -41923 79544 39781 -644855 -711800 -372218 -104177 -197173 -297197 -394649 -33231
5410 -33231 -250300 -746515 -170567 -476326 -474392 -500122 -663616 -554478 -31332 -175919
5400 -175919 -591230 -412224 -762906 -226663 -724299 -367568 108990 -98 -412197 -140920
5390 -140920 71025 -327843 -165853 -296166 79851 16491 -36264 221213 202438 229465
5380 229465 730605 586938 104346 -199818 80650 -290432 -218761 -535999 -21217 -441058
5370 -441058 -1045425 -309268 73366 219699 247905 -246251 -385700 -407893 -252670 -69915
5360 -69915 -895310 114067 222861 -1121669 -387533 -683329 -799626 -1083574 -566201 -429521
5350 -429521 -59321 -365063 -478943 -3235 -256300 -244819 -659042 -587226 -310766 245755
5340 245755 106976 104436 -84360 43095 342879 322387 54984 -355100 -770888 -331190
5330 -331190 -142306 -440154 63874 307956 -302622 -399452 -568548 -383839 -727422 -596759
5320 -596759 -601347 -341820 -666578 -66009 271727 -382187 -256558 204559 57886 -217706
5310 -217706 -473283 -244676 -5882 8554 -545573 -807396 -397845 -194925 -290861 267350
5300 267350 -520198 -713757 -190567 -291590 -359851 119923 -191178 -102781 -250244 -121077
5290 -121077 9541 -56249 -430225 -369057 -312391 25711 272282 176737 -282451 -344105 -292879
5279 -292879 145528 530689 351383 319609 -342102 -148509 -829660 -622765 -516918 47043
5269 47043 -279515 -294558 -453756 -777947 -301618 -509657 -150003 -36411 -232550 -80821
5259 -80821 -773263 -271085 35523 -307271 302879 421111 57494 -285484 -14528 349580
5249 349580 471410 402515 -392083 -332830 19529 238865 201678 731661 198701 759671
5239 759671 644832 182114 -32240 -539280 23495 -60088 14077 -541926 -52584 -14431
5229 -14431 -135524 181815 92371 -96250 49730 456846 -131128 -328948 -157138 -372390
5219 -372390 -557862 -78773 -632563 -670459 -394120 -37316 -772645 -673293 -175242 -236983
5209 -236983 -1071856 -343463 -271820 -23526 -626585 -979814 -936664 -807086 -433769 -11478
5199 -11478 -2418 -324575 404705 613601 -582268 -290875 137617 -260973 -165799 -582583
5189 -582583 -38820 -295649 -31176 178638 -239302 264188 -513246 -659315 226394 -23989
5179 -23989 63013 195729 -36318 87524 61547 80696 -295196 -335948 -199022 -881648 -419415
5168 -419415 -546216 -566592 -223087 -448473 -684602 -456715 -283383 284317 102569 211493
5158 211493 -356662 22728 -384764 -359948 -251706 -17445 -723635 -858166 -72482 -1043147
5148 -1043147 -928432 -323442 -622366 -44991 -145173 -174035 86881 227982 -20843 237512
5138 237512 -315142 143100 1403 -37176 75691 -218571 119114 -642582 -143850 -123546
5128 -123546 -57595 -332783 -682123 -87004 -191402 -114197 27176 -342844 -686763 -559723
5118 -559723 -85315 -455899 -612480 -459592 -773932 -315739 -21718 -612416 278599 186161
5108 186161 -316004 -70079 -47620 -97931 -58403 -195104 -186036 -319192 -737406 -533811 -741869
5097 -741869 -780950 -460019 -461581 -74076 -366970 -263060 -122070 -648165 -895952 -237318
5087 -237318 -441201 -284887 -419234 59927 387289 66581 -482376 -637713 -263699 -459530
5077 -459530 -427789 -179512 -580242 -232516 -485516 -466347 -255759 -554475 -136883 222761
5067 222761 -86649 -437538 -969026 -461619 -312707 -1024156 -473021 -283433 -1393 -250331
5057 -250331 -223491 20782 -293521 -657805 -201970 70874 -41425 -21229 -188066 -255515
5047 -255515 -327273 -148357 -108588 -327375 -248451 -611214 -232507 -640291 -167204 -432423
5037 -432423 -638217 -245676 -389013 -165992 -339588 489627 189685 108614 -272594 -895935
5027 -895935 -64184 -248469 -342413 -52335 230788 344006 28366 82326 -342236 -126553
5017 -126553 -557570 -984695 -178987 -524823 -388197 -624554 -354662 -8546 -85469 -70715
5007 -70715 -227206 -902339 -410059 -163531 26908 -122615 104567 -43540 -206110 -315189
4997 -315189 -212945 -384680 90760 -132895 -308838 -785498 -556414 -500877 -538043 187286
4987 187286 -302350 -85713 17930 247931 46341 -71896 -144288 -26340 -367019 -298321
4977 -298321 -585601 87898 49055 -484976 52584 -281223 358990 282309 70166 550906
4967 550906 238847 564718 560283 -2577 -154675 -43811 320755 642766 108792 -1236
4957 -1236 71512 373818 114854 716689 895622 333417 693760 200848 -255502 -509906
4947 -509906 -792624 153328 112134 41953 -23892 -256882 -266329 259244 193124 78754 36916
4936 36916 197001 -137452 -239296 198313 106057 -14253 -448260 -737286 -32430 587466
4926 587466 683911 377060 487741 737301 432065 -9767 195285 -128886 -283883 -239875
4916 -239875 490646 181716 -61439 429041 644971 420830 676364 280297 -132635 403890
4906 403890 142424 347127 381124 91122 -17305 409304 783128 122237 57847 126068
4896 126068 -126500 169969 117429 45294 489384 -41629 298199 272169 626040 409258
4886 409258 132996 468630 450586 -213617 -488791 -137696 402926 145489 -29059 481048
4876 481048 313177 244299 -210367 114128 -91902 -7800 -218001 533573 359190 981119
4866 981119 556856 -144886 -255273 339610 500328 356133 -87842 -92430 -30998 -163904
4856 -163904 -158 269204 -71864 -529785 -111670 203380 67968 220292 527326 3945
4846 3945 331674 434726 -46237 562421 914939 364013 33289 199695 92561 931854
4836 931854 997297 328391 -181403 -402546 -551707 -315623 429880 550118 74965 -756503
4826 -756503 344552 354231 -77724 768 -68483 120365 12718 219544 401161 803369
4816 803369 629340 384582 551261 662259 634819 635884 608226 837896 374808 782094
4806 782094 1019470 1030721 1056821 785669 389266 586165 574254 345355 1120237 670694
4796 670694 868131 767757 358368 512110 1270709 1350648 1617969 1851178 1657019 1683343
4786 1683343 989880 1082635 1415602 1610772 740643 704525 957846 1270372 1064555 624398
4776 624398 1383260 1243615 1108194 929190 1209051 1175584 675249 1648178 1172678 224260
4766 224260 700014 1100364 636916 873669 778083 529725 286832 -68648 365441 110762
4756 110762 94188 315294 727846 546176 969778 869582 687443 647017 433705 182089
4746 182089 -266519 -58360 73153 377563 -317079 394240 764647 18731 -228429 214156
4736 214156 1057165 357357 491060 513991 -232577 412969 435634 143852 181448 562004
4726 562004 457881 234485 -169690 50749 -21002 -327243 286153 62761 350710 -95956
4716 -95956 12904 -173708 173171 389890 427700 788684 730768 154756 -147528 334363
4706 334363 384210 -29823 315574 666249 456237 389118 747570 392282 344988 282587
4696 282587 276098 327411 299188 343580 150443 441302 608318 323204 758344 543428 552712
4685 552712 772713 741274 581409 485615 359004 705220 859853 666619 -110747 320693
4675 320693 620742 -165401 -349994 -511202 -418773 81124 423252 441944 208700 393156
4665 393156 67923 -262848 -400973 71241 967407 740660 928784 294678 187221 992926
4655 992926 632112 396718 702343 764714 1093802 844785 582608 294759 663477 492098
4645 492098 322021 165043 -240587 384876 713374 486982 324438 435688 551965 61947
4635 61947 382031 498281 608133 476018 466691 500595 676327 1278656 791621 640946
4625 640946 823330 1194065 1228622 823680 1320472 689329 113111 545051 761382 836449
4615 836449 909650 934430 1117276 1092184 1746136 1631634 1320000 1408085 1185025 1290542
4605 1290542 1950804 2098685 2120313 2010936 2049536 2270148 2494667 2948162 2944218 3074719
4595 3074719 2941971 3151157 3425568 3417866 3496761 3284384 3035738 3527030 3047353 3289553
4585 3289553 3442063 3520320 3438113 3426492 4259736 4922010 5018261 4622172 4869859 5420376
4575 5420376 5574299 5003647 4812628 4482565 4094832 4050388 3308951 3042381 3182614 3056545
4565 3056545 3948541 3420469 3112091 3011426 3191454 3586591 2800997 2820461 3421349 3139189
4555 3139189 2752050 2738855 2598011 2727796 1923817 1679095 1948530 1695222 1015193 1272547
4545 1272547 849008 1495327 1088370 254118 875478 1395596 1537770 1562551 1443798 1193119
4535 1193119 979279 704633 1311697 1216772 1046295 753178 969830 580632 939468 1075723
4525 1075723 951626 766284 504354 599319 442552 772979 712255 566198 523300 430448
4515 430448 411410 -248334 71466 -341405 542379 1059271 718663 289096 -10429 -193552
4505 -193552 -80006 -136624 26061 -203750 -2225 202743 824025 1431066 1037951 821630
4495 821630 948568 835857 467036 759986 526136 1021052 869317 519589 466470 -121487
4485 -121487 475055 165047 540270 306750 674256 762197 390721 643432 244193 332861
4475 332861 -318729 -81368 411924 825670 344772 939049 1002311 303467 223255 1002353
4465 1002353 667154 766498 867054 795491 1072998 1504602 1087955 571488 596083 1062521
4455 1062521 955110 671136 875069 1083348 988547 840562 522380 845444 1097437 1189076
4445 1189076 914163 1299003 990899 791600 814907 792282 901501 1374424 1373750 1062474
4435 1062474 1108223 1246979 1082885 1171335 1226569 1316700 1502654 1611354 1544120 1383020
4425 1383020 1597467 1690313 1932176 1642595 1635717 1070926 740653 837771 1852062 1880385
4415 1880385 1709948 2079192 1791228 1707301 996169 971724 1407830 1802743 1836329 1589802
4405 1589802 1847082 1881215 1904542 1621256 2144784 1824464 1759742 1600526 1673298 2105656
4395 2105656 2635533 2865131 2769138 2383403 2247015 2543894 3020697 3126074 3187675 3449447
4385 3449447 3616717 3458638 3609988 4376282 3584997 3788247 3211676 3026358 3502694 4039406
4375 4039406 3565721 3227633 2957622 3507713 3032905 3227775 4268268 4409176 4289830
4366 4289830 4285319 4342360 4510864 4769026 4843019 4338007 4102319 4541642 4924882 5447645
4356 5447645 5274340 5250889 4735662 4599067 5065300 5887064 4932595 4888046 5064139 5636886
4346 5636886 5570623 5421389 5713363 5709581 5882543 5995199 6098086 5440271 5010367 5241014
4336 5241014 5143180 5023548 5111667 4994968 5089840 4989390 4875805 4874407 4989380 5082277 4743402
4325 4743402 4479309 4512247 4633986 4630312 4512448 4056902 4495792 5024815 4274459 4112290
4315 4112290 4714490 4383625 3653066 3774124 4106199 4274438 4285135 4064514 4560256 5022106
4305 5022106 5005183 4561891 5312329 5009205 5205409 5170404 5359901 5964016 5949419 5427024
4295 5427024 5197630 5321917 5240582 5638722 5611896 5442901 5966314 5855301 6221246 6458075
4285 6458075 6604324 6863692 6660901 7550814 7355652 7335097 7290259 6894928 6924939 6828851
4275 6828851 6324139 6002390 5621366 5505792 6089155 6125300 5800999 6129852 6190295 5603716
4265 5603716 5687734 5941673 6002901 5533176 5485306 5404428 5539363 5639852 5347925 4844708
4255 4844708 4928120 4577527 4631527 4082087 3927385 3993315 3960326 4010875 3805573 3455716
4245 3455716 2849448 3064493 3284110 3369240 3108881 3179953 3353465 3121152 3082441 3150454
4235 3150454 3552747 3598020 3134892 3021424 3597055 3021083 3005912 3310558 3060515 3331996
4225 3331996 3181430 3463246 3201816 3083112 3397714 3947797 3826336 3788565 3721003 3809107
4215 3809107 3075894 4220698 4800060 4944163 4985633 5321803 4973366 5223959 5918556 6296933
4205 6296933 5491644 5958628 6377386 6371471 5959753 5680590 5982029 6021862 6298220 7068994
4195 7068994 7018353 6468813 6576420 6718808 6637663 7051249 6721018 6934773 7406086 7075711
4185 7075711 6969999 6947918 6638862 6871992 6384326 6485550 6455422 6886208 6963300 6375509
4175 6375509 6641706 6941285 7274621 7229750 7314092 7665307 8062912 7157341 7972872 8314084
4165 8314084 8095622 7930342 8280779 8418407 8865058 9106824 9143299 9748090 9752962 9952532
4155 9952532 10335948 10300961 10775037 11477736 10974522 10458432 10345985 10133917 10037473 8895781
4145 8895781 8836977 8975732 8097344 7558680 7852580 7359950 7135947 7245631 7451827 7097059
4135 7097059 7019507 7188717 7022052 6428213 6295368 6228642 5646640 5619010 5637592 5112169
4125 5112169 5223580 5348005 4788219 5097610 4759087 4615321 5297105 5730284 4848808 4342552
4115 4342552 4178762 3855510 4196062 3490458 3630581 3811984 3917375 4305907 3924020 4013950
4105 4013950 4250654 3447311 3836448 4000827 3659856 3523980 3741691 3723912 3041051 2898326
4095 2898326 2755245 2640629 2835853 2985677 2941333 2894283 2948582 2636512 2872244 2604429
4085 2604429 1956798 1542334 1722783 1983259 2158156 2319246 2468666 1822914 1558351 1703809
4075 1703809 1643176 1825680 1527534 2267740 2319979 1729785 1400555 1156675 1496996 1714091
4065 1714091 1754523 1535537 1356001 1234912 1531356 1307424 1431773 1411369 1969736 1899539
4055 1899539 1472655 1237999 1466880 1692719 1311470 1748492 1533176 1433840 799192 723005
4045 723005 1035105 1261829 1462464 1167319 1292805 1401645 1708373 786158 800258 1557730
4035 1557730 1398142 1133809 310286 784481 1251962 1519459 1620632 1162060 821610 1423938
4025 1423938 1109515 1118971 942058 916390 1074203 1275848 866466 767377 1137517 1018200
4015 1018200 804096 1172558 1249288 1206845 1199919 1260876 917947 615894 372848 1108285
4005 1108285 1526257 709772 39029 360934 620291 465129 754493 1007909 805233 591440
3995 591440 808298 330354 1178277 1452488 903033 948959 726110 888437 862269 521091
3985 521091 706699 227822 326928 204909 333603 239987 236876 650134 619197 838562 244713
3974 244713 761066 676316 917273 1192212 969724 472823 329525 832912 763151 954328
3964 954328 729725 413588 1005574 710252 455594 157571 574081 188279 468607 32885
3954 32885 -316871 -35832 458407 552574 563059 492726 177081 446102 -88549 1013134
3944 1013134 617137 730296 699452 772260 710768 814579 653809 534594 567684 494235
3934 494235 306783 -961 501674 429230 -60077 798678 334443 517084 645494 680157
3924 680157 201187 624934 648598 387563 1315311 413006 7456 656652 150600 124499
3914 124499 692355 296224 40055 127522 272116 1158225 1456819 1112849 1050777 1213587
3904 1213587 1378288 897412 1412310 929749 289087 544780 986484 608347 884914 754544
3894 754544 424425 113362 360065 749465 578115 415693 630589 482423 339287 257805
3884 257805 38756 -71390 752881 1057168 716712 586621 927637 707638 661625 1017221
3874 1017221 913432 1109978 935481 638058 667886 532120 451710 245527 179879 540911
3864 540911 782116 1111571 739713 214378 189494 704548 1152255 898887 722335 1113150
3854 1113150 704282 1025754 841849 861875 1159117 993570 622704 1054438 805398 611442
3844 611442 529519 513100 736618 1213738 1537572 1420540 1311173 1486809 1361300 1481431
3834 1481431 1257162 1508423 1371867 1493348 1501274 1058221 1248543 1030344 816508 971361
3824 971361 1541290 1599260 1146487 781941 1139148 1009356 1103964 2075507 1586175 1128692
3814 1128692 1707143 1557727 1636697 1056405 993562 1169388 1485828 1351201 1053318 883060
3804 883060 921404 1279404 993303 1156437 1230297 1009434 1368268 1277527 1578251 1583854 1712758
3793 1712758 1772534 1550460 1699006 1819649 2115155 1923174 2187247 2273335 1609381 1550263
3783 1550263 1292998 1635691 1587219 1619113 1847054 2345904 2528477 2241565 2741902 2769615
3773 2769615 2460476 2470329 3039351 3074851 2892328 2999461 2684454 3298592 3243998 2865736
3763 2865736 2353615 2599260 3047252 3186302 3501708 3608019 3727338 3373093 3731293 3620983
3753 3620983 4089877 4308144 3938163 3972811 4166924 4160690 3081792 3810097 4086766 3817753
3743 3817753 3832409 4000777 3468769 3542246 3928253 3830193 3538391 3075496 3136876 3322262
3733 3322262 3553264 3498289 3257429 3422712 3101976 2951666 3799395 3266956 3143044 3251419
3723 3251419 2775736 2981523 2923508 2628583 2863066 2631978 2576799 2718048 2456661 2039897
3713 2039897 2116766 3055744 2858407 2797323 2358109 2132780 1932453 1881836 1979773 1662900
3703 1662900 1772234 982255 1954218 2175140 2149112 1993434 2558820 1678878 1510830 1858924
3693 1858924 2009666 1491796 1620394 2548470 2273265 1688814 1514890 1360794 1535202 1847668
3683 1847668 1459697 1344325 1749751 1506121 2036116 1793127 1316664 1491149 1759501 1859468
3673 1859468 1299948 1760200 1354174 1639229 2206198 1779245 2024025 1812918 1957893 2073619
3663 2073619 2257067 2011084 2357356 2941312 2113281 1912613 1814925 1864532 2145321 2293888
3653 2293888 1953841 1866501 2290311 2201311 1777442 2067576 2015152 1971728 2192303 2362899
3643 2362899 1787786 1214608 1410581 1832682 1685631 1482433 1135220 1406786 1391436 1357800
3633 1357800 1255367 1292271 1196993 1392196 1550251 1524104 1468180 1490326 1566027 1726714 1266042
3622 1266042 1602774 1754483 1734224 2011101 1664596 1757087 2157496 2151636 1422565 1185422
3612 1185422 1266933 1289112 1355526 1727630 1962132 1587554 2149407 2077976 1991768 2086436 1992154
3601 1992154 2047974 1863686 2308666 2471253 2963188 3413208 2808130 2961873 3563461 3476232
3591 3476232 3660779 3635203 2869087 3544000 3960922 3114890 3469139 3278914 3615204 4356375
3581 4356375 4265694 4256019 4550841 5040108 4562768 4788577 5370542 5209485 5314250 5680958
3571 5680958 5613223 5412116 4651209 4691144 5102213 5243632 5424678 4454686 4649693 4572987
3561 4572987 4367770 4506764 4287602 4343331 4700532 4853889 5096713 5457610 5313437 4858998
3551 4858998 5460393 5033717 4629366 4946860 5169738 5310017 5132868 5545377 5235104 4880559
3541 4880559 4649719 4365231 4766196 5124027 4955208 5340084 6079468 5722777 5580468 5916073
3531 5916073 6662725 6205248 5951812 5903498 5651227 5455879 5282608 5864359 5554862 5695428
3521 5695428 5036203 4892870 4463558 4223051 4857570 4255917 4438989 4242709 4074455 3970992
3511 3970992 4124271 4233365 3973449 3648272 4065369 3925158 3236685 2761717 2149298 2282192
3501 2282192 2488256 2612228 2635550 2935911 2570694 2371652 2338634 2747322 2247155 2300576
3491 2300576 1455032 1375115 1707333 1497282 1469632 1022633 1853849 1330063 941448 1174304
3481 1174304 1328782 1189229 986576 1380960 919549 1318275 1230799 1548972 1764391 1401065
3471 1401065 876647 1048406 993064 693102 950628 785382 502253 185921 1062094 1057238
3461 1057238 670622 514227 297763 1017870 1120383 1094717 1007746 714097 627399 -36122
3451 -36122 570775 1062698 576405 904276 1743156 1372377 1640484 1024731 120951 620477
3441 620477 922498 1075478 750989 852899 1615635 762352 845103 748421 784591 932969
3431 932969 720287 687793 409461 400576 900395 1336242 1062687 126660 416406 606473
3421 606473 478762 93435 -54840 503347 948119 1144047 1193543 1095571 868323 741729
3411 741729 1038523 1069666 1327040 193518 745907 1127567 788034 1136834 853182 936931
3401 936931 515893 60460 524914 851105 241212 607567 1046340 778991 1320938 1559187
3391 1559187 1032640 1325440 972355 1311674 749982 818950 674863 700037 1195768 1141424
3381 1141424 941900 318379 552418 1006992 1022061 907407 769100 472809 326172 916778
3371 916778 1363554 835953 1050809 1234512 785658 1105164 765287 615259 865652 1261001
3361 1261001 896281 1261159 1290315 1384388 1557279 1403502 1050203 1101668 355158 642056
3351 642056 1348842 1467936 1046271 877134 1065530 1201016 715784 1448966 1763456 1291808
3341 1291808 1008437 938898 1043039 782449 403510 760239 967896 1014321 898748 953818
3331 953818 1342681 1149003 1075757 1168833 1791959 1505853 1804966 2241289 1859925 1512123
3321 1512123 1720696 1273611 1229389 1434640 1554893 1272026 1881150 1768106 1576760 1132980
3311 1132980 1332354 1675528 1648568 1855054 1305300 1565843 877011 1207265 1698630 1597480
3301 1597480 1870850 1575807 1672915 1652974 1799143 1670103 2049234 1476624 2036658 1896283
3291 1896283 2254898 2506837 2405641 2233080 2474646 2292719 2092543 2386662 2599190 2854966
3281 2854966 2618016 2289535 2291953 3235754 3233389 3167084 3019053 3530689 3533421 3170643 3332516
3270 3332516 3360406 3893597 4409641 4352878 4763421 4435645 4871940 5002656 5430354 5632471
3260 5632471 5855454 5886538 6114280 6699209 7011527 7259160 7764921 8038797 9081355 10142424
3250 10142424 10539784 10981414 11318444 11644584 11779847 13158146 14110569 14884621 15693206
3241 15693206 16216291 16564928 17812462 19297347 19989769 20815166 21586594 22868220 23529275
3232 23529275 23800238 24409134 25282700 26729620 27100270 27752608 28614845 29551052 30160474
3223 30160474 31139897 31311467 31437594 31545106 31266591 31449085 31661769 31148043 30557185
3214 30557185 30046501 29027105 28944028 28980627 28878910 28254729 27486460 27482881 28134555 29109424
3204 29109424 29441555 27684058 25487735 23475945 21607297 19892509 18348489 17005654
3196 17005654 15929035 13928521 13235195 12974855 12150737 11203275 10667627 10596294 9945217
3187 9945217 9736562 8904220 8828654 8292219 7781308 7157075 7089519 6845630 6598891 6616490
3177 6616490 6358986 5808815 5892698 5328043 5311150 5392664 5380740 5454545 4881612 4591192
3167 4591192 4452569 4351140 4466117 4803672 4669170 5099337 5034006 4726992 4496880 4642563
3157 4642563 4338630 4442865 4338598 4190783 4042080 4419703 4829966 5240411 5609972 5246050
3147 5246050 4884317 4620488 5145545 4734630 4123752 4496598 4903762 5333282 5436053 5004241
3137 5004241 4974145 6044752 5977997 5292115 5414818 5430211 5666874 5461517 6119131 6440550
3127 6440550 6582459 6570830 6467494 6775792 7432535 7183863 7740390 7478212 7401551 7917030
3117 7917030 7768706 8362457 7747181 8430204 8823466 8961756 9796936 10040119 10687227 10939406
3107 10939406 10715443 11275904 11218088 11092161 12143658 12589875 13008349 13327583 13385433 13672453
3097 13672453 14159266 14842275 14347518 14920625 15756736 15849512 15124050 15093456 15407760 15800480
3087 15800480 15862437 16254516 16327682 16098515 15446049 16098788 16809572 16459157 16692081 16366088
3077 16366088 16879238 17106212 16801305 16896720 16990244 16121150 16256255 17015681 16504633 16677774
3067 16677774 16213584 16011266 15777421 15881688 16175782 16063536 15560321 16118041 16584137
3058 16584137 16572282 16912829 16841328 16842010 16930285 17133722 17394109 17362340 17704347 17464304 17746044
3047 17746044 18294616 18409064 18549645 18771935 19207124 19686587 20317403 20662736 20543012
3038 20543012 21505630 22167262 22244903 22831830 23426985 24375755 25037373 26444877 26890466
3029 26890466 28250596 29452944 30168221 31676099 33791000 35131011 36974429 39121269
3021 39121269 40970032 42941867 45432186 48472352 50852440 54103099 57365331 61029911
3013 61029911 64211394 67188162 71278948 74643064 78631659 81076504 82975854 83923584
3005 83923584 85255380 86202441 86196131 86522893 86792955 87026844 86218766 84997774 82522648
2996 82522648 81400295 78977602 76206941 72910885 69517581 66302356 63503094 60636658
2988 60636658 57285082 54149941 51012835 48405818 46070749 43872120 41548393 40209403
2980 40209403 38613158 36777906 35199516 33026501 31758721 30593824 29677501 28759548
2972 28759548 27057052 26349654 25674155 25392022 24475496 24123836 22585987 21391673 21366632
2963 21366632 21818299 20576944 20592353 20205841 19474906 18592255 18038533 18019237 17875194 18057826
2953 18057826 18344743 17687429 17924700 18428032 17521093 17405888 17582411 18045989 17930908
2944 17930908 17935636 18018930 17846439 17874412 17556154 17459668 17394372 18019539 18149767 18358782
2934 18358782 18275268 18514680 18590656 19347203 19400790 19680828 20505890 21438678 22425420 22763115
2924 22763115 22902892 23072340 23535649 23610438 23545707 23376843 23164956 22834403 22931701 22214125
2914 22214125 21813560 21573786 21949914 22049366 22456444 22576194 23162876 23681417 24843417
2905 24843417 25600601 26820702 27746267 28634006 29987442 32087537 33730074 36104181 38001895
2896 38001895 40105854 42518195 45181117 48537835 52170394 56481868 60969103 64925663
2888 64925663 69794958 75535361 81142921 86466103 91096834 94461046 97324002 100013022
2880 100013022 102245052 103288639 103400818 102996947 102734554 102058559 100608154 99469085 98314289
2871 98314289 97625747 96336352 93895272 91442455 88300433 84715975 80783814 77317848
2863 77317848 72569113 68146498 63606142 58957959 54792821 51408157 48239183 44892954
2855 44892954 42577259 39712386 37135211 35758236 34199184 31817258 30364718 28686332
2847 28686332 27431762 26571096 25851546 25225959 24752612 23741720 23403591 23439477 22685781
2838 22685781 23125797 22479963 21861262 22090842 22526910 22861465 23048026 22998914 23497083 24085136
2828 24085136 23571371 23773987 23641311 22912028 22032159 21170305 20598937 20005221 20176187
2819 20176187 20250055 19652893 19799325 19290508 18778839 18736751 18660050 18092584 17762492 17793638
2809 17793638 18048273 17727609 16772835 16312257 16060759 15168455 14833710 14651070 13644208
2800 13644208 13236331 13363785 12187206 12306259 12108918 11005918 10569055 10355400 9649847
2791 9649847 9720110 9390076 9746604 10104333 9029320 9384129 9288392 8833231 8908008 8774373
2781 8774373 8670576 8851780 8828901 8278964 8455766 8269754 8456553 8464930 7802216 7869455
2771 7869455 7728379 7448368 7738683 7455137 7363418 6360441 6205600 6853843 6661505 6390326
2761 6390326 5803068 5524078 5661213 5760989 5780701 5698708 5520116 5365820 5620343 5274805
2751 5274805 5109497 5052922 4785063 5305266 5709749 5687974 5386469 5030271 4937469 4983186
2741 4983186 4683158 5345895 5362607 4933230 5138295 4816303 4541769 5109686 5463262 5806686
2731 5806686 5869011 5653805 5592128 6095288 6322591 6385602 6581442 6572878 6826657 6592720
2721 6592720 7920120 7696867 7851584 8517653 8679423 9204837 9607241 9983326 10697287
2712 10697287 11982627 12311006 13322140 13931965 14119941 15314673 15983811 16501511 16943856
2703 16943856 17983403 19322742 20100573 20169345 20179404 20567415 20496969 20620160 20510655 20828048
2693 20828048 20551827 20762339 20369230 20142080 20165257 19960900 19369786 19771456 19303011 19108840
2683 19108840 19271810 19216206 19158812 19663471 20228422 20395535 21261721 22304567 23891987
2674 23891987 25302628 26446083 28359701 29969167 31730856 33903898 36289434 38618257
2666 38618257 41700251 45118350 48226333 51215398 54500892 56942296 59228518 61215382
2658 61215382 62504501 64243193 65294474 65513579 66464272 68106116 68672630 68883954 68997073
2649 68997073 68419287 68049382 67696848 66644606 65806947 64870255 63931416 63337501 63061362
2640 63061362 62954899 63150159 63730167 64354258 65835633 66842911 67951207 68996756 70536198
2631 70536198 71357085 71549953 72141519 72305998 71886314 71858706 71025932 69886407 68962570
2622 68962570 67897013 66622038 65066290 63195986 60540530 58243031 55447201 52117081
2614 52117081 48955383 46542895 43294927 40720287 37880510 36099425 34490420 32956132
2606 32956132 31119647 30085030 29237085 28403274 27163785 26893473 26165260 25747232 25321216
2597 25321216 25024892 25482661 25863514 25748974 26175725 27193504 28199349 28837774 28742793
2588 28742793 30336462 30946043 31298457 31824501 32079526 32686608 32596241 32211731 31995817
2579 31995817 32418513 31527091 31514555 30689623 30193095 29545611 28411764 27231629 25992699
2570 25992699 24708987 23598844 22890851 21218189 20144573 19623590 18914265 17913691 17119902
2561 17119902 16468104 16731485 16471806 15909403 15472152 16459298 16393116 16792929 16946704 17491780
2551 17491780 18359142 18728794 19427450 19591702 21192670 22325427 23805582 25407255 26683580
2542 26683580 27771934 29462757 31269992 33532056 36429695 38386452 41256864 43983540
2534 43983540 46937955 49516062 51499147 54361472 56873288 58450758 60487335 62227586
2526 62227586 63652717 65019645 65904726 65701960 65594795 65081358 65028149 63969017 63155497
2517 63155497 61928237 59810053 56644925 54140758 50881256 47762418 43926336 40539719
2509 40539719 38221609 35522874 32510213 29877004 27649575 25432791 23528669 22045597
2501 22045597 21327031 19283525 18509586 17443669 16392511 15798321 14775451 13975962 13682767
2492 13682767 12836668 12356474 12242558 11873766 10952241 10411953 10111471 10785522 10496190
2483 10496190 10654520 10428107 9638414 9482729 9744723 10252653 10377202 10368368 10275925 10360373
2473 10360373 10107206 9011626 9381037 9301870 8768713 8060106 7766789 7405808 6348406
2464 6348406 6011416 5866150 5954792 5252295 5841226 5679841 5472494 4614587 4930355 4994071
2454 4994071 4573496 5146416 4578263 3882727 4103409 4096858 4320607 4240982 4275986 4254107
2444 4254107 3866320 3807123 4119027 4285466 4420593 4048182 3326009 3381906 3674010 3999516
2434 3999516 3749189 3802483 3586973 2592313 2644284 3326253 3321999 3226732 2851786 2992900
2424 2992900 3393673 3651438 3089157 3070544 3559122 3983637 3754631 3254408 3578233 3637648
2414 3637648 4085583 3972100 3721647 3642571 3409030 3534167 3925506 3894907 3836824 3872472
2404 3872472 3505729 3664703 4554608 4743585 4385001 4085068 4017305 4163671 4234755 4622769
2394 4622769 4378614 4794276 4931015 5121162 5001875 4145381 4430137 4603260 4445742 4950107
2384 4950107 5204842 5151131 5528949 5862811 6300549 6311085 5876096 5840551 5897296 5948170
2374 5948170 6045810 6775982 7070530 7232920 6954834 7847847 8159498 8128595 8165542 9096206
2364 9096206 8891681 8863621 9360359 9499092 10556490 10328086 11328648 11769403 12138922
2355 12138922 12855412 13482435 14330173 15447978 16057386 16847429 17564804 18159682 20014720
2346 20014720 20977363 22442501 23979570 25772270 27400469 29171684 31345273 33687404
2338 33687404 36351878 38843454 41771121 44779849 47779366 52149835 56447739 60943821
2330 60943821 66294003 71569969 77070801 82324614 86714259 90067426 93435123 95324019
2322 95324019 98002155 101759740 105769659 110828206 117739249 126018503 135352072 147585379
2314 147585379 161637393 177153737 194676025 216083222 238913788 261650254 281650534
2307 281650534 293907033 295825966 287591281 271416084 250017940 226502460 202784258
2300 202784258 181302316 160986527 144025047 129844076 116169246 104965051 95405955
2293 95405955 87363234 80249772 73586163 67397955 62262569 57964558 53526626 50066967
2285 50066967 46555264 43953910 41622471 38716691 36183656 34505483 31667748 29462492
2277 29462492 27812978 26454497 25263189 23521738 21888651 21138478 20328424 18966652
2269 18966652 17771864 16761814 16310864 15767870 14924681 14309947 13145181 13028257 12309222
2260 12309222 11882758 11748867 11382423 10702246 9695510 8840474 9024577 9036290 8471412
2251 8471412 7884226 7646957 7808249 7455245 7227115 6955956 6719954 6756927 6156667 5750470
2241 5750470 5442336 5479766 5062961 4962549 4778579 4758120 5189342 4481032 3720828 4066017
2231 4066017 4490738 4430941 4029172 4024970 4108539 3680699 2963194 3429366 3396819 2994817
2221 2994817 3086557 3016269 2863008 2950045 2580392 1952965 2462514 2515307 2801640 2600599
2211 2600599 2689266 2460768 2109106 1746397 2239051 2001713 1969759 1868285 1997930 1823764
2201 1823764 1653376 1212377 1258733 926345 1176274 1218300 1725179 1506041 1421732 1662509
2191 1662509 1725139 1353143 1231689 1598136 1440587 1535503 1069130 1168400 986830 796781
2181 796781 922684 1531004 1456566 1263274 1200583 956220 1160239 808103 691348 1063043
2171 1063043 1219120 1064834 956901 690227 13318 205373 1112904 884842 1110114 636399
2161 636399 470730 469426 154155 420654 664714 207675 473242 278273 98953 -73608
2151 -73608 110003 -19223 398544 445254 443423 549283 105058 137344 77814 -424376 -40238
2140 -40238 -48207 311929 761671 593386 108720 -6947 345312 -84727 219550 483707
2130 483707 391888 451095 131983 799171 1095952 397666 312204 -199510 411714 261434
2120 261434 226521 415843 494932 204673 741732 462958 939430 926248 782546 278922
2110 278922 430757 575627 901220 820729 752316 231736 673688 1260859 1781142 1199694
2100 1199694 1424868 767422 859527 1590449 1183589 1551770 1611453 1537113 1604468 1496513
2090 1496513 1168172 1345324 1317898 1364525 648173 862321 606001 26867 36710 597348
2080 597348 831817 349930 214527 591845 958951 1052295 668687 527964 440398 526995
2070 526995 319338 214660 -342471 -167308 241874 443971 -175248 -468187 23581 67668
2060 67668 496738 240696 100101 -313789 -7498 667115 39666 -410133 -105083 48047
2050 48047 5924 -288 353608 604931 601331 33473 -325799 443364 72652 -4626 85727
2039 85727 -108731 364434 -384702 -623388 -260705 128081 568721 841993 599576 52770
2029 52770 83326 458852 -234278 -671649 -82638 -338692 -173234 -4084 231641 318434
2019 318434 363111 -464990 -821746 56099 561192 -24176 -375645 -776590 -136273 172040
2009 172040 356533 1053748 298298 24018 -91926 -52444 145624 68742 -406275 -328387
1999 -328387 -85978 -241008 354442 492645 -201925 82317 591588 296167 16059 225134
1989 225134 281881 -250920 -42897 198324 -385714 -620954 -278293 -389150 -226720 -72440
1979 -72440 -752662 -337707 -213349 -533295 -457988 -190554 131560 -234897 -241038 -170858 165186
1968 165186 -52092 -433115 395970 438737 122641 345169 -89424 -112902 710860 382389
1958 382389 184560 182378 -96801 -136491 -121427 -501801 140788 -65966 518404 804929
1948 804929 646193 358204 502596 619236 245245 292959 -138790 362251 -142502 295781
1938 295781 706740 803643 805079 330632 487875 -95514 37418 1241562 245459 315085
1928 315085 797868 330746 -99311 -92899 -264433 236028 796676 729838 138343 87413
1918 87413 197443 981763 410157 178694 116460 233881 340428 -315335 231498 68973
1908 68973 -2991 64401 285261 172205 712223 655978 360009 -374788 -375865 222401 91602
1897 91602 -211648 -310258 25780 92650 252170 109337 68540 -327651 -345445 -57141 201720
1886 201720 341228 366505 96882 -247501 -13878 -376383 -315129 -233840 -278358 -491663
1876 -491663 -76715 298520 -47065 -383136 -589890 -81107 510842 560478 508244 -224501
1866 -224501 48695 54381 168218 149933 -197324 -28650 -316925 -86792 -202601 426299
1856 426299 269268 -100522 -568294 -322987 -361613 -81204 160785 -152994 74589 250186
1846 250186 -280055 -293322 243905 -42856 314176 -48015 -551199 247605 -409645 -267137
1836 -267137 204604 -262664 -85265 -467644 -114171 -476503 -115405 120346 128246 403428
1826 403428 562145 63667 -328875 132921 938681 729632 530300 605429 583556 -60182
1816 -60182 311252 754281 578075 546651 537124 407065 660883 786207 -669137 -318745
1806 -318745 -47447 244878 217255 551878 565127 26537 -569580 -487946 214944 512586
1796 512586 541480 177497 969396 1309585 1103703 387794 326988 155585 211567 11434
1786 11434 -212414 271201 1044153 1333157 848376 379295 395749 842680 807586 9739
1776 9739 454682 481888 446784 610591 654955 529882 536205 947635 752018 577122 740375
1765 740375 1149700 1186516 1061508 746710 792903 1677920 949869 1494228 1899912 1555248
1755 1555248 1347943 1840259 2597717 3023920 3309171 3100114 3328105 3722426 4224853 4485490
1745 4485490 5655774 6512154 7934968 8864736 10280251 10774410 11567505 11908150 12764942
1736 12764942 13770987 15659838 17490342 19071192 21148635 21903444 24383233 28155845
1728 28155845 32957151 39107893 46254556 56421955 70544697 92508364 115460926 116349326
1720 116349326 98599134 81235295 66881791 53116571 42542127 35084877 29688463
1713 29688463 25790944 23192133 21551492 19502762 16898057 14877017 13387412 12200399
1705 12200399 11254601 10029431 9664191 9150769 8300157 7990789 6963301 6469864 6168212
1696 6168212 5537095 4993287 4425309 4305023 4041803 4488466 4091000 4041526 3419150 3402294
1686 3402294 2779396 2783897 2484006 2081031 2288948 2022266 1766862 1589840 1649693 1610301
1676 1610301 2274275 1887918 1908191 1882859 1662151 1776344 1405714 1633811 1766390 2005752
1666 2005752 1437791 1837008 1790904 1130492 739986 799429 782112 1172028 1154213 578578
1656 578578 1293126 1011628 533064 540756 543342 648388 198814 213754 -358590 -60274 414194
1645 414194 98745 71553 251890 641616 -307415 -64267 132988 676085 446669 526410
1635 526410 669109 106280 432110 624162 425261 584997 344246 446035 453012 -564763
1625 -564763 -472307 -57686 404024 278113 174767 11162 -159319 343059 -87177 -7297
1615 -7297 235917 -101092 -127817 239323 -288816 -409418 189442 -138416 229363 421040
1605 421040 382827 -60765 -66512 660125 224440 256754 394605 504460 267296 -126005
1595 -126005 -18458 -221829 46681 260859 -237133 75035 77140 -202712 118299 104100
1585 104100 -253754 -283550 181706 -180863 -350631 -651249 -664584 -366041 -151364 809609
1575 809609 85688 150524 69530 602211 263240 381715 105526 115340 -195532 49459
1565 49459 167929 -376246 -221158 -175787 -104977 204467 572577 70566 -138452 -110635
1555 -110635 349382 -1318 -169746 -336053 -795220 -209442 131947 318698 80298 -329941
1545 -329941 -352783 -528497 -435897 -563202 130877 899681 237139 -296433 249686 -71006
1535 -71006 -735834 -79915 38222 13331 -554203 -501994 73233 -488457 -375589 558032
1525 558032 373211 137231 798727 274664 91981 214188 -402529 -433101 -328903 -701365
1515 -701365 -733358 -404029 320511 -23767 -286469 114097 144003 -296095 -258624 -25450
1505 -25450 247423 -218401 -473550 -71856 256244 345682 202808 -176209 -272586 132445
1495 132445 119628 154391 -543344 -676738 -454139 -375752 193968 2003 495816 406335
1485 406335 222500 -393137 -168942 -94991 -97171 -76096 69702 -603689 -206034 -249812 -161214
1474 -161214 150767 -253374 445536 -98657 -152515 -210670 -720947 -404364 -609628 -230022
1464 -230022 -915703 -392613 -428276 -252025 -301199 -217872 72711 -111746 53517 -177512
1454 -177512 265779 -230986 217653 -376049 -762283 -158270 26546 66792 -541490 -470598
1444 -470598 313931 251768 78132 564459 55109 -507323 70227 -263454 30796 -308786
1434 -308786 -380645 335243 452400 -127836 -390655 -306449 -42136 -473903 40949 441019
1424 441019 219968 126518 275609 52003 -291792 -269933 -732093 -149463 -135559 -738473
1414 -738473 -476057 -53697 -227120 -330383 -145368 -183676 144249 181440 364337 -142234
1404 -142234 -518523 -221216 -410564 293073 50981 -185872 -15819 261858 279513 -425540
1394 -425540 111326 384928 230503 -197582 -211767 84169 49601 -358923 397919 343452
1384 343452 57441 -67848 -21337 198348 -474925 -107023 66772 76982 -190658 197965
1374 197965 52467 -80174 -268341 -15178 -31947 -582385 495921 293075 -110590 -117374
1364 -117374 -205308 -583117 -402728 -397168 -219535 190571 420579 -37673 -203777 -133879
1354 -133879 181967 542173 25321 -242629 190016 -192082 -742316 -270977 743383 499993
1344 499993 -159644 251668 -313806 -393995 -230723 -347440 271600 360574 13599 102955
1334 102955 434996 218904 216695 271677 -10412 34618 -11803 -88079 -155099 -178602 -220738
1323 -220738 -211051 -354989 158992 -196227 109485 -357731 -593845 198014 489785 94353
1313 94353 -373244 -168120 -390994 -808207 -14689 534669 -56071 -427520 -642433 -958005
1303 -958005 -456401 -225730 -155088 -481006 -166523 -149997 -122540 -403076 -413538 170892
1293 170892 -230750 594877 301638 683305 137286 -81822 -288858 -360534 -271910 -194661
1283 -194661 -525752 -307677 -169349 52302 -167208 -527419 -436392 -354195 -435802 -519469
1273 -519469 -54690 -459677 -248190 -153401 50576 -338854 -76690 -4033 -68244 -461045
1263 -461045 -217848 285007 369813 -357853 -49132 381133 -104816 -429772 -305778 -34768
1253 -34768 -358897 -303882 -367846 -453195 -461753 -530754 -447517 -12016 55500 -267565 566971
1242 566971 581177 602610 504262 618559 667843 433328 310317 -132604 -247912 -327994 -389258
1231 -389258 -764919 -303174 244011 -19327 -260800 -291210 -47068 -26410 -221435 -146257
1221 -146257 -340227 -515851 -1029784 -609011 -484923 -580833 39507 -176689 -1088129 -742782
1211 -742782 -693804 -233943 112176 -394655 -27214 -26064 43422 116350 344954 639869 296745
1200 296745 -2757 100257 -364223 -159485 -889246 -407333 560100 253455 86122 -120553
1190 -120553 240397 351159 -186964 -597781 -134773 -564541 -737590 -272660 -122411 -232802
1180 -232802 187058 388043 6380 -6102 437556 333795 40117 -29143 -337494 64800
1170 64800 -214167 -199878 87163 -219687 -485176 -196438 -395870 -687724 -512221 -498158
1160 -498158 -277838 -187421 228342 128940 -205077 -40423 -505086 -245979 440270 341868
1150 341868 257630 201281 432344 371259 560812 342639 645158 -76291 -202228 -468437
1140 -468437 -41012 -435004 -190049 435534 7505 -23182 -204420 -34468 -300817 -179512
1130 -179512 -172249 -495087 -538185 276306 413941 232303 508079 -490832 -1063353 -366988
1120 -366988 -86896 -163946 -213895 212869 181470 264140 266133 -438072 -566465 -421895 -622020
1109 -622020 -14654 -310356 -150616 232216 -332481 -415972 128 -277830 65145 176579
1099 176579 74744 -417528 -440186 -63816 245662 150083 -240010 -237752 -116516 -306606
1089 -306606 190908 545921 115467 -420819 -12998 -155168 -195579 -1345 -463903 46773
1079 46773 -13738 -158370 -272921 359805 473207 -65956 -218448 -284718 -25161 244346
1069 244346 98502 342052 306886 418061 185970 307427 563802 -366500 -184394 46254
1059 46254 90138 29527 -420317 51474 -43928 -213691 -118216 -8587 -526490 -482281 -132081
1048 -132081 196005 -6582 269181 847401 497208 87504 236249 -163745 -231893 -83030
1038 -83030 -842501 -21824 512132 219193 -344753 69572 -75551 -29673 -469347 -763986
1028 -763986 377606 -239592 -109690 -89527 227003 95122 -92734 21549 -628613 -68204
1018 -68204 -18591 -310252 -589113 -345426 -328367 -693840 -119252 63021 107986 180155 158758
1007 158758 2210 -288731 -437522 -207924 19546 168186 242673 652384 785187 420507
997 420507 -93468 -30461 49150 344427 241239 -80165 -211434 -206321 -134956 -420634 -393237
986 -393237 -19762 432950 312988 -138600 -257909 93726 117246 148290 641425 545285
976 545285 130703 655330 276149 140867 103949 -189121 -359496 -285702 53910 -87999
966 -87999 -25879 -297081 -714301 77193 535290 77155 33694 62262 -59084 -279025 -382715
955 -382715 -329507 -312137 -392896 -272864 -81338 -703462 -153667 352490 24688 -129376
945 -129376 -442478 -634025 -43758 -907 -22897 -153943 12937 282628 240432 461855
935 461855 387612 -345830 -575899 -802303 -786808 -379196 -91471 -393071 49129 647003
925 647003 658282 522238 363263 -261296 123986 407699 11685 62016 -264647 -99207
915 -99207 -326834 221285 31866 49329 111677 250570 -118920 -244934 137858 467110
905 467110 307644 -281944 -353723 -423000 -234705 -281596 -40584 559989 511604 373777 175937
894 175937 501029 186157 -399742 -493734 188718 156934 55093 -268729 -386803 -84447
884 -84447 -764987 -355244 241265 221446 405997 -75229 126994 723826 529308 -125513
874 -125513 92810 -171392 350343 350026 -89147 -238221 -122722 -97913 -899009 62255 -390540
863 -390540 -423227 -376806 -8221 -673143 -661413 -36499 -137725 -568336 -477753 58417 -30219
852 -30219 -374253 -268572 -298290 -206861 -280058 242147 162721 -15463 -434726 19258 -276118
841 -276118 -739637 -647393 -549032 -273988 -50214 712178 494484 -295431 -87700 602186
831 602186 582200 270693 -237181 -60202 206207 -143845 -21798 561699 314616 384596
821 384596 -266960 -43775 -223445 -541504 -570237 201912 -35286 602733 -253557 -230630
811 -230630 -283256 -262505 151547 120541 172066 282359 412912 193997 -263325 -482576 -292947
800 -292947 257597 62754 -313892 -38175 332724 221107 -167965 97749 239513 282528
790 282528 -60409 -11169 -129861 -56792 -52161 -118683 -865863 -665933 -407787 -355372 47079
779 47079 42423 -496213 171374 91677 -626392 -443833 -508445 285520 -18981 205786 -203231
768 -203231 -470863 156886 236817 -183858 -177207 -329748 78633 -29443 -919128 -277426
758 -277426 -553512 -185660 389679 541294 88713 -353181 -163783 -254394 -129394 159678
748 159678 580339 869407 30945 22707 288875 55651 -663116 -210297 -598898 -557973
738 -557973 -316471 234819 655860 858423 412684 411550 718730 363392 629587 465050
728 465050 -203307 -460085 -161662 129203 89884 98166 409747 312181 45713 397981 252938
717 252938 191095 131731 -90190 82396 517543 504327 56348 -151825 -61223 613487 509250
706 509250 1129324 748259 -30104 -152791 -225619 137502 564635 584856 -288567 12856
696 12856 -321970 -90545 -197654 -245864 -132567 -64988 128397 -71840 65704 25110 -186524
685 -186524 -160197 428315 518700 219889 119115 326321 394180 33191 -48537 -152346 62790
674 62790 -189184 -78642 -308566 -170578 -83404 -272721 115639 166989 -53979 -31496 133559
663 133559 -350992 137460 82287 -144754 286661 228362 286942 493846 398487 582759 354104
652 354104 201856 62811 -26676 -359328 215043 479024 -182623 -567260 -90371 -48016
642 -48016 -414361 -405361 -188860 -304724 522844 -299957 -434139 180652 556277 370414
632 370414 181252 452080 631758 215493 381710 107964 497837 649236 200050 415521
622 415521 232280 -824 513348 107457 -42120 36418 30641 139412 147882 -254787 -319544
611 -319544 246118 191979 501760 287658 -32493 393888 269384 39967 443618 -198813
601 -198813 290692 -292820 -42596 -112381 -152062 203519 53057 -20289 -435968 186747
591 186747 324632 -60234 -361022 -285679 -236769 -322600 -182954 -548908 -323323 -184169
581 -184169 -546381 -536087 -327398 -892719 -439447 142116 57674 -69644 -142995 -39560
571 -39560 -69683 -52095 -23516 -446023 182661 -54892 73051 586576 309362 -96728 -43582
560 -43582 30773 94247 -238557 135210 341472 -45644 292816 645771 508889 -17435
550 -17435 505653 117433 -549527 -447204 -289528 -394726 425212 329981 11659 -800069
540 -800069 -386826 181855 72112 671715 1052117 9352 -494616 -494436 359000 648923
530 648923 996989 475785 -101039 -307411 -612603 -445121 -939063 -615780 -88247 235744
520 235744 471119 215840 -68809 -74772 -6781 249710 377776 351887 -49126 -662275 -796108
509 -796108 323691 76869 -34863 167249 337917 311206 -47481 -324986 271097 -7282
499 -7282 280732 220166 -238283 48020 -58138 39172 -495417 -616789 -101327 17001 98099
488 98099 60747 467925 57169 73838 -15328 -162408 -786890 -66898 -27909 299081 -53023
477 -53023 210375 688091 -150708 63333 -434071 -339066 137431 578002 380966 -95777
467 -95777 212851 97857 -326100 -47149 344753 365833 -301654 293487 676073 70765
457 70765 41212 227935 292927 392060 317037 8207 77339 378089 323032 -31610 -203322
446 -203322 230075 275806 165489 366576 -135929 366237 434696 476471 305310 -64145
436 -64145 -69243 -573922 221346 339060 416439 -31192 90350 -58016 -8999 -218682 -307062
425 -307062 -521229 -162024 189163 -42702 310769 397871 -168540 99317 -167690 38320
415 38320 354786 -9387 -251334 -198493 237886 195130 37413 411456 -207524 -402246
405 -402246 -360958 -228709 -870928 -780728 70473 2652 -706989 -610779 140903 -414810 -254367
394 -254367 -444621 -99854 131926 156510 480172 56230 -408715 -85757 -44850 -471113
384 -471113 -169684 -95912 282232 -570658 -354301 -83601 -44108 -58059 -215246 39369
374 39369 202269 490417 -284196 -635693 -429214 -209205 -343828 -105040 -115673 -235769
364 -235769 190046 98735 -403880 -668683 -473793 -2994 -112708 -31931 -245339 -104664
354 -104664 73307 -386560 -1022663 -136900 21697 220576 232782 157582 121206 -279227
344 -279227 -614209 -194357 5006 381669 221406 206174 -541869 -360543 -593356 -150829
334 -150829 -141931 -168655 193024 -387050 -399948 -588891 -207214 -428522 -721583 -150379 286685
323 286685 -224901 -475112 44549 -542838 -433997 314873 -25271 -197094 70379 175477
313 175477 -463696 -335695 -109496 -147196 -221371 -115735 58289 336325 468645 -135666
303 -135666 -306318 -84413 -243568 321144 2045 -66954 -613368 -340011 -254744 -982166
293 -982166 -876010 -242172 -276734 -171592 94867 89238 -289309 -802092 -721111 67810 313326
282 313326 96052 -842861 -743580 -374302 -509 126079 -196209 439462 -90311 -571740
272 -571740 -598980 -547205 92209 -116412 -451074 -409995 -420276 -78418 -436879 -70753 -88802
261 -88802 -304423 -518602 -646525 -184819 -415188 141765 -87600 -330026 30582 -532592
251 -532592 -436206 -284649 112618 323230 82131 176934 365823 447749 -79890 435068
241 435068 -334618 -204309 236493 238837 -203359 -214204 -613305 -470154 269696 238206 -118281
230 -118281 -450058 -615935 -90383 200254 364694 340115 398008 -18467 -257210 -586573
220 -586573 -804406 -504117 -795301 -435288 -404891 86368 -259920 -90721 -405480 97244
210 97244 -208114 -325203 -70472 -302692 -676595 -31911 -290088 -349578 49197 157168
200 157168 130723 372075 235358 73958 -137152 523961 -174392 -277440 14399 170725
190 170725 519311 256363 332070 226449 -164810 -515694 -536354 -520614 -511743 -205628 6475
179 6475 62043 -67560 -120469 -174995 80248 173363 -198666 -231088 -273527 277167 181289
168 181289 5965 254342 -174769 -183298 -333324 -66052 -100267 -73754 -124014 -384909 -411153
157 -411153 -315990 97163 -398287 71551 506546 601934 101087 -117152 19498 -409181
147 -409181 -180627 -240262 -508191 -191334 -336863 90191 -61130 -233109 -389929 13969
137 13969 -139406 -625727 -708557 -315476 158798 284287 -130415 -303390 -159933 -138078
127 -138078 -632817 -289755 -30939 19122 -7550 -133969 -259307 -203724 -226773 -649070 -502587
116 -502587 -546687 -555724 -214956 -532984 -229606 -13453 -394775 -160823 -469659 -328933
106 -328933 -443068 -483670 88145 316376 463811 383825 -302045 -167032 186473 -317957
96 -317957 54099 132774 -110597 -644461 -435420 -516992 -432442 -375132 -393402 -322040 -1017529
85 -1017529 -589429 -53765 -53982 60900 37425 307766 -1021 -423934 -824213 -647376 -332929
74 -332929 244205 277282 174138 259529 86068 334996 169755 -50126 66328 97701 136821
63 136821 100999 -300916 250999 48352 -38196 98739 358704 120419 9713 107097 -110224
52 -110224 -115287 -368039 -201359 -321524 -699151 -953882 -375620 -195848 -158780 88694 204895
41 204895 75428 -274176 117342 116950 -81027 173331 177975 -128723 223273 -83826 44757
30 44757 -194369 -463290 -39080 -73364 -607967 212373 561391 274375 21792 -234834
20 -234834 -9805 -169369 -328571 -143742 -153732 -436664 -244815 84394 -14603 -92867 122221
9 122221 -230124 -314170 -360143 -364791 -281100 106402 -48335 -259496 -510831
0 -510831
$$ Imaginary data points
##PAGE= N=2
##DATA TABLE= (X++(I..I)), XYDATA
16383 -1747748 -1292456 -1401681 -1634256 -1499259 -2066952 -2031404 -1759809 -1566879 -1375140 -1869884
16373 -1869884 -2133333 -1841078 -1833547 -1474916 -1480486 -1303548 -1550944 -1503110 -1271653 -1432613
16363 -1432613 -1815878 -1098394 -1282904 -1262326 -1526332 -1417374 -1425936 -1324094 -1342469 -1773136
16353 -1773136 -1544999 -1477989 -1077556 -1195763 -1122375 -1063916 -912746 -832501 -749005 -979399
16343 -979399 -1353886 -1381047 -1228442 -1027058 -1073807 -1163481 -798715 -799294 -1075105 -1471380 -1273405
16332 -1273405 -1198504 -814150 -842919 -799793 -524862 -851053 -325582 -910082 -863297 -556112
16322 -556112 -595810 -279257 -598407 -648357 -457848 -514293 -694217 -333137 -398043 -673896
16312 -673896 -809777 -440235 -732788 -1039781 -571198 -455616 -264961 13663 -597416 -597179
16302 -597179 -188204 -546207 -375765 -227516 -211177 292982 -152486 -498675 -96544 -180477
16292 -180477 -332903 -623626 -589648 -247223 -391049 -559786 -428384 20901 -171458 120303
16282 120303 -216782 -152498 -293517 -424725 86202 426847 104659 -186694 -223822 -573129
16272 -573129 -254755 137701 256903 125255 -100763 -187651 -37288 382863 -127005 -111642
16262 -111642 -425813 -226968 276275 153328 243778 305792 168324 -191770 -60865 201740
16252 201740 23987 1695 -211713 212471 499925 554064 806657 660908 507958 590296
16242 590296 137253 244689 -314985 409220 213890 283981 790161 747524 116180 710910
16232 710910 1201011 178893 673837 652732 940908 805798 1013796 673817 814857 826239
16222 826239 402170 220516 678501 756632 546775 45070 88126 18882 1473 167004
16212 167004 679299 805374 914335 720107 697650 715376 399448 392771 971988 1134702
16202 1134702 943271 933462 761183 1000519 661089 1123268 1864941 1378513 1192142 776816
16192 776816 1243986 1160047 985127 1239723 512447 564516 1057836 930803 649025 589645
16182 589645 1031440 550328 681000 1327252 1316475 1750489 1334047 1046745 1338055 1062575
16172 1062575 1369207 1197356 1001394 739829 984187 981122 1104246 1145713 1181565 1334767
16162 1334767 1294139 835708 884359 1333346 840004 451682 1078496 1314028 847348 1252235
16152 1252235 1324906 697028 1262727 1063135 1128068 1474134 622471 632815 746984 629338
16142 629338 755973 773981 538814 871006 1254237 840170 747604 739880 1395204 1260848
16132 1260848 607327 693070 1180166 1012455 855439 835932 1056972 1480876 543252 395198
16122 395198 424070 700253 1000816 1011539 999397 702851 836137 1099381 896743 1417829
16112 1417829 1069622 1210693 887344 913543 718726 1087780 1743680 1593109 1240909 1095270
16102 1095270 1298237 1335499 1154460 679457 912924 838348 395117 569199 685281 1044032
16092 1044032 1179841 1653516 1598765 651032 858322 1184442 748853 763836 1501777 1368934
16082 1368934 1359989 1605678 1419385 2075703 1933754 1102004 1202366 995586 852225 860009
16072 860009 581671 605167 730899 877894 1223170 943606 768488 1320214 1069856 1339567
16062 1339567 1639008 1452705 1682184 1032153 750621 837745 674278 1006853 1877288 1256640
16052 1256640 897059 880361 981942 1016775 1286903 1373821 249590 520847 878404 892032
16042 892032 745727 757551 923743 1654192 1768747 1608146 1851000 1561053 1030157 837498
16032 837498 1196559 1153619 706307 850620 1352658 821312 998930 978740 1098919 1246613
16022 1246613 1594534 1011089 1566886 1356210 811521 1020482 885374 1116422 441602
16013 441602 1221777 826458 879242 1279892 1441452 1382825 1253444 460580 1161619 1069349
16003 1069349 1123037 602649 335160 877769 1638875 1557762 1729956 1743647 1539507 1233236
15993 1233236 1334038 1916656 1760165 1437060 1792232 1658273 1724798 1785237 1751476 1854817
15983 1854817 1404817 1118379 866759 951400 1102540 1292824 1703300 1335249 1041036 1320657
15973 1320657 1654296 1304977 1398605 1719941 1334160 1077972 1141272 1412129 1244655 1486443
15963 1486443 1028419 1300418 1338689 1037201 1327155 1568205 711149 1245087 1438789 1557685
15953 1557685 1049993 634186 1020385 1335554 1182799 1608488 988764 1238528 1331512 1269170
15943 1269170 1248545 1054992 1370391 1534062 1684531 1772526 1310557 1269317 1055180 1231693
15933 1231693 1460753 1352257 1098174 1338787 1440724 1469583 1073931 889962 1393962 885215
15923 885215 815509 1140802 839909 1240500 1170429 1292365 1480905 974284 776163 1252241
15913 1252241 993003 916797 666788 408863 1514094 1717284 1472364 1568130 1205746 979189
15903 979189 982945 1633887 1421413 686124 1052757 1429293 792786 949500 1224158 1357790
15893 1357790 1528807 1429408 1716346 1656791 1149368 1572670 1389982 882423 1242568 1247935
15883 1247935 1051576 1105205 1296471 1450202 1610072 1339845 1342374 897384 792049 952475
15873 952475 1552835 1008666 752780 1415242 1289532 1096535 1013124 1416716 1357170 986525
15863 986525 1349073 1170635 1373019 1524163 1619110 1357262 1883504 1621877 1585457 1730808
15853 1730808 1304040 1014079 889944 1261972 976487 658112 1560433 1065636 1346687
15844 1346687 1240615 776805 1529930 1550653 966231 1459529 1624292 1327569 1188759 1228637
15834 1228637 2211158 1873093 988161 1704394 1055706 1022390 788774 1067398 1737962 1533205
15824 1533205 1295008 711078 958717 1263279 1459965 1059344 1225175 1547053 1829536
15815 1829536 1354443 1421848 1229217 996475 1569596 1360302 1376482 988199 817578 1105465
15805 1105465 1396919 911218 1228051 1179152 1000647 2010475 1341266 1246323 1092875 1631532
15795 1631532 1778994 1743229 1570128 956601 870744 940961 2150234 1568709 1609385 1559247
15785 1559247 1206391 1112865 1447225 1494440 1552466 1358835 953879 1033579 1731943 1525573
15775 1525573 1011381 1534351 898162 1085000 1094712 966898 1363289 1639719 1394473 1175391
15765 1175391 1357057 798953 897705 1454507 2164949 1806857 2128293 2113661 1848832 1222689
15755 1222689 1653960 1780739 1100185 1582222 1109574 1543575 1514551 1305725 1198361 1740670
15745 1740670 1827166 1849061 1532360 1385912 1623046 1669207 896546 1034904 1756714 808425
15735 808425 762288 943917 1427204 2124099 2195929 1273572 938212 1546530 1587766 1157211
15725 1157211 1660296 1344269 1059492 1756740 1149573 1627519 1537828 1727983 1378012 1413792
15715 1413792 1023780 935738 1092134 1234688 1147118 1106426 1048228 1005652 1236165 1887455
15705 1887455 1803703 1437874 1838956 1759158 1638738 2295960 2227257 2098637 1208033 1570330
15695 1570330 1427808 1378571 1540883 1028211 175165 599332 1298492 1291963 1715206 1149278
15685 1149278 997324 1296473 1077739 1147547 1120419 1195484 1262614 1146781 1228737 1633499
15675 1633499 1660845 1461533 868223 562361 1086087 620724 1248140 876303 692551 1107215
15665 1107215 1198280 1347709 1349205 1918422 1636951 1331635 1577579 1805841 1863764 1685295
15655 1685295 1882247 1428044 1145831 892049 694056 855041 1368910 1139277 947217
15646 947217 865695 1402550 1904959 1741034 1506265 1253402 921538 1035644 832297 828636
15636 828636 1474993 851044 1105817 1394211 1299252 1643928 551325 1083956 1170900 1143152
15626 1143152 1375348 1188116 1047834 1914283 1586324 1337679 1587213 1319247 881304
15617 881304 1385254 1721042 1549822 1701820 1649311 1876355 1471002 1383696 1441439 1337286
15607 1337286 1691473 821685 1199760 827963 781090 1421343 1197017 1268335 1535076 2118705
15597 2118705 1944663 1402700 1032199 1107711 1000946 1046560 880467 1153634 792675 708302
15587 708302 1037877 1501660 1163864 1204062 1360098 962086 1595739 1764388 1305321 1901345
15577 1901345 1389998 561326 824463 915268 1134305 1566769 1072769 1173932 1409553 1452197
15567 1452197 1492482 1545197 1423022 1551112 1535956 909264 1055613 893060 673713 697314
15557 697314 758098 319592 686698 1731903 1173985 1009052 584329 802482 1407285 1448798
15547 1448798 1227489 1343931 1512160 953089 776054 887209 1591573 1020724 368917
15538 368917 793575 462365 678886 871743 1160854 1376917 1326124 1681143 1073342 1185435
15528 1185435 1180752 1181762 1119479 1481109 1227162 1205874 1281839 1447281 1037823 1471642 1347501
15517 1347501 1618846 1577885 1097780 1335165 1079193 1146478 1346470 1400479 1193386 1563715
15507 1563715 1087034 924012 1278170 1111343 825180 1086406 1156426 1251287 963698 1116786
15497 1116786 1342419 1209839 681341 916371 1079278 610954 1095474 1591117 1371798
15488 1371798 297218 473848 617320 1100941 1368934 712862 969882 955201 1455867
15479 1455867 1039630 597803 771141 1216868 1185188 1384144 1154136 1167694 1463235 1448344
15469 1448344 1569564 1511741 1351685 2143501 1870974 1450929 575971 1053573 843760 786107
15459 786107 626116 202714 811870 1247971 1531296 1640997 1891801 1626753 1493153 875996
15449 875996 1018538 2033346 1709405 1069451 1844239 1596938 1495499 1489498 1107402 1303101
15439 1303101 1523728 1767151 1794136 1445162 1109076 988440 1404566 1490577 1133492 1381410
15429 1381410 783268 1070116 1288870 891692 1057630 1284541 1583864 1038478 1052473 893079
15419 893079 1463914 1377883 1203969 1332425 1343252 1036294 562698 399385 537243 1202770
15409 1202770 1162367 1271729 671182 636845 1095866 762653 758480 1067636 1382957 1148389
15399 1148389 1489400 887480 805791 983355 1413629 1033824 1365789 1564795 1323610 934879
15389 934879 1461354 1218285 864686 1188174 1344489 1297717 1140510 1432045 760954 1171342
15379 1171342 1100323 1715719 1858620 1364987 1588217 1020790 609156 340269 939243 1298005
15369 1298005 1180227 1719595 1576932 1077488 1582436 1869650 1526749 1430681 1318672 1017562
15359 1017562 1031997 1197423 1478814 1196103 893319 845619 836889 1476009 1571315 1314976
15349 1314976 523156 731834 933251 995517 714568 1489850 1371131 1299951 1207099 691452
15339 691452 1324223 1551013 967502 1148632 1016055 1237623 1571522 1487164 987577 982623
15329 982623 1010796 798057 1457357 1317583 466611 583495 1395080 1188589 1655019 1723485
15319 1723485 1198079 1061222 1192677 1458980 1507432 1322202 1492870 1080129 1230586 1409921
15309 1409921 1635011 1381322 1366379 1334094 1425529 1561255 1382095 1404033 1391682 1007734
15299 1007734 1258345 1624404 1851649 1464241 833297 1499060 1861847 1347541 1849707
15290 1849707 1596627 1140088 1299479 943281 1583017 1268892 977994 818803 816850 828849
15280 828849 1449051 1133664 1379957 1748283 981211 1039488 1332042 2069834 1324237 1013819
15270 1013819 1577549 942805 1061172 1126634 993962 1148415 934847 1070159 1113919 1471665
15260 1471665 1410251 853341 738085 1375771 1254553 973427 634180 1043570 890492 1316073
15250 1316073 1061812 792308 911431 729666 1140956 1288422 1012625 1477851 1855292
15241 1855292 1246374 1172554 1388703 671012 815690 1299508 1562789 1365419 1156648 1417561
15231 1417561 1276436 1682781 772547 1527277 1437985 1500114 1578027 1692662 1493411 966171
15221 966171 1069259 1328944 1032187 1337152 1754155 1845912 1673417 1399193 1214042 1147327
15211 1147327 532445 28220 573647 1219326 1680807 1362100 1189759 1038794 709164
15202 709164 1551361 1333311 1290357 1839891 1244271 1321763 712845 698078 924028 949361
15192 949361 720670 598160 1297075 1523792 1759491 1976297 1450613 941000 1521339 1175136
15182 1175136 1727345 2222994 1607438 937423 1115040 888322 1157775 1047030 895092
15173 895092 1427022 983564 989979 1516180 1217427 1334044 1849293 1685716 1560906 1658156
15163 1658156 1712753 1676962 1290058 651521 954432 1314346 1065748 1724706 1869555 1280671
15153 1280671 2121821 1685765 1490776 1822077 1078474 1325268 1275779 954056 1485073 707408
15143 707408 725689 1223642 1050504 984185 1456187 825807 968012 1623191 2029206 1978994
15133 1978994 2044957 2082662 1496344 926130 1496757 1428190 875788 1318073 1871309 1874134
15123 1874134 1669319 818835 619389 892711 1269553 1292115 2071458 2165385 1594618 1165343
15113 1165343 1456419 1362184 1032000 1563978 1484336 1848100 1883995 862128 586152 1261533
15103 1261533 1450851 1212608 1130091 1585911 835471 1241596 1164517 517116 1353450 1653554
15093 1653554 1119584 1808298 1544581 944849 1336285 1053547 944066 111228 1432959
15084 1432959 1402144 1069585 1144240 912617 1373543 1330037 1746488 1501617 1270235 1154029
15074 1154029 1020991 721536 1204103 1277518 1390164 1333240 1541348 1379130 1497107 1719738
15064 1719738 1401038 1210722 976880 1038630 812528 1206264 1685162 1167428 1132640 989555
15054 989555 1338257 1656649 917731 865393 922555 1604344 1949405 1771369 1089212 1236756
15044 1236756 1777503 1431488 1535507 1790685 1185886 1012053 1371326 1132643 1071288 1127306
15034 1127306 1344089 1182162 1032129 1313638 1494223 1446258 687186 1059607 1742023 1702027
15024 1702027 1441460 1251523 1723568 1822051 1404973 713388 931388 471226 631035 1020924
15014 1020924 717928 547822 1016029 1683746 1228954 951627 1676043 1535542 1552302 1369897
15004 1369897 1122941 1135347 984758 1282194 1436573 1899944 1840852 821959 969741 806186
14994 806186 1064682 1170955 1288178 1950729 2161406 1806066 1652208 1186515 1666517 1641068
14984 1641068 1345656 1464206 1107096 1052369 2074115 2231213 1538215 809433 1349878
14975 1349878 1566486 1573723 1530872 881290 1299708 1472833 1468946 832238 1334539 1251931
14965 1251931 976389 1446504 1072352 1345328 1273652 709279 964433 547767 1190793 1239097
14955 1239097 922578 1677690 2154155 1637495 1291970 1076938 1317449 1150320 1361278
14946 1361278 1439921 1645620 1626515 1556771 1202706 502144 895723 651129 754575 1101767
14936 1101767 2154588 1848289 1744695 1526380 803559 1375939 1599790 1406282 1354845
14927 1354845 1219634 834874 1049384 1243968 1681917 1889289 1761660 1253369 1435536
14918 1435536 1715315 1593307 1374841 770665 1077149 1499045 1219068 871577 1256157
14909 1256157 1497045 1594564 1446191 1376617 656923 289277 992617 1060642 1894207 1471111
14899 1471111 1287209 813734 1128515 568492 985037 1258087 1979812 1488062 1338135
14890 1338135 1141088 1234177 1254064 1174143 1317674 950994 1078382 1270664 1302597 1302257 1620747
14879 1620747 1060344 975501 765546 1497249 1882185 2529037 1679708 847706 1143311 1412527
14869 1412527 1875048 1401620 1530181 1663022 1298632 1281286 1256922 1947677 2346761 1399354
14859 1399354 674189 1133669 1812802 1462299 1020273 1345155 1567373 1288951 987832
14850 987832 671159 640631 1148966 1479021 1870273 1958877 1980824 1476185 1545604 1625852
14840 1625852 892317 658167 1033454 1345088 1050167 1171878 1717912 905981 1125386
14831 1125386 1209346 1626707 1124480 1256289 1539686 933863 997766 1559928 1275216 1316385
14821 1316385 1000330 1205170 1335525 1167114 1117421 438507 1430411 1738205 1850223 1771998
14811 1771998 1286598 1242264 525299 889464 1361164 1258468 1522244 1443707 1106559 1740707
14801 1740707 1594572 1811018 2244188 1547330 1439362 1540072 1114468 1007509 1789772
14792 1789772 2228315 1780675 1306545 1555005 1317509 911279 1043920 1109284 1118565 860045
14782 860045 1601168 1525976 1311738 1508956 1239106 1902962 2338189 1859058 1362916 1449838
14772 1449838 1452703 1613558 1465398 1278143 1300837 825179 789224 1046976 1503870 1942778
14762 1942778 1817834 1591461 1642968 1274014 1480559 903660 1137985 1557431 1619626 1243456
14752 1243456 622408 1324381 1177092 1149392 813833 940539 1033571 1048260 1788790 1739461
14742 1739461 989643 1836752 2015347 1535212 647655 1070272 639135 919279 934878 1310441
14732 1310441 1348907 1140445 1502342 1137186 1162197 1054912 1393058 1066048 1215911 1083238
14722 1083238 1465287 1428582 1247936 1118505 1132950 1531618 1463650 1633195 1051397 811931
14712 811931 1425785 1557560 1359594 1554293 1501225 1519226 1595728 1932609 1400492 1225494
14702 1225494 1460676 1457118 1274504 1731886 1544261 1314381 1652276 1131443 1169283 1522911
14692 1522911 1430661 1604421 1583617 1394828 1439666 1337846 1284342 1118764 1382077 1602358
14682 1602358 1806161 1416681 1043884 1537510 1312473 632549 946349 1466543 992095
14673 992095 1039374 1645201 1305071 1182365 799714 775696 1158553 1343471 829629 870015
14663 870015 1331845 897208 1268230 1555177 1057177 1253216 1316438 878795 962102 1177833
14653 1177833 1497389 1594773 1887548 1721320 1423853 1202417 1051833 1696151 1275461 742495
14643 742495 1823738 1594904 1291235 1063098 1281653 1569932 1280883 1377834 1716390 953147
14633 953147 487743 1032442 1261477 1258049 1070270 1354920 1105991 1564408 1403168 1565545
14623 1565545 1354568 925796 1497899 1815304 1878168 2139132 1625411 1801756 1029618 1881846
14613 1881846 1921588 1217736 1211618 1356645 1353661 1358941 905196 672912 801488 1077267 1525766
14602 1525766 1946847 1799971 1454814 1000273 139276 567512 1170920 615566 1294143
14593 1294143 1571619 1250758 1186015 830535 983404 518994 1591255 1978937 1665375
14584 1665375 952277 1382018 1464744 1206727 1319444 872038 1690327 1984382 1730943 1107658
14574 1107658 748083 1512720 1472809 931544 1620242 992055 799676 1032681 485329 885937
14564 885937 1079540 1606229 1811668 2432621 2087595 1596209 1239969 1649363 1759067 1764439
14554 1764439 1250184 1693769 1429307 2134533 1881695 1674442 1509834 1041965 814968
14545 814968 1442051 905912 970692 935927 1059819 1080978 1580456 1470336 1432551 1425719 1658161
14534 1658161 1304308 999504 1788617 1466410 1735843 1246384 1186484 1163383 1635524 1488488
14524 1488488 1647652 2019184 1592700 1362483 1447877 1893567 2148020 1093662 1325947
14515 1325947 987431 1202654 1284076 1389907 1564337 1397493 1192124 1263543 1068001 1572150
14505 1572150 1328341 1378712 1322802 1065335 485854 1289273 1302743 954570 999254 1283148
14495 1283148 1250017 1494582 1183720 988297 952709 1391735 1371369 1243031 1262035 990293
14485 990293 681271 1259630 1105280 1086290 1314798 1432448 1277364 1293162 1734393 1734533
14475 1734533 1354619 2066550 1744004 1529725 1537958 1207298 1138089 1102254 1302602 1958922
14465 1958922 2356014 1591184 938550 871687 1934355 1031255 974455 1041458 677861 986393
14455 986393 1234031 944439 981327 1290960 1450228 1630649 1288940 1556881 1283777 1447926
14445 1447926 1928302 1854637 1319096 1180775 1541896 1603257 2133017 1383518 1373872 951169
14435 951169 949578 1296753 1686118 1685326 1324284 1669443 1780102 1203125 1182926 1372299 1499574
14424 1499574 1135231 1152138 1248475 1057380 1327262 1797484 787123 1319179 1942592 1673645
14414 1673645 1040913 1578975 1497014 1080438 1100394 1714278 1284562 1693848 1614382 1881187
14404 1881187 1441624 524178 682581 1436563 1747178 1927329 1578950 1727622 1665407 1648577
14394 1648577 1516309 1361868 1424661 1320505 1453752 1184039 1099668 1175450 1594952 1464215
14384 1464215 1242885 1458751 1507394 1124988 1275327 1318377 1187822 988701 1539451 2066218
14374 2066218 1836836 2236751 2431460 1216197 1138098 1459502 1504935 1479814 1798814 1295845
14364 1295845 1211207 1257211 1567867 1528684 2116586 2063727 1953850 1902096 1638429 1590473
14354 1590473 1131937 1282977 1487535 1050826 1176049 1524402 1260202 1701960 1418589
14345 1418589 1636154 2065390 1405095 1151171 1232781 2101144 1982986 1212109 1102732 1438740
14335 1438740 2048826 1853238 1428820 1549854 1456382 1609116 1774640 1991518 1664201 1862914
14325 1862914 1968927 2090471 1474599 1559895 1751651 1410334 1025331 881859 1063275 1081486
14315 1081486 1222763 1213607 1457659 1830926 1333092 1694557 1932176 1682367 1461439 1381608
14305 1381608 1222877 1425698 1296280 1670665 1726949 1780489 1288268 1266946 1270544 1268136 1281372
14294 1281372 1232551 1513838 1153247 1188450 1225914 1644758 2177276 1836171 1585265 1844444
14284 1844444 1039956 975021 1302092 1542923 2321202 1846039 1768459 1227386 1282900 1869188
14274 1869188 816281 1310517 1334808 1882324 1649784 1597248 1848466 1660844 1377286 1646852
14264 1646852 1492656 1295525 1257167 1375898 1603436 1821442 1494140 1304736 704295 911592
14254 911592 1005191 1213726 1077177 1039094 1063185 1294566 1689567 1309848 1859812 1409821
14244 1409821 1436737 1778204 1776731 1813883 1606692 1341806 1062180 1448285 1915812 1349491
14234 1349491 1041018 546638 1178231 1224240 1821662 2045340 1763730 1363232 1563139 1818442
14224 1818442 1441712 1631216 1990036 1842430 859214 863056 1560164 1841206 1648364 1246006
14214 1246006 962688 1063321 1775899 1222918 1011788 1284395 1465690 1741333 1910159
14205 1910159 1967970 1899899 2012518 1792951 1128657 1313712 1898679 1681733 1566880 1630789
14195 1630789 1983507 2040247 1505678 1236298 1931690 2724653 2142129 701823 952288
14186 952288 1163820 963639 1437678 1377788 1143687 1050848 1166158 1292049 1647537 1770138
14176 1770138 1759597 1657393 1676234 2093007 1246131 1688262 1787713 1533136 1161817 1208132
14166 1208132 1792974 2204196 1899930 1681005 1674575 1873497 2018671 2174319 1640265 1993398
14156 1993398 1403018 1759482 1993741 1138312 940143 881552 933562 1107584 1132959 1795148
14146 1795148 1584166 1569120 1170187 489856 1092732 1820913 2401207 1372269 1078019
14137 1078019 977706 1494321 1588444 1555039 1341514 1368320 1556901 1074095 1136053 1146841
14127 1146841 1537466 696439 917347 1061424 1044892 1438490 1161675 949383 1470656 1198291
14117 1198291 1109417 1544441 534029 1499032 1995247 1625112 1248290 845804 1343365
14108 1343365 1541763 1556391 1315236 1120425 1392332 1580597 1551362 1372619 1261010 767683
14098 767683 1093604 883372 943639 1322995 986900 985199 1097651 742131 599809 855766
14088 855766 1498239 1507483 1166450 996537 1121905 1247956 1014989 1377927 472992 757116
14078 757116 1253904 1332101 1864309 1868852 1673081 1419981 1611484 1215870 1503940 1846238
14068 1846238 1522391 1693371 1699847 1108594 1774254 1538192 1219144 954379 1050426 1177135
14058 1177135 1408746 1306520 1371122 2011680 1913080 1609726 1238884 764642 1253164 1581067
14048 1581067 1600327 947316 1068389 1339501 1307578 1329125 1787352 2124150 1583083 1084794
14038 1084794 1161946 1234882 1240535 1248694 1321232 1584603 1554784 1908691 1803906 1734995 2017752
14027 2017752 1804004 1706528 947739 971841 1415275 1249074 819083 1515740 1491530 1546954
14017 1546954 1584858 1524564 1618847 1359864 1141734 1230948 1367267 1647449 1077650 1518494
14007 1518494 1458772 1614819 1630842 1521706 1838917 1286644 803496 1016504 1144472 1201923
13997 1201923 1416834 1531351 1901633 1827515 1403365 1378952 1434697 1225750 1357035 1686151
13987 1686151 1686726 1324694 1513905 837150 1000438 985789 1097723 702781 1747721 1437001
13977 1437001 1630785 1507100 1245776 1389362 1402531 1198708 1609305 1995751 1965253 2041290
13967 2041290 1873675 1121174 1596647 1680420 1950649 1542682 1061944 1128537 1587066 1812692
13957 1812692 1640924 1822360 2070078 1226803 1130283 1349392 1007397 1478904 1904931 1700101
13947 1700101 1871669 2101496 1645422 1753376 1245935 1464918 1466293 1490518 1104435 1662375
13937 1662375 1803247 1568102 1525337 1619836 1473260 974615 1274437 1804953 1806514 1980698
13927 1980698 1809590 1520441 1665093 1553622 1166116 637059 1201012 1662517 1520926
13918 1520926 1887859 1742242 2100177 2093050 1802439 1887030 1566718 1477260 1139338 1218410
13908 1218410 1257540 1105416 902862 1356918 1831699 2174381 1404145 1777847 1876106 1719508
13898 1719508 2146511 1819358 1820028 1716988 1563403 1491802 1645313 1921971 2150074 2018953
13888 2018953 1947910 1805718 1645193 1666367 1597489 1857676 972054 1031736 637089 1291769
13878 1291769 1561096 1176763 1723719 1815850 1559671 1496587 1227656 1308845 1555985 1286436
13868 1286436 1059461 1001385 1257070 1161738 1828446 1413443 1566775 1678368 1484891 1497528
13858 1497528 1685617 1136774 1078838 1162930 1482936 2033080 1843183 1671291 1309073 950746
13848 950746 1381121 1228084 889397 763763 841904 1074697 1667688 1845735 1763523 1704634
13838 1704634 1914983 1296361 1221547 1384163 1498603 2394927 2068117 1515355 1675544 1868996
13828 1868996 1618823 1795436 1624742 1594561 1715340 1396186 1161486 1445626 1969234 1403118
13818 1403118 1419572 1695741 1449432 1208178 1622263 1166127 1509683 1385948 1213461 571815
13808 571815 1106733 1263298 1496981 1500691 1367804 1473967 891060 1327436 1502042 929889
13798 929889 1003726 986713 1092035 902743 1478699 1612318 746851 1030894 1350286 1367854
13788 1367854 906969 1132328 1715560 1639380 1569018 1293364 1062606 1633532 2014913 2042079
13778 2042079 1609744 1714796 1543062 1611846 1101695 1150268 1361071 1609452 1343802 1720072
13768 1720072 1734610 1271461 1148497 1635241 1969606 1380192 1590196 1761899 1402695 1238445
13758 1238445 1356379 1116342 1131864 1947295 1586487 1222788 1193200 2022575 1749095 1842577
13748 1842577 1590084 1533165 1771955 1869195 1607685 1574373 1724427 1129946 1744438 1424951
13738 1424951 1047807 1209455 1152706 643531 910883 2048378 2174699 1604123 1899376
13729 1899376 1461236 1449412 1323819 1421920 1269982 1059078 1729146 2262572 1794719 1070953
13719 1070953 1662808 1435786 1258952 1225996 1476014 906888 1026604 1375910 1792688 1368499
13709 1368499 967213 1710238 1052465 1405605 879744 879430 547167 1477750 1677523 1767965
13699 1767965 1295095 728162 1438067 1719063 1375075 951403 980207 498639 775829 1265344
13689 1265344 1579605 1743560 1933442 1700723 2139556 1371105 1278546 1295873 1586392 2058046
13679 2058046 1983790 1233728 1356708 1910482 1304737 843582 1626194 1092405 813551 1160658
13669 1160658 1270838 1588438 2319197 1642019 1835620 2389941 1833124 1614014 1371476
13660 1371476 1495827 1950742 2119643 1693703 1957588 1663782 1487516 1431092 1278372 1332202
13650 1332202 1940112 1652333 1616033 1740452 2106129 1778931 1440682 1219404 1479897 2439921
13640 2439921 1505727 1370309 1225335 1068006 1138506 1282682 1333079 2002950 2276692 1723143
13630 1723143 1498294 1816928 1922357 1823409 2112793 1907857 1709477 1372033 1239480 1676480
13620 1676480 1418327 977158 1106176 1754428 1660727 1096236 1073838 1183008 1182123 1251488
13610 1251488 1989195 1626900 1346674 1631023 1313595 1661909 1917327 1457036 1589337
13601 1589337 1272662 1281579 1179462 1174893 1002525 1756375 1540644 1540860 1528921 1318521 1545444
13590 1545444 2211187 1393725 968736 1100096 1745911 2147909 1630699 1639909 1553550 859908
13580 859908 1600130 2218980 2117145 2336822 1125001 832384 1371554 1656819 1833680
13571 1833680 1586982 1699100 1542089 1414880 1609096 1037999 1682583 1718213 1721042 1425041
13561 1425041 773258 670032 1157789 1099109 1142466 1476063 2074638 2227067 2776620 1977246
13551 1977246 2263111 1629227 1446549 690409 945226 1412292 1240613 1298073 1709653 1990894
13541 1990894 1770653 1637030 1547891 1954332 1992061 1659851 1088275 1350673 1324678 1597521
13531 1597521 1551053 1719398 1854363 1850474 1754524 1661456 1553111 1485470 1549038 1868465 1351113
13520 1351113 1181642 869982 894166 880906 1105248 1386529 1718749 1209055 1423488 1149862
13510 1149862 1159071 1222850 1566066 1590728 1477605 933714 987745 1277634 1341918 901293
13500 901293 2006050 1782034 1081858 1385525 1768651 1739320 1311279 1226456 1464624 1478645
13490 1478645 1225350 1211769 1193751 857286 1506570 1541818 1742528 1731173 1410355 1438493
13480 1438493 1323469 1559683 1680921 1588426 1614823 1945162 1621999 1459526 1677763 1628545
13470 1628545 1886049 1737517 1178895 1606071 1314309 1045229 588127 1141419 741136
$$ [...]
##END NTUPLES=NMR SPECTRUM
##END=
