##TITLE=1H_EC-3310(II-3)
 CDCl3
 8 sc, 
 5.2.2024
##JCAMPDX= 6.0         $$ Bruker NMR JCAMP-DX V2.0
##DATA TYPE= NMR SPECTRUM
##DATA CLASS= NTUPLES
##ORIGIN= UXNMR, Bruker Analytische Messtechnik GmbH
##OWNER= root
$$ XWIN-NMR		Version 3.5
$$ Mon Feb  5 14:03:12 2024 Russian Standard Time (UT+4h)  she@DPX200
##.OBSERVE FREQUENCY= 200.1313
##.OBSERVE NUCLEUS= ^1H
##.ACQUISITION MODE= SIMULTANEOUS
##.ACQUISITION SCHEME= undefined
##.AVERAGES= 8
##.DIGITISER RES= 18
##SPECTROMETER/DATA SYSTEM= spect
##.PULSE SEQUENCE= zg30
##.SOLVENT NAME= D2O
##.SHIFT REFERENCE= (INTERNAL, D2O, 0, 15.4318)
##AUDIT TRAIL= $$ (NUMBER, WHEN, WHO, WHERE, WHAT)
$$ ##TITLE= Audit trail, XWIN-NMR		Version 3.5
$$ ##JCAMPDX= 5.01
$$ ##ORIGIN= Bruker BioSpin GmbH
$$ ##OWNER= she
$$ F:/spectra/data/she/nmr/H-F/1/pdata/1/auditp.txt
$$ ##AUDIT TRAIL=  $$ (NUMBER, WHEN, WHO, WHERE, WHAT)
(   1,<2024-02-05 14:02:00.06 +0400>,<she>,<DPX200>,
      <created by zg, POWCHK disabled, PULCHK disabled
       configuration hash MD5:
       00 E9 B6 7A A2 85 ED C7 34 08 36 98 17 FE 4E 26
       data hash MD5: 16K
       DE 1F 87 D8 F9 85 27 74 AF C8 ED D7 28 55 2A 12>)
(   2,<2024-02-05 14:02:03.34 +0400>,<she>,<DPX200>,
      <Start of raw data processing
       efp BC_mod = 2 LB = 0.24 FT_mod = 6 PKNL = 1 PHC0 = -24591.73 PHC1 = 7.65268 SI = 16K 
       data hash MD5: 16K
       90 A9 2A 84 6A A8 4D 52 7D F9 06 72 A6 69 BE B0>)
(   3,<2024-02-05 14:02:17.15 +0400>,<she>,<DPX200>,
      <pk PHC0 = 0.4669651 PHC1 = 0 
       data hash MD5: 16K
       F6 EC D3 93 72 AC 82 F4 0A CA A0 AE 5C D1 BB 01>)
(   4,<2024-02-05 14:02:20.31 +0400>,<she>,<DPX200>,
      <abs ABSG = 5 
       data hash MD5: 16K
       D2 47 95 9C 30 3C 77 11 44 BF 2D 42 B5 FC 1C 27>)
$$ ##END=
$$ 
$$ hash MD5
$$ 59 B5 C2 B1 47 28 F7 66 B3 21 AF 69 A6 D2 8C A1
##$RELAX= 
##$RELAX= 
##$RELAX= 
##$RELAX= 
##$RELAX= 
##$RELAX= 
$$ Bruker specific parameters
$$ --------------------------
##$DU= <F:/spectra>
##$EXPNO= 1
##$NAME= <H-F>
##$PROCNO= 1
##$TYPE= <nmr>
##$USER= <she>
##$AMP= (0..31)
100 100 100 100 100 100 100 100 100 100 100 100 100 100 100 100 100 100 
100 100 100 100 100 100 100 100 100 100 100 100 100 100 
##$AQSEQ= 0
##$AQ_mod= 1
##$AUNM= <au_zg>
##$AUTOPOS= <>
##$BF1= 200.13
##$BF2= 200.13
##$BF3= 200.13
##$BF4= 200.13
##$BF5= 200.13
##$BF6= 200.13
##$BF7= 200.13
##$BF8= 200.13
##$BYTORDA= 1
##$CFDGTYP= 0
##$CFRGTYP= 5
##$CHEMSTR= <none>
##$CNST= (0..31)
1 1 145 1 1 1 1 1 1 1 1 1 1 1 1 1 1 1 1 1 1 1 1 1 1 1 1 1 1 1 1 1 
##$CPDPRG= <>
##$CPDPRG1= <>
##$CPDPRG2= <>
##$CPDPRG3= <>
##$CPDPRG4= <mlev>
##$CPDPRG5= <mlev>
##$CPDPRG6= <mlev>
##$CPDPRG7= <mlev>
##$CPDPRG8= <mlev>
##$CPDPRGB= <>
##$CPDPRGT= <>
##$D= (0..31)
0 1.2 0 0 0 0 0 0 0 0.06 0 0.03 0 0 0 0 0.0002 0 0 0 0 0 0 0 0 0 0 0 0 
0 0 0 
##$DATE= 1707127319
##$DBL= (0..7)
120 120 120 120 120 120 120 120 
##$DBP= (0..7)
150 150 150 150 150 150 150 150 
##$DBP07= 0
##$DBPNAM0= <>
##$DBPNAM1= <>
##$DBPNAM2= <>
##$DBPNAM3= <>
##$DBPNAM4= <>
##$DBPNAM5= <>
$$ [...]
##$SUBNAM3= <"">
##$SUBNAM4= <"">
##$SUBNAM5= <"">
##$SUBNAM6= <"">
##$SUBNAM7= <"">
##$SUBNAM8= <"">
##$SUBNAM9= <"">
##$SW= 18.0517328524113
##$SWIBOX= (0..15)
0 0 2 0 0 0 0 0 0 0 0 0 0 0 0 0 
##$SW_h= 3612.71676300578
##$TD= 16384
##$TD0= 1
##$TE= 0
##$TE2= 300
##$TE3= 300
##$TEG= 300
##$TL= (0..7)
0 120 120 120 120 120 120 120 
##$TP= (0..7)
150 150 150 150 150 150 150 150 
##$TP07= 0
##$TPNAME0= <>
##$TPNAME1= <>
##$TPNAME2= <>
##$TPNAME3= <>
##$TPNAME4= <>
##$TPNAME5= <>
##$TPNAME6= <>
##$TPNAME7= <>
##$TPOAL= (0..7)
0.5 0.5 0.5 0.5 0.5 0.5 0.5 0.5 
##$TPOFFS= (0..7)
0 0 0 0 0 0 0 0 
##$TUNHIN= 0
##$TUNHOUT= 0
##$TUNXOUT= 0
##$USERA1= <user>
##$USERA2= <user>
##$USERA3= <user>
##$USERA4= <user>
##$USERA5= <user>
##$V9= 5
##$VALIST= <valist>
##$VCLIST= <CCCCCCCCCCCCCCC>
##$VD= 0
##$VDLIST= <DDDDDDDDDDDDDDD>
##$VPLIST= <PPPPPPPPPPPPPPP>
##$VTLIST= <TTTTTTTTTTTTTTT>
##$WBST= 1024
##$WBSW= 4
##$XGAIN= (0..3)
0 0 0 0 
##$XL= 0
##$YL= 0
##$YMAX_a= 547087
##$YMIN_a= -577500
##$ZGOPTNS= <>
##$ZL1= 120
##$ZL2= 120
##$ZL3= 120
##$ZL4= 120
##$ABSF1= 15.60256
##$ABSF2= -2.449291
##$ABSG= 5
##$ABSL= 3
##$ALPHA= 0
##$AQORDER= 0
##$ASSFAC= 0
##$ASSFACI= 0
##$ASSFACX= 0
##$ASSWID= 0
##$AUNMP= <proc_1d>
##$AZFE= 0.1
##$AZFW= 0.1
##$BCFW= 0
##$BC_mod= 2
##$BYTORDP= 0
##$COROFFS= 0
##$CY= -3
##$DATMOD= 1
##$DC= 0
##$DFILT= <>
##$DTYPP= 0
##$F1P= 0
##$F2P= 0
##$FCOR= 1
##$FTSIZE= 16384
##$FT_mod= 6
##$GAMMA= 0
##$GB= 0
##$INTBC= 1
##$INTSCL= 3.70164e-10
##$ISEN= 128
##$LB= 0.24
##$LEV0= 0
##$LPBIN= 0
##$MAXI= 10000
##$MC2= 0
##$MEAN= 0
##$ME_mod= 0
##$MI= 1.114404
##$NCOEF= 0
##$NC_proc= -6
##$NLEV= 6
##$NOISF1= 3.799351
##$NOISF2= 2.8
##$NSP= 0
##$NTH_PI= 0
##$NZP= 0
##$OFFSET= 15.43177
##$PC= 1
##$PHC0= -24591.26
##$PHC1= 7.65268
##$PH_mod= 1
##$PKNL= yes
##$PPARMOD= 0
##$PSCAL= 0
##$PSIGN= 0
##$REVERSE= no
##$SF= 200.130017997078
##$SI= 16384
##$SIGF1= 3
##$SIGF2= 2
##$SINO= 5.538805
##$SIOLD= 16384
##$SREGLST= <1H.CDCl3>
##$SSB= 0
##$STSI= 16384
##$STSR= 0
##$SW_p= 3612.71676300578
##$SYMM= 0
##$S_DEV= 0
##$TDeff= 16384
##$TDoff= 0
##$TI= <>
##$TILT= no
##$TM1= 0
##$TM2= 0
##$TOPLEV= 0
##$USERP1= <user>
##$USERP2= <user>
##$USERP3= <user>
##$USERP4= <user>
##$USERP5= <user>
##$WDW= 1
##$XDIM= 16384
##$YMAX_p= 427039063
##$YMIN_p= -352353
$$ End of Bruker specific parameters
$$ ---------------------------------
##NTUPLES= NMR SPECTRUM
##VAR_NAME=  FREQUENCY,     SPECTRUM/REAL,   SPECTRUM/IMAG
##SYMBOL=    X,             R,               I
##VAR_TYPE=  INDEPENDENT,   DEPENDENT,       DEPENDENT
##VAR_FORM=  AFFN,          ASDF,            ASDF
##VAR_DIM=   16384,         16384,           16384
##UNITS=     HZ,            ARBITRARY UNITS, ARBITRARY UNITS
##FACTOR=    0.220516191357247, 1,           1
##FIRST=     3088.36047281039, 0,            0
##LAST=      -524.356290195388, 0,           0
##MIN=       -524.356290195388, -352353,     0
##MAX=       3088.36047281039, 427039063,    0
$$ Real data points
##PAGE= N=1
##DATA TABLE= (X++(R..R)), XYDATA
$$ [...]
8481D928298Q799m6808N2279J5943k1934l9354j7336K910J379P3687l275j7088
8469D937500l6461M0134j0634K8739M2287r7132p578k1449j090M9520m3654n2523
8457D827659J57369L4252Q2351Q6432O5856K2372J88997J52329M5697k6367j38793
8446E498154j67432k50055j89551j95042j31798k7382m3554m2937n8542j1001
8436D380860n1450r4920J0025r6237l2639r577L5768n3353j508j5754Q7132r8756
8424D059591j27595j2587K1241l5225m6920p783K5024k0542l3415L8899j27527
8413C733161l8754j029p3922P9702N1161M0347j19600J4526k8531j9557N3811
8402C691315p626K4234n8219k7431m2501j06592M8476L7339Q5633j3599p2861
$$ y = [4928298, 4937097, 4890289, 4942568, 4958511, 4936577, 4897223, 4879887, 4882797, 4884176, 4957863, 4954588, 4937500, 4901039, 4941173, 4930539, 4959278, 5001565, 4904433, 4896855, 4875406, 4874316, 4923836, 4880182, 4827659, 4985028, 5019280, 5101631, 5188063, 5253919, 5276291, 5465288, 5617617, 5663314, 5636947, 5498154, 5330722, 5080667, 4891116, 4696074, 4564276, 4536894, 4493340, 4450403, 4391861, 4380860, 4329410, 4234490, 4244515, 4148278, 4115639, 4106062, 4141830, 4088477, 4086969, 4071215, 4158347, 4059591, 3931996, 3919409, 3940650, 3905425, 3858505, 3850722, 3875746, 3855204, 3821789, 3860688, 3733161, 3694407, 3693378, 3619456, 3699158, 3750319, 3790666, 3671066, 3685592, 3657061, 3637504, 3691315, 3683689, 3707923, 3649704, 3622273, 3579772, 3473180, 3521656, 3558995, 3644628, 3631029, 3558168]
8391C558168K8771L929r0906J0809J43084r538j35648j36169R1377N195q7503
8380C381569k1638l2079j9099J9743j4297J8744j038p5782k6829p5479j1675J18936
8368C261076Q150r0539m4665l0243O197Q941K9121Q5084R933p0648l0855K4956
8356C166508j09782o7234K5788l7030n4037Q2181o7736l170J36406n2976j7472
8345C001446l8217j88341J01181L003N2724m8400p8023J5955o2482J0645M7144
8334B816635K1813N5033M5391k3249n7853o1108j9096M948n8043K7864n004n0439
8322B696892o4977K7166r880O5387o615k11486K7433J36528l1159O9599o5310
8311B633578l3787k5275l5799K7719j16678O1332L9119p4838Q821J28451r5362
$$ y = [3558168, 3586939, 3590868, 3499962, 3510771, 3653855, 3644317, 3508669, 3372500, 3463877, 3469072, 3381569, 3359931, 3327852, 3308753, 3328496, 3314199, 3332943, 3331905, 3256123, 3229294, 3153815, 3142140, 3261076, 3269226, 3178687, 3134022, 3103779, 3109976, 3118917, 3148038, 3233122, 3243055, 3172407, 3141552, 3166508, 3056726, 2989492, 3015280, 2978250, 2924213, 3006394, 2938658, 2935488, 3071894, 3018918, 3001446, 2963229, 2774888, 2876069, 2879072, 2931796, 2883396, 2805373, 2821328, 2758846, 2769491, 2816635, 2838448, 2893481, 2938872, 2915623, 2857770, 2796662, 2777566, 2782514, 2724471, 2752335, 2747331, 2696892, 2631915, 2659081, 2649201, 2714588, 2707973, 2496487, 2523920, 2660448, 2629289, 2698888, 2633578, 2599791, 2574516, 2538717, 2566436, 2449758, 2511090, 2550209, 2475371, 2484192, 2612643, 2517281]
8300B517281J0808j6184k5905q1898L2742O1487p8542l8234Q1827J3805o7751
8289B409436P1007o9676k6257J92666j30360j4842O208q5824M7410J13656n3556
8278B459868j05505j311r719j21132n0130O4323l255N8950j5560p3237K1438O6808
8266B291538r5673r9566m1023K1317J37403r357l5581j2859M4515j6917q9479
8255B094318o5481J33937m3784p4024J10662K4278J8802p1590m7566P387m6839
8244B040100l7193j7140J24103J6781j18377J22646p5060l5489o7025j3435N7534
8233A997445N337j6633j04314P0148l6634J9777m924k3248O7311n6654j116L0627
8221A947122j35770j56444J29667J29649k2794r2843n4121r394K2797j1047N2827
$$ y = [2517281, 2528089, 2511905, 2486000, 2404102, 2436844, 2498331, 2419789, 2381555, 2463382, 2477187, 2409436, 2480443, 2410767, 2384510, 2577176, 2446816, 2431974, 2438182, 2352358, 2399768, 2513424, 2459868, 2354363, 2353052, 2343333, 2222201, 2172071, 2236394, 2233139, 2292089, 2276529, 2203292, 2224730, 2291538, 2195865, 2096299, 2055276, 2076593, 2213996, 2204639, 2169058, 2156199, 2200714, 2183797, 2094318, 2028837, 2162774, 2118990, 2044966, 2155628, 2179906, 2198708, 2127118, 2079552, 2086939, 2040100, 2002907, 1985767, 2109870, 2126651, 2008274, 2130920, 2055860, 2020371, 1953346, 1939911, 1997445, 2002782, 1986149, 1881835, 1951983, 1915349, 1935126, 1930202, 1906954, 1974265, 1917611, 1916495, 1947122, 1811352, 1654908, 1784575, 1914224, 1891430, 1798587, 1744466, 1735072, 1757869, 1746822, 1799649]
8210A799649O1888o2457P125Q830j07609N1743q2807J12732o4073O5159o3771
8199A726409N5563j4116J12468k2559N1076j12484N62101J04682r16189J99275
8189A746226p6372l2018n6984J24023n3661j5528m1192M6579R670N9885k9276
8178A681352n8408k034m9808Q95J60647r0487n8020N2970j24120l7347P6429K0643
8166A572712o5116m2733O3680M510J18317P5624m8763p2938m227L2983k577k7134
8154A604338O9536j9928q5082Q3172q6897j1585p9529N2171O8008n1276n8491
8143A484437J12497m3867J1324j399P2348p2795j18017Q108M8033O7694L1681
8132A600044p1683p9487O9658P3165j11115M2095r4619J4006n09N3446J4719j19884
$$ y = [1799649, 1861537, 1799080, 1806205, 1815035, 1707426, 1759169, 1676362, 1789094, 1725021, 1790180, 1726409, 1781972, 1767856, 1880324, 1857765, 1908841, 1796357, 2358458, 2463140, 1546951, 1746226, 1669854, 1637836, 1580852, 1704875, 1651214, 1635686, 1594494, 1641073, 1650743, 1710628, 1681352, 1622944, 1620910, 1571102, 1571997, 1732644, 1642157, 1584137, 1637107, 1512987, 1475640, 1552069, 1572712, 1507596, 1464863, 1528543, 1533053, 1651370, 1726994, 1678231, 1605293, 1601066, 1634049, 1631472, 1604338, 1673874, 1653946, 1568864, 1652036, 1565139, 1553554, 1474025, 1526196, 1594204, 1542928, 1484437, 1596934, 1553067, 1564391, 1562992, 1635340, 1562545, 1444528, 1452636, 1500669, 1568363, 1600044, 1528361, 1448874, 1518532, 1591697, 1480582, 1522677, 1428058, 1442064, 1441555, 1495001, 1509720, 1389836]
8120A389836j8946j03776Q0040l8532O6406J34645j5948K6656o0419l2658j8572
8109A408732k8125M0242M3066j4351j26815l4415m9125k9748M8807R1420M1200
8098A390888q8057p2890P4198l5295l1275m2869M9340J5679q443o5014k8659O5843
8086A223446L3620N7431m3143p2742j3273N6091k6620m206N426N1154J3868j15916
8074A165136P9097M3536N251r7303m5277R2206l0925j9224R5423j6233r485m2620
8062A219582m0207J3217o978l6030J6909l9715K5634o6228J164p9615K4441o7191
8050I64983M6668L7591L0999Q3360O8805N8039j09602P5286K8251P4717n8902
8039A300195n6180n2551j5224M7281m3171K3380k1430j2683R5217k2690j05440
$$ y = [1389836, 1370890, 1267114, 1347154, 1308622, 1375028, 1509673, 1493725, 1520381, 1459962, 1427304, 1408732, 1380607, 1420849, 1463915, 1449564, 1322749, 1288334, 1239209, 1209461, 1258268, 1349688, 1390888, 1302831, 1229941, 1304139, 1268844, 1237569, 1194700, 1244040, 1259719, 1251276, 1186262, 1157603, 1223446, 1257066, 1314497, 1271354, 1198612, 1185339, 1241430, 1214810, 1210604, 1216030, 1267184, 1281052, 1165136, 1244233, 1287769, 1293020, 1195717, 1150440, 1242646, 1211721, 1192497, 1287920, 1271687, 1262202, 1219582, 1179375, 1192592, 1185614, 1149584, 1166493, 1126778, 1152412, 1086184, 1087348, 1007733, 1032174, 964983, 1011651, 1049242, 1080241, 1163601, 1232406, 1290445, 1180843, 1256129, 1284380, 1359097, 1300195, 1244015, 1191464, 1176240, 1223521, 1180350, 1203730, 1182300, 1169617, 1264834, 1242144, 1136704]
8028A136704m2384J31893M469r036n4176j1336r9575l4258j070M8836m8806j9082
8016A002179p452L8909J1378J00370q3934o1406j1K7128k6602M921L0336j9160
8004A016656j0234K0188J2934M4737k9864K7685l8611q1363J07733N2819r4529
7993A028151L201j5540l0587l649j25251J00854m3226N507N5137j0877o7998K0823
7981I16545M7376k4333l3441l6588k6379P6873P7176N4573r9460l5015p9201L5360
7969H73486J48467r6674L5167j0164k2924O9317j4633j4110p6972n1009M6494
7958H86445L8217J1953K9776L1203J49145j37050r9161j6550n7570K7716l8438
7947H25686K5150N7096L4203J34562n7500n4430p5415j5701L8130L2839K4911
$$ y = [1136704, 1094320, 1226213, 1230682, 1221646, 1167470, 1156134, 1056559, 1022301, 1021231, 1070067, 1021261, 1002179, 994727, 1033636, 1045014, 1145384, 1061450, 1000044, 1000033, 1027161, 1000559, 1005480, 1035816, 1016656, 1006422, 1026610, 1039544, 1084281, 1054417, 1082102, 1043491, 962128, 1069861, 1122680, 1028151, 1031352, 1015812, 985225, 981576, 856325, 957179, 913953, 919460, 974597, 963720, 895722, 916545, 963921, 939588, 906147, 869559, 843180, 920053, 997229, 1051802, 952342, 917327, 838126, 873486, 1021953, 925279, 960446, 950282, 927358, 996675, 982042, 967932, 890960, 839951, 886445, 924662, 936615, 966391, 997594, 1146739, 1009689, 910528, 893978, 836408, 864124, 825686, 850836, 907932, 942135, 1076697, 1019197, 964767, 889352, 873651, 911781, 944620, 969531]
7936I69531j05973r522M8851n8914M207Q7981r1452n8007O5125K4014L1810K7370
7924I35021L0152j48606L8230P9619l6374n0345p3308q944L8385J4745J972J4092
7912H34639P389R5513p6148L541j5898p6683p6524l2175J26834J11949k8678p2499
7900H01260N2858N566N0985k8334L1219J04722j37423q0539Q5851j7728l6798
7889H31639j19156k1308O0340P3910r638l9040O5869R833M6447K326m7933l3605
7877H19684j2780n1133J06571M0838j22273j14081N1019j4715k3877P4053K2542
7866G75848j3274j7477O5659N8206l22J923R912k5105P1686J5870j02459l4019
7854H06448r8907L315K1163J85977m968p4005q2733M7707L4288M862l5794P5359
$$ y = [969531, 863558, 854036, 902887, 843973, 848180, 936161, 844709, 786702, 851827, 875841, 907651, 935021, 965173, 816567, 854797, 934416, 898042, 847697, 774389, 765445, 803830, 818575, 820547, 834639, 842028, 937541, 861393, 864934, 849036, 772353, 695829, 663654, 790488, 902437, 873759, 801260, 854118, 859684, 910669, 882335, 913554, 1018276, 880853, 800314, 886165, 868437, 831639, 712483, 691175, 751515, 825425, 815787, 776747, 842616, 852449, 898896, 901222, 853289, 819684, 806904, 755771, 862342, 903180, 780907, 666826, 717845, 703130, 679253, 753306, 775848, 762574, 745097, 810756, 868962, 868640, 870563, 880475, 855370, 927056, 942926, 840467, 806448, 707541, 710856, 732019, 917996, 913028, 839023, 756290, 803997, 838285, 843147, 807353, 882712]
7842H82712j8761q6647N0245o5377O6788J20795n3567K111k5405L9728m2153j1407
7830H59062q738J3295M2927l9375j0018K0452q7039J1001M667n5391K9123k7515
7818G52451m4012P5557o485l0099J0666J24906L3153k4159L0749j57635j58002
7807F07090J00850J63092L9738o0045J0147m9782L0640j1262P7992o2126n40215
7796C06119K38162N5647Q4170M8262K1913m4339p304j872O0172k5103L6483L3997
7784H06307K9363r6058o8484o627q9056N7629O7820k6314J00427p1438n2576L6319
7772F87312K0574m1045N6361j3143Q3589L4031l7096K1402j6703j2268l8157k5409
7760G19448K7836j0157p9481P3392n7684J25577n1694M4384J3606j29155k5959
$$ y = [882712, 863951, 777304, 827549, 762172, 828960, 949755, 896188, 898299, 872894, 912622, 870469, 859062, 850324, 863619, 906546, 867171, 857153, 877605, 790566, 801567, 806234, 750843, 779966, 752451, 708439, 783996, 777511, 747412, 758078, 882984, 916137, 891978, 922727, 765092, 607090, 707940, 871032, 910770, 850725, 860872, 811090, 841730, 830468, 908460, 846334, 306119, 544281, 599928, 684098, 732360, 754273, 709934, 702630, 700758, 760930, 735827, 772310, 806307, 835670, 739612, 671128, 664501, 575445, 633074, 700894, 674580, 775007, 703569, 650993, 687312, 707886, 666841, 723202, 710059, 793648, 827679, 790583, 811985, 795282, 783014, 744857, 719448, 747284, 737127, 657646, 731038, 673354, 798931, 747237, 791621, 805227, 676072, 650113]
7749F50113N3911k5252Q5450P9889k0209m3844M7683J0323p0266M740j23388K1281
7737F70431L6311o8563k7670K56J09167j0791l2135k0646o4647m4628R1955O3862
7725G02902j3681L7802n087K6712j5174n3233O6996j7187J6831j27986L9409O591
7713F64895N0445O8778n3895R2887j99939j1929r1287O7886J00767l0868P1967
7702G29707j1264k523p3870N1283l4500N6270l7794J8918n2051m2658R7983N84
7690G00085j54257R1254o1962k5401n647l300k0681L8189J47659j62892l742k4478
7678E14827K1032J22694k7159l7126R319k4062m0637L0634O4320K3062n0488j17076
7666D89340J2395R3980O2682j20281M0327l2747J2248j0115j3039J35561p6774
$$ y = [650113, 704024, 678772, 764222, 844111, 823902, 780058, 827741, 838064, 767798, 772538, 649150, 670431, 706742, 638179, 610509, 610765, 719932, 709141, 677006, 656360, 591713, 547085, 639040, 702902, 689221, 727023, 721936, 748648, 733474, 680241, 747237, 730050, 746881, 618895, 658304, 664895, 715340, 784118, 730223, 823110, 623171, 611242, 519955, 587841, 688608, 657740, 729707, 718443, 715920, 642050, 693333, 658833, 715103, 677309, 696227, 644176, 601518, 699501, 700085, 545828, 637082, 575120, 549719, 544072, 540772, 520091, 558280, 705939, 543047, 539305, 514827, 535859, 658553, 631394, 594268, 603587, 579525, 538888, 569522, 633842, 656904, 606416, 489340, 501735, 595715, 658397, 538116, 578443, 545696, 557944, 547829, 534790, 670351, 593577]
7655E93577o9319N8863m1664j4739o1061Q0751N8562n8901m9493m967P4379o0696
7643E05292m6638k9557K6358P7869L0586m9560j911M0034p6053m5603j2313O5618
7631D84122K6029k5200n459R2395J5989j42844l1714J4823N703l9397M6937k1800
7619D19584j8700Q5414K9287L4794k1897j7030n6921k0321l0716o3303P896J8058
7607C66145J2514N2046L2729M726j2552Q776N0173J847j29426l6909J15632k0864
7595D44837M8726M558P476N2625p9990p0831J2643Q7262L1110p5711Q6347o833
7583E42219m8057l7532M5379J0240r4649L0056Q3666L5945j30188k3747K1830
7572D35162R6956l2013n7870j8247M9442K2327r5516N6099L4078J0867r7570l5331
$$ y = [593577, 524258, 583121, 541457, 526718, 465657, 546408, 604970, 546069, 496576, 491609, 565988, 505292, 458654, 429097, 455455, 533324, 563910, 514350, 512439, 552473, 476420, 430817, 418504, 484122, 510151, 484951, 479492, 571887, 587876, 445032, 413318, 428141, 433844, 394447, 441384, 419584, 400884, 486298, 515585, 550379, 528482, 511452, 454531, 434210, 403494, 340191, 348087, 366145, 378659, 430705, 463434, 468160, 455608, 464384, 514557, 516404, 386978, 350069, 465701, 444837, 493563, 498121, 505597, 558222, 478232, 407401, 420044, 507306, 538416, 462705, 549052, 542219, 494162, 456630, 502009, 512249, 417600, 447656, 531322, 567267, 437079, 413332, 435162, 532118, 500105, 442235, 423988, 473430, 495757, 400241, 456340, 490418, 501285, 403715, 368384]
7560C68384P5217J2306m002M4325j0153j043l0590j4673O4073l777J3365o4334
7548D49098n9936J8682J32910J1466j10028R204K9526p7416r823J1963K9299N4940
7536D89885K8055o4367l5392j3029k7068L5571M6376k8928j8081P131J7843j01962
7524C36034J2144P8661o1618J9533L0629l7341J02675n2355p7522J10524j39373
7513C21991r7008J41892J70029M2466r5839j45718j4020n208J9619M0974L4112
7502D13290q4338R1778P9095q8934j47985P0608l8995P0270O715k974N8168J4649
7490D41347p3080M9955J04431o2411l807R685J3586q2609K8059j8247N1859j8257
7478D40511j7730P1152L0878p0834K8463K3488o2859r9817k7075J24433O3460
$$ y = [368384, 443601, 455907, 451905, 496230, 486077, 485034, 454444, 439771, 503844, 500067, 513432, 449098, 389162, 407844, 540754, 552220, 442192, 451396, 480922, 403506, 393683, 405646, 434945, 489885, 517940, 453573, 418181, 405152, 378084, 413655, 460031, 431103, 413022, 420153, 437996, 336034, 348178, 426839, 365221, 384754, 415383, 378042, 480717, 428362, 350840, 461364, 321991, 224983, 366875, 536904, 579370, 483531, 337813, 323793, 318585, 338204, 379178, 413290, 328952, 420730, 499825, 410891, 262906, 333514, 294519, 364789, 371504, 368530, 426698, 441347, 368267, 418222, 522653, 460242, 456435, 466120, 479706, 397097, 425156, 406909, 458768, 440511, 422781, 493933, 524811, 453977, 482440, 505928, 443069, 343252, 316177, 440610, 504070]
7467E04070q1961M256p8713l2860J12677q8214M7996O7716k1509M2901k8431o8074
7455C79854l890k5731m7216R0004n300m63k0586m1387J09509R4695L415l8057
7443D94847r7027m0753J34424o9123n0581K7668j15262L3379L5060O8412L1840
7432D52884p69R609p2246p235O1624n7876L1282L511l7014p3508J08079K3074
7420D41415j42305J38748J6445n3299O3301p0568K8969p9698l8367K6766l84k5199
7408C05824Q9469K1967P9105j2235p0325Q0853r3539l2457l6456K2595o8185Q1236
7396C67852M2359K2007r4823o6069L0874P3057K1917L7596L6607l5883n9768k1542
7384C54184N7438k675j37780J13165J13101n0373p0938J8716l7038o2362Q8980
$$ y = [504070, 422109, 426365, 347652, 314792, 427469, 339255, 387251, 454967, 433458, 476359, 447928, 379854, 375964, 350233, 303017, 393021, 387721, 387258, 366672, 325285, 434794, 529489, 532904, 494847, 397820, 357067, 491491, 422368, 371787, 399455, 284193, 317572, 352632, 421044, 452884, 452115, 461724, 389478, 382243, 443867, 385991, 417273, 420784, 383770, 310262, 418341, 441415, 299110, 437858, 454303, 401004, 464305, 393737, 422706, 343008, 304641, 331407, 331023, 305824, 395293, 417260, 496365, 484130, 413805, 494658, 401119, 368662, 332206, 354801, 286616, 367852, 410211, 432218, 337395, 271326, 302200, 375257, 397174, 434770, 471377, 435494, 375726, 354184, 411622, 408947, 271167, 384332, 497433, 447060, 376122, 394838, 357800, 295438, 384418]
7373C84418p417p4288J38119J5976m6952q8494j09885k3699Q7620R0532n9984
7362C05946N4340L446p873o9994j8753R8694j04937j15619Q7787J0043O4510K4251
7350C31841n6630r746M6707M0253M478j0333P9587q873j18924L8633j2730M7194
7338C71457j8776N046J2295k6334O6199k4759k9987k9649j3746O1203k9481n6885
7326B86583n2352j41586R1473R2502m0799J4367J09451o4343o2545M6464O535
7315B85750n1979J0070J00864K6675j8662J6959n69J0472J7707m3471r5095J20299
7303C79020n3107J0841L7988n6377J8214m6732M3932R5637K0977K5627l3260o1977
7291C80783R3865r5848m0127J02751k9630M0879m5930N8705L3258r9180n0329
$$ y = [384418, 377001, 302713, 440832, 456808, 409856, 321362, 211477, 187778, 275398, 365930, 305946, 360286, 363732, 355859, 285865, 267112, 365806, 260869, 145250, 233037, 243080, 307590, 331841, 275211, 265465, 312172, 352425, 356903, 346570, 426157, 417284, 298360, 336993, 324263, 371457, 352681, 357727, 370022, 343688, 409887, 385128, 355141, 325492, 311746, 372949, 343468, 286583, 234231, 92645, 184118, 276620, 235821, 250188, 359639, 295296, 232751, 279215, 285750, 233771, 243841, 344705, 371380, 352718, 369677, 369108, 379580, 397287, 353816, 258721, 379020, 325913, 336754, 374742, 318365, 336579, 289847, 333779, 429416, 450393, 476020, 442760, 380783, 474648, 378800, 338673, 441424, 411794, 452673, 406743, 465448, 498706, 399526, 349197]
7280C49197m8367P0938J5699K316k5859M0534j5757k2825l908n7884J19477J24610
7268E48171n7787n8506j0697k9852j9265L1780M8m4590J3760p552L6454j219K6539
7255D27284M253N9693L4783l9070p382M958O0958l6966m200L937m1945M1802L250
7242E11355j9258o1791L130Q566m1145j367p3316Q3292J0941m492P816j5533k2559
7229C85639R6091J2048J1788k1545M1921r766q0272k2998k7686K5060K2452j1003
7217D21729O962K2629o7900J7920m4440n5403M1014R0444n234j8557L5207n0964
7205C93407j17807P077Q7457P4872j9269l3726L4837q24l2066l6570P5596l7039
7193C95945j1999O9243p9450j00164J12129K6988K5120r1406k2190P888J0031
$$ y = [349197, 300830, 371768, 387467, 389783, 363924, 404458, 388701, 365876, 361968, 304084, 423561, 548171, 490384, 431878, 421181, 391329, 372064, 403844, 403892, 359302, 373062, 365510, 401964, 400745, 427284, 431537, 491230, 526013, 486943, 479561, 484519, 545477, 508511, 504311, 508248, 466303, 508105, 511355, 492097, 430306, 433436, 442002, 400857, 399490, 326174, 409466, 420407, 415915, 423731, 408198, 385639, 481730, 493778, 505566, 484021, 525942, 516176, 435904, 412906, 385220, 410280, 432732, 421729, 428691, 451320, 383420, 401340, 356900, 301497, 342511, 432955, 427721, 409164, 444371, 393407, 275600, 282677, 370134, 445006, 425737, 392011, 426848, 426024, 393958, 357388, 432984, 395945, 383946, 453189, 373739, 273575, 385704, 412692, 437812, 346406, 324216, 332104, 342135]
7182C42135r1203K4302J09508l6712L1474j0367J2972q0269N877J3486L2730k3334
7170C30599j6382O8384N6704K0391o8033o9780p2969L7110l800j06906J1308n3114
7158A33512P4041P1459O2169L0079o059n6882J3031j1882L1878K5932q2129M6193
7146C31342p2793j8924J28966m6381j6924J6440o7576M1982P4638k6363O1551
7135D05958j5287m9257P1392K4170r6565k3078K8766j5537q2223Q2370l8618J6210
7123C08301J49283l9203k9436j28553O1599N148l3764N8204M7922j38796p0898
7112A89807N0302r43J04196J6977n0409J04318q4054l8177L6962k430p297l1235
7100B88017o941J8899k3442l5642l4320O5465J32932j33508M0703R5537r3627
$$ y = [342135, 250932, 275234, 384742, 348030, 379504, 369137, 382109, 301840, 307717, 321203, 353933, 330599, 314217, 382601, 439305, 459696, 391663, 321883, 248914, 286024, 282224, 175318, 186626, 133512, 207553, 279012, 341181, 371260, 365201, 308319, 321350, 309468, 341346, 367278, 285149, 331342, 258549, 239625, 368591, 322210, 305286, 321726, 254150, 296132, 370770, 344407, 405958, 390671, 341414, 412806, 436976, 340411, 317333, 346099, 330562, 248339, 330709, 292091, 308301, 457584, 418381, 388945, 260392, 321991, 327139, 293375, 351579, 399501, 260705, 189807, 240109, 239166, 343362, 360339, 309930, 414248, 330194, 292017, 328979, 326549, 319252, 288017, 281076, 299975, 276533, 240891, 206571, 272036, 404968, 271460, 312163, 407700, 314073]
7089C14073k0847Q5004o6413L2174N6991j9562m2622k3501n6985m0985J60178
7078C77505k340m7902Q0459j08239J8061J4210m2335K8610O2183m8086Q7225m4439
7066C74912q3784M2615P8652l453q0752l3010o2489J04782O7986J2937J2890m2107
7054C89179k9662j881N7577R6784m8152o4203l0892N5703j10658m5978L1888l6055
7042B63650P9916N6344K6926n144n7900L0074J23094n2666j10481O0095R367K432
7030D25707R638K82l1584L0956L3121P9549q3431m2203J19172M6825j62793K1795
7018D47034J7842J03793M6223j39604Q7317O5674o1029K2953K6459M4744M341
7007F65747m3405R4094O6384J141k1006J4046p1767q08q77J3025P8691l2062l3704
$$ y = [314073, 293226, 378230, 311817, 343991, 400982, 381420, 338798, 315297, 258312, 217327, 377505, 375165, 327263, 407722, 299483, 317544, 331754, 289419, 318029, 380212, 332126, 419351, 374912, 291128, 333743, 412395, 408942, 328190, 295180, 232691, 337473, 405459, 418396, 431286, 389179, 359517, 357636, 415213, 511997, 463845, 399642, 368750, 424453, 313795, 267817, 299705, 263650, 343566, 399910, 426836, 421692, 363792, 393866, 516960, 464294, 353813, 413908, 423275, 425707, 435345, 435627, 404043, 434999, 468120, 547669, 464238, 422035, 541207, 588032, 425239, 447034, 464876, 568669, 614892, 475288, 562605, 628279, 567250, 590203, 616662, 661406, 665747, 622342, 716436, 782820, 783961, 762955, 777001, 705234, 704426, 703549, 716574, 795265, 763203, 729499]
6994G29499L1295k7775o3395r0865J03164m390n0958l1787p6239J129n0943r886
6982D58849M4395J06376j9928j14286k9549J38519P5053k6824l6606l8977l836
6971E53186p0597N5018P3554K0868K5315j14241J970J52480k9110K3747l0838
6960F61352m2687K4929p2294j6345j4793L7600J0051k004j6719M0104O2334k8276
6948F43252j1316R2774j1762m1676j1925M4855L9385j58573O9893k7333p847Q7007
6936G06734q8387R758j6169M2573l9283k8471K0130R1071k5274r5969P404k3433
6924E60684M851k8125K916J8624J07844L7608n4677j48130q7015L5587J36060
6913E86227K8851L947r5329m8800N3729l7046L387J21758L6561R941j00527j6138
$$ y = [729499, 760794, 733019, 669624, 578759, 681923, 677533, 626575, 594788, 518549, 519678, 468735, 458849, 503244, 609620, 589692, 475406, 445857, 584376, 659429, 632605, 595999, 557022, 553186, 482589, 537607, 611161, 632029, 657344, 543103, 545073, 697553, 668443, 692190, 661352, 618665, 643594, 571300, 554955, 540162, 577762, 587813, 585809, 569090, 609194, 671528, 643252, 631936, 724710, 712948, 671272, 659347, 704202, 743587, 585014, 654907, 627574, 619727, 706734, 618347, 628105, 611936, 654509, 615226, 586755, 606885, 697956, 672682, 576713, 584117, 560684, 565535, 537410, 540326, 558950, 666794, 704402, 649725, 501595, 414580, 450167, 586227, 615078, 619025, 523696, 474896, 528625, 491579, 494966, 616724, 653285, 663226, 562699, 546561]
6901E46561J03771O5574j30008k5509K533q347Q7181j32180K313P2002J8104o6943
6889E35052O3065p9460p655J62766N6535m0239r8216J19024l6905q4471O8983
6878F58479o0229m7316M8066n2697n0647j2157q8273J05021M0714J3755K5144
6867E79860k3190L4730o4140M709M1268M6584M8398n5105K3389k6573M2238R6269
6855G48437L3807k1159o9158j4424j4064k6733m9196P704J17967M5417K1998j29837
6843F50759j07915J41524j541o2511K7567J7758m0880L5107Q8774q6917l0839
6832F30886Lp4183k2731J8678K8931p9367Q0191P5183O64o0420m5190k3563M750
6819E33832L79J48413R2996j35719j08648M362J31306j7746R6469J1051j32142
$$ y = [546561, 650332, 715906, 585898, 560389, 562922, 554575, 641756, 509576, 511889, 583891, 601995, 535052, 598117, 518657, 511002, 673768, 730303, 690064, 591848, 710872, 673967, 589496, 658479, 598250, 550934, 599000, 546303, 495656, 483499, 395226, 500247, 540961, 554716, 579860, 556670, 591400, 527260, 531969, 573237, 619821, 668219, 613114, 636503, 609930, 652168, 748437, 782244, 761085, 691927, 677503, 663439, 636706, 587510, 595214, 713181, 758598, 780596, 650759, 542844, 684368, 682827, 620316, 647883, 665641, 624761, 659868, 748642, 661725, 630886, 630889, 556706, 533975, 552653, 581584, 502217, 582408, 657591, 658255, 597835, 552645, 529082, 533832, 534211, 682624, 775620, 639901, 531253, 535615, 666921, 649175, 745644, 756695, 624553]
6808F24553Q4864k3179p6109m8322m859l3891Q2867l6204P5006Q0485o0122l13
6796F64776q0981m0607N8615Q0724m8798N4853L3421Q4034Q475l6296j8630R0977
6784H50563j72149J2577J9928j18328j6946K9745J59155Q7076l5925n7386l745
6773G54565L7063o4653J1845K6504J9807q345K891L576n3846o189J05778l2975
6761G96021K4065N5240o4744K4753j660l9298J39137J07650j02723j23325O9670
6750H84786J02328l6849j6807J03970m0407m6071J29138J2787M6108k5581j7484
6739A095918J24471k1807O0622k261r6752P9046K5335k0319J8886m5094p4278
6728A143767L0649K7316J8961Q121J13656L7349J41323P230J4297J9960L446j1665
$$ y = [624553, 709417, 686238, 610129, 561807, 556948, 523057, 605924, 569720, 644726, 725211, 665089, 664776, 583795, 543188, 601803, 682527, 633729, 688582, 722003, 806037, 814512, 778216, 759586, 850563, 678414, 690991, 710919, 592591, 575645, 605390, 764545, 851621, 815696, 758310, 754565, 791628, 726975, 738820, 765324, 785131, 776786, 779677, 783253, 729407, 723218, 828996, 796021, 820086, 875326, 810582, 835335, 833675, 794377, 933514, 1041164, 938441, 815116, 884786, 987114, 950265, 933458, 1037428, 997021, 950950, 1080088, 1092875, 1138983, 1113402, 1095918, 1220389, 1198582, 1259204, 1256943, 1160191, 1239237, 1264572, 1244253, 1263139, 1218045, 1143767, 1174416, 1201732, 1220693, 1228814, 1342470, 1379819, 1521142, 1528372, 1542669, 1562629, 1566075, 1554410]
6716A554410Q5873J038J4014J16568O3873j03270M6770j13996j07108p9662k0765
6705A457745R439J07586J3762p5549k9287L49L7997O27N5184J6219q325Q475n112
6692A589110L4281R3326n4927l5603L9475Q2768P7092K5918l3703O5464J11221
6681A994422n4385n9854J18419l9059j02235q6592O8752O9025R3187k9569j01199
6670A870912q4947o0018K3750Q6152l0967J4510r89o7801k3193N2608P4319o2957
6658A791379L2354L3413m6823j6268K7618Q5144k0448j13701O3598R8243L3346
6647A967855K7867K5416l253K8135j9207m165R3657o0006N9028k8383n2621J36046
6635B170369O3920m5555j8841q0692j83447Q3966J87531m9783M6929L2565j09471
$$ y = [1554410, 1640283, 1641321, 1655335, 1771903, 1835776, 1732506, 1779276, 1665280, 1558172, 1478510, 1457745, 1467184, 1574770, 1588532, 1512983, 1483696, 1484045, 1522042, 1522669, 1577853, 1594072, 1585747, 1594222, 1589110, 1623391, 1716717, 1661790, 1626187, 1665662, 1748430, 1825522, 1851440, 1817737, 1883201, 1994422, 1940037, 1880183, 1998602, 1959543, 1857308, 1770716, 1839468, 1908493, 2001680, 1972111, 1870912, 1785965, 1725947, 1749697, 1835849, 1804882, 1819392, 1818403, 1750602, 1727409, 1780017, 1854336, 1791379, 1823733, 1857146, 1810323, 1794055, 1821673, 1906817, 1886369, 1772668, 1836266, 1934509, 1967855, 1995722, 2021138, 2017885, 2046020, 2026813, 2022648, 2116305, 2056299, 2115327, 2086944, 2034323, 2170369, 2234289, 2188734, 2169893, 2089201, 1905754, 1989720, 2177251, 2127468, 2174397, 2206962, 2097491]
6624B097491L4943J2536m109k1893q8143m6868O3792J04946o3384K7552N9613
6613B176476Q4098Q516m7816N2629M1563L7344o6171m9396K2122O9914o1011p4648
6601B193620J59991J69025P5290o0087J931m3790j1857K0931Q7845J04217O0730
6590B757846J24684J05552J21098O8398K8012K39434J66850p6084j9129j10553
6580C406108j79746j12451j02138m4279j8086q428p0393J7125J9347p2694k0346
6569B814019j17659P3175J9257L5017j6211m3463J0034m907R3307L9944j12893
6558B789620k4041K0165J19016Q0050j1093k6021L0377N2285Q1354n9071j34583
6547B918058J8835J06751L3712k2366M0081J31979N1182n8494l9432P1114Q6517
$$ y = [2097491, 2132434, 2144970, 2140861, 2118968, 2030825, 1983957, 2047749, 2152695, 2089311, 2116863, 2176476, 2260574, 2269090, 2221274, 2273903, 2315466, 2352810, 2286639, 2237243, 2259365, 2329279, 2268268, 2193620, 2353611, 2522636, 2597926, 2537839, 2539770, 2495980, 2484123, 2505054, 2592899, 2697116, 2757846, 2882530, 2988082, 3109180, 3177578, 3205590, 3445024, 3611874, 3535790, 3516661, 3406108, 3226362, 3113911, 3011773, 2967494, 2949408, 2940980, 2870587, 2887712, 2907059, 2834365, 2814019, 2696360, 2769535, 2788792, 2823809, 2807598, 2764135, 2774169, 2769262, 2862569, 2902513, 2789620, 2765579, 2785744, 2904760, 2984810, 2973717, 2947696, 2978073, 3030358, 3111712, 3052641, 2918058, 2936893, 3043644, 3077356, 3054990, 3095071, 3227050, 3278232, 3219738, 3180306, 3251420, 3337937]
6536C337937q1405r2202L7082O2897M1774P9179M7675N9440K9222R2130J61920
6525C775649N7937m962J01117j24338J5842O7651J11000N7455P9181j8566n7997
6514D059969K13385Q9488q474P0681Q5293J09166J41846r2645R8135R4094P4398
6503D935336K12642K6813R9276P6670J46372P6459J40370L5641Q3677K04030o091
6492F031195J10347J69986Q7634J08911J56246R0085Q1229J88930J93329J11267
6482G329159J88872J34056J00458J45869K58592J73535K11014J36487J34291J85668
6472H998001J51033K08345K71038L25146J94002J88578J89613K99540K35016K19322
6462A1279634M24772K62557L84264K26473K71228L88528M23982M63963M09425
$$ y = [3337937, 3256532, 3164330, 3201412, 3264309, 3306083, 3385262, 3432937, 3492377, 3521599, 3613729, 3775649, 3833586, 3828624, 3929741, 3805403, 3821245, 3888896, 3999896, 4057351, 4136532, 4117966, 4059969, 4273354, 4362842, 4354368, 4425049, 4510342, 4619508, 4761354, 4668709, 4766844, 4860938, 4935336, 5147978, 5174791, 5274067, 5350737, 5497109, 5573568, 5713938, 5749579, 5833256, 6037286, 6031195, 6141542, 6311528, 6399162, 6508073, 6664319, 6754404, 6835633, 7024563, 7217892, 7329159, 7518031, 7652087, 7752545, 7898414, 8157006, 8330541, 8541555, 8678042, 8812333, 8998001, 9149034, 9357379, 9628417, 9953563, 10147565, 10336143, 10525756, 10825296, 11060312, 11279634, 11704406, 11966963, 12351227, 12577700, 12848928, 13237456, 13661438, 14125401, 14534826]
6453A4534826L35922M28145N42976O40190O70906N97112P34175Q24342R76298
6444B0284892R42084R69046J151401J313423J328838J486771J790640J914853
6436C1181948K147803K589239K793334L187647L450953L402220K985513J965031
6428E3703688P12102l98506j022711j332251j146325n43255m50489j88263j71484
6419D9162506k22606m1606N2831N07881R17766J357874J682422K124456K645354
6410E8186878L346514M137802M887176N726627O460813O511580N450110L131851
6402I7839351j51592l167424n005209n346657m764942l778649k567370j829108
6394G1228400j507015j549284j986947k510161k714680k375293j717318j175390
$$ y = [14534826, 14870748, 15298893, 15841869, 16482059, 17152965, 17750077, 18484252, 19308594, 20284892, 21226976, 22196022, 23347423, 24660846, 25989684, 27476455, 29267095, 31181948, 33329751, 35918990, 38712324, 41899971, 45350924, 48753144, 51738657, 53703688, 54415790, 54017284, 52994573, 51662322, 50515997, 49972742, 49522253, 49333990, 49162506, 48939900, 48898294, 48951125, 49459006, 50376772, 51734646, 53417068, 55541524, 58186878, 61533392, 65671194, 70558370, 76284997, 82745810, 89257390, 94707500, 97839351, 97687759, 94520335, 89515126, 84168469, 79403527, 75624878, 73057508, 71228400, 69721385, 68172101, 66185154, 63674993, 60960313, 58585020, 56867702, 55692312]
6386E5692312p29144j49268N47740J043809J500857K090398K543441K297691J759632
6377F6597468O10617j090354k410225l100839l416214l320015k658430k285979
6369D8926029j864426j538588j378764j410948j721807j987398j958717k058416
6361C5006965j798751j584389j482168r98834p78583p63631o96204n26918m26880
6352B5950607l53988k34903k18424j95421l32121l31983o18353p07310p35965
6343B2222139p47371p80284p76415n69788o15200n61924m93946m24654l32806
6334A6919751l12471q8402j46106J260L3550j21447K2327K032J42371J96230N2423
6323A6701518p1770k90886m46173n96881n00144m03519l67116m53931l68712k12545
$$ y = [55692312, 54963168, 54813900, 55361640, 56405449, 57906306, 59996704, 62540145, 64837836, 66597468, 67208085, 66117731, 63707506, 60606667, 57190453, 53870438, 51212008, 48926029, 47061603, 45523015, 44144251, 42733303, 41011496, 39024098, 37065381, 35006965, 33208214, 31623825, 30141657, 29142823, 28364240, 27600609, 26904405, 26377487, 25950607, 25596619, 25361716, 25143292, 24947871, 24615750, 24283767, 23665414, 22958104, 22222139, 21474768, 20694484, 19918069, 19348281, 18733081, 18171157, 17677211, 17252557, 16919751, 16607280, 16518878, 16372772, 16374032, 16407582, 16286135, 16308462, 16310494, 16452865, 16649095, 16701518, 16629748, 16338862, 15892689, 15295808, 14795664, 14392145, 14025029, 13571098, 13202386, 12989841]
6313A2989841k30010j47471j27488j56110r9239q0863r4685l4044o8413j13855
6303A1837663j66980j80714k15970m7438k61025k86555j87598j94529j55831l941
6293A0137082j24233k44115l23610j43898n8337j67078L405P7335J8889P4502
6283I249942L4930j8427k95752l03456k35892j55185k97060k11480j57688j66931
6273G443001j41391j46230K7638q4968r8099p8552O3299K922j39458n0417o7890
6262F729855j14307q9243K9386r6043N866j00163p1838l3353Q8658J98711p7376
6251F470153k1425M8197R9116J39624n8066q4428j05420q5636m2112M1108M4818
6240F445929j62049m7402R6777L9266l5804N6685K9048M0338J4395P1544n0514
$$ y = [12989841, 12759831, 12612360, 12484872, 12328762, 12229523, 12148660, 12053975, 12019931, 11951518, 11837663, 11670683, 11489969, 11273999, 11226561, 10965536, 10678981, 10491383, 10296854, 10141023, 10137082, 10012849, 9768734, 9445124, 9301226, 9242889, 9075811, 9079216, 9156551, 9175440, 9249942, 9284872, 9266445, 8970693, 8667237, 8431345, 8276160, 7979100, 7767620, 7609932, 7443001, 7301610, 7155380, 7183018, 7098050, 6999951, 6921399, 6984698, 6987620, 6848162, 6797745, 6729855, 6615548, 6526305, 6555691, 6459648, 6465514, 6365351, 6293513, 6260160, 6348818, 6547529, 6470153, 6448728, 6496925, 6596041, 6735665, 6677599, 6593171, 6487751, 6402115, 6360003, 6401111, 6445929, 6283880, 6236478, 6333255, 6372521, 6336717, 6393402, 6422450, 6462788, 6477183, 6548727, 6498213]
6229F498213l8711k8310M1665n7809j8512q7577N442N6086M289j50971j99693
6218F024112J1615n303r6512j44599q4313j5292O7772r8388m4201P8436J13978
6207E807305M9236l4208O8048p2029j00678j35221j00479p8426j02076k8273p3748
6196E199451r2150J0826K4930l1954j16909j11511l5959n884o2571r214K6445
6185D795500J52347o1872L7239J08905j74501n5966j7484K0785M3567q4532Q0352
6174D844340J8353j14469j62983N510J82488M4279M7749j5643j0051M7910L3314
6163D920797P7478L5204N3501J36861R8240l2178j6854J16416Q5827R0904p3903
6152E492293J29850n2405l0122J6482k8383P1489M3948L2634l0481K9089K5195
$$ y = [6498213, 6459502, 6431192, 6472857, 6415048, 6396536, 6308959, 6314401, 6370487, 6374776, 6223805, 6024112, 6035727, 6030424, 5933912, 5789313, 5705000, 5689708, 5757480, 5659092, 5614891, 5693327, 5807305, 5856541, 5822333, 5890381, 5818352, 5717674, 5582453, 5481974, 5403548, 5301472, 5273199, 5199451, 5107301, 5118127, 5143057, 5111103, 4994194, 4882683, 4846724, 4840840, 4778269, 4769055, 4795500, 4947847, 4885975, 4923214, 5032119, 4857618, 4801652, 4784168, 4804953, 4848520, 4763988, 4844340, 4862693, 4748224, 4585241, 4590751, 4773239, 4817518, 4865267, 4849624, 4839573, 4887483, 4920797, 4998275, 5033479, 5086980, 5223841, 5322081, 5289903, 5273049, 5389465, 5475292, 5566196, 5492293, 5622143, 5569738, 5539616, 5556098, 5527715, 5599204, 5643152, 5675786, 5645305, 5674394, 5699589]
6141E699589J06772l2013J30677J3459Q610J66243J32482L2555R2021P1237L6952
6130F458584N4572J29814K04094P406O3062J56107l1259M9021K10883J36260J06785
6119G545329J27082K13971N6498J15888N7299J31769J03023J13963J84421J97036
6109H846279J66155K66065K20677L6011K55367L31565N0354J81099K78376K60421
6099A0892369K68852K75168K54030L60528K25016L21404L21660M39968M15094
6090A3774089M01518M65250M79265N77767O82632P93205Q55591R57665R60634
6081A9947616J152124J429716J562145J832128K418614K971645L606183M279127
6073C9199298M650588M293556K487899k54321k160831k937409k602180j822974
$$ y = [5699589, 5806361, 5774348, 5905025, 5918484, 5927094, 6093337, 6225819, 6258374, 6350395, 6421632, 6458584, 6513156, 6642970, 6847064, 6854470, 6917532, 7073639, 7042380, 7091401, 7302284, 7438544, 7545329, 7672411, 7886382, 7942880, 8058768, 8116067, 8247836, 8350859, 8464822, 8649243, 8846279, 9012434, 9278499, 9499176, 9535187, 9790554, 10122119, 10172473, 10353572, 10631948, 10892369, 11161221, 11436389, 11690419, 12050947, 12275963, 12597367, 12919027, 13358995, 13774089, 14175607, 14640857, 15120122, 15697889, 16380521, 17173726, 18029317, 18986982, 19947616, 21099740, 22529456, 24091601, 25923729, 28342343, 31313988, 34920171, 39199298, 43849886, 48143442, 50631341, 50377020, 48216189, 45278780, 42676600, 40853626]
6065D0853626r73676r7921R39971J683262K488372K857363K359387J049766J52030
6056E1312180J19627R69633J861958K299852K022358N59901j154665k699982k981025
6047E2309837k257573j248340k05144N96603P28189l80077j659756k335269k092438
6038D3456032j170305k44755P49473J855691K873523L390951L069944J234616
6030E5215170j752792m496551n613874n403448m629551l826212l139280k575540
6022B3777922k138668j679569j443919j150684r91254o80301n87005o40743n22661
6013A3943118m73769m04284m45107l34559l34894l96795k98333l73619j96549
6004A0685209k41705j94968k98744k26451j02727k66808j53229k09476j15606
$$ y = [40853626, 39879950, 39782029, 40722000, 42405262, 44893634, 47750997, 50110384, 51160150, 51312180, 51431807, 52401440, 54263398, 56563250, 58585608, 59145509, 57990844, 55290862, 52309837, 50052264, 48803924, 48598780, 49195383, 49923572, 49543495, 47883739, 45548470, 43456032, 42285727, 42040972, 42790445, 44646136, 47519659, 50910610, 53980554, 55215170, 53462378, 48965827, 43351953, 37948505, 33318954, 29492742, 26353462, 23777922, 21639254, 19959685, 18515766, 17365082, 16373828, 15693527, 15106522, 14465779, 13943118, 13469349, 13065065, 12619958, 12285399, 11950505, 11553710, 11255377, 10881758, 10685209, 10443504, 10248536, 9949792, 9723341, 9620614, 9353806, 9200577, 8991101, 8875495]
5995H875495j09308p2609j85756j39781n9262j30903k6507l8303r9108j23092
5985G890866o8959j08127n5028K2688r0179r5907n0660K6629P024r0442k8711
5974G359194o8364l1184J0627j46108l5926Q7893N4001K4919j8970j2096m4390
5963G179596l2673K0963L7109K0507j6071L3780K4993O0569J8021j08935J07265
5952G345124M9528O4751n486P5926K04558l3126Q7112L4458L7770Q605o1079R7925
5940G906066J58536J29602k7317k2947L8500Q1781Q6598l2050Q0668J52733J07390
5929H659560N0420J59847J23622k909J53735J45682J34508L0739J10519K25984
5919I791707J14267J48387O8888K16397K02430J66823J31114J38339K23458K02628
$$ y = [8875495, 8766187, 8693578, 8507822, 8368041, 8308779, 8177876, 8151369, 8113066, 8013958, 7890866, 7821907, 7713780, 7658752, 7681440, 7591261, 7495354, 7444694, 7471323, 7478347, 7387905, 7359194, 7290830, 7259646, 7270273, 7124165, 7088239, 7176132, 7230133, 7255052, 7236082, 7223986, 7179596, 7146923, 7167886, 7204995, 7225502, 7209431, 7243211, 7268204, 7328773, 7346794, 7237859, 7345124, 7394652, 7459403, 7453917, 7529843, 7734401, 7701275, 7788387, 7822845, 7860615, 7869220, 7808141, 7906066, 8064602, 8194204, 8166887, 8143940, 8182440, 8264221, 8350819, 8318769, 8399437, 8552170, 8659560, 8709980, 8869827, 8993449, 8990540, 9144275, 9289957, 9424465, 9455204, 9565723, 9791707, 9905974, 10054361, 10123249, 10339646, 10542076, 10708899, 10840013, 10978352, 11201810, 11404438]
5909A1404438K03314K67117K42089K99727J04211J85872K91836K92622L61115
5900A3652341L17698L51100L51697L59085L57528M89674M82006M15862K32337
5891A7009328N28693N59999M46714M91947M97478N42335N19244N85092M99898
5882B1680728N62581N64803P19599Q61835Q56738Q80772J000292J069216J203442
5873B9400006J432317J574880J746855J960646K124758K263899K732792L009719
5865D6245872L158472L712858M164855M060938L304585J939475R2082j741192
5857F4937945k592579k919652k709724k078030j733881j165881n57639M8051M97529
5848E1726139J058685J541656J993575K599241K948829L608864L971163M470780
$$ y = [11404438, 11607752, 11874869, 12116958, 12416685, 12520896, 12706768, 12998604, 13291226, 13652341, 13970039, 14321139, 14672836, 15031921, 15389449, 15879123, 16361129, 16776991, 17009328, 17538021, 18098020, 18544734, 19036681, 19534159, 20076494, 20595738, 21180830, 21680728, 22243309, 22808112, 23527711, 24389546, 25246284, 26127056, 27127348, 28196564, 29400006, 30832323, 32407203, 34154058, 36114704, 38239462, 40503361, 43236153, 46245872, 49404344, 53117202, 57282057, 61342995, 64647580, 66587055, 66679137, 64937945, 62345366, 59425714, 56715990, 54637960, 52904079, 51738198, 51180559, 51228610, 51726139, 52784824, 54326480, 56320055, 58919296, 61868125, 65476989, 69448152, 73918932]
5840G3918932N005731N266420N824773O360324O109007M352893P59496l369837
5832A04227739o419306p590879p483661o745867n664768m606960l683094k926623
5824E9106581k097289j488221q65960k18026K67204O26406J172526J770925K414255
5815F0688401K835738L249861L227206K450446J526682O15938m21464j655205
5807G2517603l082739m082081m514092m464352m054471l325119k750242k337811
5799D3906696j953458j669391j139916q31220o40640o23740k62722q0571j85525
5790C6519513j13430J03395J93297K74844K44073J19824k2302k37574o92502j196237
5780C5192901j403644j424339j339952j099062p44251m28070l49893k36811p2394
$$ y = [73918932, 78924663, 84191083, 90015856, 96376180, 102485187, 106838080, 107597576, 104227739, 97808433, 90217554, 82733893, 75988026, 70323258, 65716298, 62033204, 59106581, 57009292, 55521071, 54655111, 54437085, 54704289, 55330695, 56503221, 58274146, 60688401, 63524139, 66774000, 70001206, 72451652, 73978334, 74594272, 74172808, 72517603, 69434864, 65352783, 60838691, 56374339, 52319868, 48994749, 46244507, 43906696, 41953238, 40283847, 39143931, 38312711, 37672071, 37048331, 36785609, 36705038, 36519513, 36406083, 36509478, 36702775, 36977619, 37221692, 37341516, 37319214, 37081640, 36389138, 35192901, 33789257, 32364918, 31024966, 29925904, 29181653, 28753583, 28403690, 28166879, 28094485]
5771B8094485R9249K51780K74834J40303J30001K1029p6685l23703p08933q14775
5761B7087585p59325p67392p59827l84635l88928m15922j07331j82335j08683
5752B3213207l5233k01537r7946m8413J4709J08920J25113K46529J41757K15932
5742B3683038R5088j16666j06909k12983k76098j87189q126k06880j03153j07847
5732B2452275k17739k68443l50423k11844p0189n559j33650j47906p4989k27650
5722B0743883k82028k45541k96987l80334k18797j26732p9745m5284K2017j4498
5712A9075954J63286J50061P9589L6712M2151K3718r5706k32838k25448k60149
5702A8757330j11357j31354j20438k626q8470o749k0054j14925p3903L5030J7085
$$ y = [28094485, 28193734, 28445514, 28720348, 28860651, 28990652, 29011681, 28934996, 28611293, 27902360, 27087585, 26328260, 25560868, 24801041, 24416406, 24027478, 23611556, 23504225, 23321890, 23213207, 23177974, 22976437, 22878491, 22830078, 22844787, 22953707, 23078820, 23325349, 23467106, 23683038, 23778126, 23661460, 23554551, 23341568, 23065470, 22878281, 22870155, 22663275, 22560122, 22452275, 22234536, 21966093, 21615670, 21403826, 21333637, 21328078, 21194428, 21046522, 20971533, 20743883, 20461855, 20216314, 19919327, 19538993, 19320196, 19193464, 19113719, 19068435, 19090452, 19075954, 19239240, 19389301, 19468890, 19505602, 19547753, 19571471, 19475765, 19242927, 19017479, 18757330, 18645973, 18514619, 18394181, 18391555, 18303085, 18296336, 18276282, 18161357, 18087454, 18122484, 18139569]
5691A8139569R8070k991Q8952K20101Q9641J30807J46359O0793K6223J37019J11124
5680A9245667K7512J13157J76667L21846L16950L57858L53727N46679L86656N35130
5670B2381849P38366P14226R89911J129641J560497J870908J974200J706200N10973
5661C3576771j111126j727890j479521j138176q48973o89678m82008m96767l34296
5652B5268336k95002k44189j93257j97090Q2226J08173m5712K3875P7954L5074
5642B4620388P6478L4498J13565q5898j69095j06995k4566j4836j90637j28832
5632B4124070L9404n8343j46364j80223j03859o4222M7885J40114J21560J92929
5622B4112951J8835q2561k2399n9345j52720j46563k50858k59168p3903k2262
$$ y = [18139569, 18237639, 18234648, 18323600, 18543701, 18633342, 18764149, 18910508, 18971301, 18997524, 19134543, 19245667, 19273179, 19386336, 19563003, 19884849, 20201799, 20559657, 20913384, 21460063, 21846719, 22381849, 23120215, 23834441, 24824352, 25953993, 27514490, 29385398, 31359598, 33065798, 33576771, 32465645, 30737755, 29258234, 28120058, 27271085, 26581407, 26099399, 25602632, 25268336, 24973334, 24729145, 24535888, 24338798, 24421024, 24529197, 24483485, 24507360, 24585314, 24620388, 24696866, 24731364, 24844929, 24759031, 24589936, 24482941, 24458375, 24443539, 24252902, 24124070, 24163474, 24105131, 23958767, 23778544, 23674685, 23610463, 23658348, 23798462, 23920022, 24112951, 24131786, 24049225, 24026826, 23967481, 23814761, 23668198, 23417340, 23158172, 23084269, 23062007]
5612B3062007j53195n6610m6765k201p4074o1889n5197J17706K58939J85552K04649
5601B3378922J95371J76839O4190L8082J63079K65929K25956K35760J74669K06816
5591B5125613K99557J41812K67300J89676L23251K81514M46208N24724L55270
5582B7954925N24056N78217O08807N72503N45560O49588N94860L43840M07955
5573C2780311O41692O47759O36445O42302M85093L40935K47905K46486K3942r7937
5563C6594933M2043J83378J96825L10471M27956N32419N64126O11332O14790P22317
5553D0800590O06878M13861N06307M95471P07608Q35302Q84226J035961J161308
5544D7447512J090046R39038J075834Q85310R15594R66724J123563J264378J177691
$$ y = [23062007, 22908812, 22852202, 22805437, 22803236, 22729162, 22667273, 22612076, 22729782, 22988721, 23174273, 23378922, 23574293, 23751132, 23815322, 23853404, 24016483, 24282412, 24508368, 24744128, 24918797, 25125613, 25425170, 25566982, 25834282, 26023958, 26347209, 26628723, 27074931, 27599655, 27954925, 28478981, 29057198, 29666005, 30238508, 30784068, 31433656, 32028516, 32372356, 32780311, 33422003, 34069762, 34706207, 35348509, 35833602, 36174537, 36422442, 36668928, 36692870, 36594933, 36636976, 36820354, 37017179, 37327650, 37755606, 38288025, 38852151, 39463483, 40078273, 40800590, 41407468, 41821329, 42327636, 42823107, 43530715, 44366017, 45250243, 46286204, 47447512, 48537558, 49476596, 50552430, 51437740, 52353334, 53320058, 54443621, 55707999, 56885690]
5535E6885690J314764J351939J519327J451337J413557J094667R16235J201182
5527F7148698J287612J338961J642659J866981J843336K201531K146584K295129
5519H1771491K568554K825974L081947L560295L884571M099827M266295M358941
5511A10417895M576122M756907M957205N392035O218672P279617Q856226J0838822
5503A63293501J2782841J4677410J4536489J0638863M786567J173965J637200
5496B23526836N051063J0116518J6226712K3095632L0005955L5849418L8151865
5489C82023999L2106817J2908247j5512155l8267541m6156057m3711307l6824640
5482B46567363k9603003k3382124j8425522j4206769j0849484q184332n884636
$$ y = [56885690, 58200454, 59552393, 61071720, 62523057, 63936614, 65031281, 65947516, 67148698, 68436310, 69775271, 71417930, 73284911, 75128247, 77329778, 79476362, 81771491, 84340045, 87166019, 90247966, 93808261, 97692832, 101792659, 106058954, 110417895, 114994017, 119750924, 124708129, 130100164, 136318836, 143598453, 152454679, 163293501, 176076342, 190753752, 205290241, 215929104, 220715671, 221889636, 223526836, 228577899, 238694417, 254921129, 278016761, 308022716, 343872134, 382023999, 414130816, 427039063, 411526908, 373259367, 327103310, 283392003, 246567363, 216964360, 193582236, 175156714, 160949945, 150100461, 141916129, 136031493]
5475A36031493m346172l221634k081078r09178P2285R87847J739840K036718Q63831
5466A31173952j876807m899130o245395o276552n438071m401933l138593j869064
5458I7028407p80462K54095N62681J63933j065611j822218j528684o57459M35740
5449I2590422J400040J924329J464990j5604j841404l269080l449739k868703
5441H5935251j877129j099879r29345j805837k932313l443225l116995k192820
5433F8537708j536229n38600N36250J252342J997506K339439J642051m69220l094971
5424G0666276m809065n082597m641940l915051l104950k436725k074871j604975
5416D2996102j257386j001197p16821n44681n85645l88689n42325q19607q29869
$$ y = [136031493, 131685321, 128463687, 126382609, 125473431, 125545716, 126533563, 128273403, 130310121, 131173952, 129297145, 124398015, 118152620, 111876068, 106437997, 102036064, 98897471, 97028407, 96247945, 96502040, 97064721, 97228654, 96163043, 94340825, 92812141, 92154682, 92590422, 93990462, 95914791, 97379781, 97364177, 95522773, 92253693, 88803954, 85935251, 84058122, 82958243, 82028898, 80223061, 77290748, 73847523, 70730528, 68537708, 67001479, 66462879, 66999129, 68251471, 70248977, 72588416, 74230467, 73761247, 70666276, 65857211, 60774614, 56132674, 52217623, 49112673, 46675948, 44601077, 42996102, 41738716, 40737519, 40020698, 39476017, 38890372, 38501683, 37959358, 37139751, 36309882]
5407C6309882q33091q77574p71121o92646n91888n16212p02340n31963l74607
5398C0418440n06135m35965l11213k84507l62443l82748k09513j60867k4081o665
5388B7734303R9697K4611o1353j97112k89681k78907k43663k82432j20767k46013
5378B6138683j99575l65700l86638l54006l57115m44656m48028m77175n60085
5369B2545705m50171l86817l60170l60827j45350k14498j20429k0864j46422N4574
5359B0394731R0847J43337J09102O0825O7794j8449n6866l09328k82472j76123
5349B0023398k29236l48093l19957l07985m73950m52425k66208l07765k83779
5340A7034000m13457j94647j74147j74674j75916k14271j01282j93647k52769
$$ y = [36309882, 35476791, 34599217, 33828096, 33135450, 32543562, 32027350, 31325010, 30793047, 30418440, 29912305, 29476340, 29165127, 28880620, 28518177, 28135429, 27925916, 27765049, 27740968, 27734303, 27834000, 27858611, 27797258, 27600146, 27310465, 27031558, 26787895, 26505463, 26384696, 26138683, 25939108, 25573408, 25186770, 24832764, 24475649, 24030993, 23582965, 23105790, 22545705, 22095534, 21708717, 21348547, 20987720, 20842370, 20627872, 20507443, 20486579, 20340157, 20394731, 20485578, 20628915, 20738017, 20798842, 20866636, 20848187, 20791321, 20481993, 20199521, 20023398, 19794162, 19446069, 19126112, 18818127, 18344177, 17891752, 17625544, 17317779, 17034000, 16620543, 16425896, 16251749, 16077075, 15901159, 15686888, 15585606, 15391959, 15139190]
5331A5139190q5421m4181j29516j17311j98271j97994j01627k30593k98099k57732
5321A3478445j83837j45959k54760k25869k09204k23035j43485k30137l9546q9707
5311A1732906j94683n2771k33591j19049l00468p0387n2886j35331j45635k73268
5301A0154837p0604l9041j08173j16158r935o3977L1149q2092n5764M1979M382
5290I686603j60300j50007R0026o1651n42l791n0252l222N8016n2989J09518j10111
5278I351298j76252m9054P389j12645M2600n3289j15858l4589j6231M5244j09614
5267H778999R2849P5266K9971J00719m0901j04176j6219M6925m827P1742k8362
5256I001986l8626O9137L5693Q1452M2532O1268K28665J27424q650J9221j14414
$$ y = [15139190, 15053769, 15009588, 14880072, 14762761, 14564490, 14366496, 14264869, 14034276, 13736177, 13478445, 13294608, 13148649, 12893889, 12668020, 12458816, 12235781, 12092296, 11862159, 11822613, 11732906, 11538223, 11485452, 11251861, 11132812, 10832344, 10761957, 10709071, 10573740, 10428105, 10154837, 10084233, 10045192, 9937019, 9820861, 9810926, 9746949, 9778098, 9696006, 9640242, 9682221, 9686603, 9526303, 9376296, 9466322, 9404671, 9404129, 9400338, 9350086, 9346864, 9404880, 9351891, 9461409, 9351298, 9175046, 9125992, 9133381, 9020736, 9063336, 9010047, 8894189, 8859600, 8843369, 8888613, 8778999, 8871848, 8947114, 8977085, 9077804, 9036903, 8932727, 8916508, 8963433, 8958606, 9030348, 9001986, 8963360, 9032497, 9068190, 9149642, 9192174, 9253442, 9482107, 9609531, 9600881, 9620102, 9505688]
5245I505688j43479j80613q9670j24617q6113m7328M6574n7354M9834p6046l7480
5234H759396K3599p4349M0316N6662m0291j5940R1692K00450N076l0262m3917
5223H972432J04961J43403R2017M5566J35173Q2202O4878l5332r2212L5156J54244
5212I702488j479n7802L7452K2343M897J31984N1430m3935J56788Q923K7517J998
5200A0042604R7481O8031J18604J45353J44999K1950J33195J11716J83719J72309
5190A1239961J29396K23516K02722J11805J5499J12769O2197L0752n4709J6820
5180A2090728j31711j15626j24649l5153j57333q4351k6702o7351K7730o0156
5170A1315426M1967L4696O087n4023O6178J46686J8023O4748O0501J40262K43991
$$ y = [9505688, 9362209, 9181596, 9091926, 8967309, 8881196, 8833868, 8880442, 8823088, 8872922, 8796876, 8759396, 8782995, 8708646, 8748962, 8805624, 8765333, 8749393, 8841085, 9041535, 9046611, 9016349, 8972432, 9077393, 9220796, 9312813, 9358379, 9493552, 9575754, 9640632, 9605300, 9513088, 9548244, 9702488, 9701009, 9643207, 9680659, 9703002, 9707899, 9839883, 9891313, 9847378, 10004166, 10013089, 10040606, 10042604, 10140085, 10208116, 10326720, 10472073, 10617072, 10639022, 10772217, 10883933, 11067652, 11239961, 11369357, 11592873, 11795595, 11907400, 11922899, 12035668, 12097865, 12128617, 12073908, 12090728, 11959017, 11843391, 11718742, 11683589, 11526256, 11441905, 11415203, 11347852, 11375582, 11315426, 11357393, 11392089, 11398176, 11344153, 11410331, 11557017, 11575040, 11639788, 11700289, 11840551, 12084542]
5159A2084542N6051N58J15719J58671P7099J46770M0017j5142q844p4618j56952
5148A2423871p8878J9146j02002j30863M7860r9295J305M8604j44891q1781J452
5137A1904528r1640J09453P5121L098L8303J58514J25420R2001K49408L59140
5127A3023346K46551L44025L49077L97696M94721P59914R53531J037061J213117
5118A8819039J080237M56812m71777j258601j252873j010394p71199n76994n32613
5109A4481637l28412l29841l21448k47279j98175j50960p3474n2163j26811j52012
5099A2501062j13299o1728J18517R3016j1409O6011l4372r7141o1876r347O8416
5088A2457850O1932l1523j23665O8244R0454K0382J8962m5040J72095j2241p4923
$$ y = [12084542, 12140593, 12141151, 12256870, 12415541, 12492640, 12639410, 12679427, 12664285, 12655441, 12580823, 12423871, 12344993, 12364139, 12262137, 12131274, 12179134, 12079839, 12081144, 12129748, 11984857, 11903076, 11904528, 11812888, 11922341, 11997462, 12000560, 12038863, 12197377, 12322797, 12414798, 12664206, 13023346, 13269897, 13613922, 13962999, 14360695, 14855416, 15615330, 16568861, 17605922, 18819039, 19899276, 20356088, 19884311, 18625710, 17372837, 16362443, 15591244, 15014250, 14481637, 14153225, 13823384, 13501936, 13254657, 13056482, 12905522, 12832048, 12779885, 12653074, 12501062, 12387763, 12326035, 12444552, 12537568, 12526159, 12592170, 12557798, 12460657, 12398781, 12389434, 12457850, 12519782, 12488259, 12364594, 12432838, 12523292, 12543674, 12562636, 12517596, 12689691, 12677450, 12602527]
5077A2602527Q0006M8786J89307N5628N3604l8212Q8033J12673J65141k9264J32717
5066A3460946Q6803J17395L8348K6897K07416K16258R6065Q1145J11889M9204
5056A4492366J14015K1660J48537K19833J30259J45539J15280K34059K28737K11438
5046A6061723J51481K39542K32772L16964K12201J43785J38446M9006K15334J54675
5036A7915929M9131J73518K08426J99012K29632J63638K32624L09999J58495L13610
5026A9954014M30908K96690J85721L58306L84214L12573L14669M45732L82762
5017B3065589K79496K71045K30945M66264L63940K46521K14591K38758K90651
5008B5667800L07160J60982K75061L03054K51752K20996K53494L90663K49670
$$ y = [12602527, 12682533, 12731319, 12920626, 12976254, 13029858, 12991646, 13079679, 13192352, 13357493, 13328229, 13460946, 13547749, 13665144, 13703492, 13730389, 13937805, 14154063, 14250128, 14331273, 14443162, 14492366, 14606381, 14628041, 14776578, 14996411, 15126670, 15272209, 15387489, 15621548, 15850285, 16061723, 16213204, 16452746, 16685518, 17002482, 17214683, 17358468, 17496914, 17545920, 17761254, 17915929, 17965060, 18138578, 18347004, 18546016, 18775648, 18939286, 19171910, 19481909, 19640404, 19954014, 20384922, 20681612, 20867333, 21225639, 21609853, 21922426, 22237095, 22682827, 23065589, 23345085, 23616130, 23847075, 24313339, 24677279, 24923800, 25138391, 25377149, 25667800, 25974960, 26135942, 26411003, 26714057, 26965809, 27186805, 27440299, 27830962, 28080632]
4999B8080632K21673L16452K03811L20826K77097N05690N16787M68382N43692
4990C1455042N55139M55325N73471M47701L49791M32176M78030M02849N34885
4981C5684409M28377N59996N28224N01595N40225M57111M01701M73437M91652
4972D0066727N27628N49087O09630O45042N78922N75536N28286N53295O76875
4963D5311028O18214O40037O38266P63911P53025P14843Q18213R78850J188606
4954E2424993J219850J402920J577908K016396K152790K629833L099710L589341
4946G0113741M053818M818892N510579O442410P529038R489213J2415679J6323314
4938A36696684K1010295K6320442L0145419K5299096M833316j9218886k9607446
$$ y = [28080632, 28302305, 28618757, 28822568, 29143394, 29420491, 29926181, 30442968, 30911350, 31455042, 32010181, 32465506, 33038977, 33486678, 33836469, 34268645, 34746675, 35149524, 35684409, 36112786, 36672782, 37201006, 37702601, 38242826, 38699937, 39101638, 39575075, 40066727, 40594355, 41143442, 41753072, 42398114, 42977036, 43552572, 44080858, 44634153, 45311028, 45929242, 46569279, 47207545, 47971456, 48724481, 49439324, 50257537, 51236387, 52424993, 53644843, 55047763, 56625671, 58642067, 60794857, 63424690, 66524400, 70113741, 74167559, 78986451, 84497030, 90939440, 98468478, 107957691, 120373370, 136696684, 157706979, 184027421, 214172840, 239471936, 244305252, 225086366, 195478920]
4931A95478920k9224188k4489902j9221711j4669583j1319735q660623o592857
4924H1300321n042592m029463l457567l059550k857447k465516k076706j576732
4916E6734748j576558j305517j480325j899303k103182k149191k331347k153151
4908D1736174j729298j606581j467158j337821j310110j158823j107957j086252
4900C0932174q30298o63142o81391o23017n73143o42633o37109n94160o52455
4891B5034826m51000m57932m73269n78900m46706l97586l45399l66209m17352
4882B1100473l23445k49492k80787k96197k96131l16626m19154m32428k42818
4873A8243395l86011m23096l52298l53944m86734l87844l29510k45158j70855
$$ y = [195478920, 166254732, 141764830, 122543119, 107873536, 96553801, 87893178, 81300321, 76257729, 72228266, 68770699, 65711149, 62853702, 60388186, 58311480, 56734748, 55158190, 53852673, 52372348, 50473045, 48369863, 46220672, 43889325, 41736174, 40006876, 38400295, 36933137, 35595316, 34285206, 33126383, 32018426, 30932174, 30101876, 29438734, 28757343, 28134326, 27561183, 26918550, 26281441, 25687281, 25034826, 24583826, 24125894, 23652625, 23073725, 22627019, 22229433, 21884034, 21517825, 21100473, 20777028, 20527536, 20246749, 19950552, 19654421, 19337795, 18918641, 18486213, 18243395, 17857384, 17434288, 17081990, 16728046, 16241312, 15853468, 15523958, 15278800, 15107945]
4864A5107945r1970j95660j16533k28141j84039k30771k22963k03414q6117j32867
4854A3415470j38246j92495j31117j07705j23859k7084p8856p1553j65050r4840
4844A2284665j07950j26601j159o4464j13444J8885j12267k15224j14765m7332
4834A1400344j03533M0509Q878j22541m6214r3222j058k9620j81005k7623J22887
4823A0967802m6612r2338k0114p9996n5132j07040q2385p036o786k4131j09935
4812A0336297n6351r757L3524k0400r4346J2760r9895N3362m4873l7111M4750
4801A0117960K1635k3526o734J10172j3816q7807m6490j43281P2512q9944q9546
4790I821135j5680l4093O1686j3759k7949j07774j0829o0035L5611J0393M1515
$$ y = [15107945, 15015975, 14820315, 14703782, 14475641, 14291602, 14060831, 13837868, 13634454, 13548337, 13415470, 13277224, 13084729, 12953612, 12845907, 12722048, 12694964, 12616108, 12544555, 12379505, 12284665, 12176715, 12050114, 12048955, 11984491, 11871047, 11889932, 11777665, 11562441, 11447676, 11400344, 11296811, 11337320, 11346198, 11223657, 11177443, 11084221, 11083163, 11053543, 10872538, 10844915, 10967802, 10921190, 10828852, 10808738, 10728742, 10673610, 10566570, 10484185, 10477149, 10470363, 10446232, 10336297, 10279946, 10270189, 10303713, 10283313, 10188967, 10201727, 10101832, 10155194, 10110321, 10073210, 10117960, 10139595, 10116069, 10109335, 10219507, 10205691, 10117884, 10071394, 9928113, 10000625, 9910681, 9821135, 9805455, 9771362, 9833048, 9819289, 9791340, 9683566, 9672737, 9612702, 9648313, 9658706, 9700221]
4779I700221r6458l9232l6733J541p6277L2093l8203J10445j16687q5022J9927
4768I375615j27109j5199M8440P001L793o9427o1310M7593l93l8694k0969L3552
4756I182893n6515o5786Q7859p3474o5795j3041j09088J0779j54717k741J48233
4745H888607j4957p3960L0946r9438k4878N7716l1486j58397K5937j6977P4788
4734H657901m4793j8097L2204k5510r0325J22564J2809j24403m9834N7022k2768
4723H506770M6244l1516j72683R3625J14864m9075l4589p331K8105l5934r3423
4712H365057j2224K5153M4913j0259o8591J9453o9351r7247N1887l9721m5667
4701H163403P9109P2683N6847N2921j29473j08390Q662l8747j63349R8517M7000
$$ y = [9700221, 9603763, 9564531, 9527798, 9529339, 9453062, 9485155, 9446952, 9557397, 9440710, 9355688, 9375615, 9248506, 9233307, 9281747, 9288748, 9292541, 9223114, 9161804, 9209397, 9209004, 9170310, 9149341, 9182893, 9126378, 9060592, 9148451, 9074977, 9009182, 8996141, 8887053, 8897832, 8743115, 8740374, 8888607, 8873650, 8799690, 8830636, 8731198, 8706320, 8764036, 8732550, 8574153, 8600090, 8583113, 8657901, 8613108, 8595011, 8627215, 8601705, 8511380, 8633944, 8646753, 8522350, 8472516, 8529538, 8506770, 8553014, 8521498, 8348815, 8442440, 8557304, 8508229, 8473640, 8466309, 8494414, 8458480, 8365057, 8352833, 8377986, 8422899, 8412640, 8344049, 8363502, 8294151, 8196904, 8248791, 8209070, 8163403, 8242512, 8315195, 8372042, 8424963, 8295490, 8187100, 8195762, 8157015, 7993666, 8092183, 8139183]
4690H139183M4199l1647M6212J9386m9253o4125m0807J42844j8926n6376k7071
4679H103619L2528J8066J19032l9689k1554J45662n357Q8219p5371j13035J52464
4668H404584J0307j37573K2910m7315m1797k0433q3707m4393m4247j7237q1570
4657G919529n2449n374p7799o8314p5840l4369O4372P2016K2309k0047j32290
4646G611744J1126P8129j06915r6783k6927L7554O5085m0657k3374M9382n1942
4635G506422r5819P9144k2017p2400k1969P6954M6524O0676p146L6285j3002M8566
4623G622218J36589k0808J06710J72396J20372J53622K5700r1376j55130j46740
4613G923553q0605o718j65269j27274j16854J8462J9108j08363j11201r3659M0354
$$ y = [8139183, 8183382, 8151735, 8197947, 8217333, 8168080, 8103955, 8063148, 8205992, 8187066, 8130690, 8103619, 8136147, 8154213, 8273245, 8233556, 8212002, 8357664, 8352307, 8440526, 8365155, 8252120, 8404584, 8414891, 8277318, 8300228, 8252913, 8211116, 8190683, 8106976, 8062583, 8018336, 8001099, 7919529, 7867080, 7861706, 7783907, 7715593, 7639753, 7605384, 7669756, 7741772, 7764081, 7744034, 7611744, 7622870, 7700999, 7594084, 7497301, 7470374, 7507928, 7573013, 7532356, 7508982, 7558364, 7506422, 7410603, 7489747, 7467730, 7395330, 7373361, 7450315, 7496839, 7557515, 7550369, 7586654, 7573652, 7622218, 7758807, 7737999, 7844709, 8017105, 8137477, 8291099, 8316799, 8225423, 8070293, 7923553, 7842948, 7836230, 7670961, 7543687, 7426833, 7445295, 7464403, 7356040, 7244839, 7151180, 7191534]
4602G191534r317O0859K1338m2358j37138L5843j5056R9364k4424j51021M7606
4591G077230j13321k8803j0483m213N1587k9565N2113J15180j9463j68782L0414
4580F951894M0014M0635p8481j7266J9946l0848k2020j6312M2816o982k859o6505
4568F854032o3078L6538M5024K3215o6597J9586J65602j11198p2638N4292k7578
4557F857200n159l8839P5724N4509K0905q8865Q8261p156q303J6287m9681K5764
4545F940647K3736R8661k9851l9828K7929o5061l538L2345k2405J5526K1926q965
4533F991122r906O865j7106J21962k0037r5150j8318j3435Q8308L9827k183O9508
4521G141457q501J3318N9105j1382q3207R887O9100M2202P4382M058r3099Q4019
$$ y = [7191534, 7182217, 7243076, 7264414, 7222056, 7084918, 7120761, 7105705, 7205069, 7180645, 7029624, 7077230, 6963909, 6935106, 6924623, 6920410, 6971997, 6942432, 6994545, 7109725, 7090262, 6921480, 6951894, 6991908, 7032543, 6954062, 6936796, 6956742, 6925894, 6903874, 6887562, 6930378, 6923396, 6920537, 6854032, 6790954, 6827492, 6872516, 6895731, 6829134, 6848720, 7014322, 6903124, 6830486, 6884778, 6857200, 6852041, 6813202, 6888926, 6943435, 6964340, 6875475, 6963736, 6956580, 6948277, 6964564, 6914883, 6940647, 6964383, 7063044, 7033193, 6993365, 7021294, 6956233, 6952695, 6985040, 6962635, 6978161, 7000087, 6991122, 6981216, 6988081, 6970975, 7092937, 7072900, 6977750, 6959432, 6945997, 7034305, 7074132, 7071949, 7141457, 7132956, 7146274, 7205379, 7193997, 7110790, 7120677, 7189777, 7231979, 7306361, 7310419, 7217320, 7301339]
4509G301339L1006L4502M2347j13490L5632J1891J7139j41451q999J1301j07155
4498G114062N2353M6793P70r0368K2947L1925r3584l8918Q7956j9474R5713l6532
4486G173643K0800J8329p9888J29760J9537j15305m9268J44718J48498p1556O67
4475G339935P3340m1731k3078n17k5752j7952q7285J4518L6342P35m6959o9794
4463G151802R293k7997L9930m8146J02752m2694l7864j7730o017L7075L2887J7656
4451G210947K584N3148O784k3012j04236N1784N0728L2732j26849r0702R0348
4440G154256O0547K8139q1541K4458K1350Q5138P0657o0787j4606j03194O9543
4429G253960J08490j154j21360K2239L4889j2845J3415N472m9990L3458P1684
$$ y = [7301339, 7332345, 7366847, 7409194, 7295704, 7331336, 7343227, 7360366, 7218915, 7209916, 7221217, 7114062, 7166415, 7213208, 7213978, 7123610, 7146557, 7178482, 7084898, 7045980, 7133936, 7114462, 7210175, 7173643, 7194443, 7212772, 7132884, 7262644, 7282181, 7166876, 7117608, 7262326, 7410824, 7339268, 7339935, 7413275, 7371544, 7348466, 7347949, 7322197, 7304245, 7216960, 7231478, 7267820, 7268555, 7221596, 7151802, 7161095, 7133098, 7173028, 7124882, 7227634, 7184940, 7147076, 7129346, 7123329, 7160404, 7193291, 7210947, 7213531, 7266679, 7273463, 7250451, 7146215, 7197999, 7248727, 7281459, 7154610, 7063908, 7154256, 7214803, 7242942, 7161401, 7185859, 7207209, 7292347, 7363004, 7302217, 7287611, 7184417, 7253960, 7362450, 7361296, 7239936, 7262175, 7297064, 7284219, 7297634, 7303106, 7253116, 7286574, 7358258]
4418G358258j5049L4628j3116N859J5947Q8527P278r2188m2112J9863K5315K3558
4406G416768R150m4471K5047p4739K3238L9909J9692P8742q6943j0997L3965J40437
4394G569798P766j0497J5647n6026j18210N5175R2059o5347K6426J2031J04455
4383G633277m7825J20735Q1837j842l5884n9635k1668K3814J3351J542Q8413K8569
4371G824684J5460j504Q8025K4242J2451j3974O4090j6214N6172M0834j4244M1919
4359H121941P530j0045N30O2212L7290J18401K6045L5025q9601n2563J72841J0647
4347H440253p7986M1138J14242K7548M0365K4721m7785L850k858k3672K05307
4336H745123M8471K4087m0068J26396J0664k3287k295l9449J16553l4277m9774
$$ y = [7358258, 7343209, 7377837, 7364721, 7370580, 7386527, 7475054, 7482332, 7390144, 7348032, 7367895, 7393210, 7416768, 7425918, 7381447, 7406494, 7331755, 7354993, 7394902, 7414594, 7493336, 7406393, 7395396, 7429361, 7569798, 7577564, 7567067, 7582714, 7526688, 7408478, 7463653, 7555712, 7490365, 7516791, 7528822, 7633277, 7585452, 7706187, 7788024, 7786182, 7750298, 7690663, 7668995, 7692809, 7706160, 7707702, 7796115, 7824684, 7840144, 7838640, 7926665, 7950907, 7963358, 7949384, 8013474, 7997260, 8053432, 8094266, 8080022, 8121941, 8129471, 8119426, 8119956, 8182168, 8219458, 8337859, 8363904, 8398929, 8309328, 8256765, 8429606, 8440253, 8362267, 8403405, 8517647, 8545195, 8585560, 8610281, 8562496, 8566346, 8563488, 8539816, 8745123, 8793594, 8817681, 8777613, 8904009, 8914673, 8891386, 8889091, 8849642, 8966195, 8931918, 8882144]
4325H882144P3090J46656J27701n8642N0139J45327l9043o823N1542j0376J28966
4314I490681K7176J3033K54456J53511J62614m4325J00975J55239M2265l3678
4304A0321947m4095K2378O7906l6004p4202N334J4964p8351m5249J00356M6641
4293A0301625L6824m7713p1026N7783J2119M9346Q9802k5648M703Q4388n2322
4282A0439881J43740N2016P770J95391Q2092J8758J66269R8745L9944J31681K3700
4271A1399987O4155N3531o1796O4033j3000K7177K7380Q62j5663N3804m0540J22048
4259A1681978J0340n7228K4757k0719J74700L2636K923j1725J56534K6872N1870
4248A2072938Q6577J22799N9949J35011m0899M8285J27763Q3854J79623J18583
$$ y = [8882144, 8955234, 9101890, 9229591, 9170949, 9221088, 9366415, 9327372, 9320549, 9372091, 9361715, 9490681, 9517857, 9530890, 9785346, 9938857, 10101471, 10057146, 10158121, 10313360, 10355625, 10321947, 10277852, 10300230, 10368136, 10332132, 10257930, 10263264, 10278228, 10199877, 10154628, 10254984, 10301625, 10338449, 10290736, 10219710, 10277493, 10289612, 10338958, 10428760, 10403112, 10407815, 10492203, 10439881, 10583621, 10635637, 10643407, 10838798, 10920890, 10939648, 11105917, 11204662, 11244606, 11376287, 11399987, 11464142, 11517673, 11455877, 11519910, 11506910, 11534087, 11561467, 11562329, 11546666, 11600470, 11559930, 11681978, 11692318, 11635090, 11659847, 11639128, 11813828, 11846464, 11849387, 11837662, 11994196, 12021068, 12072938, 12159515, 12282314, 12342263, 12477274, 12436375, 12484660, 12612423, 12696277, 12875900, 12994483]
4238A2994483R0203M5536O6094O1206O5505R0419J45900P7144l87J38997O4184
4227A3839284J7218J04821Q6113j5121J84472R2061J11310J07012j0097J34863
4217A4651936k156N7975J30368M4676K13855J13848l3205J52273M7692P6493O9504
4206A5523259J46209J25758J44279R2453P1720J31628J63110J02515J50056P0306
4196A6721293P2077J15730N3908J21079R0298K33998J25541M8397O1729J74041
4186A7818091J51513O7530R0520Q7508O4724J48047K75625M4205N709l6008N5581
4175A8773045J90628J22044J31894J72281P5345K3892n7349J01564L1829n1494
4165A9513679J57397O6489M4868R2750m1676N1813q4069M8910J2320L4671O5659
$$ y = [12994483, 13084686, 13130222, 13196316, 13257522, 13323027, 13413446, 13559346, 13636490, 13636103, 13775100, 13839284, 13856502, 13961323, 14047436, 14032315, 14216787, 14308848, 14420158, 14527170, 14517073, 14651936, 14649780, 14707755, 14838123, 14882799, 15096654, 15210502, 15177297, 15329570, 15377262, 15453755, 15523259, 15669468, 15795226, 15939505, 16031958, 16103678, 16235306, 16398416, 16500931, 16650987, 16721293, 16793370, 16909100, 16963008, 17084087, 17174385, 17408383, 17533924, 17582321, 17644050, 17818091, 17969604, 18037134, 18127654, 18215162, 18279886, 18427933, 18703558, 18747763, 18753472, 18717464, 18773045, 18963673, 19085717, 19217611, 19389892, 19465237, 19489129, 19431780, 19533344, 19565173, 19513679, 19671076, 19737565, 19782433, 19875183, 19833507, 19885320, 19801251, 19850161, 19862481, 19897152, 19962811]
4154A9962811r3053n874N4035M6271k4072r4548j9278N6940J60427J6036o6609
4143A9993086l226K112P6682j8301K1961L2141P210r1567Q1862n1534L8376j04117
4131A9984685n3634m0223p0634p7100r8313j45506q9085j75184q7529j9259j56149
4120A8972069l6004j7163j54052j14828p8872j73949j81748J8963J38550K2481
4110A8395447l3200l6661r2470j0493P0431j02917q4343P4336q6580k00718j22942
4099A7769890j6552o8699j08587m9028r9236j4366k61832k03627j26764q7945
4089A6733254j46714j23579j00266o5186k4750j21202k00394n0313q4664k5710
4079A5790476J4058r6421j35460n3687N8988O9150j27418r5761J01281o9870j20330
$$ y = [19962811, 19869758, 19863884, 19917919, 19964190, 19940118, 19845570, 19826292, 19883232, 20043659, 20059695, 19993086, 19989860, 19991972, 20068654, 20050353, 20072314, 20104455, 20111665, 20020098, 20101960, 20050426, 20088802, 19984685, 19931051, 19890828, 19820194, 19743094, 19644781, 19499275, 19410190, 19235006, 19147477, 19128218, 18972069, 18936065, 18918902, 18764850, 18650022, 18571150, 18397201, 18215453, 18234416, 18372966, 18395447, 18362247, 18325586, 18233116, 18222623, 18293054, 18190137, 18105794, 18180130, 18093550, 17892832, 17769890, 17753338, 17684639, 17576052, 17527024, 17427788, 17413422, 17151590, 16947963, 16821199, 16733254, 16586540, 16462961, 16362695, 16297509, 16272759, 16151557, 15951163, 15900850, 15816186, 15790476, 15804534, 15708113, 15572653, 15518966, 15577954, 15647104, 15519686, 15423925, 15525206, 15455336, 15335006]
4068A5335006j00231l0236j41124P3420N6351j69896j6590k01977k038l3296k24011
4057A4545378m4543o0746j76396p2977J240j84305p5102j28681J2967r4233p5096
4046A3647506K0407m7365k3768n676m1677j23543l3243o9032J5740k0726p8055
4035A3240568j3780J3028j16174k3934o9399k7754L335M790r5135r8951p774n007
4023A2803813m1157j98765n0915m4884p4383K9795n0884p1009l3802k2049o0332
4012A2185428K5282N6715j38114r7928j00868l1877n6336p837L8426N556j17145
4001A1761302l751Q7231M6953L1029q4682o9559m56L0607J3993r1855p7872o0144
3989A1582796N7145o610l616j11835l1182j8132l7309O1929r6232j4852J52066
$$ y = [15335006, 15234775, 15204539, 15063415, 15136835, 15193186, 15023290, 15006700, 14804723, 14802685, 14769389, 14545378, 14500835, 14440089, 14263693, 14190716, 14191956, 14007651, 13932549, 13803868, 13816835, 13722602, 13647506, 13667913, 13620548, 13596780, 13591104, 13549427, 13425884, 13392641, 13323609, 13339349, 13318623, 13240568, 13226788, 13239816, 13123642, 13099708, 13030309, 13002555, 13005890, 13010680, 12915545, 12816594, 12808820, 12803813, 12762656, 12563891, 12512976, 12468092, 12393709, 12423504, 12372620, 12301611, 12267809, 12245760, 12185428, 12210710, 12267425, 12129311, 12031383, 11930515, 11898638, 11842302, 11834465, 11872891, 11878447, 11761302, 11757551, 11844782, 11891735, 11922764, 11838082, 11768523, 11768067, 11798674, 11812667, 11720812, 11642940, 11582796, 11639941, 11633331, 11629715, 11517880, 11486698, 11468566, 11431257, 11493186, 11396954, 11382102, 11534168]
3978A1534168O1555j42603n1775q2207k0284J3560Q2084L4954K8889p4883j07518
3967A1275940k0580K472o855r50l0351m1895o0145N5984N6062r0010o8796P1272
3955A1142148P3731K3356k8160j41213O3602M7526j51919L6402o1698p7573M6526
3944A0972728k1498N2157r8918N6794m5123K1511R224j3628O0913l9568O42m0180
3932A0915054O8639k8309J603j2787p8298n7179K5245L459l0748P465L0675N2755
3920A0897574j26313J8398J2543o766l90k0194q2916K7918j7942m7545R8171m7947
3908A0704591k4684n0075l0882J4371O6388l0820o9131J3733K165m4803L2561
3897A0583414J8808o2343K5928k2949o4961q1162p965J4052m2890J1669N930k1411
$$ y = [11534168, 11595723, 11453120, 11401345, 11319138, 11298854, 11312414, 11394498, 11429452, 11458341, 11383458, 11275940, 11255360, 11257832, 11250977, 11250027, 11219676, 11177781, 11117636, 11173620, 11229682, 11139672, 11070876, 11142148, 11215879, 11239235, 11211075, 11069862, 11133464, 11180990, 11029071, 11065473, 11003775, 10926202, 10972728, 10951230, 11003387, 10904469, 10961263, 10916140, 10937651, 10946875, 10933247, 10994160, 10954592, 10955234, 10915054, 10983693, 10955384, 10956987, 10944200, 10865902, 10808723, 10833968, 10837427, 10806679, 10814144, 10844819, 10897574, 10771261, 10789659, 10802202, 10795436, 10795046, 10774852, 10691936, 10719854, 10701912, 10654367, 10752538, 10704591, 10679907, 10629832, 10598950, 10613321, 10679709, 10648889, 10579758, 10593491, 10595656, 10550853, 10583414, 10602222, 10539879, 10565807, 10542858, 10477897, 10396735, 10388770, 10402822, 10359932, 10371601, 10377531, 10356120]
3885A0356120k7678K998L3377j4869n1740q9528J032l7572q6398K941k2611r851
3873A0056221o7808L5714K5062p0719r0244J8080q5318M9346p883j02429Q567
3862I768589r4915o6334j0089l5525Q9087n3787o0287j34872k6569J68977p3942
3851I470333k3008r2995k974j4874o6982N0505j06798L5656M6248l8911p2545
3840I183655j0152l5473p24L0608K225p482p9232r9477l2748M9951m835r0771
3828H905545q2009r5376L9448J05159P4323j8789k7702r235q2905J1228j65096
3817H654591j2503o5179J7468K7615j3357r3706j1867M136k5679M0290o8069J3187
3805H466927K3396q1816k7662n553K2224n3548N0536n8200p3289p4291o0432N8791
$$ y = [10356120, 10328442, 10331440, 10364817, 10349948, 10298208, 10208680, 10209712, 10172140, 10085742, 10088683, 10066072, 10056221, 9988413, 10024127, 10049189, 9978470, 9888226, 9906306, 9820988, 9870334, 9862451, 9760022, 9768589, 9673674, 9607340, 9597251, 9561726, 9650813, 9597026, 9536739, 9401867, 9375298, 9544275, 9470333, 9447325, 9354330, 9351356, 9336482, 9269500, 9320005, 9213207, 9248863, 9295111, 9256200, 9183655, 9173503, 9138030, 9137306, 9167914, 9170139, 9162657, 9083425, 8983948, 8951200, 9001151, 8996316, 8905545, 8823536, 8728160, 8767608, 8872767, 8947090, 8928301, 8900599, 8891364, 8808459, 8819687, 8654591, 8642088, 8576909, 8594377, 8621992, 8608635, 8514929, 8503062, 8507198, 8481519, 8521809, 8453740, 8466927, 8490323, 8408507, 8380845, 8375292, 8397516, 8343968, 8394504, 8336304, 8263015, 8188724, 8128292, 8187083]
3793H187083j3062p7866L8949n1496j32118k4534J17072r7156j33858K8114j5084
3782G826044M411l0673j4337O6230o0490o9261j20410m1858L0564P3540p6172
3771G587588r3604R6112P7892q9888j43804n4980k3151l0890q6436K6432l7889
3760G227382P2656M832p3048K1566j07991l1990Q4527j07006p13N626j8708q3322
3748F993811L374J0117J20258p8206n1441k5228l038j26775n803Q4780j150L078
3736F923777q9526K0672K6252J0695k8590N770l6747j0410O1643j1965q9327j318
3724F780926L2100J2191l8940M0057O4007P715N2979m6212r5446o0443l485O3619
3712F809068p4571j53683P3367p1600l4954O0501k1331L965l0252p039J9424O0300
$$ y = [8187083, 8174021, 8096155, 8135104, 8083608, 7951490, 7926956, 8044028, 7946872, 7813014, 7841128, 7826044, 7830455, 7799782, 7785445, 7851675, 7791185, 7721924, 7601514, 7559656, 7590220, 7663760, 7587588, 7493984, 7590096, 7667988, 7578100, 7434296, 7379316, 7356165, 7325275, 7238839, 7265271, 7227382, 7300038, 7304870, 7231822, 7253388, 7145397, 7113407, 7197934, 7090928, 7090215, 7095841, 7077133, 6993811, 6997185, 7007302, 7127560, 7049354, 6997913, 6972685, 6969647, 6842872, 6837069, 6921849, 6920699, 6923777, 6834251, 6854923, 6881175, 6891870, 6863280, 6869050, 6832303, 6821893, 6883536, 6871571, 6782244, 6780926, 6813026, 6825217, 6786277, 6826334, 6890341, 6898056, 6951035, 6904823, 6809377, 6748934, 6745449, 6809068, 6734497, 6580814, 6654181, 6582581, 6547627, 6608128, 6586797, 6590762, 6560510, 6553471, 6572895, 6633195]
3700F633195p2598N352O5890j35056k8712n8719P2597l1335q5685M8017n5582
3689F357364r7150J2232j6724j6192j8436R3287k374j134K6291R3282K6073j00277
3677F356242J10959n5716K9475L3364o4693m7291j29464j02893J39P5260O6105
3666F271487j389M3531J5269K896k8560j9428O3720j7287j32608O6243L8742r095
3654F293521l8095o5066m1232j3419K8934N1499K13m7509J4154l1604J1790J04915
3642F268101j57658j5817M4314K4386J33052O4763l5096n4411j41677m1806L0502
3631F118653O9279J7832L5843j851P0412j09557L6679O8648o1212l8498n2103
3620F154125J256J21438K0398j7523j1518L9053K3535L5253P5345J58431k1119
$$ y = [6633195, 6560597, 6565949, 6631839, 6496783, 6468071, 6409352, 6481949, 6450614, 6364929, 6412946, 6357364, 6260214, 6272446, 6255722, 6239530, 6221094, 6314381, 6312007, 6310873, 6337164, 6430446, 6456519, 6356242, 6467201, 6411485, 6440960, 6474324, 6409631, 6362340, 6232876, 6129983, 6130122, 6205382, 6271487, 6270098, 6313629, 6328898, 6331794, 6303234, 6283806, 6347526, 6330239, 6197631, 6263874, 6302616, 6293521, 6255426, 6190360, 6149128, 6135709, 6164643, 6216142, 6216355, 6168846, 6183000, 6151396, 6163186, 6268101, 6110443, 6094626, 6138940, 6163326, 6296378, 6361141, 6326045, 6271634, 6129957, 6088151, 6118653, 6187932, 6205764, 6241607, 6239756, 6310168, 6200611, 6237290, 6305938, 6244726, 6206228, 6154125, 6155381, 6276819, 6297217, 6279694, 6268176, 6307229, 6330764, 6366017, 6441362, 6599793, 6578674]
3609F578674o6549N5032q2102J9116p264O5605J18288J775r8376Q8392L9876P225
3597F719692L6887N5135Q122J1478m6547R6561Q4941J17634k5736O2897j020r785
3585G110259L6381J77373J13835j3395J240R824L615K2558P3291L5438M9184O6440
3573G686043n959P6766J08591Q1107J7359M4191J955J15985P6268J5577J7034
3562H234917Q3887J59906Q2611Q6314O1938J40500J1747J33444J29561L4771J44292
3551I303888J05441J41020J21125J21399J60316J10887J62063J22522K07074J04990
3541A0660725N9891m7748R8942K18034J58047J73955J52096J84575K32061K36151
3531A2126729K79148K30232K40761J76054L63909M69616L66520L97401M91197
$$ y = [6578674, 6512125, 6567157, 6485055, 6504171, 6496907, 6562512, 6680800, 6682575, 6584199, 6672591, 6712467, 6719692, 6756579, 6811714, 6819836, 6831314, 6784767, 6881328, 6966269, 7083903, 7058167, 7121064, 7120044, 7110259, 7146640, 7324013, 7437848, 7424453, 7425693, 7435517, 7439132, 7461690, 7534981, 7570419, 7619603, 7686043, 7680084, 7756850, 7865441, 7946548, 7963907, 8008098, 8010053, 8126038, 8202306, 8217883, 8234917, 8318804, 8478710, 8561321, 8647635, 8709573, 8850073, 8861820, 8995264, 9124825, 9159596, 9303888, 9409329, 9550349, 9671474, 9792873, 9953189, 10064076, 10226139, 10348661, 10555735, 10660725, 10720616, 10672868, 10771810, 10989844, 11147891, 11321846, 11473942, 11658517, 11890578, 12126729, 12405877, 12636109, 12876870, 13052924, 13416833, 13886449, 14252969, 14650370, 15141567]
3522A5141567M90198M98769M40210N64054O60688O66259O62443O68617P53498
3513B0546303P10061O02012M65412L98033K64394J39450n4183j00403l29223m05073
3503B2236783m28048p07079n91657p44974p61302n60834n79469o69443o31202
3494A6562775m07128m66032m38813l74810m65159l32098l33735k98562l23144
3485A3123294l89804k45067k39811k02322j76736r3057j41997j76327j28900J2441
3475A1341714K856o9152l6801P1518N2785N6014k5658O0330N8405j62039n6253
3464A1293719k3253o8094j41986j18046j29544j67762j72225k59452k38308k18458
3454I756591j64819j66541l11962k11392j64599j11060q2741j62020j0444j70270
$$ y = [15141567, 15631765, 16130534, 16570744, 17134798, 17795486, 18461745, 19124188, 19792805, 20546303, 21256364, 21858376, 22323788, 22721821, 22986215, 23125665, 23071482, 22971079, 22641856, 22236783, 21808735, 21101656, 20509999, 19765025, 19003723, 18442889, 17863420, 17193977, 16562775, 16155647, 15689615, 15250802, 14875992, 14410833, 14078735, 13745000, 13446438, 13123294, 12733490, 12488423, 12248612, 12046290, 11869554, 11776497, 11634500, 11458173, 11329273, 11341714, 11344570, 11275418, 11238617, 11310135, 11362920, 11418934, 11393276, 11453606, 11512011, 11349972, 11293719, 11270466, 11202372, 11060386, 10942340, 10812796, 10645034, 10472809, 10213357, 9975049, 9756591, 9591772, 9425231, 9113269, 8901877, 8737278, 8626218, 8543477, 8381457, 8371013, 8200743]
3444H200743q7356r8721q3518n7814k3856J01833p2627k39307N0238k8906j47846
3433G512863r685j13019o3362k03484j59052m6677j55084j73288j47369j65812
3423F276031j21697j25741j35257j07769j75794j50836j00954o9312r7309r1821
3413E099541r8559l1675r4821m6662j34998q6719M5746m9624r3696l2220j30488
3402D345825o0850j7379j26595j01468l3822o6471p3088k5425n7783j07468l562
3391C671914J05041q9907j53462j10325K00O7144L3529o9812l8167j18892J5726
3380C312989l4578M0670j21113Q9611j2347q6591r9734m415J0793j07303L3382
3369C021364L2269o4811Q5554k2741q1802o5564Q559L1456j41598q1710N0404
$$ y = [8200743, 8113387, 8014666, 7931148, 7873334, 7849478, 7951311, 7878684, 7639377, 7689615, 7660709, 7512863, 7503178, 7390159, 7326797, 7123313, 6964261, 6917584, 6762500, 6589212, 6441843, 6276031, 6154334, 6028593, 5893336, 5785567, 5609773, 5458937, 5357983, 5288671, 5191362, 5099541, 5000982, 4969307, 4874486, 4827824, 4692826, 4606107, 4651853, 4602229, 4508533, 4476313, 4345825, 4284975, 4267596, 4141001, 4039533, 4005711, 3939240, 3866152, 3840727, 3782944, 3675476, 3671914, 3776955, 3687048, 3533586, 3423261, 3423461, 3490605, 3524134, 3454322, 3416155, 3297263, 3312989, 3278411, 3319081, 3197968, 3287579, 3275232, 3188641, 3088907, 3084492, 3095285, 2987982, 3021364, 3053633, 2988822, 3074376, 3051635, 2969833, 2904269, 2912828, 2944284, 2802686, 2720976, 2771380]
3358B771380n0539J4979j8127r7877R8946q4754P952l068n953L4676k897K0322
3346B685040P158j16571l9292M3049j1232o5850l4251P308Q175j02351r9895m5376
3334B235912k2666J6405n9000l5796L9527Q6824j07163O4831L4000j6086p909
3323B228879J1190O6698k9786m805q6960J4840L0272j50515q086R8337M4526q7739
3311B126851l8169k6768k8469M1079p4105n2954r28J2569L2562O0312K8182n731
3299B074431m179N7461o3286J540P8227l690j4186L814k3387r2659M4427L6280
3287B094793j27177l360k5324J89450p4208K5174k8975n9457o7931j59907N6443
3276A819521N6303p5762R2759n438o1288q2355J01963J03050j196j18263L8185
$$ y = [2771380, 2720841, 2735820, 2717693, 2619816, 2718762, 2634008, 2641960, 2638892, 2632939, 2667615, 2664718, 2685040, 2692198, 2575627, 2536335, 2579384, 2568152, 2502302, 2468051, 2475359, 2483534, 2381183, 2281288, 2235912, 2213246, 2229651, 2170651, 2134855, 2174382, 2261206, 2154043, 2218874, 2252874, 2236788, 2228879, 2240069, 2306767, 2276981, 2272176, 2185216, 2200056, 2230328, 2079813, 2071727, 2170064, 2214590, 2126851, 2088682, 2061914, 2033445, 2074524, 2000419, 1947465, 1946537, 1959106, 1991668, 2051980, 2080162, 2074431, 2070252, 2127713, 2064427, 2065967, 2144194, 2140504, 2126318, 2130132, 2106745, 2014086, 2058513, 2094793, 1967616, 1964256, 1938932, 2128382, 2054174, 2079348, 2050373, 1990916, 1922985, 1763078, 1819521, 1875824, 1800062, 1892821, 1887383, 1826095, 1743740, 1845703, 1948753, 1947557, 1829294, 1867479]
3265A867479K2766l6725Q4420n3246J2547r9300L4761O2324J9622L2931j37429
3254A810150r95k9569N3881m1598J987j3965Q733K1534m7109L3470n2867K2929
3242A766581m1559P4463M1770J02496o4304o5208p5885o4896R4568N5135j0286
3231A812875M8544m3366l7611Q6733K8385n6029m4317l8331L8886l1735J4269
3220A778303K6609K5107J7370J2247L5656j6296j6132R8292n586k7617K10249
3209B138202N3907K2000K9683k1988R8192o1201k3273M0369J11136P3298o7545
3198B392780J36605n0951o1573K0005J43920m4091p7209M4138J10608J9297j01333
3187B532196m4564K084N9783K5475J08074j5435P3501j5123Q9167J35007J10258
$$ y = [1867479, 1890245, 1853520, 1937940, 1884694, 1897241, 1797941, 1832702, 1895026, 1914648, 1947579, 1810150, 1809155, 1779586, 1833467, 1791869, 1793856, 1779891, 1788624, 1810158, 1763049, 1796519, 1743652, 1766581, 1725022, 1799485, 1841255, 1943751, 1879447, 1814239, 1738354, 1673458, 1768026, 1823161, 1812875, 1861419, 1818053, 1780442, 1867175, 1895560, 1839531, 1795214, 1756883, 1795769, 1764034, 1778303, 1804912, 1830019, 1847389, 1859636, 1895292, 1878996, 1862864, 1961156, 1955570, 1927953, 2138202, 2192109, 2214109, 2243792, 2221804, 2319996, 2258795, 2235522, 2275891, 2387027, 2460325, 2392780, 2529385, 2478434, 2416861, 2436866, 2580786, 2536695, 2459486, 2503624, 2614232, 2633529, 2532196, 2487632, 2489716, 2549499, 2574974, 2683048, 2667613, 2741114, 2725991, 2815158, 2950165, 3060423]
3176C060423l5948L2088j293Q9933M0698J65371Q4154K143j20587m8075p6483
3165C192424j66358k41270j19911l6970M6192o4970n2620k08359m6197N4984j8959
3154B337986L2369p7907O059j24989j1340m0271q0299n697K1458Q8956k2863l7936
3142B085526N1623m0902O4349l8450O1844q8572j57166j770N0801r3122o0414
3131A833747o0166r295o4146r8596Q4192l059l2710k09282P58J09104p1344p047
3119A472156r2342j5487r3353K0318l4936Q4785j09524j21059K9059K089N3825
3108A195531m7882n0322q427Q2029k9077j38662j6366Q6878m6187J3115K4013
3097A064643n9904o4768q5599q385N9432N1274j8332j0714o2901J22909l5061
$$ y = [3060423, 3024475, 3056563, 3055270, 3145203, 3185901, 3351272, 3435426, 3437569, 3316982, 3268907, 3192424, 3026066, 2784796, 2664885, 2627915, 2674107, 2609137, 2556517, 2348158, 2301961, 2356945, 2337986, 2370355, 2292448, 2298507, 2173518, 2162178, 2121907, 2041608, 2035911, 2057369, 2146325, 2123462, 2085526, 2137149, 2096247, 2160596, 2122146, 2183990, 2095418, 1938252, 1936482, 1987283, 1894161, 1833747, 1773581, 1764286, 1700140, 1601544, 1685736, 1682677, 1649967, 1440685, 1441443, 1550547, 1479203, 1472156, 1379814, 1364327, 1270974, 1291292, 1256356, 1341141, 1231617, 1110558, 1139617, 1141706, 1195531, 1147649, 1097327, 1088900, 1170929, 1141852, 1003190, 986824, 1073702, 1027515, 1040630, 1064643, 1004739, 939971, 854372, 845987, 905419, 956693, 938361, 927647, 864746, 987655, 952594]
3086I52594k0934l1896J4896o9724l6413K5176L2672j6981q0621p8554N9494O7209
3074H16918j35752N9898N7539l1690R535o5407k4258l8003N9622m8354j9181q129
3062F32738J02708k5415o611J0010o0652j1686m2947o687K847N5566j7795M6156
3050F78232p8313R7119l7964j01249J03951J8233J8089m8735K6029j13683k5736
3039E35973J10801J5615p6705J687j4214J6107R5922j03253O1171k250m0014J4510
3027F15350m8600m5054P842M92K2644j2430Q812l1938K90J660R8749j05804q3826
3014D28187L9932J5086n4245k301M0314l8927J9982N7569p0682M9755k8996q623
3002D47051k5311K639m197j4239K945M4703P4625N8447q8865p6828N2641k2355
$$ y = [952594, 931660, 899764, 914660, 844936, 808523, 833699, 866371, 849390, 768769, 690215, 749709, 816918, 681166, 741064, 798603, 766913, 776448, 711041, 686783, 648780, 708402, 660048, 640867, 632738, 735446, 710031, 703420, 713430, 652778, 641092, 598145, 591458, 594305, 649871, 632076, 678232, 599919, 697038, 659074, 557825, 661776, 680009, 698098, 649363, 675392, 561709, 535973, 646774, 662389, 585684, 587371, 573157, 589264, 685186, 581933, 643104, 640854, 600840, 615350, 566750, 521696, 529538, 530030, 552674, 540244, 549056, 517118, 517408, 519068, 617817, 512013, 428187, 468119, 483205, 428960, 426659, 466973, 428046, 448028, 505597, 434915, 484670, 455674, 447051, 421740, 424379, 420182, 405943, 408888, 453591, 528216, 586663, 497798, 420970, 473611, 451256]
2990D51256m4344Q20P7879J07329n3574r5782j9548J0990R549m5883p2796P3495
2978C99391L0292n359l4704m9441o304q712N553M2391K083M1410j3578m8090L9250
2965C94182O874K2263M5253l4326J8041m5909L6578N1945o430n6474k6209o5453
2953C40335R749k2839j4811P3214J622J28215k4785M5552r2214p0385r3605O2349
2941C42397N4621K2893n2834N605j4432M3490q5007M2k0654j5698J19008o2080
2929C37351q7959r072M253J0728N6392P1753q32k1943J709L0411q0174o1335L6893
2916B88175k103J56146q5456K6398l3914k4999K8938o5829k3457j8977L1809J03812
2904C80543R451j25660J1583J989r392K2075j18888J24859p37p5754K2442q0080
$$ y = [451256, 406912, 407732, 485611, 592940, 539366, 443584, 424036, 435026, 444575, 398692, 325896, 399391, 429683, 424324, 389620, 340179, 333875, 325163, 330716, 373107, 375190, 416600, 403022, 354932, 394182, 401056, 423319, 468572, 434246, 452287, 406378, 442956, 494901, 488471, 431997, 405788, 340335, 350084, 327245, 312434, 385648, 387270, 515485, 490700, 536252, 444038, 373653, 280048, 342397, 397018, 419911, 367077, 372682, 358250, 401740, 316733, 316775, 296121, 280423, 399431, 337351, 249392, 240320, 244573, 255301, 311693, 383446, 382614, 360671, 362380, 392791, 312617, 251282, 288175, 286072, 442218, 356762, 383160, 349246, 324247, 353185, 287356, 263899, 244922, 276731, 380543, 389994, 264334, 275917, 277906, 268514, 290589, 171701, 296560, 295823, 220069, 242511, 162431]
2892A62431J10366R8354q2510Q4405M0726p8977q9700p4645Q6499Q754j8674j0098
2880B36931n0867q3254N3738N8768n891q5071J61653j0388J6232K876Q9056r4333
2868B89450j59442M2730Q0530Q4461r4346n0223L8041J4677K6801J0294q4002
2857A98971j13833R4525J7172o6061n1906Q0063J3291l7109l1086N7355N0216
2846B11598p0431o097K1222K444J02076k237n8144m7535o4585J40150J8922j705
2834B45678o8055l8779M5982m0794m1419R7173n4830J2382Q444o0380k7816l3121
2822D4465K074Q5092k8693L3550J8696K8647m3284L5229N0623j14590m2834o137
2810F2838O7528P5294M4962j535L5143o9283p8824m3131j195l4999L5178R6981
$$ y = [162431, 272797, 371151, 288641, 373046, 413772, 334795, 245095, 170450, 256949, 265703, 247029, 236931, 186064, 102810, 156548, 215316, 209425, 124354, 286007, 275619, 291851, 294727, 383783, 289450, 130008, 172738, 253268, 337729, 243383, 193160, 231201, 245878, 272679, 282973, 198971, 85138, 179663, 196835, 130774, 78868, 158931, 172222, 135113, 104027, 161382, 211598, 141167, 135070, 156292, 158736, 260812, 258575, 200431, 152896, 88311, 228461, 247383, 245678, 177623, 138844, 184826, 144032, 102613, 199786, 144956, 157338, 165782, 105402, 77586, 44465, 46539, 131631, 102938, 136488, 155184, 183831, 140547, 175776, 226399, 111809, 68975, 62838, 130366, 205660, 250622, 249087, 284230, 214947, 136123, 92992, 91797, 56798, 91976, 188957]
2798A88957p6543k8919J7135L590J3088j7148j11741P265K8980R0149j8475J4972
2786A11310M1576o240j954l8347K6360m7806K4348J5913n8891J11985k6958p8642
2774G2654L8909q6487n9047J13845r507J3744K5480l0764J4256O8359j2872j40883
2762G687N6734N6875q5681J5811N060n070l0790J4239j1928M9046j04302p0965
2750a03284J2188J31039J02804L6640p2046l7658J5040k4865r1527P2723N8723
2739I9777m0284J7035M4848n1145M7310M348j8111p049o1912R952o4837N2153
2727C2085p3375L2063j1013O8387o689R4402j002J7312r1310l5203L2609N5916
2715A14182r0070P593M5054o8991J12299m92n096m8467Q914m7276k6802J18472
$$ y = [188957, 112414, 83495, 100630, 104220, 117308, 100160, -11581, -4316, 24664, 114813, 96338, 111310, 152886, 146646, 144692, 106345, 132705, 84899, 109247, 125160, 66269, 178254, 151296, 72654, 111563, 25076, -33971, 79874, 70367, 84111, 109591, 78827, 93083, 161442, 148570, 7687, 64421, 121296, 35615, 51426, 56486, 51416, 20626, 34865, 22937, 71983, -32319, -103284, -91096, 39943, 142747, 179387, 107341, 69683, 84723, 59858, -31669, 41054, 99777, 59493, 76528, 121376, 70231, 117541, 121889, 103778, 96729, 34817, 44769, -20068, 32085, -41290, -9227, -20240, 48147, 41458, 135860, 134858, 152170, 60860, 25657, 58266, 114182, 24112, 31705, 76759, 7768, 120067, 119575, 114479, 66012, 74926, 27650, 848, 119320]
2703A19320l3330L4137j0459r2449K1811k2394N3878K8394J827j02770p4462O7465
2691i032O4226P8914k4844l2718m8161L1653P3877q3325k5944O3449m6979n6874
2679a5758O2695l6004J9836m6307j9059K2922m99K01942m2323l4143L400M669
2667A21371m2297K9834p0227m2850P5015Q6750n0770j13579Q999R0861j2548N2563
2655A33122o5513j4033L6346M9308l8428Q1512N604r1960J44968P8072j19372
2644A99626p9381K2355M257l253n0685p8334O108M2742R8968K3714j8996p4686
2632I2435L5955J18039p1649l9911O395q4853Q0388J34659j16121n9343q4422
2621A1572O6816r4182J7655J1205N4582r0204L982N1758M5184n3380j604N0534
$$ y = [119320, 85990, 120127, 109668, 17219, 39030, 16636, 70514, 98908, 100735, -2035, -76497, -9032, 55194, 134108, 109264, 76546, 28385, 60038, 133915, 50590, 24646, 88095, 41116, -15758, 46937, 10933, 30769, -15538, -34597, -11675, -12174, 189768, 147445, 113302, 116702, 121371, 79074, 108908, 38681, -4169, 70846, 157596, 106826, -6753, 2246, 93107, 80559, 133122, 67609, 53576, 89922, 139230, 100802, 182314, 187918, 95958, 240926, 318998, 199626, 120245, 142600, 146857, 143604, 92919, 14585, 20693, 63435, 162403, 186117, 167121, 92435, 128390, 246429, 174780, 134869, 141264, 56411, 136799, 271458, 155337, 95994, 11572, 78388, -15794, 1861, 13066, 67648, -22556, -18574, 33184, 78368, 24988, 23384, 73918]
2609G3918K2118m3326m6504K9501J1953p6270Q0197O8642j24873p3295J5019R4488
2597C1568Q8731J3950p6704P1m8752N1431K0356Q948N5835j19716L9480O8316
2585A33514K1161n4124j3948K8138k6020Q155Q3814O559P772l5542j04009Q8983
2573A44453P7490m4970m9552r043M6798o4144q6970M070J36999K5830j12833K9195
2561I7323K1802O0796j2945l2673j9616n4186Q1639j14237k0997J65557m1037
2550A31426J0794l9461m4948K9527L5196p976l9964m9058O7760O2369p8107o9469
2538H089J24789l7687q6094J98746M7963k6458j42909n4696o254J6281K4231K7163
2526I3164o8o5878M6553J03595p6578j9927N8874k829n7479L9419m0421J9894
$$ y = [73918, 96036, 52710, 6206, 35707, 47660, -28610, 51587, 120229, -4644, -77939, -62920, 31568, 120299, 134249, 57545, 57616, 8864, 60295, 80651, 89599, 145434, 25718, 65198, 133514, 154675, 100551, 86603, 114741, 88721, 96876, 180690, 187249, 195021, 159479, 55470, 144453, 221943, 176973, 127421, 118378, 165176, 101032, 14062, 18132, 155131, 180961, 68128, 97323, 119125, 179921, 166976, 134303, 114687, 60501, 142140, 27903, 6906, 172463, 131426, 142220, 102759, 57811, 87338, 122534, 114558, 74594, 25536, 93296, 155665, 77558, 8089, 132878, 95191, 9097, 207843, 255806, 229348, 86439, 31743, 25489, 41770, 66001, 93164, 93096, 27218, 73771, 177366, 100788, 80861, 139735, 136906, 79427, 118846, 78425, 98319]
2514I8319L9714n3458L2311N1094M9467j2477p0918K7538N9572l6335Q7667j47056
2502A25438J4098l4587j590J0170J8581p60J16067m4130q5745j2645J22668J18731
2490C46296Q9003p6683n9040K9570P1529r5922j2634j983M3422p1047k6446O1494
2478B97559L6724m1002J0951K8922P6482P4131p9539N8665M2377L2726n6183j50590
2466C31223O1515J70016j9986L5103m5454L2004l7967k0864J28783O100j14170
2455E26303J38918N9336l0999M591l936q6311N2515P8340O3629M5543J1782r1225
$$ y = [98319, 138033, 84575, 116886, 167980, 217447, 204970, 134052, 161590, 221162, 184827, 272494, 125438, 139536, 104949, 103359, 113529, 132110, 131350, 247417, 203287, 117542, 104897, 227565, 346296, 435299, 358616, 299576, 329146, 400675, 304753, 292119, 290136, 333558, 262511, 236065, 297559, 334283, 293281, 304232, 333154, 409636, 483767, 404228, 462893, 505270, 537996, 481813, 331223, 392738, 562754, 542768, 577871, 532417, 564421, 526454, 505590, 634373, 640473, 526303, 665221, 724557, 693558, 698149, 694213, 607902, 660417, 738757, 802386, 847929, 859711, 768486]
$$ [...]
##END NTUPLES=NMR SPECTRUM
##END=
