##TITLE=1H_EC-3309(VI)
 CDCl3
 8 sc, 
 1.8.2024
##JCAMPDX= 6.0         $$ Bruker NMR JCAMP-DX V2.0
##DATA TYPE= NMR SPECTRUM
##DATA CLASS= NTUPLES
##ORIGIN= UXNMR, Bruker Analytische Messtechnik GmbH
##OWNER= root
$$ XWIN-NMR		Version 3.5
$$ Thu Aug  1 14:01:17 2024 Russian Standard Time (UT+4h)  she@DPX200
##.OBSERVE FREQUENCY= 200.1315
##.OBSERVE NUCLEUS= ^1H
##.ACQUISITION MODE= SIMULTANEOUS
##.ACQUISITION SCHEME= undefined
##.AVERAGES= 8
##.DIGITISER RES= 18
##SPECTROMETER/DATA SYSTEM= spect
##.PULSE SEQUENCE= zg30
##.SOLVENT NAME= DMSO
##.SHIFT REFERENCE= (INTERNAL, DMSO, 0, 22.1065)
##AUDIT TRAIL= $$ (NUMBER, WHEN, WHO, WHERE, WHAT)
$$ ##TITLE= Audit trail, XWIN-NMR		Version 3.5
$$ ##JCAMPDX= 5.01
$$ ##ORIGIN= Bruker BioSpin GmbH
$$ ##OWNER= she
$$ F:/spectra/data/she/nmr/H-F/1/pdata/1/auditp.txt
$$ ##AUDIT TRAIL=  $$ (NUMBER, WHEN, WHO, WHERE, WHAT)
(   1,<2024-08-01 13:58:57.57 +0400>,<she>,<DPX200>,
      <created by zg, POWCHK disabled, PULCHK disabled
       configuration hash MD5:
       00 E9 B6 7A A2 85 ED C7 34 08 36 98 17 FE 4E 26
       data hash MD5: 16K
       3F 19 E2 A1 1D 4F B5 E6 EA 48 C6 43 97 B6 D0 1B>)
(   2,<2024-08-01 13:59:22.71 +0400>,<she>,<DPX200>,
      <Start of raw data processing
       efp BC_mod = 2 LB = 0.24 FT_mod = 6 PKNL = 1 PHC0 = -25633.59 PHC1 = 1.387491 SI = 16K 
       data hash MD5: 16K
       04 48 FA B4 81 48 27 F4 06 EE AC 14 78 DE 12 F0>)
(   3,<2024-08-01 13:59:59.98 +0400>,<she>,<DPX200>,
      <pk PHC0 = -4.453012 PHC1 = 11.6 
       data hash MD5: 16K
       D2 1C 61 AD 04 75 10 D4 C3 1A 7B 10 F9 9F 9E 8A>)
(   4,<2024-08-01 14:00:07.56 +0400>,<she>,<DPX200>,
      <abs ABSG = 5 
       data hash MD5: 16K
       BE 80 EA A0 E6 F6 FB C6 78 BF E2 50 CD 50 97 C3>)
$$ ##END=
$$ 
$$ hash MD5
$$ 25 1E 3F D6 DE BC F5 1A 5F 1B 83 C3 F4 B6 C3 88
##$RELAX= 
##$RELAX= 
##$RELAX= 
##$RELAX= 
##$RELAX= 
##$RELAX= 
$$ Bruker specific parameters
$$ --------------------------
##$DU= <F:/spectra>
##$EXPNO= 1
##$NAME= <H-F>
##$PROCNO= 1
##$TYPE= <nmr>
##$USER= <she>
##$AMP= (0..31)
100 100 100 100 100 100 100 100 100 100 100 100 100 100 100 100 100 100 
100 100 100 100 100 100 100 100 100 100 100 100 100 100 
##$AQSEQ= 0
##$AQ_mod= 1
##$AUNM= <au_zg>
##$AUTOPOS= <>
##$BF1= 200.13
##$BF2= 200.13
##$BF3= 200.13
##$BF4= 200.13
##$BF5= 200.13
##$BF6= 200.13
##$BF7= 200.13
##$BF8= 200.13
##$BYTORDA= 1
##$CFDGTYP= 0
##$CFRGTYP= 5
##$CHEMSTR= <none>
##$CNST= (0..31)
1 1 145 1 1 1 1 1 1 1 1 1 1 1 1 1 1 1 1 1 1 1 1 1 1 1 1 1 1 1 1 1 
##$CPDPRG= <>
##$CPDPRG1= <>
##$CPDPRG2= <>
##$CPDPRG3= <>
##$CPDPRG4= <mlev>
##$CPDPRG5= <mlev>
##$CPDPRG6= <mlev>
##$CPDPRG7= <mlev>
##$CPDPRG8= <mlev>
##$CPDPRGB= <>
##$CPDPRGT= <>
##$D= (0..31)
0 1.2 0 0 0 0 0 0 0 0.06 0 0.03 0 0 0 0 0.0002 0 0 0 0 0 0 0 0 0 0 0 0 
0 0 0 
##$DATE= 1722506337
##$DBL= (0..7)
120 120 120 120 120 120 120 120 
##$DBP= (0..7)
150 150 150 150 150 150 150 150 
##$DBP07= 0
##$DBPNAM0= <>
##$DBPNAM1= <>
##$DBPNAM2= <>
##$DBPNAM3= <>
##$DBPNAM4= <>
$$ [...]
##$SUBNAM3= <"">
##$SUBNAM4= <"">
##$SUBNAM5= <"">
##$SUBNAM6= <"">
##$SUBNAM7= <"">
##$SUBNAM8= <"">
##$SUBNAM9= <"">
##$SW= 24.0689530833862
##$SWIBOX= (0..15)
0 0 2 0 0 0 0 0 0 0 0 0 0 0 0 0 
##$SW_h= 4816.95568400771
##$TD= 16384
##$TD0= 1
##$TE= 0
##$TE2= 300
##$TE3= 300
##$TEG= 300
##$TL= (0..7)
0 120 120 120 120 120 120 120 
##$TP= (0..7)
150 150 150 150 150 150 150 150 
##$TP07= 0
##$TPNAME0= <>
##$TPNAME1= <>
##$TPNAME2= <>
##$TPNAME3= <>
##$TPNAME4= <>
##$TPNAME5= <>
##$TPNAME6= <>
##$TPNAME7= <>
##$TPOAL= (0..7)
0.5 0.5 0.5 0.5 0.5 0.5 0.5 0.5 
##$TPOFFS= (0..7)
0 0 0 0 0 0 0 0 
##$TUNHIN= 0
##$TUNHOUT= 0
##$TUNXOUT= 0
##$USERA1= <user>
##$USERA2= <user>
##$USERA3= <user>
##$USERA4= <user>
##$USERA5= <user>
##$V9= 5
##$VALIST= <valist>
##$VCLIST= <CCCCCCCCCCCCCCC>
##$VD= 0
##$VDLIST= <DDDDDDDDDDDDDDD>
##$VPLIST= <PPPPPPPPPPPPPPP>
##$VTLIST= <TTTTTTTTTTTTTTT>
##$WBST= 1024
##$WBSW= 4
##$XGAIN= (0..3)
0 0 0 0 
##$XL= 0
##$YL= 0
##$YMAX_a= 495297
##$YMIN_a= -511169
##$ZGOPTNS= <>
##$ZL1= 120
##$ZL2= 120
##$ZL3= 120
##$ZL4= 120
##$ABSF1= 22.04244
##$ABSF2= -2.026754
##$ABSG= 5
##$ABSL= 3
##$ALPHA= 0
##$AQORDER= 0
##$ASSFAC= 0
##$ASSFACI= 0
##$ASSFACX= 0
##$ASSWID= 0
##$AUNMP= <proc_1d>
##$AZFE= 0.1
##$AZFW= 0.1
##$BCFW= 0
##$BC_mod= 2
##$BYTORDP= 0
##$COROFFS= 0
##$CY= -3
##$DATMOD= 1
##$DC= 0
##$DFILT= <>
##$DTYPP= 0
##$F1P= 0
##$F2P= 0
##$FCOR= 1
##$FTSIZE= 16384
##$FT_mod= 6
##$GAMMA= 0
##$GB= 0
##$INTBC= 1
##$INTSCL= 3.70164e-10
##$ISEN= 128
##$LB= 0.24
##$LEV0= 0
##$LPBIN= 0
##$MAXI= 10000
##$MC2= 0
##$MEAN= 0
##$ME_mod= 0
##$MI= 1.114404
##$NCOEF= 0
##$NC_proc= -5
##$NLEV= 6
##$NOISF1= 3.799351
##$NOISF2= 2.8
##$NSP= 0
##$NTH_PI= 0
##$NZP= 0
##$OFFSET= 22.10652
##$PC= 1
##$PHC0= -25638.04
##$PHC1= 12.98749
##$PH_mod= 1
##$PKNL= yes
##$PPARMOD= 0
##$PSCAL= 0
##$PSIGN= 0
##$REVERSE= no
##$SF= 200.129484310307
##$SI= 16384
##$SIGF1= 3
##$SIGF2= 2
##$SINO= 5.538805
##$SIOLD= 16384
##$SREGLST= <1H.CDCl3>
##$SSB= 0
##$STSI= 16384
##$STSR= 0
##$SW_p= 4816.95568400771
##$SYMM= 0
##$S_DEV= 0
##$TDeff= 16384
##$TDoff= 0
##$TI= <>
##$TILT= no
##$TM1= 0
##$TM2= 0
##$TOPLEV= 0
##$USERP1= <user>
##$USERP2= <user>
##$USERP3= <user>
##$USERP4= <user>
##$USERP5= <user>
##$WDW= 1
##$XDIM= 16384
##$YMAX_p= 352040790
##$YMIN_p= -216071
$$ End of Bruker specific parameters
$$ ---------------------------------
##NTUPLES= NMR SPECTRUM
##VAR_NAME=  FREQUENCY,     SPECTRUM/REAL,   SPECTRUM/IMAG
##SYMBOL=    X,             R,               I
##VAR_TYPE=  INDEPENDENT,   DEPENDENT,       DEPENDENT
##VAR_FORM=  AFFN,          ASDF,            ASDF
##VAR_DIM=   16384,         16384,           16384
##UNITS=     HZ,            ARBITRARY UNITS, ARBITRARY UNITS
##FACTOR=    0.29402158847633, 1,            1
##FIRST=     4424.16638727586, 0,            0
##LAST=      -392.789296731848, 0,           0
##MIN=       -392.789296731848, -216071,     0
##MAX=       4424.16638727586, 352040790,    0
$$ Real data points
##PAGE= N=1
##DATA TABLE= (X++(R..R)), XYDATA
$$ [...]
6769F597184k45924k82069l02160k52176j99298j97091j33339p9434j39012m9027
6759D717654j09224j32487j24025k23248k36441j59645n9705O595q7168P6383
6749C668689p5018j03689J8943j01081j24475r1800m2765m0801J0309m0523R9461
6738C177250J4594p4441j53065k11664j26688j82546j09565r5498J131n6833p0671
6727B112004j29413o0678N2966j09765q9742o8764k7962k4976o560k3998n4985
6716A568127l3133p266r7326J5919J2220m5964J1491m2141m306j08839J04309
6705A373091j140p2495K2392r43J9316j3446J06088n6559m9471O420k3823k9725
6693A279705N0729P7340j3185J4644K6839J1500j11363L1401r673n4948L1977
$$ plain form
6769 6597184 6351260 6069191 5767031 5514855 5315557 5118466 4985127 4905693 4766681 4717654
6759 4717654 4608430 4475943 4351918 4128670 3892229 3732584 3672879 3679474 3592306 3668689
6749 3668689 3593671 3489982 3508925 3407844 3283369 3191569 3148804 3108003 3118312 3077789 3177250
6738 3177250 3191844 3117403 2964338 2752674 2625986 2443440 2333875 2238377 2239508 2182675 2112004
6727 2112004 1982591 1921913 1974879 1865114 1775372 1706608 1678646 1653670 1647110 1623112 1568127
6716 1568127 1534994 1527728 1430402 1446321 1458541 1412577 1424068 1381927 1377621 1268782 1373091
6705 1373091 1371951 1299456 1321848 1320905 1340221 1326775 1432863 1376304 1326833 1333253 1309430 1279705
6693 1279705 1330434 1407774 1394589 1409233 1436072 1447572 1336209 1367610 1357937 1302989 1334966
6682A334966l0770m2919J08315J7898O5474K4285K9469O3137L6013J30934P5458
6671A812260n207N1611J9877L3249Q7969m3595l2428k004n2895j00782M6220j12266
6659A702009k2045l0372J3642o980k6718q6011j3950K9737M2695n6545n8928k3426
6647A463108L8317J10104M5007O4341K84K5330Q6851M039J44259m0674p3784q3720
6635A783462p7162o6743k6940j02241r7908j5672o7064q8809m221L6888l4737
6624A238853o3544m4791m756J312L6942Q0546k3181n8402L7392Q62L2213m164
6612A229282J4110N7953J22948l7852m0517P075k2651j030M2824n8806p484M9126
6600A354978n620J20114O7972R4881K999m024n0569l6636j10908q626K1140l6808
$$ plain form
6682 1334966 1304196 1261277 1369592 1387490 1452964 1477249 1506718 1569855 1605868 1736802 1812260
6671 1812260 1807053 1858664 1878541 1911790 1999759 1956164 1923736 1921732 1868837 1768055 1814275 1702009
6659 1702009 1679964 1649592 1663234 1656254 1629536 1543525 1529575 1559312 1602007 1545462 1486534 1463108
6647 1463108 1501425 1611529 1656536 1720877 1721161 1746491 1833342 1837381 1981640 1940966 1867182 1783462
6635 1783462 1706300 1639557 1612617 1510376 1412468 1396796 1329732 1240923 1236702 1273590 1238853
6624 1238853 1175309 1130518 1125762 1127074 1164016 1244562 1221381 1162979 1200371 1201233 1233446 1229282
6612 1229282 1243392 1301345 1424293 1386441 1345924 1352999 1330348 1329318 1372142 1313336 1305852 1354978
6600 1354978 1349358 1469472 1537444 1632325 1635324 1631300 1580731 1544095 1433187 1424561 1445701 1408893
6588A408893N0149K7760K258p475R7958j6965N7859J5746N6215Q6437J11259l287
6576A886807N975p4202r7460K2752J4882J7468L5863m8200R7904K6507j3294L0061
6564A905063m4353N4969j4632L8143n5278m5933j5394o5849P7782M5381m5738
6553A834161O1595J5772m243J3586l9385J32373N7162M6522O0246J27877R7268
6542B402934m7961J08992P2655m000M2166L5933K2462j8072m3528J129K9960p760
6530B594910P4149J6830o307q6945O718P349L7944j7545m0188K5594P8298n3727
6518B637080L5923O1603R1848J9633M0365r892j2715J00115K3866j7836j6621
6507B953369J33401J7035o3229N5983J13525l0678J5743P1644l3966l5845n9457
$$ plain form
6588 1408893 1459042 1486802 1489060 1481585 1579543 1562578 1620437 1636183 1692398 1778835 1890094 1886807
6576 1886807 1892782 1818580 1721120 1743872 1758754 1776222 1812085 1763885 1861789 1888296 1875002 1905063
6564 1905063 1860710 1915679 1901047 1939190 1883912 1837979 1822585 1756736 1834518 1879899 1834161
6553 1834161 1895756 1911528 1907285 1920871 1881486 2013859 2071021 2117543 2177789 2305666 2402934
6542 2402934 2354973 2463965 2536620 2532620 2574786 2610719 2633181 2615109 2571581 2572710 2602670 2594910
6530 2594910 2669059 2685889 2679582 2592637 2599355 2606704 2644648 2627103 2586915 2612509 2690807 2637080
6518 2637080 2673003 2734606 2826454 2846087 2886452 2876560 2863845 2963960 2987826 2969990 2953369
6507 2953369 3086770 3103805 3040576 3096559 3210084 3179406 3195149 3266793 3232827 3196982 3137525
6496C137525K8213l3104J07404j891n0180M2816L6906q588J41858l8526n7303
6485C305130J20968j0131M7121L2473j3643J02385L7476K1336j6031Q6653J47537
6474C861274r02Q4014K9193P1772J15838N5606M1687P2328J63995K03946J3006
6463D711757J44873J57157J05875O2413J16572J52527J84971Q3522J25146J26585
6453E971398K28840J68972L48481J84358L31138L57717M05637M65822M57002N22589
6443I441954N77784M78296O31978N31979O94321O35422O73581P83937R21205R93416
6433A6363873J074502J397797J551589J484347J277851R81956Q88401J021823
6425B6042139O38630L67583L94181N00093P52960P26180Q39959J031970J213520
$$ plain form
6496 3137525 3165738 3132634 3240038 3238147 3187967 3230783 3267689 3259101 3400959 3362433 3305130
6485 3305130 3426098 3415967 3463088 3495561 3481918 3584303 3621779 3643115 3627084 3713737 3861274
6474 3861274 3860372 3944386 3973579 4045351 4161189 4216795 4258482 4330810 4494805 4698751 4711757
6463 4711757 4856630 5013787 5119662 5182075 5298647 5451174 5636145 5719667 5844813 5971398
6453 5971398 6200238 6369210 6717691 6902049 7233187 7590904 7996541 8462363 8919365 9441954
6443 9441954 10019738 10498034 11130012 11661991 12356312 12991734 13665315 14449252 15370457 16363873
6433 16363873 17438375 18836172 20387761 21872108 23149959 24131915 25020316 26042139
6425 26042139 26680769 27048352 27442533 27942626 28695586 29421766 30261725 31293695 32507215
6416C2507215J398766J496908J745288J923051K270709K627834K841653L300327
6408E0111751L842573M452420N362273O817703Q378730R653540R758569P872599
6400A06250158N634197M900538M810870K903418J421814K336126M832208O138473
6392A39227802N230665L666747K006473k79390r40833J809518O944658J2334385
6384A70000025J5409626J1516714L465452j330977n191936j3387714k0449801
6377A60031389k0253700j6535245j3687680j0896487q559379o935654n975780
6370G7187464n289646m495129l454743k656863k251028k298416k733762k855640
6362E1152237k887616l017689l022841k698317k121775j624602j140156p17702
$$ plain form
6416 32507215 33905981 35402889 37148177 39071228 41341937 43969771 46811424 50111751
6408 50111751 53954324 58406744 63769017 70586720 78965450 88618990 98377559 106250158
6400 106250158 111884355 116784893 121595763 124499181 125920995 128257121 133089329 139227802
6392 139227802 144458467 148125214 150131687 149852297 148911464 150720982 157665640 170000025
6384 170000025 185409651 196926365 200391817 199060840 193868904 180481190 160031389
6377 160031389 139777689 123242444 109554764 98658277 90098898 83163244 77187464
6370 77187464 71897818 67402689 63947946 61291083 59040055 56741639 54007877 51152237
6362 51152237 48264621 45246932 42224091 39525774 37403999 35779397 34639241 33921539
6354C3921539m41488N757M03044R00963J331342J498279Q56885J01725l26339
6345C8251707j72344m13509j070289j138043o28842K73174Q01042P71739P63489
6336C7438124L95504J08690j35145m28692j190945j906287k553555l038398l149881
6327B5539415k591442k034077j628562j210300r67854p90768o12534m93748l17860
6318A4892270k28024j12686k5891J21110L20588O11233Q27520P01484N83865L17143
6308A8008612J69166j86747k90178l71316l63101l92324m21571m43522l88818
6299A5320201k76726k2235l3131J65197M43483N91598N61598P51259Q01010P65254
6289A9067508N60106K70545K75023L23750N17107O74287O80324Q02821Q85961
$$ plain form
6354 33921539 33480051 33485808 33888852 34789815 36121157 37619436 38476321 38578046 38251707
6345 38251707 38079363 37665854 36595565 35457522 34828680 35101854 35902896 36674635 37438124
6336 37438124 37833628 37942318 37807173 37378481 36187536 34281249 31727694 28689296 25539415
6327 25539415 22947973 20913896 19285334 18075034 17107180 16316412 15703878 15210130 14892270
6318 14892270 14664246 14551560 14525669 14646779 14967367 15578600 16406120 17107604 17691469 18008612
6308 18008612 18177778 17991031 17700853 17329537 16966436 16574112 16152541 15709019 15320201
6299 15320201 15043475 15021240 14988109 15153306 15596789 16188387 16749985 17501244 18302254 19067508
6289 19067508 19627614 19898159 20173182 20496932 21014039 21688326 22368650 23171471 24057432
6280B4057432J037426J218664J593218J793197K170465K965468M012125M528655
6272D3376650M834065L478109P87591j513809j949766j137097K82551J618859
6264D9777153K722226L236345L059404J705054R434p94184l78697R93479K535897
6255F2866111L509868L606698K620704R47080l4824M39872J769507L263195N241135
6246H4229346P407553R019797R129603Q775429R463222M677612q390038j6111678
6238A08200846j3426544q498854n925980l330121k747581l152812l537136k782084
6230F4799734j362017j24815N14170n05917k759232m210595m182734l618772k986958
6221D5562864k203040j268942m24928M8467m61371j898178l208435l836996l333223
$$ plain form
6280 24057432 25094858 26313522 27906740 29699937 31870402 34835870 38847995 43376650
6272 43376650 48210715 51688824 52476415 50962606 49012840 47875743 48158294 49777153
6264 49777153 52499379 55735724 58795128 60500182 60509616 59715432 59336735 60330214 62866111
6255 62866111 66375979 69982677 72603381 73550461 73515637 73955509 75725016 78988211 84229346
6246 84229346 91636899 100656696 109786299 118561728 128024950 132702562 124312524 108200846
6238 108200846 94774302 86275448 80349468 77019347 74271766 71118954 67581818 64799734
6230 64799734 63437717 63312902 63827072 63321155 60561923 56351328 52168594 48549822 45562864
6221 45562864 43359824 42090882 41665954 41714421 41253050 39354872 36146437 32309441 28976218
6212B8976218k708950j922862j367056p85796m80354k53050k00355n91961q90856
6203A9774978r02094o49454n53347q02076j040893j396853j294444j159754j121585
6194A0854478p86376p12184n90923n94771l83992l69433m00829k76008l47624
6185F392338l12187k63360k48055k61387j49437r2237k10802k05774j56302j05715
6175D387082j20804j12648j81776m63j56395j76536j15331j41393j3581j02369
6165C265786k00193j14261o6970j2057m5447p9071p4286n1860k6190r006r2548
6154B493897o9236l6703j7885r808k2264r1861k4532K7830M8519j19423q9949
6143B088585K0589o0180j13238l359N1661n9921j7745Q158m9425L0765p5734l7189
$$ plain form
6212 28976218 26267268 24344406 22977350 22191554 21711200 21458150 21257795 20665834 19774978
6203 19774978 18872884 18223430 17670083 16868007 15827114 14430261 13135817 11976063 10854478
6194 10854478 10068102 9355918 8764995 8170224 7786232 7416799 7015970 6739962 6392338
6185 6392338 6080151 5816791 5568736 5307349 5157912 5065675 4854873 4649099 4492797 4387082
6175 4387082 4266278 4153630 3971854 3971391 3814996 3638460 3523129 3381736 3368155 3265786
6165 3265786 3065593 2951332 2884362 2872305 2826858 2747787 2673501 2621641 2595451 2586445 2493897
6154 2493897 2424661 2387958 2370073 2360265 2338001 2246140 2221608 2249438 2297957 2178534 2088585
6143 2088585 2109174 2048994 1935756 1932397 1984058 1924137 1906392 1914550 1865125 1895890 1820156 1782967
6131A782967j7172R4091Q48l4997P3027p37Q3854K2558K5307L2774n2845o198
6119B003477n2349j11692q2583m4167o0888n2917r6117p5339l7489k0477J8094
6108A387553n0175j15617K8952Q36j8893j2986j226K4125L9236j8028O4363L5131
6096A363271P958q4850L7698l9426J003n4221p9269n0861q7433n6249p440o3676
6084H86505j158J8140m1116q1085o7514R7314O748o3723j31376M1402L6068R71
6072G01176o1245n068N1062l648k5062Q691N4955r593K080l6402j5130o4273m1936
6059E55607n3292O2777n2730J3115Q9234p3824k0799o898L7968q1302m0165q452
6047D21239j5529N755J5759J6135J8447K9719N1232j03055L7250l7521L3148p893
$$ plain form
6131 1782967 1765795 1859886 1860734 1825737 1898764 1898027 1981881 2004439 2029746 2062520 2009675 2003477
6119 2003477 1951128 1839436 1756853 1712686 1651798 1598881 1502764 1427425 1389936 1369459 1387553
6108 1387553 1337378 1221761 1250713 1251549 1232656 1219670 1218444 1242569 1281805 1263777 1328140 1363271
6096 1363271 1371229 1286379 1324077 1284651 1285654 1231433 1152164 1101303 1013870 957621 950181 886505
6084 886505 885347 903487 862371 781286 713772 811086 817834 754111 622735 664137 700205 701176
6072 701176 639931 634863 685925 682277 657215 665906 720861 711268 713348 676946 661816 597543 555607
6059 555607 502315 565092 512362 525477 614711 540887 520088 513190 551158 469856 429691 421239
6047 421239 405710 411465 427224 443359 461806 491525 542757 439702 476952 439431 472579 464686
6035D64686N3096k0478J9512l7557o3953K4832J0647k8290k2949L7619j8171o3126
6023C55868K5306m473L1624n1209j2283J5135l6977K8150k18J8251p1959M5848
6011C43063K3904K820k0615j2093L0311K0970m3559o662q989Q082J0040j8751
5999C28521N5494M2504j3533J5957N2481k3530l7836n9073O1343J897l8631L3890
5987D19484m0382k7042J666j0040K0574K9071M6172L3033l1499P3260k9724l0690
5975D53883J6261J3327J7014M9151o849n3217k6639l001j3434j0485m0842N0697
5963D45866L348n6037M9514p4494j4204O8458q189k8139L2686l7996m1065k2265
5951C17483K6452n3632n9381N3017o34j765K4181J8849J6433p2751j0335K8703
$$ plain form
6035 464686 517782 497304 516816 479259 415306 440138 450785 422495 399546 437165 418994 355868
6023 355868 381174 376701 408325 357116 344833 359968 322991 351141 350923 369174 297215 343063
6011 343063 366967 369787 349172 337079 367390 388360 344801 338139 329150 337232 347272 328521
5999 328521 384015 426519 412986 428943 481424 457894 420058 360985 422328 424225 385594 419484
5987 419484 379102 352060 353726 343686 364260 393331 439503 472536 441037 514297 484573 453883
5975 453883 470144 483471 500485 549636 542787 489570 462931 459930 446496 436011 395169 445866
5963 445866 449214 393177 442691 368197 353993 422451 414262 386123 418809 380813 339748 317483
5951 317483 343935 290303 230922 283939 283305 281540 305721 324570 341003 268252 257917 286620
5939B86620L107k7005m5658m47n2201P8127m9633m7226Q5331q7510l6960O6250
5927A72795j10051j0079P4432l7175L1m3824k4254M8118O0172r4855K8578Q922
5915G2810L7043j3663l0877k9945j7489N3832N8550n6442L3474k2434L871l8381
5903E0349P468P721J8144j6604j6352M8237p880n7294o3931J17536L5155j4130
5891A08419m4053r692Q4797N4529m8454L7197N0870J51912L7438o881n5797o5217
5879B95068r9490j9781m1313n0353L7267l9171j1280j0768K1299j4620m7L8543
5867A05354q8687L0607k9989r321O437l2491M8088M0394n2776l5462m4159J19299
5855E7294O8658j9149n072k4966j02241N8317Q013j1768j3888p3344o3942K4124
$$ plain form
5939 286620 289727 262722 217064 216617 164416 242543 192910 145684 231015 143505 106545 172795
5927 172795 62744 52665 127097 89922 89953 46129 21875 69993 130165 35310 63888 72810
5915 72810 109853 96190 65313 35368 17879 71711 130261 73819 107293 84859 88730 50349
5903 50349 57817 65538 83682 67078 50726 98963 91083 33789 -30142 87394 122549 108419
5891 108419 64366 54674 139471 194000 145546 182743 233613 385525 422963 416082 360285 295068
5879 295068 195578 175797 134484 84131 121398 82227 70947 60179 81478 66858 66811 105354
5867 105354 16667 47274 17285 7964 14401 -18090 29998 70392 17616 -17846 -62005 57294
5855 57294 125952 106803 101731 76765 -25476 32841 40854 29086 15198 -58146 -122088 -97964
5843i7964K4752j535P4897L2330l1527q7370L75n0313M9701m10M868N9507k7460
5830e0149M3070M9576q4402k5806M1970j5k387j3783L7478k9427L2951n4830P9
5817e5675K9418j5134J1867P965k6820o9845N5688m67M9327M6816p4753k6308
5805f7921o587K9123J4723M0429l2386o4777O8171l8998M0709K0940j1960m5878
5793e4412n6304L2384N2057q4611L4352O5353j6211N2595p126o4979K5078K6206
5781D382J8558l9076J2819M6929n3561j746M4750l7433j4288j3638M1303m1706
5769c2707j319P296J7788l506N9867N9108j6822J4433l9494N285m5960J765l3867
5756h133N8668M1794L3117n5546J4058j9256L8558k3326n3730M531L7771L420
$$ plain form
5843 -97964 -73212 -74747 150 32480 953 -86417 -86042 -136355 -86654 -87064 -82196 -22689 -50149
5830 -50149 -7079 42497 -41905 -67711 -25741 -25756 -28143 -41926 -4448 -33875 -924 -55754 -55675
5817 -55675 -26257 -41391 -29524 -21559 -48379 -118224 -62536 -63003 -13676 33140 -41613 -67921
5805 -67921 -74508 -45385 -30662 9767 -22619 -87396 -19225 -58223 -17514 3426 -8534 -54412
5793 -54412 -110716 -78332 -26275 -110886 -76534 -11181 -27392 25203 18077 -46902 -21824 4382
5781 4382 22940 -16136 -3317 43612 -9949 -11695 33055 -4378 -18666 -32304 8999 -32707
5769 -32707 -34026 -26730 -8942 -12448 47419 106527 89705 104138 64644 69929 23969 25734 -8133
5756 -8133 50535 92329 125446 69900 83958 64702 103260 79934 26204 30735 68506 71926
5744G1926l841j2725k9956L2541k0231L7869L959o7715J7793L4862o4767l1956
5732c2241L0746R0694p6318J5598N548m3211k2532K9886K3767O330m2597q26J7005
5719A849L7408j7528K3032J6352p866m437M4696n9751j1648P8376M101p1503j3385
5706A9696J2081n8733P0003j461q66l2401l4858m6385J4550L2827R224J7518L8845
5693D0040L2964m6385o0599Q4275k8825p8874O1295Q3452j1353r1758n8947M6022
5681b8693k5672j1186k8783N9246M7892r676Q3980o9428K9009M2675J4484j15684
5669a1836N815k5029k3502J9664Q1788m3828J9086j4255m3954m204k4891M5275
5657a9871k851J5784k6959j2790L3720k2520o4368K2378R8373n172j03446N6061
$$ plain form
5744 71926 68085 55360 25404 57945 37714 75583 79542 11827 29620 64482 -285 -32241
5732 -32241 -1495 89199 12881 28479 34027 -9184 -31716 -1830 21937 28267 -14330 -15156 1849
5719 1849 39257 21729 44761 61113 53247 48810 93506 33755 22107 100483 104584 33081 19696
5706 19696 31777 -26956 43047 41586 40720 8319 -26539 -72924 -58374 -25547 -16323 1195 40040
5693 40040 73004 26619 -33980 50295 21470 -57404 3891 87343 75990 -15768 -74715 -28693
5681 -28693 -54365 -65551 -94334 -35088 12804 3128 87108 17680 46689 89364 103848 -11836
5669 -11836 -6021 -31050 -54552 -34888 46900 3072 22158 7903 -36051 -40255 -65146 -19871
5657 -19871 -22722 -6938 -33897 -46687 -12967 -35487 -99855 -77477 20896 15724 -87722 -31661
5645c1661P9983l9260p9517O95m2072L3036M1682Q571l5860m6906M9443q754o7065
5632a37685K4894L9760J2543k7210J4621q629n0286P3661n6450k3412L8178K4747
5620g5268n6051P898P0269j21042L2695M4215L4635J0743K6011o742J6775q3620
5608i9482P8827m3917p7558O6601j8470L9846K4597o6695L9988j8007N2017o568
5596b8821m3878N0541J4396J0960j7710j8389O3678n4804N870L6871q2360j9284
5584h2930K9910k272o2870l2691Q7191Q4770o1754q4505P7469k2225o8605M185
5572a34327J9817N0914r878J0032J1681n7337n446N895j5562J38176o4388p9769
5560a30192l3711R9970L6150n7281k1410N4689K106K4566r001K4446l3359L692
$$ plain form
5645 -31661 48322 9062 -70455 -69760 -111832 -78796 -37114 -28543 -64403 -111309 -61866 -70620 -137685
5632 -137685 -112791 -73031 -60488 -87698 -73077 -81706 -131992 -58331 -114781 -138193 -100015 -75268
5620 -75268 -131319 -123421 -53152 -174194 -141499 -97284 -62649 -51906 -25895 -32637 -15862 -99482
5608 -99482 -20655 -64572 -142130 -75529 -93999 -54153 -29556 -96251 -56263 -74270 -22253 -28821
5596 -28821 -72699 -22158 -7762 3198 -14512 -32901 30777 -24027 -18157 18714 -63646 -82930
5584 -82930 -53020 -55292 -118162 -150853 -63662 21108 -40646 -125151 -47682 -69907 -138512 -134327
5572 -134327 -114510 -63596 -73474 -63442 -51761 -109098 -114544 -108649 -124211 13965 -50423 -130192
5560 -130192 -163903 -63933 -27783 -85064 -106474 -51785 -49679 -25113 -34114 -9668 -43027 -39335
5548c9335k1477L6285j3487K7761p0036j3153L8767o5438N9322o9999M6226j0696
5536i5260J7716p170n3053O0078Q741m6863M3784K8298j5136L3609o8122O65P6996
5523a5717p6507P6490k8750m1630K7846K0923R136q1201j2677P3065m5339n3267
5511a47628J49061M1356L2343n7058p3787m8540p17N3062m0314M3598m4443R209
5499h3858K4365L6088K8275o026m7474l3797n980L7850p9474k830P0346O295M7882
5486h338j22733P505Q1264L872J2037L1403j02687K0285K8300o2159O4606L0554
5474a6091J527o7236K0830L5651k8919j1677J205L1374o3595m4719j7123M0120
5462a18653L2772j1885l533J062J8809J2778K490J0850j0401j741m5531L3184
$$ plain form
5548 -39335 -60812 -24527 -38014 -10253 -80289 -93442 -54675 -120113 -60791 -130790 -84564 -95260
5536 -95260 -77544 -84714 -137767 -77689 -68948 -115811 -72027 -43729 -58865 -25256 -93378 -92713 -15717
5523 -15717 -92224 -15734 -44484 -86114 -58268 -37345 -28209 -109410 -122087 -49022 -94361 -147628
5511 -147628 1433 42789 75132 18074 -55713 -104253 -104970 -51908 -92222 -48624 -93067 -83858
5499 -83858 -59493 -23405 4870 -1156 -48630 -82427 -88407 -50557 -130031 -132861 -62515 -56220 -8338
5486 -8338 -131071 -123566 -42302 -38430 -26393 5010 -97677 -77392 -49092 -111251 -46645 -16091
5474 -16091 -14564 -81800 -60970 -25319 -54238 -65915 -64710 -33336 -96931 -141650 -158773 -118653
5462 -118653 -85881 -97766 -101299 -100237 -81428 -68650 -66160 -55310 -65711 -67452 -112983 -79799
5450g9799N0679l1844K1239m1872k7880R8998p0951l1886M2398J3173Q258J9518
5438b9969L4096m7673q8954J351Q5962n5318l2943O6593k1542k6983J12877k9650
5426c2153m0332l0567M0739O516j221L7743l5659o6939r417R76M6955L5445L115
5413d4799l4298K316P7626j3620L2411Rj5475n0076j122L3156k6609l7702l1690
5400a09873J5998N7236l4190L3871q691K9466m0854k4576K2364n1022N5817k2418
5388g6872K0668n739n8512J00128m4092M2880K7981n9126K6388o3681J9871k8450
5376i8556k981N8369M2457J0884J3654N0184q119o6786l1541J817m9613K0851
5364e9380o9597M1194P3028m4671k8095j4661L7863M0417n7621N484j958O0002
$$ plain form
5450 -79799 -29120 -60964 -39725 -81597 -109477 -10479 -81430 -113316 -70918 -57745 -49487 -29969
5438 -29969 4127 -43546 -132500 -131149 -45187 -100505 -133448 -66855 -88397 -115380 -2503 -32153
5426 -32153 -72485 -103052 -62313 -55797 -57018 -19275 -54934 -121873 -131290 -130314 -83359 -47914 -44799
5413 -44799 -79097 -76781 845 -12775 19636 19645 4170 -45906 -47028 -13872 -40481 -78183 -109873
5400 -109873 -93875 -36639 -70829 -36958 -45649 -16183 -57037 -81613 -59249 -110271 -54454 -76872
5388 -76872 -56204 -61943 -120455 -20327 -64419 -21539 6442 -52684 -26296 -89977 -70106 -98556
5376 -98556 -101537 -43168 -711 10173 23827 74011 65892 -894 -32435 -30618 -80231 -59380
5364 -59380 -128977 -87783 -14755 -59426 -87521 -102182 -64319 -23902 -81523 -76039 -77997 -17995
5352a7995k8116j866J2747l616P889L5293L0366k2957m4797L8894N1805o1993
5340d346o0269l7118N238M2106n8856M0867M9585L3282l0022o4443M9271q5212
5328a19917O6465m0054M910L8996J3081k6589M7337O833m2588o405q722N1970
5316a4683L0603j18526n9926J7825J6729L9517O620K5789n0813q072N9814m507
5304e9630L3881L523l1443o4524Q5316l3424L7879J8623Q903j7818n5046K9318
5292d4442P578l1505O5298P980q3919j761P6745r0365J2364K1325M6595j747r6381
5279a12235J27749l5883j5251l2202k6417L7347m270J5043K6081N6937o3717n1542
5267g8360m0256M2160j824l1328R1023J5295m9890J0337M182k9047Q0693k2271
$$ plain form
5352 -17995 -46111 -47977 -35230 -38846 -30957 4336 34702 11745 -33052 5842 57647 -4346
5340 -4346 -64615 -101733 -96495 -54389 -113245 -72378 -22793 10489 -19533 -83976 -34705 -119917
5328 -119917 -53452 -93506 -88596 -49600 -36519 -63108 -15771 -8938 -51526 -57931 -66653 -14683
5316 -14683 15920 -102606 -162532 -144707 -127978 -88461 -81841 -56052 -106865 -114937 -55123 -59630
5304 -59630 -25749 -22226 -53669 -118193 -32877 -66301 -28422 -9799 -896 -18714 -73760 -44442
5292 -44442 -36864 -68369 -3071 4909 -79010 -80771 -4026 -94391 -82027 -60702 -14107 -15854 -112235
5279 -112235 15514 -20369 -35620 -67822 -94239 -56892 -61162 -46119 -20038 36899 -26818 -78360
5267 -78360 -118616 -76456 -78280 -109608 -18585 -3290 -53180 -42843 -38661 -67708 12985 -9286
5255i286n2035j6380p446L3287p720m6142P8029j0937j9578J8054n3146k3690
5243a16990R943R9501m4200R003o3116l3649M5753M6829j549M2342J8665r7978
5231h5446r202n293K6157M709N7602m1849m7206M0860R1925k0092m669k9812o2154
5218h4470l3047M0252R889m8244l0570K6402M8072P6591o0639n8747M180N5703
5206e4628M4788P487l7860q6038J14829L843J7728n1763M5398k051m8262N0171
5194C642n1810l7718o5508N5042K7468n6637k413K5543j13680R895J67478J329
5182c7369r0708O3303K7967K9877k6923l2887n056J09041o0843m3792n6342M7506
5170g6226L6601K4172Q2843k3955o4597O6296m9592k8890J2409M1330m1790m5825
$$ plain form
5255 -9286 -61321 -77701 -85147 -51860 -59580 -105722 -27693 -38630 -58208 -40154 -93300 -116990
5243 -116990 -107047 -7546 -51746 -42743 -105859 -139508 -93755 -46926 -48475 -6133 12532 -85446
5231 -85446 -94648 -99941 -73784 -69075 -11473 -53322 -100528 -59668 32257 12165 7496 -22316 -84470
5218 -84470 -117517 -77265 -67376 -115620 -146190 -119788 -71716 4875 -55764 -114511 -110331 -54628
5206 -54628 -9840 -2353 -40213 -126251 -11422 -7579 10149 -41614 3784 1733 -46529 3642
5194 3642 -48168 -85886 -151394 -96352 -68884 -125521 -127934 -102391 -216071 -206176 -38698 -37369
5182 -37369 -128077 -64774 -36807 -6930 -33853 -66740 -71796 37245 -23598 -67390 -123732 -76226
5170 -76226 -39625 -15453 67390 43435 -21162 45134 -4458 -33348 -20939 20391 -21399 -67224
5158f7224O6219k8670n3056o967O504M2193j5957k2796O0519Q8611o4446o621
5146a691j9034l1620L116J23164m011k6973K8553q8930o6521R7120l2507j4563
5134c3897m2007o7671J05637P060p451n4774l234o437K9807l2236L4699R025N5488
5121e991Q044N3256K5001q575J840K8921j00591K0001n0098o230m2796N9534j0348
5108b8032j0033P8734p230r610Q901j6917J2747p0642K1317k4417M5924L3370
5096C4112p8869l0714L0339j2735R8437j8176j01755N846M3968m0591K1805K2671
5084b5662L1814m7466l4886M193K3140k9458J4731O5404o450l811L9246o852l0976
5071g033p12l4369q0912L6532M0093m4154N4174p840R4774K3586l3866J2764r251
$$ plain form
5158 -67224 -1005 -29675 -82731 -89698 -83194 -41001 -56958 -79754 -19235 69376 4930 -1691
5146 -1691 -20725 -52345 -49229 73935 69924 42951 71504 -17426 -83947 13173 -19334 -33897
5134 -33897 -75904 -143575 -37938 -30878 -38329 -93103 -96337 -102774 -72967 -105203 -70504 -61479 -5991
5121 -5991 2053 55309 80310 71735 73575 102496 1905 21906 -28192 -34422 -77218 -17684 -28032
5108 -28032 -38065 40669 33439 23829 32730 15813 28560 -42082 -20765 -45182 742 34112
5096 34112 -44757 -75471 -45132 -57867 40570 22394 -79361 -73515 -29547 -70138 -48333 -25662
5084 -25662 6152 -41314 -76200 -72007 -48867 -78325 -63594 1810 -4640 -8451 30795 23943 -7033
5071 -7033 -7745 -42114 -123026 -86494 -46401 -90555 -36381 -44221 50553 74139 40273 53037 43786
5058D3786j2535j498n5309L9198p4766j6334O6810Q499l1973O808J8801k4802
5046c3315j035n5223Q752J28117o4967K2556j6515Q3678q1039n8645N3981r932
5034b3587m2626j9085L2576j729N1916L4656M495k2100j8400Q180j6561O0677
5022D8412l7711q8407M5373n8789L0839j2542K9730K452l6489k6534L9401M4216
5010b0049L2772L2783p3214l1733J0802l3496M4521k014K0375N3124q5126M4539
4998f716K8675K159j5964L5214k7075q8205N3875o7351O4321P3950n1332j9985
4986a8434L3013K5284q886J978l4796k2531N856K0991j0784N901m6248O553K1400
4973b0703j8483j04j7459l1183P562J409Q797J26522j0265n4355o6325q484N7170
$$ plain form
5058 43786 31251 29753 -25556 13642 -61124 -77458 -10648 -2149 -34122 -27314 -8513 -33315
5046 -33315 -34350 -89573 -80821 47296 -17671 4885 -11630 72048 -8991 -67636 -13655 -23587
5034 -23587 -66213 -85298 -52722 -54451 -2535 32121 36616 14516 -3884 4296 -12265 48412
5022 48412 10701 -77706 -32333 -91122 -60283 -72825 -43095 -40643 -77132 -103666 -64265 -20049
5010 -20049 12723 45506 -27708 -59441 -48639 -82135 -37614 -39628 -19253 33871 -51255 -6716
4998 -6716 21959 24118 8154 43368 16293 -71912 -18037 -85388 -21067 52883 1551 -18434
4986 -18434 14579 39863 30977 32955 -1841 -24372 -18516 2475 -8309 -2408 -48656 -42103 -20703
4973 -20703 -39186 -39290 -56749 -87932 -80370 -78961 -70164 56358 46093 -8262 -74587 -83071 -25901
4960b5901n4953R142P1405L3104m7985N287o392j1144q6227Q2560M6412n303j6218
4947f213J4892l4926K2301k8776r5875O8716N7833K6776N2591n4960k3597K5458
4935B4220o1353r0783K9732N0263J5568k9703J1592J4347k3957Q3852k1162m3718
4923d1102K2202p807N764N8282n7421r724L613m9451K3431J3743j0955o876m572
4910f0873K532R5910K2839m6748j37775M0647N5405r5736N1730M0529M6788J9185
4898C4433l5201o5130Q041L4200p410Q323L4533l4622N3543M188n2067o779j5897
4885c9845M1384k0870o1743P3417N4567n2852L3668L288n4100n07k3803M582n819
4872d8633L19R16J8924J4838r895K5732K1364n6482n614N4323l1183l2883Q463
$$ plain form
4960 -25901 -80854 -71712 -307 32797 -15188 -9901 -16293 -27437 -113664 -31104 15308 10005 -6213
4947 -6213 8679 -26247 -3946 -32722 -128597 -59881 -2048 24728 77319 22359 -1238 24220
4935 24220 -37133 -127916 -98184 -47921 -32353 -62056 -50464 -36117 -60074 23778 2616 -41102
4923 -41102 -18900 -26707 -20943 37339 -20082 -29806 -26193 -75644 -52213 -38470 -49425 -56301 -60873
4910 -60873 -58341 37569 60408 13660 -124115 -83468 -28063 -123799 -72069 -31540 15248 34433
4898 34433 -768 -65898 -57857 -23657 -31067 -22744 11789 -22833 30710 34898 -17169 -23948 -39845
4885 -39845 1539 -19331 -81074 -7657 46910 -5942 27726 31014 -23086 -23593 -47396 -42814 -48633
4872 -48633 -48314 -47398 -28474 -13636 -23531 2201 23565 -32917 -38531 15792 -15391 -48274 -39811
4859c9811Q259R7200k9428j8219M4909k6261l7991l178n292J6219K4844j8298
4847A2953K7133M6263J4304M7206n7496J3434j1752O5998K1430k5100n345k0949
4835A28079l6103K1899K7935K5325M2373J1949n2354r7712L699J1278j189N915
4823I1094J0858J6737k8230J4387j0001k4150k8594K1803M2234j9913K5749J1366
4811A23340K4024m5731K9613O6308N9369O3006O762M6665J3082o3036R974j18343
4799B15033l6715p1782o254J6388L4423m3385j8774l9759L5176K2263p8043M7530
4787G6101N1993R633m1354q029l3028K8642K559k6229o9678j1862O5684M1350
4775H5782k5994j3799L328n4558j0594M0930N6986j05424M5085l9979k0144J41163
$$ plain form
4859 -39811 -31552 65648 36220 18001 62910 36649 -1342 -4520 -9812 6407 31251 12953
4847 12953 40086 86349 100653 147859 90363 103797 92045 158043 179473 154373 149028 128079
4835 128079 91976 113875 141810 167135 209508 221457 169103 71391 75090 86368 85179 91094
4823 91094 101952 118689 90459 104846 94845 70695 42101 63904 106138 86225 111974 123340
4811 123340 147364 101633 131246 197554 256923 319929 326691 373356 386438 323402 333376 215033
4799 215033 178318 106536 100282 116670 151093 107708 88934 49175 84351 106614 28571 76101
4787 76101 128094 137727 96373 88344 55316 83958 86517 60288 -9390 -21252 44432 85782
4775 85782 59788 45989 49317 -5241 -15835 25095 82081 -23343 21742 -18237 -38381 102782
4763A02782k5334k0254n409N9207o1871o0643O4172L4508m6222k7286O6509r198
4751G0961R332j3955l649q651l3558O0060k5542M4764o6396J5115m3179J7641
4739B2943o2281R1N5486l6783O8281m9022n4756N7109M6225J0870K4075p7134
4727E104q897N8338l2098k0491J1908k2394K1408J8767L386K2916J2561P9287
4715A49795p760j8255k6689j7226l5716l7235N4799P866r4218j6646M4264J7253
4703B0232Q5918J2145R534q4049O5336j4394k5026p686j9034O399j7862M6917
4691G8430K2297k085L0022Q4805n6019j6838K746l0648q499k4965k9122N2969
4679A03093l4818m6280J8456N8118j4038j05853R1106P4875o0826N2121J3954
$$ plain form
4763 102782 77448 57194 51785 110992 49121 -11522 52650 87158 40936 13650 80159 70961
4751 70961 80293 66338 62689 54038 20480 80540 54998 99762 33366 48481 5302 22943
4739 22943 -39338 -39247 16239 -20544 47737 -1285 -56041 1068 47293 58163 82238 5104
4727 5104 -3793 54545 22447 1956 13864 -8530 12878 31645 35031 57947 70508 149795
4715 149795 142035 123780 97091 79865 44149 6914 61713 69579 -24639 -41285 2979 20232
4703 20232 106150 118295 127829 43780 109116 94722 69696 62010 42976 49375 31513 78430
4691 78430 100727 98642 128664 213469 157450 140612 143358 112710 104211 79246 50124 103093
4679 103093 68275 21995 40451 98569 84531 -21322 69784 144659 83833 135954 149908
4668A49908o8408l1532J6433K850l41L8115k4735K8901j9883k089o635O7752m231
4655A46105M95k915l5794K8004k9459n4132R185J8963k9858J7212N3056o470k5126
4642H9266l1651M9907N7087k3243m9490M8811k964M5847j9033J1527K4390n6891
4630A43563K5837M0368J7749k2884J9557j3866m0125O5974r556l6961K4157n6113
4618A57700P5346J3161n5888J9513P1868R0971r9139M6920O4713m1128R6628O0759
4606E01424p0933K3909L0003J1059n7605M436Q86K541L8533q4893n3003O3147
4594D09504J868o97K3094J13175N7329p7705R8472J03089l854l0022k4633m4976
4582F24644k3989m2571k326p6071p3968K4847M3656j1946J0861J0807L1755k4782
$$ plain form
4668 149908 81500 49968 66401 69251 68910 107025 82290 111191 91308 89219 82584 150336 146105
4655 146105 146600 143685 107891 135895 106436 52304 61489 80452 50594 67806 120862 114392 89266
4642 89266 57615 107522 164609 141366 91876 140687 137723 183570 164537 176064 200454 143563
4630 143563 169400 209768 227517 204633 224190 210324 170199 236173 226617 189656 213813 157700
4618 157700 233046 246207 190319 209832 281700 372671 273532 320452 385165 344037 440665 501424
4606 501424 430491 454400 484403 495462 437857 442293 443179 445720 484253 399360 346357 409504
4594 409504 411372 410675 433769 546944 604273 526568 625040 728129 724275 694253 669620 624644
4582 624644 600655 558084 555758 479687 405719 430566 474222 462276 473137 483944 515699 490917
4570D90917O9503k333m2637P0088l5928m5572j598O421J6215j33154L7005J023
4558D29950o97k3768L4273M5688q4550N9618k2973k5568J5661L4070K1693m6710
4546D36687K6067k7331l6100L2301K2746P6551n0257q7638J42230j1870k2390
4535E00996j0211n298M6747O0738l1036q1794K2853K6333O2063L635J5349M2467
4523F52842p9154j0013M2404K1856J1120K2654l4809L5140O4362L4833n8353j03738
4511E99144m1042Q8513P3711Q574K3057Q9853N7693j5006m8086k479P5201n1072
4499H58061M2287R0196P782R6105L6156l1499N8979k061r9661k3384l8479M717
4487I99199J5772L6741n1840L1569M7860o8203J2763L2256m2573J8407L8536R5679
$$ plain form
4570 490917 560420 558087 515450 585538 549610 504038 502440 508861 525076 391922 428927 429950
4558 429950 429253 405485 439758 485446 400896 460514 437541 411973 427634 461704 483397 436687
4546 436687 462754 435423 399323 431624 454370 530921 480664 393026 535256 523386 500996
4535 500996 490785 485487 532234 592972 561936 480142 502995 529328 591391 595026 610375 652842
4523 652842 573688 563675 606079 627935 639055 661709 626900 662040 726402 761235 702882 599144
4511 599144 558102 646615 720326 728900 751957 841810 899503 884497 836411 833932 909133 858061
4499 858061 900348 990544 998326 1094431 1130587 1099088 1158067 1156006 1056345 1032961 994482 999199
4487 999199 1014971 1051712 999872 1031441 1079301 1011098 1023861 1056117 1013544 1031951 1070487 1166166
4475A166166L3242j4314M9289K4894m9946m132P8056N1031M5755K7081R567q185
4463A408504O6621m9357K9757k2684k7397o1346L7809P3701J3144n267K0702m1259
4451A442928M9626M0266M6810Q246m0810k7559R3850R9679N8564j5079N6423N3918
4439A866862J7955J4914J17744K3301m2045M5314Q9723J18561K7147R1280O3565
4428B434321Q5581J42864K1082R8607J65242R1981J14784J26481R6150J42026
4418C519119J85470K63084J94299J49703K32935K91697J45019J53600J59742N3525
4408E348193K43695J96277J56866K94321K70749L32489L92887L93409L88462M35794
4398H453142N03407N43883N73646N58539O11827O80559P31005P60422O97395P28171
$$ plain form
4475 1166166 1199408 1185094 1234383 1259277 1209331 1205199 1283255 1334286 1380041 1407122 1416689 1408504
4463 1408504 1475125 1425768 1455525 1432841 1405444 1344098 1381907 1455608 1468752 1463485 1484187 1442928
4451 1442928 1492554 1532820 1579630 1587876 1547066 1519507 1613357 1713036 1771600 1756521 1812944 1866862
4439 1866862 1884817 1899731 2017475 2040776 1998731 2044045 2133768 2252329 2279476 2370756 2434321
4428 2434321 2519902 2662766 2683848 2782455 2947697 3039678 3154462 3280943 3377093 3519119
4418 3519119 3704589 3967673 4161972 4311675 4544610 4836307 4981326 5134926 5294668 5348193
4408 5348193 5591888 5788165 5945031 6239352 6510101 6842590 7235477 7628886 8017348 8453142
4398 8453142 8956549 9500432 10074078 10632617 11244444 11925003 12656008 13416430 14113825 14841996
4388A4841996P80828Q90946R72592J204378J297697J442079J749248K135026K448800
4379B7763590L084122L768407M534160N139891M507612J973543r77329k565025
4371D7228971k661542k082517j469914r10929l94485R6949O23446R59995J439393
4362D2829367K259255L133806M245947N630418P347095R044672R766327O678872
4354I0935759n49875o881403r030695q278703o830555n605663m582413l855764
4346D5320688k852510k138678j366445p04571j42462N10833J396842K382404L444405
4337D5850506M067738L204044K82129l129619m865700m934100m598115l995240
4329C1881643l579694l101877k778837k312875j832656j675800j346629j145761
$$ plain form
4388 14841996 15622824 16513770 17486362 18690740 19988437 21430516 23179764 25314790 27763590
4379 27763590 30847712 34616119 39150279 44290170 48797782 50771325 49793996 47228971
4371 47228971 44567429 42484912 41014998 40104069 39709584 39806533 40429979 41389974 42829367
4362 42829367 45088622 48222428 52468375 58098793 65445888 74490560 84256887 90935759
4354 90935759 90385884 83504481 74473786 66195083 59364528 53758865 49176452 45320688
4346 45320688 42468178 40329500 38963055 38258484 38116022 38626855 40023697 42406101 45850506
4337 45850506 49918244 53122288 53404417 50274798 45409098 40474998 35876883 31881643
4329 31881643 28301949 25200072 22421235 20108360 18275704 16599904 15253275 14107514
4321A4107514j059673q75016q14024o63865n45109m78512m50161l44757m19931
4312H456466l39880l38538j63096k11315j92558j93446j48242m0766k02776j77347
4302F448502p2131j28536m3192l5622l6277O2031N6957J67187L39814K09201J42696
4291G110630j22266j65709q4947q5706J33222P4647J77791K79621K71376J00550
4281G689209Q3999R2809L70316K55981K19938P1379M8269Q0755J75821L88316
4271I476792N33348N04440N30876O97231R17795J131288J022897O08458M9713
4262A5472838m02903p99502q56290q81654n38170l54453k71113q0758J72547K99725
4252A1760267M78603O44316R34756J251140J570101J930431K093529J852329N31133
$$ plain form
4321 14107514 13047841 12172825 11358801 10694936 10149827 9671315 9221154 8876397 8456466
4312 8456466 8116586 7778048 7614952 7403637 7211079 7017633 6869391 6828625 6625849 6448502
4302 6448502 6376371 6247835 6204643 6169021 6132744 6194775 6251732 6418919 6758733 6967934 7110630
4291 7110630 6988364 6822655 6737708 6652002 6785224 6859871 7037662 7317283 7588659 7689209
4281 7689209 7773208 7866017 8236333 8492314 8712252 8783631 8831900 8912655 9088476 9476792
4271 9476792 10010140 10514580 11045456 11742687 12660482 13791770 14814667 15423125 15472838
4262 15472838 15069935 14270433 13414143 12532489 11994319 11639866 11368753 11287995 11460542 11760267
4252 11760267 12238870 12883186 13817942 15069082 16639183 18569614 20663143 22515472 23046605
4243B3046605j138641k135278k247151j918768j600312j203060r61901p05865
4235A1135629m05321l61036k73781k62K18781L48429N33822O69085Q11708Q03251
4225A3480305N20640k03261q67378j234777j303354j162233r57427p64929o22522
4216F885064n78192m96044l61213k47131k36063k28841j90403q2055k26796j67498
4206D070828j94303j58283j78982l3262p0415l0284l4778j9908p2559j15044o7200
4195C095810k7219p0218n8144O4052o7964n4021m8247o8674N0169k1567o14J9318
4183B812681Q812j03081p4033K9912N6272j198O0967l6858k7146o1830L6953J09543
4171B810994L19R4204Q8128r114Q5454J45858m1067L8081L8118N5529M0432M3946
$$ plain form
4243 23046605 21907964 19772686 17525535 15606767 14006455 12803395 11841494 11135629
4235 11135629 10730308 10369272 10095491 10095229 10314010 10662439 11196261 11865346 12677054 13480305
4225 13480305 14000945 13797684 12930306 11695529 10392175 9229942 8272515 7507586 6885064
4216 6885064 6306872 5810828 5449615 5202484 4966421 4737580 4547177 4465122 4238326 4070828
4206 4070828 3876525 3718242 3539260 3505998 3435583 3405299 3370521 3350613 3278054 3163010 3095810
4195 3095810 3068591 2998373 2940229 3004281 2936317 2882296 2834049 2765375 2815544 2793977 2793363 2812681
4183 2812681 2821493 2718412 2644379 2674291 2730563 2729365 2790332 2753474 2726328 2664498 2701451 2810994
4171 2810994 2811313 2905517 2993645 2984531 3069985 3215843 3174776 3212857 3250975 3306504 3346936 3390882
4159C390882P8227O2484J18575Q0410Q6448J23693J37771J04214J81507J84754
4149D548965K25987K11354J97465J77181K55929K58055L20349K97714J21431L10136
4139F924566L49122K66356L96808N26645N35785M79651L00636K29527K00512L08584
4129A0518192M18024M74312N69692N81983O18279N15395N81281P96640Q25374
4120A5899172R20411Q70264Q76175Q00010J010038J232319J490450J747326J934268
4111B6780433K341672K970226L835572N200688O763995P062307L523692j813216
4103E6665369m057228l436445k084546o87385Q78496K639278L741928K800060
4095E6459527N24884J25321J660036L541252L723550Q11512l124527m486236l534529
$$ plain form
4159 3390882 3469109 3531593 3650168 3730578 3817026 3940719 4078490 4182704 4364211 4548965
4149 4548965 4774952 4986306 5183771 5360952 5616881 5874936 6195285 6492999 6614430 6924566
4139 6924566 7273688 7540044 7936852 8463497 8999282 9478933 9779569 10009096 10209608 10518192
4129 10518192 10936216 11410528 11980220 12562203 13180482 13695877 14277158 15073798 15899172
4120 15899172 16819583 17689847 18566022 19366032 20376070 21608389 23098839 24846165 26780433
4111 26780433 29122105 32092331 35927903 41128591 47892586 54954893 58478585 56665369
4103 56665369 52608141 49171696 47087150 46399765 47278261 49917539 53659467 56459527
4095 56459527 56984411 57109732 58769768 62311020 66034570 66846082 63721555 59235319 55700790
4086E5700790j474687K96691O97948j861691l598525l114025j620074J8198J776765
4077D6821390L814917M973130K008828m087596p377130p226598n867839m849126
4069B8209976l814452l022015k485800j920511j602221j354451j049064q45295
4061A2116167q00073p06925o41761n49388m66871l84219l43873l54351l55463
4052G513243l15524l32659k68746k60050j77713j12938k17854k49039j79007j12157
4042E287556j84723j43092j35656p3471r9624r2359j32602k1616o3528j38639
4032D202246q5983j4917m2896j27912n8603j8110p1990k6615J944m768m7707p8172
4020C626517o7435Q5634l0203M539M9727p2422q365k1689P6486M9488K723l0871
$$ plain form
4086 55700790 54226103 54522794 55220742 53359051 49760526 46646501 45026427 45044625 46821390
4077 46821390 50636307 55609437 57618265 53530669 46153539 38926941 33059102 28209976
4069 28209976 24395524 21373509 18887709 16967198 15364977 14010526 12961462 12116167
4061 12116167 11316094 10609169 9967408 9418020 8951149 8566930 8223057 7868706 7513243
4052 7513243 7197719 6865060 6596314 6336264 6158551 6045613 5827759 5578720 5399713 5287556
4042 5287556 5102833 4959741 4824085 4750614 4650990 4558631 4426029 4404413 4340885 4202246
4032 4202246 4116263 4101346 4058450 3930538 3871935 3853825 3781835 3755220 3757164 3752396 3704689 3626517
4020 3626517 3559082 3644716 3614513 3619052 3668779 3596357 3587992 3566303 3642789 3692277 3695000 3664129
4008C664129l8521n466q158P5445K1122j55K3992j6807L8562N5832M149Q1381
3996C895505J49510J75086J69081J72935N0015R9637J31766J62661L6619K63557
3986E306372K08367J46638J40448K00622R7350K23452O9401K33980J93546J62620
3976F982796K31224L03470K97062M47914L76410L60091N22768N80135N65109O22210
3966A1289189O53100O51196P08624P27794P68375Q36537Q11215J034573J156807
3957A8637410J150324J390950J471116J648898J842448K133782K450560L013655
3949C3739143L607612M629025N518562N803136L938516K8255l043387l703281
3941E0517581l055304k246144j353697o22368J44999O73440J002693J250499J427185
$$ plain form
4008 3664129 3625608 3620142 3611984 3687429 3708551 3708396 3732388 3715581 3754143 3809975 3814124 3895505
3996 3895505 4045015 4220101 4389182 4562117 4612132 4711769 4843535 5006196 5042815 5306372
3986 5306372 5514739 5661377 5801825 6002447 6099797 6323249 6392650 6626630 6820176 6982796
3976 6982796 7214020 7517490 7814552 8262466 8638876 8998967 9521735 10101870 10666979 11289189
3966 11289189 11942289 12593485 13302109 14029903 14798278 15634815 16446030 17480603 18637410
3957 18637410 19787734 21178684 22649800 24298698 26141146 28274928 30725488 33739143
3949 33739143 37346755 41975780 47494342 53297478 57235994 57264249 54220862 50517581
3941 50517581 47462277 45216133 43862436 43240068 43385067 44058507 45061200 46311699 47738884
3932D7738884K066676L058489M298304N954968Q228209J0383303Q708408R30217
3924I1367458o623684r357420q631411p100938n887509m699655l327870k226619
3916D3512352j333481r56251j046474r29823m14837J23316J001310K013426K782175
3907D4751713L045598J440021j815413m176248m621366m112963l510178k894887
3899B8106277k461915j967744j628957j164052q93264p53309p88758r34487q78021
3890A6635770q60290p67620o50085n14944n29047l03930k93161k29200j33946
3881A2353547j23067q2926O0374J2499J46279J24042K48327M99632M26480J62717
3871A3827904j81311k73458l44171k63634l08487k27813j93852j34082j41149
$$ plain form
3932 47738884 49805560 52864049 57162353 63117321 71345530 81728833 90437241 91367458
3924 91367458 84743774 75386354 66754943 59654005 53766496 49066841 45738971 43512352
3916 43512352 42178871 41222620 40176146 39246323 38831486 38954802 39956112 41969538 44751713
3907 44751713 47797311 49237332 47421919 43245671 38624305 34511342 31001164 28106277
3899 28106277 25644362 23676618 22047661 20883609 19990345 19237036 18448278 17513791 16635770
3890 16635770 15775480 15007860 14357775 13842831 13313784 13009854 12716693 12487493 12353547
3881 12353547 12230480 12147554 12207928 12220427 12366706 12490748 12739075 13238707 13665187 13827904
3871 13827904 13646593 13373135 13028964 12765330 12456843 12229030 12035178 11901096 11759947
3862A1759947q3125j53458R6054J76422J72813J97933L8652j54996j56091J09562
3852A2003713K40923K35319Q506j44715k28929k69292j95017l12037j27982j6795
3842A1193694k3268l47053k28036j07805J9353m6569Q4885L14803L59169K48139
3832A1467312J02762Q9320p8700j59715r7773j40375L7017K02022K13917L64899
3822A2000686M72766P41343Q49314J005916J313912J479304J329300Q66237Q2970
3813B0141748n94410r35416o65747o31392m28042j95604L3683K68980M40839N94628
3803A8029267J083993J351841J785355K372191L330906M307869N104794L025986
3795D0392202q41111l099065l865370l694444l219016k848272k191156j722571
$$ plain form
3862 11759947 11676822 11523364 11619418 11795840 11968653 12166586 12205238 12050242 11894151 12003713
3852 12003713 12244636 12479955 12488461 12343746 12114817 11845525 11650508 11338471 11210489 11193694
3842 11193694 11170426 10823373 10595337 10487532 10506885 10460316 10545201 10860004 11219173 11467312
3832 11467312 11570074 11659394 11580694 11420979 11323206 11182831 11219848 11421870 11635787 12000686
3822 12000686 12473452 13214795 14064109 15070025 16383937 17863241 19192541 20058778 20141748
3813 20141748 19547338 18611922 17946175 17314783 16886741 16691137 16724820 16993800 17434639 18029267
3803 18029267 19113260 20465101 22250456 24622647 27953553 32261422 37366216 40392202
3795 40392202 39551091 36452026 32586656 28892212 25673196 22824924 20633768 18911197
3787A8911197j262021q58805o49433m11855l13863Q210J63314L24305N41355P73297
3777A7225701Q40314O59511j357q71407j244517j288347j099146r56451p53482
3768A2510819o84635p18744n09372l90344l09658k65534j93083k83924m2701l0365
3758I082459j13964j40217j44306j4696k9203L3489O1366j54181j27500K8157
3748H481404p9076J9687M9155J5197L5424P4954J46005O4768L8831J81410j2297
3737I015462K02286K78375K48781K47064K56552L59978K37851L71611L80499M83480
3727A2081939M26377M74922M98212O70449O42223L01359L42389L56230M09803
3718A6203903M83283O29681P24204Q14418Q74192R35024J037088J366067J424060
$$ plain form
3787 18911197 17649176 16790371 16140938 15729083 15415220 15423430 15586744 15911049 16452404 17225701
3777 17225701 18066015 18725526 18724169 17852762 16608245 15319898 14220752 13264301 12510819
3768 12510819 11826184 11107440 10598068 10207724 9898066 9632532 9439449 9155525 9112824 9082459
3758 9082459 8968495 8828278 8683972 8669276 8640073 8673562 8734928 8580747 8453247 8481404
3748 8481404 8402328 8422015 8471170 8486367 8521791 8596745 8742750 8807518 8846349 9027759 9015462
3737 9015462 9217748 9496123 9744904 9991968 10248520 10608498 10846349 11217960 11598459 12081939
3727 12081939 12508316 12983238 13481450 14151899 14794122 15095481 15437870 15794100 16203903
3718 16203903 16687186 17316867 18041071 18855489 19729681 20664705 21701793 23067860 24491920
3709B4491920J618803J772672J492880J090661P08406O94299Q80577R91782Q79879
3700C4621879N95020P93488J135845J248465J441180J596434J752915J831193
3692D5016419J980207K158586K681023L023380L635293M063637L920506L638005
3684G0117056M320718N463019N945669N065560L693918K791891L128647M287512
3676A04813990N872922P693855R387052J0566488J1791696J4097919J8655306
3669A82879228K4824416L4243394M6381940M8483644J5228168l0662891m6635008
3662B74742891m1877791l3307019k7366975k1681257j6350287j1853581p755943
3655A14550038m180341p26915K258891J853954l426036p851791p902848o095554
$$ plain form
3709 24491920 26110723 27883395 29376275 30466936 31175342 31869641 32750218 33742000 34621879
3700 34621879 35216899 36010387 37146232 38394697 39835877 41432311 43185226 45016419
3692 45016419 46996626 49155212 51836235 54859615 58494908 62558545 66479051 70117056
3684 70117056 74437774 79900793 85846462 90912022 94605940 97397831 100526478 104813990
3676 104813990 110686912 118380767 127767819 138334307 150126003 164223922 182879228
3669 182879228 207703644 241947038 288328978 336812622 352040790 321377899 274742891
3662 274742891 232865100 199558081 172191106 150509849 134159562 122305981 114550038
3655 114550038 110369697 109642782 111901673 113755627 110329591 102477800 94574952 88479398
3647H8479398m257735k641117n45989J265504Q00058j803935k741752j297114
3639G7257318J060184L301949L465085K80833l902429n133390l787127j600107
3631G0942316q87542k723845m910302m541517l008523j483779J6112J684387L449600
3622E8536907L667875n73842n641414o803188o050063n015577m060806l275152
3614C0784740k621798k082001j637934j299040j186755j072055j048398j060721
3606A8776038q95155p77484o19649o32395n03429m65979l63024l03845k90219
3597A3924859j78521o8916j29643r1749M9279L2772P5942N6575K15963K34010
3587A4120571K24040L23230L44377N28536O70820O20785P52479J065829J249125
$$ plain form
3647 88479398 84221663 81580546 81034557 82300061 83100119 81296184 78554432 77257318
3639 77257318 78317502 81619451 85084536 85365369 81462940 76329550 72542423 70942316
3631 70942316 70054774 67330929 62420627 57879110 54870587 53386808 53402920 55087307 58536907
3622 58536907 62204782 61630940 55989526 49186338 43136275 38120698 34059892 30784740
3614 30784740 28162942 26080941 24443007 23143967 21957212 20885157 19836759 18776038
3606 18776038 17880883 17103399 16483750 15851355 15347926 14881947 14518923 14215078 13924859
3597 13924859 13746338 13677422 13547779 13456030 13505309 13538081 13614023 13670598 13886561 14120571
3587 14120571 14344611 14667841 15012218 15540754 16211574 16832359 17584838 18650667 19899792
3578A9899792J523593K168976K788880L617134M876641N991152N105448K42374
3570D6213990m513771n632902m979356l951682l294427k692553k323570k067409
3562A6758320j671029j306938j128145r12738o51197o07895n08801m94181l22125
3553I155271k75245k19104j79173k15402j88060l1555o3719P0334R6978K80273
3543H430598N58619P21856O19089K81959l47640r20621q64880p18059o99739l87359
3533F673823l79322l33141j76386r9476j46346j69348q0917j0709N0400p378J22229
3522E443429J39950L37185L26021M75308P66762Q15149N27836j44946q17143q68933
3512G000618p06010n75290n21277l64323l19738l36252j59465j17792o6023m6187
$$ plain form
3578 19899792 21423385 23592361 26381241 29998375 34875016 40866168 45971616 46213990
3570 46213990 41700219 36067317 31087961 27136279 23841852 21149299 18825729 16758320
3562 16758320 15087291 13780353 12652208 11739470 11088273 10480378 9971577 9477396 9155271
3553 9155271 8880026 8660922 8481749 8266347 8078287 8046732 7983013 8053347 8150325 8430598
3543 8430598 8989217 9711073 10330162 10612121 10264481 9343860 8478980 7760921 7061182 6673823
3533 6673823 6294501 5961360 5784974 5685498 5539152 5369804 5288887 5278178 5328578 5321200 5443429
3522 5443429 5583379 5920564 6246585 6721893 7488655 8303804 8831640 8686694 7869551 7000618
3512 7000618 6294608 5719318 5198041 4833718 4513980 4177728 4018263 3900471 3834448 3788261
3502C788261j9656k2517o2362K3283P5418M7922J23178K35606K37024L22723L13567
3491E062447J09401L9318P4228r5613k87165m35677l41031k79430l38904k04716
3481C302858j66050j86963j73305j50454l0415r2449j8692l3763k3106m5288j0503
3470B371870k7050P2605J2641J431R3546o7693R7006J75046J08856M7549j03759
3459B782048p4274p627q5846n8523j00217n6169p3284K7309K0068o6532N3190
3448B360143K9697k918l0830J5429l839K6976Q0858J19658R2307N0839N2170J18292
3436B908782K6500J12295J05843n0056o1900r9850n1686j8994p1299R7623j1502
3425B885756l7858j9811n4041n0212L1066n0861m1253K2825J7616L4759j9235
$$ plain form
3502 3788261 3768605 3746088 3683726 3707009 3782427 3830349 3953527 4189133 4426157 4748880 5062447
3491 5062447 5171848 5211166 5285394 5189781 4902616 4466939 4125908 3846478 3507574 3302858
3481 3302858 3136808 2949845 2776540 2626086 2595671 2503222 2484530 2450767 2427661 2382373 2371870
3470 2371870 2344820 2417425 2430066 2431497 2525043 2457350 2554356 2729402 2838258 2885807 2782048
3459 2782048 2707774 2700147 2614301 2555778 2455561 2399392 2326108 2353417 2373485 2306953 2360143
3448 2360143 2389840 2386922 2356092 2371521 2367682 2394658 2475516 2595174 2687481 2738320 2790490 2908782
3436 2908782 2935282 3047577 3153420 3103364 3041464 2941614 2889928 2870934 2799635 2897258 2885756
3425 2885756 2847898 2828087 2774046 2723834 2754900 2704039 2662786 2685611 2703227 2737986 2718751
3414B718751P0004M7556M4064O0829J05645J19860J32435j6385K2744K6100O9217
3403C400820L8970M1556P7241J21753J52736J59434J75486K79865K38513L98134
3393E084508N73820N68181P74652J053837J597242K031937P29222j301641j586710
3384I525048j172280p80284o33898n14231l28811k82042m64791m76749m41409
3375D430553k44580r491n2593r5663j69208k15811j88894j3430j66838j61697
3365C112348n3059j1968j09549o5253r0372r5753k3766j11460n8781r1089n3599
3354B347699o8705M7560J7251o2862O4240L7847j03814M8438J31915m6582J07172
3343B520159j3889L9110J7840l0356R5883Q1478J6977J01958J35514K11359J97863
$$ plain form
3414 2718751 2788755 2836311 2880375 2941204 3046849 3166709 3299144 3282759 3305503 3331603 3400820
3403 3400820 3439790 3481346 3558587 3680340 3833076 3992510 4167996 4447861 4686374 5084508
3393 5084508 5658328 6226509 7001161 8054998 9652240 11684177 12413399 11111758 9525048
3384 9525048 8352768 7572484 6938586 6424355 6095544 5813502 5348711 4871962 4430553
3375 4430553 4185973 4176482 4123889 4028226 3859018 3643207 3454313 3440883 3274045 3112348
3365 3112348 3059289 3047321 2937772 2872519 2782147 2686394 2662628 2551168 2492387 2401298 2347699
3354 2347699 2278994 2326554 2343805 2280943 2345183 2383030 2279216 2327654 2459569 2412987 2520159
3343 2520159 2506270 2545380 2563220 2532864 2628747 2710225 2727202 2829160 2964674 3176033 3373896
3332C373896J37061n811n1012j20961j30708o7057o9651L1354R857n4123M8132
3321C100977P7604J10306J7165R9327J98386R2673M1379R2854R9524J65060P2017
3310D167272K09059J70221J12161Q6708J76693J98865L08769K29867L60057M41551
3300F461223M74772L58342N90303P81449R71937Q18713P30418M70271N26061O45234
3290A2828723N66387L82666j03J12706K49940K85438M18645N55918O62191N65230
3280A6627741Q32364R51661J135358J303546J333711J293907J314558J416460
3272B6209306J535519J968260K280255K435838K727178L056781L369239L627215
3264D7209591M161205M935558N654659O789373Q408764J0644755J4290476J9271109
$$ plain form
3332 3373896 3510957 3505146 3454134 3333173 3202465 3135408 3065757 3097111 3106968 3052845 3100977
3321 3100977 3178581 3288887 3306052 3405379 3603765 3696438 3737817 3830671 3930195 4095255 4167272
3310 4167272 4376331 4546552 4658713 4745421 4922114 5120979 5429748 5659615 6019672 6461223
3300 6461223 6935995 7294337 7884640 8666089 9638026 10456739 11187157 11657428 12183489 12828723
3290 12828723 13395110 13777776 13777673 13890379 14140319 14425757 14844402 15400320 16062511 16627741
3280 16627741 17460105 18411766 19547124 20850670 22184381 23478288 24792846 26209306
3272 26209306 27744825 29713085 31993340 34429178 37156356 40213137 43582376 47209591
3264 47209591 51370796 56306354 61961013 68750386 77159150 87803905 102094381 121365490
3256A21365490K6062257L7785279N1209162L5881207j8118432m7156937m1621041
3249A65406985l1432192k5475437j9547180j4365157j1661719q878727o959063
3242D7087510n250063m395808l436555l027030k407432k154998j763924j619495
3234B3032205j405862j196357q89726q03000o62095n64461o31642n06898m25542
3225A5946622l27912k44787j70796J11663L05486P05391J207549K061817K524172
3216B2119205K14037k602163k922932k271899j820155j612777j161206r37178
3208I004932o78976o61965n20253n06850l91481l14539k29161l70928k46436k63641
3198D820702k10411j34030k31543j54292j22239k05024j30210n4423p6837j16117
$$ plain form
3256 121365490 147427747 185213026 236422188 272303395 254184963 207028026 165406985
3249 165406985 133974793 108499356 88952176 74587019 62925300 54046573 47087510
3242 47087510 41837447 37441639 34005084 30978054 28570622 26415624 24651700 23032205
3234 23032205 21626343 20429986 19540260 18737260 18075165 17510704 16879062 16372164 15946622
3225 15946622 15618710 15373923 15203127 15314790 15620276 16325667 17533216 19595033 22119205
3216 22119205 22333242 19731079 16808147 14536248 12716093 11103316 9942110 9004932
3208 9004932 8325956 7663991 7143738 6636888 6245407 5930868 5701707 5330779 5084343 4820702
3198 4820702 4610291 4476261 4244718 4090426 3968187 3763163 3632953 3578530 3501693 3385576
3188C385576n4655k02019L343q1670j49652k7483q1568q2167j06204p7291m4247
3177B481963j22886K8531p8599r6915l3998o0167r7796q52l812j05319r4349n7643
3165A758158J8273j1564n0899o0173k2547p74j3345m9421r0388J58450p5661j03358
3153A456751N8064m8279j2494r7471l9949o1733o2843M9782j2580l6415q8274
3142A104559M5125p5407N271K8507l8691q228O937n2765N5499L6292L4639r6223
3130A045515J6120O8041m7308M9497n619q7152J3042n9334p3412N9838J20213
3119A099441o541M1525N3565k0350L7311j8849L1467M2648M2168M5642n7548q0392
3107A210087O0571k4066j6231R2060j6288l0080O4371J14759J7394O9304j6278
$$ plain form
3188 3385576 3330921 3128902 3132245 3050575 2900923 2873440 2791872 2709705 2603501 2526210 2481963
3177 2481963 2359077 2387608 2309009 2212094 2178096 2117929 2020133 2019281 2015469 1910150 1815801 1758158
3165 1758158 1776431 1764867 1713968 1653795 1631248 1630474 1617129 1567708 1477320 1635770 1560109 1456751
3153 1456751 1514815 1466536 1454042 1356571 1316622 1254889 1192046 1241828 1229248 1192833 1104559
3142 1104559 1149684 1074277 1079548 1108055 1069364 1061136 1068073 1015308 1070807 1107099 1141738 1045515
3130 1045515 1061635 1129676 1082368 1131865 1126246 1039094 1052136 992802 919390 979228 1099441
3119 1099441 1092900 1134425 1187990 1167640 1204951 1186102 1217569 1260217 1302385 1348027 1290479 1210087
3107 1210087 1270658 1246592 1230361 1322421 1306133 1276053 1340424 1455183 1472577 1541881 1525603
3096A525603J7209P8691P8997J23385N9401J49823P4751J02444J19955J27259
3086B457518J28668K32169K83805K52977K96920M15160O20182Q28430J056355
3077F572184J581034K246533J566347r59995j951376j724884j283702j021927
3069E024214p03643n20731m23919m33392k52767k61132j50139k02827k16700o3471
3059A795493j72811q4626k9660n1061k0433j64820o3875n5654q7298L2835m9588
3048A048502k1465m8573m0641R0940n2616n5294o1705m7913o5542l645N4143O6029
3036H62220p4425m4043N1810O2865p0333L5325Q6017N102J2769K2673L7159l1138
3024I56001N1107J1818k1927N4500J04862N9953J25765K05811K39534N7250j67516
$$ plain form
3096 1525603 1542812 1621503 1700500 1823885 1883286 2033109 2107860 2210304 2330259 2457518
3086 2457518 2586186 2818355 3102160 3355137 3652057 4067217 4687399 5515829 6572184
3077 6572184 8153218 10399751 11966098 11006103 9054727 7329843 6046141 5024214
3069 5024214 4320571 3799840 3375921 2942529 2689762 2428630 2278491 2075664 1858964 1795493
3059 1795493 1622682 1538056 1508396 1457335 1436902 1272082 1208207 1152553 1065255 1098090 1048502
3048 1048502 1027037 978464 937823 1028763 976147 920853 859148 811235 745693 742048 796191 862220
3036 862220 787795 743752 795562 858427 788094 823419 909436 914538 927307 949980 987139 956001
3024 956001 1007108 1018926 996999 1051499 1156361 1216314 1342079 1547890 1787424 1844674 1677158
3013A677158j43705k22500k65293p8317k6340o7406j69046l4049K3908p0313j6008
3002F08089p9437K4180m3793m1799P0457Q979N365N430l9975L5127J26430M1942
2990G20995J20038N0150J09176P0726l0086j06437j37702q8842m6642q8263p1482
2979E01631L8405M912j31751K5539m6998M05l1394j166L0654q6193p9001J03532
2967C28575J7604m9812k2466l6242k896J8657L4836o0217M651M7828K420o5957
2955B16981l5117j5464M0721m9200M7191J7362o9161J22571p4543O2279o0114
2944B03506r339n8984m9798J688O7739l8477N6035J08134m205m2991m6199K2078
2932B09187l0304r3151N1293k8008M2428O1277p7422J3465J0072j3938P290N7500
$$ plain form
3013 1677158 1533453 1310953 1045660 967343 941003 873597 704551 670502 694410 624097 608089
3002 608089 528652 552832 509039 467240 537697 546676 552041 557471 517496 552623 679053 720995
2990 720995 841033 891183 1000359 1071085 1040999 934562 796860 708018 661376 573113 501631
2979 501631 540036 544948 413197 438736 391738 392143 360749 359583 390237 304044 225043 328575
2967 328575 346179 296367 273901 237659 234763 253420 288256 228039 232690 280518 282938 216981
2955 216981 181864 166400 207121 157921 205112 222474 153313 275884 201341 263620 203506
2944 203506 194167 135183 85385 87073 154812 116335 172370 280504 276299 233308 187109 209187
2932 209187 178883 85732 137025 109017 151445 212722 135300 148765 158837 144899 152189 209689
2920B09689m7356J956n6991M2029k6002k207P4741n702K3265j6724q0289R7883
2908B14292M9568O0688o4913j0495k303l7320K9723k257K1304l7415J2841J7882
2896B51595p4239J1406m9965N5578O4076K503k439M6763j629p9215K4848L934
2884B53216j4810J7189n292P1567n2906k5450P5638j17044L4828P130Q0813O1307
2872C86186j18602K5558k2237N0473P4655j18136L2100Q3791J7466l282K7854
2861D35826Q0081l7642o1932m7487k3779O4305L1169N0101l1031r7053J9568O0507
2849D42633l6953p1165J2842j526l026N5853m5349o4708M9964J5639K8092K7240
2837D09536L2814n2281o181K0477p8752O6870Q2004p6771m345m3966r354J29989
$$ plain form
2920 209689 162333 164289 107298 149327 123325 121118 195859 190157 213422 196698 116409 214292
2908 214292 263860 324548 259635 249140 246837 209517 239240 236983 258287 220872 233713 251595
2896 251595 177356 188762 138797 194375 258451 260954 258515 305278 303649 224434 249282 253216
2884 253216 238406 255595 250303 321870 268964 243514 319152 202108 236936 244066 324879 386186
2872 386186 267584 293142 270905 321378 396033 277897 309997 393788 411254 407972 435826
2861 435826 515907 478265 416333 368846 345067 409372 440541 490642 459611 362558 382126 442633
2849 442633 405680 334515 347357 345831 342805 398658 353309 288601 338565 354204 382296 409536
2837 409536 442350 390069 383888 404365 325613 392483 474487 397716 393371 349405 340051 470040
2825D70040l8950Q7586K9765l0242J26045R1574O4265M0727p7634o6423l2711
2814F64042m4715o2983o2119K4147p2353O5352j7463p8192P6576Q1327Q350J12196
2802F94165R581n0298j7646n8605l1377n0235k779M2661J08551L0208N4235R34
2790G29395j9570n6077l6670N6110M9429Q3751J46553J22647k07301j24782q8491
2779F54994r9748k3311l1165K8759n7555q1564r2843J6128Q845j11457L3384K5289
2767B69756J3124M6780q6907M4759o0767L929R550m6925O6139o1136k3649J7148
2755A91801J4076M0917q8137L4876j5020J6313K0920p7093M7222L972l9790P8623
2743B28680k7339m7423P8787L6781q645K6421j4109k33L8626J9195j8159L795
$$ plain form
2825 470040 431090 518676 548441 518199 644244 735818 800083 840810 763176 696753 664042
2814 664042 619327 556344 494225 518372 446019 511371 493908 415716 492292 573619 581969 694165
2802 694165 703746 653448 635802 577197 545820 495585 492806 535467 644018 674226 728461 729395
2790 729395 709825 653748 617078 673188 722617 806368 952921 1075568 868267 743485 654994
2779 654994 555246 531935 500770 529529 471974 390410 297567 313695 322540 211083 244467 269756
2767 269756 282880 329660 242753 287512 226745 230674 240224 193299 259438 198302 174653 191801
2755 191801 205877 246794 158657 193533 178513 194826 215746 138653 185875 189847 150057 228680
2743 228680 201341 153918 232705 269486 260841 287262 273153 272920 311546 330741 312582 316377
2731C16377m7203l99J58879p0691q040l6028J4395q5837n3035N9140j6154J2275
2719B43679L1892k386k5566l8321O2848O9510j08936j9592P7950k0207k082O517
2707B75306L7583K0154l5753m0309p6863N2777J3544n4915N8458j1687K1466M1735
2695C01496k3925l523j9379J7299j5301L2016m2746M1030K0280K4061k4918l7956
2683B68434O8455n6398J8033L9184K3444j00614k466L0348K3541J1775M3263j6360
2671C50639q5192M6208J9562k3894M6233k5305Q073l2982J635M2728j4127M4124
2659C77702J4174M913l7371K7809K0230M0902j6852j5897m0933J5390j76N2580
2647D42471K7276K8712L1305k0874J15483l8294K994P9683k3969j6457K2106J1161
$$ plain form
2731 316377 269174 268775 427654 356963 348923 312895 327290 241453 188418 247558 231404 243679
2719 243679 275571 273185 247619 209298 272146 341656 232720 213128 291078 270871 268789 275306
2707 275306 312889 333043 297290 256981 180118 232895 246439 191524 249982 238295 259761 301496
2695 301496 277571 274048 254669 271968 256667 288683 245937 286967 307247 331308 306390 268434
2683 268434 336889 280491 298524 337708 361152 260538 258072 288420 311961 323736 366999 350639
2671 350639 265447 311655 331217 307323 353556 328251 336324 303342 304977 347705 333578 377702
2659 377702 391876 396789 359418 387227 407457 448359 431507 415610 374677 390067 389891 442471
2647 442471 469747 498459 529764 508890 624373 586079 589073 668756 644787 628330 650436 661597
2635F61597J0219k563K2750k3059N9573m9849l6999M9070L6214L5105K933J04342
2623H69333N7519N0577n0301N5480l762J4727p401j6615N8926j851L0376J8280
2611A075288P329J03730R8260L1884j1793J82075J37761Q9096L8939J38192J91170
2600B081931P6926J57707J46924P4775o7032l5410o2325j3892J23765J31748J61179
2589B776296J64572M7041R0877Q7840n4717n0192L308J26059N7906J43459K17207
2578C609656M11898L44942K02355J7968l06902m08666m17855k29496j37220q5100
2568C001580M3841r3264P9081J0169q1364m7297j08316j61657j76116J5565k9293
2557B452929j6931l817R4560L323m6006J0233j33064j91616p7028k7765l5542
$$ plain form
2635 661597 671816 669253 692003 668944 728517 678668 641669 690739 726953 762058 764991 869333
2623 869333 926852 977429 927128 982608 978846 993573 986172 969557 1028483 1026632 1057008 1075288
2611 1075288 1082617 1186347 1284607 1316491 1304698 1486773 1624534 1713630 1752569 1890761 2081931
2600 2081931 2158857 2316564 2463488 2538263 2471231 2435821 2373496 2359604 2483369 2615117 2776296
2589 2776296 2940868 2987909 3078786 3166626 3111909 3061717 3065025 3191084 3248990 3392449 3609656
2578 3609656 4021554 4366496 4568851 4586819 4279917 3871251 3453396 3223900 3086680 3001580
2568 3001580 3045421 2952157 3031238 3041407 2960043 2912746 2804430 2642773 2466657 2482222 2452929
2557 2452929 2435998 2432181 2526741 2530064 2484058 2494291 2361227 2169611 2092583 2064818 2029276
2546B029276L8979j2945j1585m145n0841l342K2912m7236K0547M5872l6056j0287
2534A981149m984J01664O026L9511M5890k6979L4446J18595j1545O8941K7201
2523B379915L1504J03339J11266N1994Q9170J42295R1121J83576J56005J91698
2513C531883K41024J65760L07677K79984M27826M13274N05720O12256O37216O91402
2503G814022N11919L39852K95985L31895L90667M13461K43465K57021N00865L76239
2493A1475391L50919j87268q59510r45188q58324q90100q28855p25465n22671
2484F008929l88004l97626m00116l51186l57381k88743j72224k70366j76662k30329
2474B976292k18509r3430p1783j26089r3989j48643l9418p0931j28435o661Q4804
$$ plain form
2546 2029276 2068255 2055310 2043725 2039580 1988739 1985397 2008309 1961073 1981620 2027492 1991436 1981149
2534 1981149 1976165 2077829 2083855 2123366 2169256 2142277 2176723 2295318 2283773 2352714 2379915
2523 2379915 2411419 2514758 2626024 2678018 2767188 2909483 3000604 3184180 3340185 3531883
2513 3531883 3772907 3938667 4246344 4526328 4954154 5367428 5873148 6485404 7122620 7814022
2503 7814022 8325941 8665793 8961778 9293673 9684340 10097801 10341266 10598287 11099152 11475391
2493 11475391 11826310 11639042 10779532 9834344 8976020 8085920 7257065 6531600 6008929
2484 6008929 5620925 5223299 4823183 4471997 4114616 3825873 3653649 3383283 3206621 2976292
2474 2976292 2757783 2664353 2592570 2466481 2372492 2223849 2184431 2113500 1985065 1978404 2063208
2463B063208k6700r0384q4097n5555k086l0642l9159J1126p883M0941l5079m4346
2451A699344o940k1505o3378k5165P376m0129k5715l4182p2967k6247J00924K1960
2439A513376m5427j2554O4010O912J3253J088N0554L1226n5419j4808L9671l2903
2427A558979J304L2341r1728J3996j944m8096K3901l2959K661K3347N8469J00802
2415A641073j8192l7960P3257j3924j03N18r814J9782k0875j0691l8796L3418
2403A617693K9101Q1572k4095p2452L7271m1914N8229M6233r5805P1547j222K9966
2391A736124k565J4384M4755P0447j6579L86q8516L7609j9078j4772j7834M974
2379A749335J5573J6362k7623n8959L5211j9793m6826J6084M5279L1811l5523
$$ plain form
2463 2063208 2036508 1946124 1862027 1806472 1804386 1773744 1734585 1745711 1737828 1778769 1743690 1699344
2451 1699344 1692404 1670899 1607521 1582356 1589732 1549603 1523888 1489706 1416739 1390492 1491416 1513376
2439 1513376 1467949 1455395 1519405 1526317 1539570 1540658 1591212 1622438 1567019 1552211 1591882 1558979
2427 1558979 1560283 1592624 1500896 1514892 1512948 1464852 1488753 1455794 1458455 1481802 1540271 1641073
2415 1641073 1622881 1584921 1658178 1644254 1644151 1644669 1634855 1654637 1633762 1623071 1584275 1617693
2403 1617693 1646794 1728366 1704271 1631819 1669090 1627176 1685405 1731638 1635833 1707380 1706158 1736124
2391 1736124 1733559 1747943 1792698 1863145 1846566 1846952 1758436 1796045 1776967 1762195 1744361 1749335
2379 1749335 1764908 1781270 1753647 1694688 1729899 1710106 1663280 1679364 1724643 1756454 1720931
2368A720931l9231N5227N0067J6746Q131j3291m1791o210J1942L1890m9159K5073
2356A770325q3979j0311j2436n0950R4864M5215l7501k3758n6358J3380O8947
2345A717438j8133k3734p8427o7451M6963O1623p1621L4258M0611K2808K8530
2334A692865l5644l9112M1231m231L1811o5854o0370j2877L139J128m276J11813
2322A659623l3023O9698j0280j0483p3000M8186J01134n5638r3479O9349L8843
2311A710930P3852m4421p1147P7579Q1955M301N9787K0988r770j7848n0867m84
2299A834855J9628J05369M8691m1344n114R8157L8671N7283j7915k2576K0409
2288B136114K4017J2798P4901J8009Q8788R7183j3915P6882K3257N8412Q1645
$$ plain form
2368 1720931 1681700 1736927 1786994 1803740 1811871 1798580 1756789 1750579 1762521 1794411 1745252 1770325
2356 1770325 1686346 1676035 1663599 1612649 1707513 1752728 1715227 1691469 1635111 1648491 1717438
2345 1717438 1699305 1675571 1597144 1529693 1576656 1638279 1566658 1600916 1641527 1664335 1692865
2334 1692865 1657221 1618109 1659340 1655109 1686920 1621066 1560696 1547819 1550958 1552086 1547810 1659623
2322 1659623 1626600 1696298 1686018 1675535 1602535 1650721 1751855 1696217 1602738 1672087 1710930
2311 1710930 1784782 1740361 1669214 1746793 1828748 1833049 1892836 1913824 1904054 1886206 1835339 1834855
2299 1834855 1854483 1959852 2008543 1967199 1962085 2060242 2098913 2156196 2138281 2115705 2136114
2288 2136114 2160131 2172929 2247830 2265839 2354627 2451810 2437895 2514777 2538034 2596446 2678091
2277B678091K1401O2447m0502M4333o547l8628K1871J2498J13644L7633J27618
2266C033859M3716M8029j3625J7528l112O1736j9266M1603J49961Q4270J7472
2255C462171L4622M8664P7817J25879R3131Q258R5461K9389J00379O7136P2262
2244D215169J29809O8085J86137J66461N5382J16862O5934R0059J03525L8292
2234E235715J45941J38525J72306K02064L3521J16885J45852J34905J86836J78900
2224F691450J56292J51776J84807M6108K40463K02160J90028K26256K53990J40648
2214H483978K54945K23372J88867K98341L37900K54141K90242L86698M30682L91161
2204A1540327M98275M89215N27707N96886P50658P49587P66393Q07716R68083
$$ plain form
2277 2678091 2699492 2761939 2721437 2765770 2759223 2720595 2742466 2754964 2868608 2906241 3033859
2266 3033859 3077575 3125604 3111979 3129507 3126395 3188131 3168865 3210468 3360429 3444699 3462171
2255 3462171 3496793 3545457 3623274 3749153 3842284 3850542 3946003 3975392 4075771 4142907 4215169
2244 4215169 4344978 4413063 4599200 4765661 4821043 4937905 5003839 5093898 5197423 5235715
2234 5235715 5381656 5520181 5692487 5894551 5928072 6044957 6190809 6325714 6512550 6691450
2224 6691450 6847742 6999518 7184325 7230433 7470896 7673056 7863084 8089340 8343330 8483978
2214 8483978 8738923 8962295 9151162 9449503 9787403 10041544 10331786 10718484 11149166 11540327
2204 11540327 12038602 12527817 13055524 13652410 14403068 15152655 15919048 16726764 17694847
2195A7694847R85124R59047J014806R45122Q29298O44221K92472l6832l68570
2186B2959535p14018r23445j076154j087951j012473q69635p55585p20920o46519
2177A5152835n40531m71082m42084l79007k63903k84671k01524j77977j05772
2168A2286284j21301m6452r4092j68573j43993k25953j69422n4965R7926J07381
2158A1466840L01150M31042P72830P76504M05365k37028p98405q55815p45196
2149A1517287o70220n65873m62383l35390j85744k74484k2774p1503Q2381K807
2139I014104L3339K41359K51551L74578N79951Q42371J113294J399071J764393
2130A5614011J290225p6968j329247j641554j700022j420358j007540q83774o52343
$$ plain form
2195 17694847 18679971 19639018 20653824 21598946 22428244 23072465 23364937 23328105 22959535
2186 22959535 22245517 21322072 20245918 19157967 18145494 17275859 16520274 15799354 15152835
2177 15152835 14612304 14141222 13699138 13320131 13056228 12771557 12570033 12392056 12286284
2168 12286284 12164983 12118531 12024439 11855866 11711873 11485920 11316498 11261533 11359459 11466840
2158 11466840 11767990 12199032 12971862 13748366 14153731 13916703 13118298 12262483 11517287
2149 11517287 10847067 10281194 9818811 9483421 9297677 9023193 9000419 8928916 9011297 9014104
2139 9014104 9047443 9288802 9540353 9914931 10494882 11337253 12450547 13849618 15614011
2130 15614011 16904236 16827268 15498021 13856467 12156445 10736087 9728547 8844773 8192430
2121H192430n58556k84085k98392l04787j77983j11436n3474N0756N3598J46114
2111F654185K40525L49712M19107N18265O66676N31094L2360o22123q92848r09206
2101F987747o60962n38358m30244l61196l02996k81698j92543j40102j86129j15681
2091C777838q1182j36244q0866n1203k6111J6456r625q8406j20240J3907j08471
2080C105853J0530p674p6886k9596j13606o5696N60l4685o7764J7043p1158r6442
2068B570479O5266j9737K156j02705M4118J4483r8302m51o7412j8087j0488k9158
2056B350162k3045m419n8602k4031o6533P154m5616l2212r4218j2167L6289k8796
2044B003966l4410K6413K4563j5489j5639L7552m3733j03617N0194n1899j9015
$$ plain form
2121 8192430 7633874 7349789 7051397 6746610 6568627 6457191 6403717 6454473 6508071 6654185
2111 6654185 6894710 7244422 7663529 8181794 8848470 9379564 9411924 8789801 7896953 6987747
2101 6987747 6326785 5788427 5358183 4996987 4693991 4412293 4219750 4079648 3893519 3777838
2091 3777838 3696656 3560412 3479546 3428343 3402232 3418688 3409063 3320657 3200417 3214324 3105853
2080 3105853 3116383 3108709 3031823 3002227 2888621 2822925 2823485 2788800 2721036 2738079 2666921 2570479
2068 2570479 2635745 2616008 2618164 2515459 2559577 2574060 2475758 2475307 2407895 2389808 2379320 2350162
2056 2350162 2327117 2322698 2264096 2240065 2173532 2180686 2135070 2102858 2008640 1996473 2032762 2003966
2044 2003966 1969556 1995969 2020532 2005043 1989404 2026956 1983223 1879606 1929800 1877901 1858886
2033A858886O823m7839r2913N3981O0343n8084j4072L7748m8597M0365k4227m2030
2021A730384J8443K1231j1058O2249n3635k2443O5890m3494M3774P0349J4923
2010A896613O6103m3349q209q46O5600N1845K8561K5807K8502J32466P7434J5890
1998B336417J1033J9454N6743L3654R1559J46185Q3220N6793J20050J26902O6849
1987C148859J40190J448m4963l7101R9259l0635O3824J1133O6818J20973L5501
1976C575306J60156K04880K38968J06793R6678K4994n0084R2823J65877J62228
1966D778619J85683K23703K82861J80528K88668J82575k5678N5236O5908K076
1956F220179L0309J01023J39990J15789J40873K13038J62245J86256J9114Q587
$$ plain form
2033 1858886 1865709 1817870 1724957 1778938 1839281 1781197 1767125 1804873 1756276 1796641 1772414 1730384
2021 1730384 1748827 1770058 1759000 1821249 1767614 1745171 1811061 1767567 1811341 1881690 1896613
2010 1896613 1962716 1919367 1911158 1910312 1975912 2027757 2056318 2082125 2110627 2243093 2320527 2336417
1998 2336417 2347450 2366904 2423647 2457301 2548860 2695045 2778265 2835058 2955108 3082010 3148859
1987 3148859 3289049 3290497 3245534 3208433 3307692 3277057 3340881 3352014 3418832 3539805 3575306
1976 3575306 3735462 3940342 4179310 4286103 4382781 4407775 4357691 4450514 4616391 4778619
1966 4778619 4964302 5188005 5470866 5651394 5940062 6122637 6096959 6152195 6218103 6220179
1956 6220179 6250488 6351511 6491501 6607290 6748163 6961201 7123446 7309702 7328816 7337403
1946G337403N5631N7180M0583J94288J98827L13801K09521K83704L66024L87333
1936I444295L66126J47584J54661k8585k08630k32591l72368k72400k89121j56973
1926H551998m8380J3686N0626N7952J23076J588J441J01074J42937J30062J06553
1915I232613K1378L5098p3889j64482k14977k92790l17535k77504l59218j91426
1905G397268k74619k87389j32693j52443n4333o3286o7261o2180j19427j47284
1895F036353k12623j23405j56707k33629k78275k03507j86200l11042k66852j85451
1885C878662j33265k17095j80172n5004j49204j89562j08723j29133n6432k0752
1875B639320q3974j36003j27657L3480q0321q0753r0513l7704r3600m8624q5896
$$ plain form
1946 7337403 7393034 7450214 7490797 7685085 7883912 8197713 8407234 8690938 9056962 9444295
1936 9444295 9810421 9958005 10112666 10084081 9875451 9642860 9270492 8998092 8708971 8551998
1926 8551998 8503618 8517304 8567930 8625882 8748958 8750546 8751987 8853061 8995998 9126060 9232613
1915 9232613 9253991 9289089 9215200 9050718 8835741 8542951 8225416 7947912 7588694 7397268
1905 7397268 7122649 6835260 6702567 6550124 6495791 6432505 6365244 6303064 6183637 6036353
1895 6036353 5823730 5700325 5543618 5309989 5031714 4828207 4642007 4330965 4064113 3878662
1885 3878662 3745397 3528302 3348130 3293126 3143922 2954360 2845637 2716504 2660072 2639320
1875 2639320 2555346 2419343 2291686 2325166 2244845 2164092 2073579 2035875 1942275 1893651 1807755
1864A807755n1719n6630j25611J0329m9437k9129o9328k7800j09704n127R1781
1853A385380n6506j5426o6833L283k7751l0246p4993K7908j1139q7676K1271l6010
1841A031262p9792J618k3508k964j5315o7444n1452l9304L772n0511M3399k5265
1829G24496k2337J1671m4620n935k5844L9965M7036l948m9680m6368k617j9218
1817F02601k7029L120k3171m9424M5195j9046j56972L5977K7094K962m458o5804
1805C71045O073K2928O0810o5822M2266m160k456p2499l2770L142L7629o9871
1793B96315M113L2620Q519R331q2248m254l416Q7463p1432K4026L9220n2713p6057
1780B11487M8805k06K4695O5027m7116p1606p1973N0046L3466J0645l9673m415
$$ plain form
1864 1807755 1756036 1699406 1573795 1584124 1534687 1505558 1436230 1408430 1298726 1293599 1385380
1853 1385380 1328874 1313448 1246615 1249898 1222147 1191901 1116908 1144816 1133677 1046001 1067272 1031262
1841 1031262 951470 953088 929580 926616 911301 843857 792405 753101 756873 706362 749761 724496
1829 724496 702159 713830 669210 663275 637431 677396 724432 720484 670804 624436 621819 602601
1817 602601 575572 578692 555521 506097 551292 532246 375274 411251 438345 441307 436849 371045
1805 371045 377118 400046 460856 395034 437300 433140 430684 358185 325415 328557 366186 296315
1793 296315 300428 333048 341567 350898 268650 264396 260980 348443 277011 301037 340257 287544 211487
1780 211487 260292 260086 284781 349808 302692 231086 159113 209159 242625 253270 213597 209182
1768B09182N7990K0985l9299O9012N7746p4972J3822n7471o0041N7451M321K1745
1756B80471j4022q6540J7186l4471R022K8557j3509J2311l7607P086L1339j9171
1744A80652l0694L7430j9575L4689P981k2379n4464k4946N967K7475R166J8313
1732A69615J17035r2625K87K4258m5461L1994j7439j8095M5297L7433p4763j5750
1720A61786N524O5760n1216k7620N3839P404j8117O6n7336k7566L1010L4725j5798
1707A62461l1349n0005M7612O6755o5604O6025l5485L5161J2180q738P6962j20107
1695A55868j0733J2281k1710n5346k4878J18694L33r221o8425l6102L3876l9602
1683E5035k1172N6984M3145p51j8733m755M42n1456M7641M250j159k5607k0406
$$ plain form
1768 209182 267172 288157 248858 317870 375616 300644 314466 256995 196954 254405 258726 280471
1756 280471 266449 179909 197095 162624 171646 200203 186694 199005 161398 168484 199823 180652
1744 180652 149958 187388 167813 202502 210483 188104 133640 108694 114661 142136 151302 169615
1732 169615 286650 194025 194312 218570 173109 205103 187664 169569 214866 252299 177536 161786
1720 161786 167310 233070 181854 154234 208073 215477 197360 197426 140090 112524 143534 178259 162461
1707 162461 131112 81107 128719 195474 129870 195895 160410 195571 207751 199013 275975 155868
1695 155868 145135 157416 135706 80360 55482 174176 174509 165288 96863 60761 94637 55035
1683 55035 33863 90847 133992 133241 114508 109753 110195 58739 106380 110630 109471 83864 63458
1670F3458l1L2654M354k0601k3967K4560K7131l4788K119R696K475L5114o763
1657A15411q9224n466N7093J0445K2090q6570m1791P1863O022K4431l1831K0042
1645G2515j7514P39L1339r3591n0096O1760j9029l2237N3855L5894L1231l936
1633G0930j17592J11650k124k9358K4561n1811o653J7241j3493n2680j38R558
1621c9909J06100q2085j4479M6972Q6009o2590k9027N7482p4456J10593K5453
1610A30063k7057p5340O0J4259j8626k1883L0261l8193P164o8183n0251R7201
1598b0525K288q8537Q0050P9785Q251m5402m0366P728O2581k7220N550k0511l5236
1585c1564M0555m6226K2420N1576r886m4832M5592L248p0344J6893O4237J5730
$$ plain form
1670 63458 63427 96081 100435 79834 55867 80427 107558 72770 74889 84585 87060 122174 115411
1657 115411 26187 20721 77814 88259 110349 23779 -18012 53851 59873 84304 52473 72515
1645 72515 55001 55740 87079 -6512 -56608 5152 -13877 -46114 7741 43635 74866 70930
1633 70930 -46662 64988 62864 33506 58067 6256 -397 16844 3351 -49329 -49467 -39909
1621 -39909 66191 -15894 -30373 16599 102608 40018 10991 68473 -5983 104610 130063
1610 130063 103006 27666 27726 41985 23359 1476 31737 -6456 708 -67475 -117726 -20525
1598 -20525 -18237 -106774 -26724 53061 61312 15910 -24456 -16728 45853 18633 24183 3672 -31564
1585 -31564 8991 -37235 -14815 36761 26875 -17957 27635 30883 -39461 -22568 41669 57399
1573E7399M4590j17388k8868R885K1226j5487j0212P306O1348p7878M3440l9503
1561d4142m470J5452k9711J05136P69J8037j43122P514N8875j5936M5363j0354
1549C411m1863K7845P830L0001n3216l649O9202Q2346k4831p4731O0184K5487
1537A08016k7356M9595m4892M4033n0557p4793O8295k1130n1417N4589j9118J870
1525C7135R036k1831O3955n1230O495m7179J9384L5874l1753n2148K3359l811
1513a2714k1254o3464Q5744l7402o599J08183r0580J2685k967m7008N894M3729
1501b5753M5401n9602k4159Q7874k6548j2283j1388Q2815l3059J8725L2021m1126
1489C2918n9406M9066k8612L1211l9718k1907K2073j948Q740M0532K8630o1926
$$ plain form
1573 57399 101989 -15399 -44267 -34382 -13156 -28643 -38855 -31549 29799 -48079 -4639 -44142
1561 -44142 -48612 -33160 -62871 42265 43034 61071 -82051 -74537 -15662 -31598 13765 3411
1549 3411 -38452 -10607 -2777 27224 -25992 -29641 39561 121907 97076 22345 82529 108016
1537 108016 80660 130255 85363 129396 78839 4046 72341 51211 -206 54383 35265 37135
1525 37135 46171 24340 88295 37065 43560 -3619 15765 51639 19886 -32262 -8903 -12714
1513 -12714 -33968 -97432 -11688 -49090 -55689 52494 -38086 -25401 -28368 -75376 -69482 -25753
1501 -25753 19648 -39954 -64113 23761 -2787 -15070 -26458 56357 23298 42023 74044 32918
1489 32918 -26488 22578 -6034 25177 -14541 -36448 -14375 -16323 -7583 32949 61579 -347
1477c47M5826n5429j6807l0557N0380K0535Q3353p4392p5076K1311M0317M427
1465A3541k113R132k6569l5855R0854n6733K0458N7147J7402K9895l6524j4437
1453F6198p448n6687O0363L7265q4934L0209m2777L7531L0998o0833n9709L6718
1441a3106M0178J401n2052L3487r614L9382N9693m3134k4881L1179k0989m8122
1429f578N763M2536j8393L2040R4483r0190p2657j5934J35668n7025o1032N2581
1417D1262J1311j281J7952j4406J7168K8106m1890K1326N426N8163l0596k9300
1405H3241J0390L4493K8242l0345o0151K5948J5342N1856O494J5352j4642k3912
1393A42308K4815J3083P3990l8013O1393Q953K1721N3131k6197J6062K1766M2569
$$ plain form
1477 -347 45479 -9950 -26757 -57314 -6934 13601 96954 22562 -52514 -31203 9114 13541
1465 13541 11428 20560 -6009 -41864 48990 -7743 12715 69862 87264 117159 80635 66198
1453 66198 58750 2063 62426 99691 14757 44966 2189 39720 70718 9885 -49824 -13106
1441 -13106 27072 28473 -23579 9908 294 39676 99369 56235 31354 62533 41544 -6578
1429 -6578 -815 41721 23328 55368 149851 59661 -12996 -28930 106738 49713 -11319 41262
1417 41262 52573 51292 69244 54838 72006 100112 58222 79548 84974 143137 112541 83241
1405 83241 93631 128124 156366 126021 65870 91818 107160 159016 165510 180862 166220 142308
1393 142308 167123 180206 254196 216183 277576 286529 308250 361381 335184 351246 373012 415581
1381D15581O4563J0306P0535J06489P1646P139P6744m999m448J142K0182l2567
1369H02313J4273K8976J13639k6351Q3933P7236J7366M0374N7931P8031J48682
1358A436403Q5966R3874J58270J62508J56929J49318J65209K14909K62410K83254
1348C169050L07723L15321M66057L26984M48400N24001O44875R30774J508743
1339H641928K134052J699030J875934J785566k23281j822497k910990k142597
1331I037145j649340j263062r77133p05282n71433l78932l28741l78092k96928
1322B488202l03264k08204k01547j18793j69097j37710j65976l8186r0154o9583
1312I85688q404k4886j37365n7927K2611j0384m0613j12476p9136k1828L8623
$$ plain form
1381 415581 480144 490450 560985 667474 739120 746259 823003 818004 813556 814698 834880 802313
1369 802313 816586 845562 959201 932850 1016783 1094019 1111385 1151759 1209690 1287721 1436403
1358 1436403 1522369 1616243 1774513 1937021 2093950 2243268 2408477 2623386 2885796 3169050
1348 3169050 3476773 3792094 4258151 4585135 5033535 5557536 6202411 7133185 8641928
1339 8641928 10775980 12475010 14350944 16136510 15913229 14090732 11179742 9037145
1331 9037145 7387805 6124743 5147610 4442328 3870895 3491963 3163222 2785130 2488202
1322 2488202 2184938 1976734 1775187 1656394 1487297 1349587 1183611 1145425 1055271 985688
1312 985688 977284 952398 815033 757106 779717 769333 728720 616244 537108 515280 553903
1301E53903r2848o0774L1998L7167n7337n5776k7272N9470k5242l8100R998m1649
1289B93538n9994K8502K7798o1785m6124k5111j1524L0550J1011J5544m8968l0160
1277A23277k1974J4924N3742L0208j5810j8755l6750K2878P3725j15090N7896
1266A68271o6700l0381p3253L3592N27n1396P5386R3597k3674j05276n540K9559
1254D4712k3756L9732n3042q821K3559L0144K2235k540j19959P8481M0570p7447
1242f132L2975L0479O7302j18778M6612M1850j9913n5827p8288J21842R731n9909
1230A1944j0962R653O0572Q030o3098j8465q761M3280n7576J1295k3188J3794
1218b3482O4871p5395L1894j7034m73k6666N163K5574j1924q404O967m301k8507
$$ plain form
1301 553903 461055 400281 432279 469446 412109 356333 329061 388531 363289 325189 335187 293538
1289 293538 233544 262046 289844 228059 181935 156824 145300 175850 186861 202405 153437 123277
1277 123277 101303 116227 169969 200177 184367 165612 128862 151740 225465 110375 168271
1266 168271 101571 71190 -2063 31529 32056 -19340 56046 149643 125969 20693 15153 44712
1254 44712 20956 60688 7646 -1175 22384 52528 74763 72223 -47736 30745 71315 -6132
1242 -6132 26843 57322 124624 5846 52458 94308 74395 18568 -59720 62122 71853 11944
1230 11944 982 10635 71207 79237 16139 -2326 -11087 32193 -25383 -14088 -37276 -23482
1218 -23482 41389 -34006 -2112 -19146 -19619 -46285 -41122 -15548 -27472 -35876 -28909 -33210 -61717
1205f1717L6567O975N8232p9661J9205j3075P384P5928k8879l5827p633N4391
1193C1890k7090l2346j05607O0282O5273j18268R6598l6339K3654k5338J6106
1182e1185k2950J2418O16m473L5306j3135L4494p0486l5411J711P4131N1678l6882
1169b4168n4723L0677M4547l6327J2561R6907m6361j8587L4167j905q9775O2896
1157I909J1056m6113N084L3308O4174k3394L1831j6844j4858o2022k492m3030
1145e3391l1880L7445j576J00531p723R317O6212N626m4656r964J4414M276m7024
1132D1607q120L4241J2330k7306Q763p0814k58l6577K9056m20L9319o1606k7706
1119f7491L1460K0568k2170o8892N4616r702O643j8302N6582n1950J4918j0718
$$ plain form
1205 -61717 -25150 -18175 40057 -39604 -20399 -33474 -26090 49838 20959 -14868 -22501 31890
1193 31890 4800 -27546 -133153 -72871 -7598 -125866 -29268 -65607 -41953 -67291 -51185
1182 -51185 -74135 -61717 -61101 -65574 -30268 -43403 -8909 -79395 -114806 -113095 -38964 12714 -24168
1169 -24168 -78891 -48214 -3667 -39994 -27433 69474 23113 4526 38693 36788 -52987 9909
1157 9909 20965 -25148 -20064 13244 77418 54024 85855 69011 54153 -7869 -10361 -53391
1145 -53391 -85271 -47826 -49402 51129 43406 52723 118935 124561 79905 69941 84355 88631 41607
1132 41607 33487 67728 80058 52752 61515 -9299 -9557 -46134 -17078 -17498 21821 -39785 -67491
1119 -67491 -36031 -15463 -37633 -106525 -51909 -61611 -54968 -73270 -16688 -68638 -53720 -64438
1107f4438k345J2848k8118K367K4786M2369n7994Q9812N28o109r339k2956O338
1094a2251l075r37l2608j9393L4721L1921r231K1874k7621k9479K3919p923l6540
1081f6623O1953o6644J5832L9178l9020M4251o6851O8159j911m0779k4308L2446
1069d4317K1618j4814L3495o5415K0445n6760O4651Q3664o059k1172l816k688
1057H832q9727k645L2124l34m1334j1838P1131p182J5539j7358P040j80n4531
1044i0463N1732n3821m6331J7771P9630K8908J8355n3254J4944N9507L1182j1972
1032D6188j3447m8678m6005J2888K5446L0717j9966m2134j2372M3009K5171p1321
1020g0504K8048Q673M0655O934k8710l197N1596K8639p5048j3205K2788k0110
$$ plain form
1107 -64438 -66783 -53935 -82053 -79686 -54900 -12531 -70525 19287 19815 13706 4367 -18589 -12251
1094 -12251 -15326 -16263 -48871 -68264 -33543 -1622 -10853 11021 -16600 -46079 -22160 -30083 -66623
1081 -66623 -4670 -71314 -55482 -16304 -55324 -11073 -77924 -9765 -11676 -52455 -76763 -44317
1069 -44317 -22699 -37513 -4018 -69433 -48988 -105748 -41097 42567 36508 15336 11520 8832
1057 8832 -80895 -83540 -51416 -51750 -93084 -104922 -33791 -40973 -25434 -42792 -35752 -35932 -90463
1044 -90463 -38731 -92552 -138883 -121112 -41482 -12574 5781 -47473 -32529 26978 58160 46188
1032 46188 32741 -15937 -61942 -49054 -23608 7109 -12857 -54991 -67363 -24354 817 -70504
1020 -70504 -42456 -33783 6872 13806 -14904 -18101 33495 62134 -12914 -26119 -3331 -23441
1008b3441j6688K5250j7227l2061j505P383j5494P175R76O4160K536p8989j5437
995i3362J5867J8757J1020O8859l1109L161L633q4888R120J5026o086p066M9600
982b7468k4400O8483o4339m222r642K174M7911K0347q062J894n3571Q4688l2378
969A415J2645m7555q76J25620j08704N113j24L6578k4258j0756N4402r765o9920
956c6185n6943J3344L3280l502j1283J4182k6029K944M0914j6310M6894n2859
944e1553m2787J40455m5286k5431J2106m0573o699K7749J2035N2778j26435m16
932i4057J5534P8484J1878j02557P2091l4924K1184K9731J285O1855p0736k9913
920d0145L4417L2771j1986j871r88o815K9487o4853k9349P255n9592p994R9460
$$ plain form
1008 -23441 -40129 -14879 -32106 -64167 -65672 -58289 -73783 -66608 -65632 -1472 1064 -77925 -93362
995 -93362 -77495 -58738 -47718 21141 -9968 -6807 -3174 -88062 -78942 -63916 -70002 -77068 -27468
982 -27468 -51868 16615 -47724 -51946 -61588 -59414 -11503 8844 782 2676 -50895 33793 1415
969 1415 14060 -33495 -34371 91249 -17455 -12342 -12466 24112 -146 -10902 43500 33735 -36185
956 -36185 -93128 -79784 -46504 -50006 -61289 -47107 -73136 -70192 -29278 -45588 1306 -51553
944 -51553 -94340 46115 829 -24602 -12496 -53069 -59768 -32019 -19984 32794 -93641 -94057
932 -94057 -78523 -39 11839 -90718 -18627 -53551 -32367 -2636 -1351 60504 -10232 -40145
920 -40145 -5728 27043 15057 13186 12198 5383 34870 -29983 -59332 -52077 -111669 -119663 -20203
907b0203L772k5115o063j3454K1689j7195m1204m7900R4368L9800j7367j7373
895d6245j918L8045q89m4180l6297Q5967l103M5462o3061j6349j9205L0980l0676
882f1469J0359K5917N832O2678o9823m7023L8912J1618P75q1736M0084J8529N7780
869A2433N5869p2203n6698P944N9040m1619L4513l394O066N4929m8381l6365P1264
856D3398k4021j09678L7467r657J2987P1208m6352p390k7587K6886K0903j4352
844b6188L4889j6074k0730j9095N9282K4918l4182K332q762L0811J8403l0193
832A5411m4695K4149J5292m0050K6701m6617k6688K8694M1983N7585p7519L7194
820A1440L8808o4186n277p2778j1989M2054N1449j5417K7481p2265J31P9012N6541
$$ plain form
907 -20203 -16431 -41546 -47609 -61063 -39374 -56569 -97773 -145673 -51305 -11505 -28872 -46245
895 -46245 -48163 -10118 -11007 -55187 -91484 -5517 -8620 36842 -26219 -42568 -61773 -30793 -61469
882 -61469 -51110 -25193 -19361 43317 -26506 -73529 -34617 -22999 -22224 -103960 -63876 -45347 12433
869 12433 68302 -3901 -60599 -52655 6385 -35234 -721 -4115 1951 56880 8499 -27866 43398
856 43398 19377 -90301 -52834 -62491 -49504 21704 -24648 -32038 -59625 -32739 -11836 -26188
844 -26188 8701 -7373 -28103 -47198 12084 37002 2820 5152 -3610 27201 45604 15411
832 15411 -29284 -5135 10157 -29893 -3192 -49809 -76497 -47803 -5820 51765 -25754 11440
820 11440 50248 -13938 -19215 -91993 -103982 -61928 -10479 -25896 1585 -70680 -70549 8463 65004
807F5004m6388o6172Q9233n0953J0921Q45J6154j537k0386J9652m7977p167J8304
794b0467Q2547m9379o335j9996p2151O6629J9553m8543l6240L5394L3612m9384
782f4760L4838J672K6440J3733j9173l3620L720J5455K7690l6171n0243N9055
770b1364l4978L541N0390J4469k808m3224j5748j659J7666N592j4803J1991J0969
757a9966J6503k3355L2853r304p405Q2659r7673N1284m4696K9902L530l2960Q3745
744F5117q3791M4127L685l7471l2428L7219k2254n7578P8086M0165J7363n3146
732i06n8384N5921M1269l2262J6630j4053n3535J7953n636Q8911J1514K5842r0900
719B364o6204L2203q065m2576O8974n0735K0500J03268m4225J5461q369l2618
$$ plain form
807 65004 18616 -47556 41677 -9276 1645 2490 18644 17107 -3279 16373 -31604 -38771 -20467
794 -20467 62080 12701 6366 -13630 -85781 -19152 401 -48142 -84382 -48988 -15376 -64760
782 -64760 -29922 -28250 -1810 11923 -7250 -40870 -37150 -21695 5995 -30176 -80419 -21364
770 -21364 -56342 -52801 -2411 12058 9250 -33974 -49722 -51381 -33715 -28123 -42926 -30935 -19966
757 -19966 -3463 -26818 6035 -3269 -10674 71985 -25688 25596 -19100 10802 14332 -18628 65117
744 65117 -18674 25453 29138 -8333 -40761 -3542 -25796 -83374 -5288 34877 52240 -906
732 -906 -59290 -3369 37900 5638 22268 8215 -45320 -27367 -33003 55908 67422 93264 2364
719 2364 -63840 -31637 -39702 -82278 -13304 -64039 -43539 59729 15504 30965 22596 -10022
707a0022L4803J4184l6575p200L9617l756K9k8751k8541J1932J7521k6234K0383
694b610m5770J2536O491N207j6480P3647P432r28L218q5922l7948m480R548K2446
680e3613K3361L9551M4645k1980J499N6581q158m9053o3052r847M2530J0973j324
667A2113l3412m415K0846m7903J8313O953M066J970Q4688l1738p894J6026p4881
654c5268R543J4303J8649K3801o054l1890K8975K4047k1417l1523M6532l1286
642H412J269l8573j1581P7211N4592L4270o3411K1440k5500l0020l5768P97K8564
629B1702J840J8587O111j2045M2935l0226o0637r7256L2713P6668K080L7246l8074
616A644O9630q9703o414n1637O5042K8859M5369j2287o1351N8805n330o3433M9247
$$ plain form
707 -10022 24781 38965 2390 -4810 34807 31051 31080 2329 -26212 -14280 3241 -22993 -2610
694 -2610 -48380 -35844 -29353 -24146 -40626 33021 40453 39525 42743 -43179 -81127 -85607 -76059 -53613
680 -53613 -30252 9299 53944 31964 33463 90044 81886 32833 -30219 -40066 2464 13437 12113
667 12113 -21299 -25714 -4868 -52771 -34458 -27505 -23439 -21469 63219 31481 23587 39613 -35268
654 -35268 -25725 -11422 7227 31028 24974 -6916 22059 46106 24689 -6834 39698 8412
642 8412 9681 -28892 -40473 36738 91330 125600 62189 83629 58129 28109 -7659 -6862 21702
629 21702 23542 42129 48240 36195 79130 48904 -11733 -108989 -76276 392 2472 39718 1644
616 1644 71274 -18429 -24843 -76480 -11438 17421 62790 50503 -10848 47957 42627 -20806 28441
603B8441j239o045L4633K2272m4840m9727M5253O5142j02105l7704P9417l8251
591d753o4577Q5251j5261M389O072m4891J9816K9358m5304j5406K8844l473j2344
578c2279M3112O927N0723m7544q4049k3731L4184Q7980J0414q5210L8896R1385
566I0808r2497q216K3365j9934M8608R205j5584o4589N1316p945j7179n657L775
553d524j4514L0226O80n427K6557j1162m1841N628K942M4754N5315n3585j175
540C3874j9471M5594n113k5325n251L4624m072K8542n8544r754K6629l8360J7965
527B1338M8317k3024l8552p577J3778J4714l006n4253K7693P487m8219l0632M6859
514b5077k842k5995J1415N3762j7260K5927n8562l8688k7338P7579J25285k9689
$$ plain form
603 28441 27202 21157 55790 78062 33222 -16505 28748 93890 -8215 -45919 33498 -4753
591 -4753 -69330 15921 660 5049 11121 -33770 -13954 15404 -29900 -45306 -16462 -19935 -32279
578 -32279 10833 17760 68483 20939 -63110 -86841 -52657 35323 45737 -39473 -577 90808
566 90808 -1689 -9905 13460 -6474 42134 51339 35755 -28834 22482 14537 -2642 -8299 -4524
553 -4524 -19038 11188 11868 6441 32998 21836 -20005 -14377 -11435 33319 88634 35049 33874
540 33874 14403 59997 54884 29559 24308 58932 54860 83402 24858 15104 41733 3373 21338
527 21338 69655 46631 8079 502 14280 28994 25988 -28265 -572 6915 -41304 -71936 -25077
514 -25077 -27919 -53914 -42499 11263 -5997 19930 -38632 -77320 -104658 -27079 98206 68517
502F8517j00275K6214p498R1718m6666j12311P7210k2033l3814O3952P7857j1346
490G1525N1562k490m8468k0330q1853j4203K0094j4027J2931K2071L9342r37J7525
477E2742k2953n1515M9459o5448R0962o5636m7109J3969K9279O8868o0231N8008
465E0395J0090k5736k832J9534p6762j4429J2747l2334Q5044J19184o0665q8346
453d110p115L5539K5080o7825l2M6016L3770m850k1517m7786Q023J104j9382O0972
$$ plain form
502 68517 -31758 -5544 -13042 78676 32010 -80301 -3091 -25124 -58938 5014 82871 71525
490 71525 123087 120597 72129 51799 -30054 -44257 -24163 -38190 -25259 -3188 36154 35217 52742
477 52742 29789 -21726 27733 -37715 53247 -12389 -59498 -45529 -16250 52618 -7613 50395
465 50395 60485 34749 31917 51451 -25311 -39740 -26993 -59327 25717 144901 84236 -4110
453 -4110 -11225 24314 49394 -18431 -18463 27553 61323 56473 34956 -12830 -4807 -3703 -23085 37887
$$ [...]
##END NTUPLES=NMR SPECTRUM
##END=
