##TITLE=1H_EC-3309(III-2)
 CDCl3
 8 sc, 
 4.4.2024
##JCAMPDX= 6.0         $$ Bruker NMR JCAMP-DX V2.0
##DATA TYPE= NMR SPECTRUM
##DATA CLASS= NTUPLES
##ORIGIN= UXNMR, Bruker Analytische Messtechnik GmbH
##OWNER= root
$$ XWIN-NMR		Version 3.5
$$ Thu Apr  4 14:07:13 2024 Russian Standard Time (UT+4h)  she@DPX200
##.OBSERVE FREQUENCY= 200.1309
##.OBSERVE NUCLEUS= ^1H
##.ACQUISITION MODE= SIMULTANEOUS
##.ACQUISITION SCHEME= undefined
##.AVERAGES= 8
##.DIGITISER RES= 18
##SPECTROMETER/DATA SYSTEM= spect
##.PULSE SEQUENCE= zg30
##.SOLVENT NAME= MeOD
##.SHIFT REFERENCE= (INTERNAL, MeOD, 0, 15.7007)
##AUDIT TRAIL= $$ (NUMBER, WHEN, WHO, WHERE, WHAT)
$$ ##TITLE= Audit trail, XWIN-NMR		Version 3.5
$$ ##JCAMPDX= 5.01
$$ ##ORIGIN= Bruker BioSpin GmbH
$$ ##OWNER= she
$$ F:/spectra/data/she/nmr/H-F/1/pdata/1/auditp.txt
$$ ##AUDIT TRAIL=  $$ (NUMBER, WHEN, WHO, WHERE, WHAT)
(   1,<2024-04-04 14:05:53.82 +0400>,<she>,<DPX200>,
      <created by zg, POWCHK disabled, PULCHK disabled
       configuration hash MD5:
       00 E9 B6 7A A2 85 ED C7 34 08 36 98 17 FE 4E 26
       data hash MD5: 16K
       E2 3A 6F 0C 63 41 7E AC 57 BA BF 97 08 5D 5C 3A>)
(   2,<2024-04-04 14:05:56.10 +0400>,<she>,<DPX200>,
      <Start of raw data processing
       efp BC_mod = 2 LB = 0.24 FT_mod = 6 PKNL = 1 PHC0 = -25301.37 PHC1 = 9.387309 SI = 16K 
       data hash MD5: 16K
       DE 45 95 EC 62 AF 43 67 FF 6E 79 CF B5 32 BB E6>)
(   3,<2024-04-04 14:06:09.23 +0400>,<she>,<DPX200>,
      <pk PHC0 = 1.280751 PHC1 = 2.2 
       data hash MD5: 16K
       1A EE 1E 9D 55 B4 C8 74 B5 AF A2 34 AE A0 2E B4>)
(   4,<2024-04-04 14:06:26.78 +0400>,<she>,<DPX200>,
      <abs ABSG = 5 
       data hash MD5: 16K
       C7 F6 2E 21 B4 3E FF 94 37 D9 90 FB 2E 2C CE 2F>)
$$ ##END=
$$ 
$$ hash MD5
$$ B2 D9 5C 45 A0 47 EB E6 E4 59 27 F5 3B EA 4F C0
##$RELAX= 
##$RELAX= 
##$RELAX= 
##$RELAX= 
##$RELAX= 
##$RELAX= 
$$ Bruker specific parameters
$$ --------------------------
##$DU= <F:/spectra>
##$EXPNO= 1
##$NAME= <H-F>
##$PROCNO= 1
##$TYPE= <nmr>
##$USER= <she>
##$AMP= (0..31)
100 100 100 100 100 100 100 100 100 100 100 100 100 100 100 100 100 100 
100 100 100 100 100 100 100 100 100 100 100 100 100 100 
##$AQSEQ= 0
##$AQ_mod= 1
##$AUNM= <au_zg>
##$AUTOPOS= <>
##$BF1= 200.13
##$BF2= 200.13
##$BF3= 200.13
##$BF4= 200.13
##$BF5= 200.13
##$BF6= 200.13
##$BF7= 200.13
##$BF8= 200.13
##$BYTORDA= 1
##$CFDGTYP= 0
##$CFRGTYP= 5
##$CHEMSTR= <none>
##$CNST= (0..31)
1 1 145 1 1 1 1 1 1 1 1 1 1 1 1 1 1 1 1 1 1 1 1 1 1 1 1 1 1 1 1 1 
##$CPDPRG= <>
##$CPDPRG1= <>
##$CPDPRG2= <>
##$CPDPRG3= <>
##$CPDPRG4= <mlev>
##$CPDPRG5= <mlev>
##$CPDPRG6= <mlev>
##$CPDPRG7= <mlev>
##$CPDPRG8= <mlev>
##$CPDPRGB= <>
##$CPDPRGT= <>
##$D= (0..31)
0 1.2 0 0 0 0 0 0 0 0.06 0 0.03 0 0 0 0 0.0002 0 0 0 0 0 0 0 0 0 0 0 0 
0 0 0 
##$DATE= 1712225153
##$DBL= (0..7)
120 120 120 120 120 120 120 120 
##$DBP= (0..7)
150 150 150 150 150 150 150 150 
##$DBP07= 0
##$DBPNAM0= <>
##$DBPNAM1= <>
##$DBPNAM2= <>
##$DBPNAM3= <>
##$DBPNAM4= <>
$$ [...]
##$SUBNAM3= <"">
##$SUBNAM4= <"">
##$SUBNAM5= <"">
##$SUBNAM6= <"">
##$SUBNAM7= <"">
##$SUBNAM8= <"">
##$SUBNAM9= <"">
##$SW= 18.0517689322627
##$SWIBOX= (0..15)
0 0 2 0 0 0 0 0 0 0 0 0 0 0 0 0 
##$SW_h= 3612.71676300578
##$TD= 16384
##$TD0= 1
##$TE= 0
##$TE2= 300
##$TE3= 300
##$TEG= 300
##$TL= (0..7)
0 120 120 120 120 120 120 120 
##$TP= (0..7)
150 150 150 150 150 150 150 150 
##$TP07= 0
##$TPNAME0= <>
##$TPNAME1= <>
##$TPNAME2= <>
##$TPNAME3= <>
##$TPNAME4= <>
##$TPNAME5= <>
##$TPNAME6= <>
##$TPNAME7= <>
##$TPOAL= (0..7)
0.5 0.5 0.5 0.5 0.5 0.5 0.5 0.5 
##$TPOFFS= (0..7)
0 0 0 0 0 0 0 0 
##$TUNHIN= 0
##$TUNHOUT= 0
##$TUNXOUT= 0
##$USERA1= <user>
##$USERA2= <user>
##$USERA3= <user>
##$USERA4= <user>
##$USERA5= <user>
##$V9= 5
##$VALIST= <valist>
##$VCLIST= <CCCCCCCCCCCCCCC>
##$VD= 0
##$VDLIST= <DDDDDDDDDDDDDDD>
##$VPLIST= <PPPPPPPPPPPPPPP>
##$VTLIST= <TTTTTTTTTTTTTTT>
##$WBST= 1024
##$WBSW= 4
##$XGAIN= (0..3)
0 0 0 0 
##$XL= 0
##$YL= 0
##$YMAX_a= 489825
##$YMIN_a= -544580
##$ZGOPTNS= <>
##$ZL1= 120
##$ZL2= 120
##$ZL3= 120
##$ZL4= 120
##$ABSF1= 15.70065
##$ABSF2= -2.351239
##$ABSG= 5
##$ABSL= 3
##$ALPHA= 0
##$AQORDER= 0
##$ASSFAC= 0
##$ASSFACI= 0
##$ASSFACX= 0
##$ASSWID= 0
##$AUNMP= <proc_1d>
##$AZFE= 0.1
##$AZFW= 0.1
##$BCFW= 0
##$BC_mod= 2
##$BYTORDP= 0
##$COROFFS= 0
##$CY= -3
##$DATMOD= 1
##$DC= 0
##$DFILT= <>
##$DTYPP= 0
##$F1P= 0
##$F2P= 0
##$FCOR= 1
##$FTSIZE= 16384
##$FT_mod= 6
##$GAMMA= 0
##$GB= 0
##$INTBC= 1
##$INTSCL= 3.70164e-10
##$ISEN= 128
##$LB= 0.24
##$LEV0= 0
##$LPBIN= 0
##$MAXI= 10000
##$MC2= 0
##$MEAN= 0
##$ME_mod= 0
##$MI= 1.114404
##$NCOEF= 0
##$NC_proc= -6
##$NLEV= 6
##$NOISF1= 3.799351
##$NOISF2= 2.8
##$NSP= 0
##$NTH_PI= 0
##$NZP= 0
##$OFFSET= 15.70065
##$PC= 1
##$PHC0= -25300.09
##$PHC1= 11.58731
##$PH_mod= 1
##$PKNL= yes
##$PPARMOD= 0
##$PSCAL= 0
##$PSIGN= 0
##$REVERSE= no
##$SF= 200.129564194052
##$SI= 16384
##$SIGF1= 3
##$SIGF2= 2
##$SINO= 5.538805
##$SIOLD= 16384
##$SREGLST= <1H.CDCl3>
##$SSB= 0
##$STSI= 16384
##$STSR= 0
##$SW_p= 3612.71676300577
##$SYMM= 0
##$S_DEV= 0
##$TDeff= 16384
##$TDoff= 0
##$TI= <>
##$TILT= no
##$TM1= 0
##$TM2= 0
##$TOPLEV= 0
##$USERP1= <user>
##$USERP2= <user>
##$USERP3= <user>
##$USERP4= <user>
##$USERP5= <user>
##$WDW= 1
##$XDIM= 16384
##$YMAX_p= 483326155
##$YMIN_p= -467504
$$ End of Bruker specific parameters
$$ ---------------------------------
##NTUPLES= NMR SPECTRUM
##VAR_NAME=  FREQUENCY,     SPECTRUM/REAL,   SPECTRUM/IMAG
##SYMBOL=    X,             R,               I
##VAR_TYPE=  INDEPENDENT,   DEPENDENT,       DEPENDENT
##VAR_FORM=  AFFN,          ASDF,            ASDF
##VAR_DIM=   16384,         16384,           16384
##UNITS=     HZ,            ARBITRARY UNITS, ARBITRARY UNITS
##FACTOR=    0.220516191357247, 1,           1
##FIRST=     3142.164285121, 0,              0
##LAST=      -470.552477884767, 0,           0
##MIN=       -470.552477884767, -467504,     0
##MAX=       3142.164285121, 483326155,      0
$$ Real data points
##PAGE= N=1
##DATA TABLE= (X++(R..R)), XYDATA
$$ [...]
10526 21736 -126968 -52507 -5278 -3195 -8976 -52391 55722 -5096 -110666 65778 44061
10515 44061 132413 104401 110430 103083 135183 150776 50581 61512 7236 106549 91802 132108
10503 132108 139603 34625 109074 78999 166266 196691 293206 203625 112555 -8609 71170
10492 71170 76349 57785 -16972 -53849 71466 59351 49468 43651 47352 -12320 59038 119639
10480 119639 180064 3694 -73720 -37196 -4736 -12238 36984 -35367 -63975 -48384 -5510
10469 -5510 -16974 -50075 19091 61743 -38249 51199 123332 66569 114162 110172 1057 96898
10457 96898 154295 77081 62204 49087 25373 -10359 100186 99455 -16808 9982 81451 103085
10445 103085 87905 36397 19440 58699 81457 86294 81571 38490 -25770 34625 207293 165996
10433 165996 70216 16308 63159 154675 94779 154103 84924 28804 132476 3417 48581
10422 48581 89499 52118 136275 138502 33535 59995 53936 104204 89958 184555 50863 -7366
10410 -7366 93498 79251 114072 28718 55692 75778 115014 25970 32578 140006 151660 163258
10398 163258 125392 155570 221373 244519 60417 -9519 27611 42749 65288 71508 81929
10387 81929 42725 80849 227028 223198 231203 248870 127651 94492 148318 176695 135170 91944
10375 91944 -24720 60949 105157 3136 -18758 65736 163045 137938 107652 41773 54062
10364 54062 53412 114274 160275 83064 93935 69517 -8326 12721 24863 97086 93265 66057
10352 66057 36220 54265 53636 39661 141508 192579 152272 114514 33766 -5141 62554 -20351
10340 -20351 116214 92688 151697 149887 1925 -8622 75146 105823 52737 -63008 -39261
10329 -39261 76410 126549 195953 178421 91818 108792 60447 69840 151490 176423 210612 155046
10317 155046 184549 175108 100980 103736 204397 186721 138358 71826 107228 64762 61573 104806
10305 104806 93442 136271 126473 86430 64003 88394 139880 121961 162752 102433 38840 6935
10293 6935 22304 87243 51812 121623 229053 195584 65907 104889 158733 133684 21937
10282 21937 64519 119678 87743 -1240 37452 -55026 -37718 71618 236409 179726 214014
10271 214014 161353 141152 135185 181562 217656 34529 13371 44548 124293 114982 159798 86801
10259 86801 174969 183153 77494 77097 -10227 139224 188140 193593 190691 49726 187315 216608
10247 216608 163453 30274 201135 217179 131319 150736 225759 169069 124049 85580 111179
10236 111179 91090 117881 57050 58756 21230 -9588 87030 4299 21130 12791 -29409 -59021
10224 -59021 80584 131599 142314 181446 106857 41053 61222 81928 122176 177889 4600
10213 4600 78028 227583 219580 201569 143462 192155 227733 207328 228056 245283 214182 205868
10201 205868 185635 117450 110033 84566 132444 85757 134300 211983 175855 197824 205433 79936
10189 79936 38866 173922 117200 109196 117595 133700 52610 76140 131658 217206 239366 249003
10177 249003 76088 39020 107988 206720 148493 244817 271978 194041 176694 147798 157173
10166 157173 62359 154195 131462 74311 82692 185066 176917 117641 84273 126892 180256 175428
10154 175428 170127 161011 197193 173059 129592 253800 167697 123769 174923 190609 164472 161269
10142 161269 145977 121095 100047 94810 111211 116068 131046 69735 63026 30644 128186 131846
10130 131846 134977 179060 201483 167507 180562 264125 254544 97806 197747 227276 128824 120730
10118 120730 184554 220240 160911 198109 228184 245213 144549 71720 144685 288451 268391
10107 268391 177628 205629 203457 204226 273964 263044 268245 188210 300600 282443 220600 231007
10095 231007 205496 164565 241061 243753 238679 204840 150780 149261 121505 226299 289027 406412
10083 406412 305531 279153 249128 133150 124144 227080 213983 211437 157969 196908 172752
10072 172752 164849 213132 149191 100116 134130 271577 342583 264727 269224 267843 137911 228771
10060 228771 155127 169815 174147 147156 224089 242132 173289 93291 167313 203520 224854 248259
10048 248259 276085 275111 289030 287342 200178 222254 139261 174253 156388 60026 73635 214719
10036 214719 197568 269537 237201 99783 203578 178455 180497 209294 214583 222732 130935 127072
10024 127072 164991 115255 136729 120683 212836 314131 289196 249093 335009 305643 290123
10013 290123 236628 231446 275964 307668 323161 376541 426402 405952 377214 351317 454666
10002 454666 448194 526881 505585 422400 380997 203438 287959 404514 472698 606070 471175
9991 471175 389985 435725 366003 377907 384943 395787 472041 363331 477296 427894 274661
9980 274661 382678 379720 290157 326170 359264 502169 537490 422433 421409 392153 387229 376631
9968 376631 479641 524545 498379 394941 391678 283696 408730 491952 464466 457277 413152
9957 413152 440154 401765 467510 360645 270436 298421 334040 424424 348220 336523 437646
9946 437646 508271 407768 389048 369012 269179 230426 338734 429595 369591 429210 370795
9935 370795 282309 290093 269649 312698 334574 323261 378613 359088 404171 374790 300428 230391
9923 230391 257187 316479 284317 339114 439999 346222 247258 293959 362643 333032 335921 339634
9911 339634 284968 218222 140049 210310 308496 367668 375779 273059 229356 267052 374787
9900 374787 262788 187013 281085 243229 248328 303312 323645 340624 325669 382810 378179 375068
9888 375068 375704 373001 344097 304417 302973 322766 351510 430759 357771 334881 313975 417994
9876 417994 437108 414637 371785 285705 393832 356079 380415 355778 297766 305764 338439 384121
9864 384121 366687 362132 436610 385850 423585 368524 444177 582499 555023 485929 593965
9853 593965 587750 575446 565645 554130 504642 572846 613352 625285 533833 612537 717626 701540
9841 701540 723681 667069 647664 624385 691504 660109 704596 773001 747377 804300 830253 901316
9829 901316 992637 1048880 994260 964102 1095285 1200001 1168729 1001562 976402 936376 902404
9818 902404 822254 857981 865762 827352 823408 858593 830766 858066 997535 1049390 996054 981827
9806 981827 1050215 1018802 954119 940699 977052 983711 978124 1069945 1020981 1023842 916755 1015828
9794 1015828 1173697 1235641 1270872 1254846 1269818 1300705 1279106 1302032 1331489 1323869 1216828
9783 1216828 1158840 1134369 1063191 1061991 1108228 1210413 1197307 1185406 1121831 1023515 989742
9772 989742 972979 1152289 1112138 1030929 1086828 1053843 1031699 965141 1021493 1026033 1096884 1056599
9760 1056599 1085999 940764 1060722 1135800 1138943 1136198 1066162 1069186 1077878 1039489 1209007 1316895
9748 1316895 1375201 1468078 1358316 1379911 1530133 1599537 1734857 1912194 1946790 2025993 2174513
9737 2174513 2348776 2427139 2671565 2825098 2922479 2873007 2868705 2770397 2668795 2400694 2187626
9726 2187626 2077870 1893012 1724725 1581355 1483173 1454461 1423097 1462132 1499091 1325400
9716 1325400 1245184 1218418 1155115 1141944 1164852 1200230 1203298 1204791 1144093 1129934 1232932 1185977
9704 1185977 1196378 1182864 1161009 1156671 1117366 1101199 1119902 1084683 1073677 1137358 1164865 1059916
9692 1059916 1107135 1126095 1154025 1209569 1245636 1233601 1284795 1224485 1157913 1156746 1168580 1224379
9680 1224379 1259802 1179467 1204037 1228475 1146133 1095813 1127791 1106445 1223371 1379036 1450239
9669 1450239 1434789 1390062 1357465 1296273 1328376 1257722 1263119 1279807 1354796 1311564 1303748 1348564
9657 1348564 1491356 1529599 1450276 1446026 1522100 1445912 1440093 1432064 1409458 1489806 1537950 1500658
9645 1500658 1562345 1573847 1472174 1619229 1631895 1566073 1514258 1489820 1561466 1579835 1634095
9634 1634095 1630826 1665279 1683806 1712908 1744257 1747218 1770118 1799243 1774124 1848369 1873332 1845730
9622 1845730 1797979 1894228 1853399 1789354 1826863 1816462 1821795 1688146 1703703 1778592 1894657
9611 1894657 1976441 2007787 2029339 1987722 1953663 1931693 1979210 1997474 2021898 2006957 2000963 2165706
9599 2165706 2158736 2058506 2141992 2144396 2154495 2243699 2251788 2292526 2279291 2224500 2209530 2298037
9587 2298037 2367131 2384944 2318827 2304448 2386561 2358574 2439842 2382338 2432223 2616810 2611282
9576 2611282 2608547 2616523 2616306 2749134 2853013 2843888 2952214 2949992 3043148 3123606 3097139 3072135
9564 3072135 3059445 3266449 3442610 3521932 3577612 3569227 3567256 3601705 3729354 3756293 3768262
9553 3768262 3881512 4025189 4126791 4289860 4434902 4562886 4683354 4781620 5066170 5173827
9543 5173827 5254761 5421962 5444900 5684232 5869515 5949917 6042017 6235276 6462094 6641161
9533 6641161 6883590 7065008 7155106 7280159 7462833 7779225 7929358 8154037 8375012 8627265
9523 8627265 8868335 9101994 9453435 9750250 10030511 10437302 10653321 10954265 11252304 11516794
9513 11516794 11948645 12398278 12815850 13265612 13700596 14073460 14466197 14995754 15415547
9504 15415547 15812895 16236050 16778714 17412726 17791692 18339526 19083863 19728950 20239696
9495 20239696 20935895 21730739 22499225 23319496 24202829 25355638 26568350 27714706 29052705
9486 29052705 30534943 32321866 33992607 35882694 38105088 40513537 43256055 46490316
9478 46490316 50147926 54387878 59569729 65537850 72432976 80439216 88760866 96258264
9470 96258264 102173634 107128852 111981633 115469007 115632193 112632688 108327417 104473751
9462 104473751 100183096 94565821 88504653 83831111 80858503 79217537 78682990 79409107
9454 79409107 80810375 82058557 82898840 83551339 84319970 84708189 84505096 83581317 82485287
9445 82485287 81843122 81360626 80972384 81158234 82621023 85609852 90155085 96273757 103386370
9436 103386370 110101293 115123402 119202912 123825454 127442279 126918493 121648985 114828891
9428 114828891 109050891 103564234 96715951 88910800 82452955 77906682 74808928 72957154
9420 72957154 72223851 72319569 72492186 71907493 70884266 69687774 68267473 65845459 62361682
9411 62361682 58407982 54413856 50317470 45662869 41055823 36937274 33533761 30666122
9403 30666122 28225831 26052925 24288397 22865801 21559744 20304404 19110628 18219192
9395 18219192 17357831 16602583 15726917 15088310 14478924 13891318 13398836 12985083 12544576
9386 12544576 12175885 11829537 11549869 11328944 11112554 10940904 10770578 10560167 10271439
9377 10271439 9952870 9734080 9358497 9042114 8823100 8570199 8384713 8182360 7945119
9368 7945119 7693269 7503570 7566163 7554500 7407260 7233992 7030075 6828656 6641820 6471059
9358 6471059 6252018 6147992 6091183 5946204 5891086 6040488 5915061 5870191 5900545 5847474
9348 5847474 5712160 5661200 5463209 5298167 5182224 5063503 4954597 5012683 5004955 4822739
9338 4822739 4775846 4851536 4945583 5004454 4884646 4778668 4654544 4343002 4223684 3979795
9328 3979795 3785863 3806993 3636088 3495258 3440615 3462648 3347048 3251420 3184126 3170297 3103713
9317 3103713 2996430 2924650 2767161 2752273 2694631 2736071 2626297 2631739 2531212 2491350 2424929
9306 2424929 2419204 2426588 2353132 2361046 2295177 2329560 2323983 2326948 2177050 2079520 2102996 2132907
9294 2132907 2117357 2051564 1991967 2033424 2094797 2180681 2242994 2263041 2204267 2126436 2159069
9283 2159069 2135970 2134888 2007861 2080320 2115318 2010909 2019961 2121066 2091318 2016631 2039239
9272 2039239 2028687 2038791 2043494 2024736 2013314 2093592 2111684 1978589 1977320 2025963 2002093 1991193
9260 1991193 1954604 1896272 1948032 1931373 2104714 2133830 2111568 2193690 2192484 2351236 2399732
9249 2399732 2416340 2483091 2593972 2634259 2673919 2797583 2860559 2836805 2917452 2905604 2936026
9238 2936026 2800034 2825547 2779015 2805812 2775486 2638531 2596854 2615911 2597847 2539377 2382049
9227 2382049 2384125 2287802 2223859 2271023 2282865 2237169 2209290 2342858 2369576 2425639 2431483 2352088
9215 2352088 2389978 2341021 2364925 2327143 2303973 2388575 2424933 2485890 2622400 2771072 2912879
9204 2912879 2983150 2880723 2933381 2923617 2882332 2717258 2622864 2522698 2433151 2367289 2351518
9193 2351518 2318284 2128387 2060708 2098736 2031558 1978120 1910337 1926536 2013768 2005307 1936628
9182 1936628 1828618 1795975 1855182 1826118 1870242 1853098 1875026 1867126 1871846 1922442 1922014 1909546
9170 1909546 2028018 2065431 1984903 1916166 1995523 2110841 2155738 2032932 2035223 1984293 2039473
9159 2039473 2136758 2068755 2076899 2033413 2137939 2112549 2048439 2080453 2057331 2135427 2151420
9148 2151420 2185794 2390562 2437798 2365214 2383801 2438228 2477822 2631811 2645740 2493835 2523566
9137 2523566 2444174 2399287 2412110 2358907 2528892 2525407 2531384 2628020 2542585 2604110 2748778
9126 2748778 2708990 2694506 2900986 3025018 3058462 3140813 3146422 3047260 2948055 2943121 2893240
9115 2893240 2819008 2829970 2925970 2895803 2883611 3012863 3022990 3065916 3036658 3037236 2998168 2945971
9103 2945971 2911090 2927951 2969851 2956980 2879207 2900003 3054631 3070335 3088988 3125864 3037656
9092 3037656 3086070 3102446 3094211 3119037 3131182 3342539 3261134 3305454 3315629 3327559 3424756
9081 3424756 3549648 3473415 3471766 3598380 3653088 3704040 3800369 3857273 3870558 4032295 4144682
9070 4144682 4106296 4102430 4051592 4032724 4057461 4062194 4122067 4108203 4114391 4216480 4280009 4277308
9058 4277308 4314811 4402080 4425431 4402142 4288554 4277705 4322363 4310173 4239800 4356498 4326439
9047 4326439 4413334 4406512 4336175 4389642 4414050 4506044 4490528 4492913 4500858 4509244 4483990 4601050
9035 4601050 4627550 4718141 4659130 4747174 4767049 4744803 4806423 4795712 4827768 4996745 5035051
9024 5035051 4977394 5065203 5158270 5099551 5126970 5140854 5096984 5131424 5225618 5138130 5121508
9013 5121508 5194699 5199382 5203151 5210415 5265874 5371887 5414260 5365033 5507085 5623566 5658343
9002 5658343 5642650 5558043 5623369 5684199 5726196 5833981 5835782 5898429 5921444 6012284 6017591 6155767
8990 6155767 6266015 6352219 6486437 6516382 6632857 6642643 6635548 6763127 6837459 6903851 6975237
8979 6975237 7133807 7315718 7303340 7515433 7702025 7827602 8014557 8171015 8379462 8525481
8969 8525481 8681912 8904580 9086960 9314703 9565614 9805775 9999720 10213072 10447548 10619451
8959 10619451 11002479 11270911 11507262 11763856 12065417 12474168 12774043 13136864 13520422
8950 13520422 13819984 14098143 14638674 15025653 15422305 15930612 16390421 16963319 17501735
8941 17501735 18079550 18761444 19452401 20089091 20840604 21574046 22390882 23194926 24051443
8932 24051443 25045185 26056916 27050733 28284929 29690658 31099998 32787567 34492304
8924 34492304 36011450 37099442 37760602 38486396 39197640 39978114 40567307 40491473 40453761
8915 40453761 40688993 41108966 41675178 42328236 43098017 44122653 45152558 46350865 47772097
8906 47772097 49321624 50992104 52832451 54898706 57066788 59531519 62304796 65343538
8898 65343538 68559460 72021425 75965058 80281323 85069216 90594188 97006588 104697944
8890 104697944 113490689 123563298 134553143 144878128 152470293 157324143 161205386 165911173
8882 165911173 170970023 173961881 174174123 173522232 174549028 178290650 184437833 192417787
8874 192417787 200443243 206811219 211243104 214346801 216279602 216495726 216368982 218682587
8866 218682587 224993173 235759837 250705974 268258480 283060385 289282552 287090764
8859 287090764 282477806 278458948 269590960 251234460 226452563 203064702 184368529
8852 184368529 169575473 157274993 147024472 138614170 131839840 125914837 120254709 114426497
8844 114426497 108714724 103867369 100121148 97339858 94321559 90791428 87269396 84088882
8836 84088882 81163441 78300114 75325420 72357877 69368061 66324745 63394132 61013111
8828 61013111 59146865 57801222 56842653 56413105 56373849 56571323 57290672 58520486 60201247
8819 60201247 62494414 65220409 67993754 69912132 70307554 69875474 69364376 69489538 69807502
8810 69807502 69121083 67172803 64843609 63395539 63114703 63856484 65533214 67570900 69267512
8801 69267512 70661048 71701167 72384172 72764575 72694355 72357045 71428846 69533615 66763445
8792 66763445 63416102 59265767 54356459 49337210 44900735 41306638 38321236 35914521
8784 35914521 34053897 32527227 31256362 30165856 29244298 28477985 27869860 27505789 27144858
8775 27144858 26816913 26785224 26923660 27015501 27288405 27708576 28454196 29414097 30507850 31724827
8765 31724827 32710748 33385891 33660413 33699499 33432304 32864440 32230197 31595550 30897106 30244967
8755 30244967 29583508 28924437 28276659 27540142 26949426 26593335 26311869 26171045 26330504
8746 26330504 26608789 26851098 27205613 27849122 28404587 29148664 29966524 30676351 31016438
8737 31016438 31134307 31080241 31008681 31106346 31338409 31646422 32202470 32773745 33337654 34068252
8727 34068252 34963318 36145484 37235224 38741994 40295378 41955452 44243743 46737628
8719 46737628 49750905 53421487 57704923 62814588 68561484 74131010 77446630 77453252 74747668
8710 74747668 71506532 69307533 68331199 68477750 69690533 71981227 75312849 79192114
8702 79192114 83071954 86141160 87114226 86102662 84135913 82635501 82496545 83654487
8694 83654487 86130195 89665564 93987819 98132853 101572271 103810730 104331539 103532918
8686 103532918 102696903 102824694 103788795 105472613 108084012 112298813 118219764 125093446
8678 125093446 131283222 134845223 135243883 133473101 132266040 133319866 137259595 144529950
8670 144529950 155188582 163636396 163072791 153147800 140850071 131892170 124752431 118088501
8662 118088501 111959702 107143835 103348006 100993237 100169869 100816844 101922950 102137458
8654 102137458 100212891 95684871 89450988 83956848 79593105 75666609 71697364 68031048
8646 68031048 65336698 63666866 62937069 62795486 62997885 62266914 59651027 55411006 50649212
8637 50649212 46347027 42925350 40167667 37966378 36413178 35405359 34721920 34561191
8629 34561191 34613087 34963345 35324192 35151691 34095501 32494805 31153211 30217076 29785908
8620 29785908 29417433 28465887 26939955 25083324 23199441 21369674 19696152 18189989
8612 18189989 16939875 15926270 15045226 14324151 13651407 13010555 12456824 11897160 11530564
8603 11530564 11161782 10708076 10269882 9891588 9532562 9261054 8899094 8593480 8446091
8594 8446091 8114732 7746917 7608952 7428435 7307545 7114911 6990506 6838609 6628022 6500408
8584 6500408 6253140 5987632 5967474 5823908 5806863 5626567 5332531 5235856 5052926 4945114
8574 4945114 4859275 4661652 4591092 4499925 4389809 4299943 4212923 4193824 4110545 3993954 3900011
8563 3900011 3862576 3711873 3821949 3749346 3567286 3502797 3309065 3287252 3359831 3305072 3266152
8552 3266152 3243850 3342234 3281184 3255660 3165151 3124470 3128321 3018463 2961644 3035442 2895755
8541 2895755 2776269 2791372 2790529 2725149 2652724 2578145 2641484 2522488 2415458 2364515 2347553
8530 2347553 2319147 2327875 2273956 2345183 2323083 2360390 2423383 2428055 2427740 2422520 2429470 2515433 2647617
8517 2647617 2718202 2826287 2764362 2725084 2656025 2645513 2679966 2582985 2567589 2453835 2262480
8506 2262480 2213194 2096005 2037946 1917290 1912345 1916116 1793275 1545273 1504399 1527784 1521385
8495 1521385 1470872 1492531 1434397 1435377 1456878 1320179 1263006 1322799 1294167 1308028 1456558
8484 1456558 1423054 1513108 1580693 1502803 1527623 1607107 1702734 1656536 1620376 1570864 1529216
8473 1529216 1536190 1438427 1310227 1278674 1133880 999646 968440 968207 1001235 904412 918655
8462 918655 939964 854547 798417 813451 777577 768210 827725 715215 669952 663886 769435 728403
8450 728403 667441 758289 735183 631720 627623 745984 810761 751765 706671 779523 795382
8439 795382 816975 864712 790564 774314 742574 627514 583252 652502 668001 680925 589194
8428 589194 620755 499882 572041 601176 470808 424180 492122 441916 430044 386298 450353
8417 450353 471968 504116 527433 526104 565037 491317 491707 610563 634186 508587 530657 533480
8405 533480 470154 441529 537482 517763 503019 436791 406088 447446 606142 550407 550339 508725
8393 508725 526754 394878 405105 479541 419376 420781 444049 388576 386439 281775 347963 314444
8381 314444 380897 270087 247226 291800 288119 345925 261099 211982 335465 318278 240585
8370 240585 342245 349053 368348 303579 301953 379989 328908 309804 340452 296180 236158 251871
8358 251871 322131 309567 233243 211717 237869 367015 361509 316026 330107 352825 339800 454909
8346 454909 499711 361853 334786 320428 448671 455068 495301 467502 413693 323073 247058
8335 247058 205633 300105 259595 391396 473002 307554 308897 444248 480774 556700 476465
8324 476465 581187 712355 650184 672745 657916 564023 613687 687068 686157 520376 558675
8313 558675 681607 762687 729778 666289 614662 499913 499874 525441 521689 574424 554993 486941
8301 486941 447694 371670 264212 245243 461687 448037 428256 443162 429230 419106 323213
8290 323213 296034 421134 447818 438069 406265 459860 386465 334747 321775 366554 327230 299249
8278 299249 279365 265253 230829 163855 202289 260333 284695 258307 271035 263424 195245 225039
8266 225039 312830 296922 205417 151882 167212 11459 -25551 123735 107541 104697 86703
8255 86703 66612 66522 50431 60480 57928 39116 74796 -18466 -53184 -48215 -51631 -69129 -106263
8242 -106263 -78272 -22471 -22232 -15037 -1475 -50974 -31458 -54599 -34437 19398 26265 31281 31570
8229 31570 -76551 -94794 -164280 -74187 -28494 -80988 -94554 -37867 -15890 -62596 -54717 -7072
8217 -7072 -7184 15814 -11784 -9309 40924 -23203 2987 -52221 -38070 -26715 -23745 2477 -67101
8204 -67101 71054 14260 -23875 -105183 -11903 -13119 49505 -27614 51087 59154 11081 -193704
8192 -193704 -269070 392763 331589 261557 297560 210004 100200 164763 213558 135188 54069
8181 54069 55520 -35661 -71685 -74373 -34189 -48123 -102190 -118595 -134692 -90531 54882 4798
8169 4798 -131950 -150170 -141822 -135993 -77247 -34742 -26232 -50355 -70282 -116723 -94186 -112910
8157 -112910 -131804 -35072 -16833 -106764 -12400 -51317 -185170 -140552 -114117 -241670 -219499
8146 -219499 -250397 -243881 -93559 -31582 -17639 -108644 -105714 -111425 -120912 -142142 -144469 -231051
8134 -231051 -134973 -142836 -117006 -71857 -112369 -274391 -206459 -104272 -125698 -126926 -67322 -99612
8122 -99612 -46968 42853 -79697 -57134 -26151 -695 -44812 -59191 -62311 -63783 -83078 -147039
8110 -147039 -171603 -221205 -88210 -171533 -203603 -79833 -73466 -173337 -164805 -95358 -129964 -187905
8098 -187905 -133049 -175717 -218580 -264786 -277676 -152331 -179412 -203309 -153782 -178745 -177979 -154279
8086 -154279 -121517 -118113 -157557 -106769 -81053 -29293 -67767 -198392 -196181 -135378 -117544 -161545
8074 -161545 -257280 -307991 -318532 -259302 -178501 -134406 -200065 -176911 -206452 -187710 -113920 -92232
8062 -92232 -173504 -152726 -138276 -174354 -182338 -178585 -190742 -141186 -101072 -153121 -270888 -230893
8050 -230893 -105456 -53552 -71843 -73131 -126614 -5912 -33596 -48597 18716 -39337 -28332
8039 -28332 42651 55150 -41840 -69880 -61595 -130153 -157199 3706 -8877 -149052 -166305 -101961
8027 -101961 -103496 -82738 -140754 -196356 -72529 -47309 -121284 -121910 -116487 -126153 -61930 -16683
8015 -16683 38427 93748 59396 106060 6281 9801 -23817 -36776 -23813 -27970 -28564 -40566 -33803
8002 -33803 -46074 24103 -5091 -57107 -25785 -75223 -152410 -97457 -72035 -53186 -42893 -21974
7990 -21974 -59127 -124990 -42640 -31655 -31049 -49557 -35154 -105540 -85109 -57769 -23904 4021
7978 4021 -25490 -55201 -118192 -162524 -91505 96945 41780 -159945 -68313 -44719 -157237
7967 -157237 -210841 -201886 -14405 40703 31604 -96918 -108947 -104226 -45674 -87831 -5348 -51381
7955 -51381 -151847 -142628 -17996 54075 52617 50474 20015 177924 87076 84966 -2927 -19580
7943 -19580 -51081 -62780 -86249 -113218 -117213 -1064 -77151 -146750 -118174 -115317 -121768 -61429
7931 -61429 -40157 -67467 -193884 -124824 -56257 -199192 -89012 -77723 7122 -56862 -203287
7920 -203287 -171254 -114836 -164222 -163719 -125304 -175397 -149328 -54305 -127296 -174307 -109917 -76391
7908 -76391 28694 18594 -95184 -74274 -110093 -59420 -70477 -84556 -46775 -99254 -129343
7897 -129343 -62594 -95658 -196795 -121745 -50234 -111940 -104102 -116098 -44864 -87537 -146845 -138427
7885 -138427 -143333 -137919 -113716 -117451 -185260 -196182 -161847 -193210 -145392 -193521 -155142 -115008
7873 -115008 -118560 -56812 -89296 -106020 -37313 -172810 -293439 -203805 -181349 -108412 -67639
7862 -67639 -46790 -131965 -114709 -41089 -58957 -167825 -220790 -232324 -127551 -95633 -127191
7851 -127191 -206136 -247941 -251751 -186374 -108458 -19323 -101496 -248276 -96192 -43199 -113638
7840 -113638 -115835 -119779 -151468 -49054 -53744 -123922 -86213 -94916 2186 -12146 -159301 -109889
7828 -109889 -36239 -44455 -95448 -32080 -76357 -106940 -154582 -150274 -132658 -81714 -128292 -263784
7816 -263784 -168448 -213837 -141542 -21230 -1239 -64765 -44490 -106040 -86076 5448 -80409
7805 -80409 -199056 -467504 -400213 -235575 -242874 -250155 -140521 -148818 -213469 -194658 -144392 -172201
7793 -172201 -255457 -282278 -285158 -178201 -103021 -80637 -75094 -113475 -164613 -181731 -246210 -146630
7781 -146630 -127799 -134420 -119011 -128884 -104257 -88662 -21581 -51666 -136749 -101433 -159308 -258230
7769 -258230 -193286 -278919 -235260 -124947 -214666 -278368 -179117 -144906 -275232 -167787 -104104
7758 -104104 -61986 -79536 -76218 -119270 -150627 -207919 -197584 -191149 -30393 -121846 -257097 -180736
7746 -180736 -65270 -114857 -202314 -52768 -37625 -78682 -178735 -150273 -253186 -217909 -156850
7735 -156850 -113699 -67562 -79618 -140053 628 -4939 -143651 -217041 -200500 -98536 -117217
7724 -117217 -90922 -178660 -248309 -136650 -137873 -160310 -146674 -109519 -131232 -261290 -272063
7713 -272063 -254011 -161078 -135488 -136520 -245856 -308309 -235402 -183640 -163480 -97060 3282
7702 3282 -118235 -208172 -247687 -176504 -63282 -75236 -112390 -85637 -185283 -128554 -198124 -189634
7690 -189634 -115517 -97968 -237516 -186894 -42356 -196015 -231287 -122584 -144133 -215835 -199662
7679 -199662 -182596 -259554 -238788 -219012 -221838 -143697 -118275 -89245 -159892 -202107 -234052 -176970
7667 -176970 -184321 -169822 -176813 -126939 -162811 -184453 -223178 -160104 -91334 -65879 -31307 -26465
7655 -26465 -23163 -35515 -158071 -139538 -199615 -243254 -122518 -196166 -259882 -130378 -150729
7644 -150729 -152173 -77781 -96199 -129434 -251504 -302532 -197065 -242298 -273423 -139357 -87387
7633 -87387 -207585 -223967 -117537 -90678 -138432 -98837 -52710 -83088 -142826 -147965 -150077 -63985
7621 -63985 -88011 -181189 -114853 -103638 -96667 -163704 -3469 -58027 -22537 -95642 -171670 -147959
7609 -147959 -1981 -25066 -117440 -167811 -160969 -145665 -186458 -54040 -65175 -119679 -143905
7598 -143905 -118849 -102697 -91537 -58293 -27742 -63325 -187718 -145693 -94792 -58694 -121099
7587 -121099 -185060 -152174 -157550 -48962 -62623 -117393 -131375 -129441 -245187 -240985 -164443 -171961
7575 -171961 -174258 -125761 -49077 -81661 -45285 -51085 -115431 -101865 -50186 -63609 -96851 -12159
7563 -12159 -101930 -93514 -78207 -134725 -127570 -137579 -176620 -208784 -95760 -158226 -77130 57827
7551 57827 42661 12427 -142814 -146436 -7465 -17866 -112366 1474 47907 8231 -15830
7540 -15830 -17838 -90082 -63897 -70085 -10064 44573 73341 -71154 -110010 115 -61410 -38482
7528 -38482 -112078 -14655 -20808 -73608 -10944 24880 -5316 -53746 4118 -57186 -91526 -76863
7516 -76863 -45590 13195 54009 36022 -46829 -71178 -79684 -153652 -154062 -89250 -126122 -152451
7504 -152451 -145127 -186809 -112399 -70153 -137409 -114457 -83553 -66339 -62987 -73445 -140636 -111085
7492 -111085 -103217 -99406 -102142 -32965 -99667 -163751 -11838 36776 -29604 -74434 -134413 -97728
7480 -97728 -96453 -71033 -19215 -113660 4542 15025 -82892 -83584 -82149 -65746 -109360 3708
7468 3708 5608 -62502 -16003 -80535 -140961 -126138 -70130 -100891 -50459 -52781 -54732 -132548 -157179
7455 -157179 -118928 -32482 -42364 -49528 -6807 40144 -45809 -120699 -108928 -155442 -36866 62088
7443 62088 35243 -19295 4814 73454 98080 62904 -12200 -86511 -45206 -47737 9698 129374
7431 129374 36275 -8482 17975 38843 6123 -89464 -35034 -25313 -155354 -292433 -191744
7420 -191744 -114529 -37818 -104674 -88637 -67132 -63286 -112667 -108567 -104360 -72213 -94572 -77082
7408 -77082 -101171 -106962 -12051 -59185 -36243 -58093 -81142 -83369 -57159 -94917 -139084 -105452
7396 -105452 -87637 -97798 -108473 -175424 -120586 -112868 -124166 -112876 -30044 29289 -26316 -10123
7384 -10123 -56181 -17488 -121963 -34473 47973 -46749 -70959 -37365 -45206 -7656 -69145 -123212
7372 -123212 -12459 -54730 27182 1958 45304 -28396 -23311 33572 26854 -13537 -29339 -43066
7360 -43066 -119739 -19800 64457 10840 -59514 -87610 -9238 -36166 -46041 -67793 16237 -127373
7348 -127373 -98966 -29170 -94648 -140750 -146426 -106756 -112041 -98442 -173891 -135147 -63995 -52125
7336 -52125 -105921 -119038 -135766 -201410 -129352 2982 3265 -64856 -62920 -87188 -58366 -32963
7324 -32963 -168292 -186562 -171488 -149545 -85604 -29735 -113503 -56130 -81476 -81016 -115526 -192543
7312 -192543 -164736 -124054 -80663 -39817 21155 47998 27063 -31275 -5439 51960 227 51896
7300 51896 4077 41145 135034 8093 38060 -12200 -115813 -117348 -55081 -135027 -156411 -133375
7288 -133375 -137779 -56159 -40633 -51723 -48727 14347 -33751 -78867 -61807 -58550 -74845 -61937
7276 -61937 -56430 -106684 -131029 -39554 -23749 -38651 -52847 -45880 -72409 -46143 14810 -15968
7264 -15968 6517 -70873 -170206 -130380 -110673 -75664 2422 6221 -34223 -105819 -181005 -192327
7252 -192327 -114028 -38202 -32387 -81466 -70234 -12718 55505 64839 17558 57353 -43497 -9437
7240 -9437 -9971 -71971 -139199 -144717 -75277 -33089 -53081 -21946 40051 -72714 -124334 -73641
7228 -73641 -21816 -80219 -18027 -28499 -118321 -114610 39564 32359 -97095 -59465 -40017 -28262
7216 -28262 -3984 -31832 64613 -10724 -8595 2564 -36223 8500 -36441 -67455 7363 16381
7204 16381 3989 -35478 -23619 -56972 -23548 -42612 -16874 7878 -1499 28601 -14227 6523
7192 6523 18957 -2036 -39328 -80348 -152815 -28966 -2980 -25874 -91965 31404 41597 -5066
7180 -5066 50346 -41054 11371 69286 34038 24262 62095 78779 147987 75582 50996 53859
7168 53859 58431 12837 -44521 75485 30207 -66452 -72857 -71488 -66680 -81881 -120489 -59175
7156 -59175 66720 61764 -24980 -34677 -5707 37759 -35062 1196 -21136 -26348 -61384 -52748
7144 -52748 -120671 -166416 -129261 1551 37922 46639 72937 54164 -52650 -37545 64015
7133 64015 -83687 -68336 -36610 -43871 -6619 28771 -105261 -114529 -34621 -81612 -70271 -80094
7121 -80094 -112527 -63802 -12628 -57990 -110679 13481 -9094 -11212 37478 2693 -5050 25713
7109 25713 27389 28673 19180 56547 -32592 71683 120911 87811 98826 106434 121915 110563
7097 110563 192423 141061 200593 138368 35958 70338 26382 43317 68940 5693 8790 12866
7085 12866 -37661 -34018 18798 54677 -12182 13964 1575 -83801 -117594 -134544 -60536 -45613
7073 -45613 -20886 -100410 10621 85845 -78663 -160259 -84930 28746 -50044 83086 115050
7062 115050 -509 2636 6350 -26477 36991 19202 -19454 -44641 -94373 -40756 -42656 -143646
7050 -143646 -116398 -171063 -159732 1268 66955 57178 6524 66030 -10154 -131781 -92384
7039 -92384 -62026 -86668 30107 37299 38270 -8726 -23563 -69666 -43391 -95820 -148872 -93884
7027 -93884 -47011 -50437 -49651 -85704 -68896 -87955 -39540 6938 -89879 -198011 -113623 -110518
7015 -110518 -1537 41050 58763 -43143 -83130 -79755 -61248 113372 67692 19698 -87495
7004 -87495 90305 125744 58961 -8788 28018 -75378 -97137 -51676 -59357 -58290 -19489 -18779
6992 -18779 -312 -2058 49659 -5030 13275 18458 -51070 -111721 -10569 10363 -2592 7042
6980 7042 37307 109624 22942 5787 -34881 41595 -35966 -20035 3983 -33649 -24361 -37375
6968 -37375 15350 14073 44844 97182 -67788 -103267 -62134 -10325 76969 86229 4486 -27272
6956 -27272 38120 127715 108272 -8728 -68162 -147309 -84178 -29301 -39752 12855 83855 85167
6944 85167 -268 38756 -79807 -188577 -20870 106958 192420 141595 134364 94699 95761
6933 95761 79470 66700 75967 -36047 17880 65627 129366 175415 186446 137697 131511 80863
6921 80863 114739 173034 56519 27130 10149 64327 50354 -868 -4755 -42579 937 -37673
6909 -37673 -22057 29474 -28777 -43766 -29814 40873 54068 40001 -42005 -45479 -49243 -74462
6897 -74462 28597 56490 -3632 16643 -30925 20847 61110 41194 18782 -32774 49871 93787
6885 93787 80347 111521 65748 26941 -5457 -22754 5928 -63503 -121334 -111325 -72069 -23271
6873 -23271 -33638 -66621 42611 35812 -38667 81185 201177 160290 137313 50864 28470
6862 28470 34621 91711 136623 178821 122591 96269 119750 34314 -31093 31147 56644 49480
6850 49480 87632 152714 82541 40371 59272 194774 134412 53378 185732 119979 98991
6839 98991 24774 77857 106045 79439 59183 -3091 -37965 2807 24265 70324 50581 24522
6827 24522 4553 92080 145445 96102 24922 -35392 95592 158876 162151 182366 196772 96550
6815 96550 138032 189520 176398 145308 103517 103536 146096 185804 141989 155263 265256 322538
6803 322538 322490 346904 222037 252149 247696 163883 265206 333560 253232 302208 281171 293256
6791 293256 216516 171266 209615 263866 196730 174654 222128 225278 269755 176321 256965 325142
6779 325142 300613 188636 135794 113322 140650 174903 102227 88495 169418 135584 183127
6768 183127 209902 254677 276884 307604 307219 390897 429285 438519 484323 432700 477903 487009
6756 487009 466597 517321 599042 515250 461168 374233 346768 399369 360706 384435 273107
6745 273107 208426 281603 259319 213796 157413 128710 102043 85054 158363 224044 229064 127684
6733 127684 163563 276892 223296 239069 123150 115004 137093 35174 172305 157258 113791
6722 113791 145778 178315 248090 217022 163675 161896 169521 111494 153002 144348 87818 86370
6710 86370 239612 262130 136117 155794 104395 153209 176587 201870 248825 201706 208520 217627
6698 217627 219405 38023 128817 198178 216290 136870 74103 18474 44809 135832 143677 115743
6686 115743 1077 37004 -5496 46544 134245 118153 165987 130384 177692 233658 208413
6675 208413 175726 156161 151934 80272 50193 96325 142145 99106 138536 120310 100684 105244
6663 105244 64587 133656 273023 187711 154245 288877 272990 169070 193408 241194 163234
6652 163234 97274 126711 138108 166108 148900 141028 169142 184198 145606 174800 168140 169053
6640 169053 165385 232904 223607 101176 135193 199105 261954 257530 275026 149415 190214 125281
6628 125281 -2420 79549 190734 235870 129390 145928 153323 202485 152865 239526 235349
6617 235349 136055 95809 76075 106662 38410 27007 110869 80590 172537 233747 213784 256095
6605 256095 158547 241361 209421 184517 278933 301916 181217 115051 168431 243187 275447
6594 275447 244390 309429 299499 253329 300442 171532 89386 127268 197499 276249 164309
6583 164309 213730 281792 263551 139075 116425 97577 195209 220589 260589 172634 255210
6572 255210 350832 270204 187343 168342 187856 172600 269533 283600 222186 223629 217459 236709
6560 236709 227965 264539 243855 181587 281957 225963 272205 294810 238112 205992 324144
6549 324144 301080 241704 249608 342250 393531 388670 385472 447114 384040 398504 382541 386204
6537 386204 292096 299841 355575 378674 437530 355502 326721 405677 382292 368309 339719 359745
6525 359745 253311 303339 381473 345532 374435 384915 408243 280860 389254 455928 387753
6514 387753 362584 420940 423832 408456 423859 429145 414925 363629 433759 445843 430406 521516
6502 521516 580859 529852 552706 468810 552566 633710 614181 575248 560919 595036 598136 763676
6490 763676 677538 648889 677870 662957 686486 698065 641937 628055 737274 804894 687740
6479 687740 660233 752366 837652 803417 741627 831864 774520 843537 796358 797267 937469 953810
6467 953810 1002660 1026256 1047838 1030153 1055731 1084192 959945 843709 943546 886803 800519
6456 800519 667225 775343 828822 775086 770922 708022 688065 658943 697560 754200 711503
6445 711503 724787 762625 795839 861822 877132 1000166 987800 1056544 1111706 829885 769641
6434 769641 839750 840615 750456 722634 843560 818237 807905 694252 676247 756685 752965 876293
6422 876293 799348 731506 791260 722305 650847 709363 644786 715287 697121 744597 776244 813421
6410 813421 740853 685194 776010 768106 786351 720677 721739 826642 810452 711517 800066 840561
6398 840561 862341 814396 735136 770915 697033 784269 881280 854093 901978 833198 917371 911589
6386 911589 951273 943938 947186 974435 956464 1069844 1071559 1042312 1111577 1163730 1183666 1119010
6374 1119010 1110652 1153181 1153747 1101051 1156740 1098285 1194818 1205259 1118876 1121460 1147140 1227539
6362 1227539 1288833 1247566 1238575 1289930 1175509 1280885 1374645 1377205 1408208 1537096 1458325
6351 1458325 1414883 1439977 1479249 1529326 1497598 1546098 1505892 1529430 1671064 1691276 1700183
6340 1700183 1687880 1605286 1544257 1578128 1671578 1583766 1489789 1543565 1627107 1599776 1603849 1677415
6328 1677415 1767278 1862505 1820401 1699997 1699119 1672010 1766615 1786114 1750969 1786336 1856847 1917486
6316 1917486 1901671 1960874 1916195 1952396 1984906 2018887 2092869 2060319 2053097 2112445 2139549 2289755
6304 2289755 2400882 2420906 2368768 2442167 2434490 2359086 2407610 2415017 2370919 2310241 2359525 2478075
6292 2478075 2529592 2472517 2458000 2345760 2463895 2460027 2536757 2636599 2593453 2489219 2559410
6281 2559410 2639979 2670737 2758383 2757873 2779925 2698039 2740659 2867097 3011594 2982069 2992541
6270 2992541 3129922 3211098 3298243 3395704 3420928 3526532 3547341 3592704 3712574 3813742 3954785
6259 3954785 4008763 4078021 4156722 4249952 4401066 4497998 4620009 4880048 5054173 5122080 5239518
6248 5239518 5269970 5399465 5535387 5696867 5711751 5781902 6083596 6337293 6626587 6708905
6238 6708905 6917681 7059584 7309607 7584566 7747200 8019205 8386961 8588294 8873847 9035433
6228 9035433 9241494 9453426 9730514 10009081 10366996 10620202 10910934 11291395 11528883 11907317
6218 11907317 12166578 12542048 12856224 13197166 13646275 14073390 14466174 14977602 15285873
6209 15285873 15806924 16463299 17119206 17706236 18517205 19299004 20049207 20980597 21965310
6200 21965310 23118049 24298937 25489216 26827017 28214133 29721344 31261342 33007326
6192 33007326 34987513 37210750 39697467 42812628 46336373 50236788 54743662 59558928
6184 59558928 64248467 68090066 70175943 69769889 67326689 63985543 60546714 57859281
6176 57859281 55873128 54627159 54055497 53968945 54422127 55170461 56288318 57676310 59373694
6167 59373694 61430696 63985188 67145144 71154848 75998973 81873133 89087914 97465520
6159 97465520 106693710 115923157 123305579 126569547 124352002 116749166 106370195 95825373
6151 95825373 86568871 79134858 73094721 68406530 64693811 61684462 59251210 57341961
6143 57341961 55928666 54852012 54267768 53911112 54023731 54729643 55973328 57897127 60589674
6134 60589674 64043117 67751254 71376031 73868052 74239435 71715529 67036351 61378518
6126 61378518 55647850 50454517 45890554 41927696 38518240 35468142 32728995 30236282
6118 30236282 28163229 26272893 24798526 23458265 22183847 20967407 19816384 18827939
6110 18827939 17899025 17059654 16184205 15386433 14823648 14257629 13825864 13354452 12987677
6101 12987677 12593646 12258753 12008426 11684827 11390498 11204296 11053074 10876702 10757736
6092 10757736 10628053 10556905 10385231 10379073 10173393 10020501 10004928 9959181 9974526 9875308 9873277
6081 9873277 9848505 9852894 10082374 10153268 10388498 10565152 10812698 10990892 11105307 11016581
6071 11016581 10904759 10883967 10705499 10693965 10628852 10831513 11019774 11161199 11345333 11744770
6061 11744770 11972956 12135302 12404508 12574665 12784733 13070236 13434100 13821088 14152700
6052 14152700 14482092 14769834 15011999 15386002 15840586 16469027 17147288 18056335 19034488
6043 19034488 19943337 21001381 22114025 23421788 24948792 26491572 27719045 28318226
6035 28318226 28206464 27508210 26474461 25273203 23954725 22822329 21973409 21345152 20995058
6026 20995058 20784730 20794872 21002892 21482940 22040449 22926738 23806508 24937467 26372887
6017 26372887 28025692 30031905 32390431 35179735 38202404 41322536 44052672 45472324
6009 45472324 45209134 43089712 39713065 35898405 32318431 29273030 26850264 24999952
6001 24999952 23394350 22257182 21242376 20405617 19900748 19626950 19489093 19475867 19729644
5992 19729644 20085897 20620987 21333268 22287539 23439555 24776155 25922661 26887892 27442136
5983 27442136 27292290 26149266 24320824 22196389 20130759 18293720 16618677 15085951
5975 15085951 13917602 12889592 11937808 11268840 10594944 10047753 9639810 9329599 8913480
5966 8913480 8565807 8246734 7970779 7734437 7531900 7293676 7067054 6802831 6517096 6430920
5956 6430920 6337344 6122067 5991667 5808130 5648580 5496601 5453335 5313618 5296730 5237235
5946 5237235 5108365 4908492 4805857 4802111 4777073 4644911 4560305 4540085 4629968 4614043 4542367
5935 4542367 4438569 4518688 4541263 4473006 4475637 4393072 4433759 4482711 4490369 4462848 4484311 4474804
5923 4474804 4407852 4408321 4489114 4585014 4599483 4487456 4465181 4530085 4537132 4546906 4743794 4793384
5911 4793384 4813202 4813856 4901110 4863826 4894830 4966861 5183860 5305190 5373219 5553684 5651720
5900 5651720 5708869 5636309 5586837 5667416 5836100 5892578 5945022 6061191 6208472 6380425 6414119
5889 6414119 6533389 6733821 6940536 7085893 7231799 7280601 7533631 7670052 7851516 8122775
5879 8122775 8179601 8388920 8620740 9036229 9298513 9492295 9737001 9935198 10179835 10541841
5869 10541841 10803274 11187164 11588927 11971363 12393348 12803198 13376620 13950469 14220311
5860 14220311 14468273 14730965 14996830 15211740 15444947 15803979 16230105 16753941 17292145
5851 17292145 17844891 18554102 19158704 19713735 20356821 20987470 21738747 22575005 23473503
5842 23473503 24464140 25376375 26390313 27370477 28475758 29821120 31457510 33232423 35325803
5833 35325803 37696203 40355997 43339996 46916173 51375498 56739323 62988350 69734365
5825 69734365 76276109 80207637 79903861 76073985 71303939 67401084 64727708 63356712
5817 63356712 63395780 64801746 67242715 70763291 74779714 78155472 79614718 79542756 79706223
5808 79706223 81139377 84138034 87922101 91108336 91985384 89721422 85009986 80033443
5800 80033443 76321236 74250056 73679268 74459447 75372073 74992323 72372943 68386342 64862334
5791 64862334 62736433 62152888 62914251 65094116 68585142 72930657 77339214 79551198
5783 79551198 77378352 70595115 61845195 53552513 46838347 41378751 36739496 33077090
5775 33077090 29987284 27450754 25355264 23483655 21887661 20513940 19327582 18213178
5767 18213178 17263642 16386767 15542175 14896330 14211013 13592396 13128024 12572595 12142446
5758 12142446 11899162 11468595 11134821 10807041 10545523 10237746 9884420 9687276 9431326
5749 9431326 9170784 8971776 8598296 8428749 8279323 8041878 7857223 7646635 7666723 7593254
5739 7593254 7426882 7254381 7159063 7047683 6923400 6850514 6708526 6780695 6793913 6673363
5729 6673363 6487523 6405294 6356873 6268452 6091067 5982985 6003237 6002407 5862107 5746559 5736963
5718 5736963 5753536 5728281 5755722 5670658 5649677 5568709 5594579 5596500 5549202 5519747 5503588 5647978
5706 5647978 5647911 5618410 5587405 5582434 5709202 5790498 5853288 5853499 5836327 5894210 5860519 5810454
5694 5810454 5836319 5836696 5879265 5867957 5897592 5954921 6003778 5989609 6142605 6306119 6429706
5683 6429706 6607292 6756382 6903352 7007684 7082067 7258883 7556076 7755044 7747536 7745016
5673 7745016 7904472 7993799 8060932 8099455 8197232 8209271 8387890 8502171 8712296 8756113 8899085
5662 8899085 9219742 9471364 9704593 9928598 10116821 10316584 10485004 10706338 11006026 11219317
5652 11219317 11470882 11795509 12090570 12469975 12768127 12973213 13380859 13691255 14057797
5643 14057797 14439502 14836851 15293410 15754258 16245437 16764327 17479521 18176237 18760339
5634 18760339 19330923 20256789 21036402 21878329 22830307 23904352 25124028 26528469 27963855
5625 27963855 29508910 31103960 32744257 34590145 36486364 38620054 41097758 43799018
5617 43799018 46836289 50320426 54294700 58987742 64202376 69839480 74985407 78501509
5609 78501509 79176061 77006881 72893196 68358322 64559114 61658656 59670221 58615473
5601 58615473 58174711 58545087 59356753 60349200 61606967 63041341 64741474 66905851 69390071
5592 69390071 72358112 76034774 80850063 87076521 94665457 103602624 113207502 121886728
5584 121886728 126532475 124922216 117441374 106849385 96165261 86846556 79134884 72888472
5576 72888472 68056096 64440282 61806604 59844936 58576676 57661225 56860080 55886846 54946787
5567 54946787 54278716 53809125 53948238 54743737 56173532 58382204 61065592 64025613 66464482
5558 66464482 67491819 66172873 62543199 57626870 52336266 47589788 43699235 40306947
5550 40306947 37538007 35131868 33009893 31181164 29653464 28437000 27459516 26529323
5542 26529323 25507057 24504683 23386020 22390870 21382452 20513634 19640740 18955460 18496773
5533 18496773 18042345 17590892 17061966 16601171 16394061 16116925 16024227 15863146 15782110 15704792
5523 15704792 15678189 15631408 15598645 15638221 15688601 15791740 15874666 16123105 16444814 16724150
5513 16724150 16820570 16610897 16189709 15784400 15414213 15057540 14901536 14766976 14697414 14598613
5503 14598613 14606221 14624515 14598039 14551367 14571113 14588448 14548510 14716468 15041091 15239105 15474135
5492 15474135 15765056 15734894 15604205 15642575 15792288 15895057 16111628 16435837 16608134 16578562
5482 16578562 16403978 16043638 15882999 15678011 15455402 15397634 15399322 15426909 15456134 15481066
5472 15481066 15372946 15173358 14926671 14788135 14815807 14899902 15150254 15391523 15692822 16027777
5462 16027777 16486736 16723638 16863540 17064743 17257036 17454363 17562034 17489791 17520042 17805438
5452 17805438 17988271 18303345 18868042 19516046 20271962 20999020 21849494 22965307 24281644
5443 24281644 25844387 27447581 29364052 31480252 33542445 35168500 35943004 35852684 34765036
5434 34765036 33226229 31665287 30183493 29054323 28314282 27774636 27576682 27606941 27914289
5425 27914289 28354365 29064642 30097737 31325524 32761413 34505236 36683955 39351726
5417 39351726 42746260 46824149 51539084 56989446 62708944 67153054 68722012 66490368
5409 66490368 61472257 55609126 50141039 45231944 40975213 37461940 34706537 32311781
5401 32311781 30424191 28984150 27904116 27040311 26506504 26060370 25737989 25631148 25740925
5392 25740925 26168815 26686678 27476231 28530378 29518677 30612728 31698139 32333600 32396810
5383 32396810 31433295 29655169 27530674 25572040 23709556 22127094 21017728 19970397
5375 19970397 19007321 18067145 17248846 16583850 15988562 15549284 15202526 14806813 14483345
5366 14483345 14285148 14032982 13908664 13714616 13652829 13332406 13250159 13168385 13001795 12885369
5356 12885369 12960076 13033362 12984757 12984665 12826961 12757240 12635821 12635518 12698970 12659334 12586046 12652724
5344 12652724 12760107 12947882 13152699 13335293 13487219 13651915 13755037 14092184 14429821
5335 14429821 14598073 14707745 14867704 15122831 15400934 15579160 15840364 16254753 16533528
5326 16533528 16944905 17365603 17851495 18408603 18926225 19428351 19951875 20432488 20937809
5317 20937809 21673462 22467752 23084789 23822604 24648595 25510117 26209744 26713907 27113761
5308 27113761 27624934 28266798 28826404 29444188 30208584 31169920 32205744 33369662 34567003
5299 34567003 35636493 36687312 37699377 38687253 39564751 40477953 41374866 42025459 42553851
5290 42553851 43147358 43769508 44383640 45256206 46438138 47699834 49097423 50596849 52102686
5281 52102686 53714611 55338652 57037485 58655888 60434684 62379702 64185517 66254490
5273 66254490 68554659 70938153 73728714 76745016 80057247 83833036 88097552 92758026
5265 92758026 97356677 101479025 105421009 109691985 114785615 120157710 124995001 128089074
5257 128089074 129822421 131550999 134381360 138624622 144453525 151911528 160617041 170353029
5249 170353029 180674810 190821029 200837714 211769920 225008856 242090719 264699635
5242 264699635 293977826 329827513 371615745 417078629 459606492 483326155 472828844
5235 472828844 430114246 374409377 323388717 282163188 249225127 222728175 201955586
5228 201955586 185891601 173698800 164456156 158022688 154096379 152462586 152716111 154369869
5220 154369869 156587417 157271013 153972373 146345770 136717709 127988153 121158901 116128447
5212 116128447 112839105 111248960 111148575 112120463 113626952 114325693 113127750 110499375
5204 110499375 108226410 107479441 108564696 111135095 114480121 117261176 117725391 114835878
5196 114835878 109722183 104271443 100083975 97628063 96590387 95589523 93371122 89472105
5188 89472105 84498550 80128212 77244755 75654939 75401328 76395517 78552677 81542353
5180 81542353 85004120 87752667 87413544 82935054 75640423 67787869 61071513 55455724
5172 55455724 51125631 47473284 44511972 42090204 40158548 38575647 37193381 35902723
5164 35902723 34466347 33020701 31544754 30298249 29232211 28266448 27433202 26716912 25971629
5155 25971629 25284818 24704238 24215034 23842704 23625297 23341056 23109642 22864354 22680319
5146 22680319 22535783 22432936 22374979 22251494 22203812 22291077 22348343 22463274 22613153 22949594
5136 22949594 23154406 23381107 23686623 24160764 24785846 25483583 26337004 27158380 28271113
5127 28271113 29524208 30930020 32642931 34524317 36588380 38837574 41545945 44829775
5119 44829775 48916976 53941642 59942619 67127298 75042422 83138946 89708439 91850386
5111 91850386 87734128 78987129 69016187 60130523 52898216 47122109 42276432 38333709
5103 38333709 35117168 32192654 29642328 27330884 25270610 23577470 22207024 20918096
5095 20918096 19849414 18973617 18065621 17211700 16424057 15773733 15341546 14929279 14567426
5086 14567426 14252564 13936519 13637292 13392897 13153268 12951945 12628891 12611911 12565216 12643665
5076 12643665 12863504 13188089 13712117 14233102 14671437 14807666 14619723 13910544 12918604
5067 12918604 11925168 10992602 10289663 9757190 9331945 8941057 8630184 8460926 8154450
5058 8154450 7865570 7706046 7587416 7464435 7459927 7443827 7360588 7395732 7449136 7561982 7685382
5047 7685382 7693642 7877923 8168426 8497804 8981599 9522225 10196190 10904047 11433371 11421226
5037 11421226 10939362 10152509 9286485 8539475 7874301 7307607 6833631 6399734 6094297
5028 6094297 5885116 5589938 5373851 5357057 5224987 5135541 5029635 4930855 4916213 4805388
5018 4805388 4839867 4795265 4773347 4903465 5034931 5158504 5255522 5463439 5609835 5954282
5008 5954282 6312760 6506521 6691722 6683891 6677418 6724731 6691075 6709582 6600276 6255469 5850915
4997 5850915 5505242 5148761 4861917 4622570 4478562 4207028 4006491 3964239 3753440 3574926
4987 3574926 3495890 3435479 3496518 3520526 3389022 3274170 3283832 3428419 3278058 3250860 3241484
4976 3241484 3294372 3297728 3254064 3270408 3400607 3480550 3606013 3611596 3651431 3809456 3888920
4965 3888920 3908203 3776179 3655935 3570317 3531490 3513625 3392771 3367619 3249329 3204114 3160719
4954 3160719 3146608 3208963 3142604 3139225 3131486 3073757 3089339 3090091 3126381 3232931 3222873 3256966
4942 3256966 3367472 3412893 3421452 3434722 3472574 3611390 3648053 3654964 3685081 3771153 3819622
4931 3819622 3940688 4098803 4039799 4010744 3961735 3829363 3725481 3697157 3691590 3674462 3676196
4920 3676196 3572828 3572507 3663520 3694540 3683249 3700225 3627013 3593305 3623583 3530965 3556369 3643257
4908 3643257 3605404 3616970 3807095 3744487 3619911 3698434 3768325 3749800 3913689 3958914 4022629
4897 4022629 4132550 4143551 4195888 4241414 4204712 4147698 4189434 4148682 4266641 4247980 4257334
4886 4257334 4352311 4517046 4630501 4727401 4760749 4931184 5259751 5517476 5777107 5979125
4876 5979125 6328271 6688421 7126358 7720230 8375182 9202330 10268353 11583166 13122560
4867 13122560 14618614 15399368 14812386 13080582 11298195 9932773 9054872 8423600 7849237
4858 7849237 7453768 7034642 6830825 6479808 6157628 5848645 5472868 5234652 5089636 5041928
4848 5041928 4914632 4866178 4821077 4657180 4464392 4294016 4052090 3937455 3907777 3865455
4838 3865455 3852463 3846210 3818229 3696138 3719042 3794340 3688760 3600068 3391465 3253658 3150721
4827 3150721 3205240 3253137 3163916 3208410 3125479 3091529 3164977 3019336 2973780 3039972 3026495
4816 3026495 3154886 3222215 3358670 3409409 3407695 3465111 3424090 3425920 3395711 3433563 3410213
4805 3410213 3468664 3550894 3647352 3700873 3747963 3889171 3967504 4034006 4106117 4244463 4413766
4794 4413766 4561344 4840693 4995148 5046568 5020749 5006749 4991054 5081021 5061706 5031574 4935018
4783 4935018 4964297 4985853 4938036 4968990 5037045 5218906 5451247 5567391 5688267 5884525
4773 5884525 6029822 6257384 6513103 6784590 6997615 7257424 7588480 7808248 8036734 8291440
4763 8291440 8518558 8758920 9007592 9234552 9428048 9662754 9981332 10222686 10409178 10642276
4753 10642276 10852877 11135905 11443165 11771980 12174258 12345330 12598129 13031100 13212778
4744 13212778 13546441 14151037 14518758 14812432 15266799 15810519 16280785 16689996 17293881
4735 17293881 17969947 18556870 19263546 19933355 20538016 21160617 21835840 22465064 23168162
4726 23168162 23792054 24475986 25162970 25822739 26744543 27546741 28426665 29375362 30501574
4717 30501574 31397161 32382760 33516752 34920836 36308546 37710290 39120450 40945479
4709 40945479 42885178 44934686 47434769 50320778 53592816 57392662 61819877 67106743
4701 67106743 73133590 80129896 87830722 96467205 105743182 116332141 128252604 143263109
4693 143263109 162376203 187303252 218370170 255474281 298281904 345223844 376584493
4686 376584493 368920054 322477529 263825558 216012917 180450103 153299552 130981280
4679 130981280 113683734 100008162 89118990 79972643 72453479 66122923 60745510 55992029
4671 55992029 51916027 48283166 45219269 42210908 39587523 37150352 35036609 33153621
4663 33153621 31403336 29754187 28463177 27281760 26300155 25298982 24600738 23984156 23422705
4654 23422705 22754598 22228810 21797296 21485526 21042577 20719511 20516493 20545709 20651895 20984144
4644 20984144 21560745 22483498 23648910 25326865 27242523 28933028 29156548 27142879 23853789
4635 23853789 20844051 18675175 16927974 15415659 14293443 13414947 12600867 11852043 11255608
4626 11255608 10675055 10280160 9918753 9382517 8992727 8627705 8414799 8055570 7781155
4617 7781155 7621714 7284970 6963570 6729597 6476777 6361998 6164365 5983301 5827623 5687271
4607 5687271 5483756 5415338 5274223 5220589 5139427 4948868 4853602 4771880 4680201 4515347 4412780
4596 4412780 4401216 4292591 4217727 4097731 4042159 3829402 3634876 3538799 3403620 3260106
4586 3260106 3234459 3184105 3178737 3130751 3172248 3152070 3037087 3010882 2927946 2917385 2922226 2851206
4574 2851206 2870569 2806025 2796144 2685902 2631985 2454313 2429393 2395015 2333120 2363783 2312239
4563 2312239 2269258 2268755 2222656 2149609 2090757 2140106 2075407 2045782 2067310 2104932 2031538 2066017
4551 2066017 1985629 1879487 1826378 1811013 1760716 1659293 1621736 1633530 1713784 1681270 1617621
4540 1617621 1552572 1540595 1577491 1606525 1477088 1525807 1521488 1498511 1508665 1587631 1553216
4529 1553216 1436736 1371016 1392526 1404934 1418817 1472411 1441495 1376893 1407153 1391435 1325658
4518 1325658 1366333 1421165 1370078 1258019 1247897 1158863 1218028 1263116 1228192 1305228 1277194
4507 1277194 1290574 1342774 1333503 1363657 1333570 1195420 1206566 1210174 1378297 1384932 1369114 1389268
4495 1389268 1500707 1510743 1510289 1488034 1344160 1236264 1329467 1441496 1366758 1494034 1530344
4484 1530344 1603256 1620695 1675587 1696010 1724937 1685241 1737926 1905896 1973600 1903995 1900531
4473 1900531 2122244 2207657 2234599 2277710 2363777 2436997 2561712 2758411 2878662 3159519
4463 3159519 3323518 3532372 3837031 4185542 4541292 4800563 5197524 5864940 6616383 7563550
4453 7563550 8651278 10027624 11807619 13459192 14565043 14374940 12784641 10626775
4445 10626775 8843856 7538711 6492284 5745643 5138372 4628713 4248579 3815384 3519142
4436 3519142 3262375 3075799 2865837 2679897 2540789 2510084 2297581 2148315 2138616 2144895
4426 2144895 1856321 1782500 1819439 1712168 1514874 1569350 1588114 1442504 1413216 1251052
4416 1251052 1259987 1342284 1254601 1184298 1233394 1287605 1275833 1054436 1031516 1068578 1112748
4405 1112748 1107486 1003745 964259 1018092 978660 864431 882082 921635 1030396 1144456 1119340
4394 1119340 1110396 1187824 1193751 1099818 1064217 1066072 1171534 1180076 1274908 1275103 1261769 1312502
4382 1312502 1331322 1298855 1334548 1278759 1250031 1384699 1541676 1760074 1889572 2007703
4372 2007703 2158604 2322890 2380710 2468552 2204442 1980001 1752018 1539687 1363095 1263127
4362 1263127 1170139 1071750 1096586 1022679 987314 973221 887470 852119 860794 894085 824852 729498
4350 729498 667934 699740 731184 675767 753954 698932 783052 801167 711548 822679 823282 905320
4338 905320 930775 902140 1000299 1050891 1189176 1313444 1506591 1652496 1737087 1590372 1405190
4327 1405190 1376442 1167887 955240 928391 843905 783759 664196 583195 528148 496100 520119
4316 520119 533800 447034 489869 416706 393734 504086 339767 316042 391491 311615 357782
4305 357782 335343 370350 367312 465187 406493 327076 343996 336566 319933 349601 367593 269727
4293 269727 323281 260906 316901 373931 322860 310455 276086 265750 303701 182473 194102
4282 194102 179916 109452 137831 166721 149700 127663 136250 161314 155155 263530 351611 316260
4270 316260 268743 249140 187448 157649 248662 237490 223650 189351 102559 91275 137752 230513
4258 230513 281101 234549 281147 226986 121228 202518 278662 249321 241576 292644 287157 369967
4246 369967 377248 306627 305050 253131 280445 180214 194063 256773 334133 285418 200539 186784
4234 186784 312508 347711 228398 264661 292065 323277 260432 204274 242878 269072 241408
4223 241408 246651 160232 196176 258984 246008 318670 266187 200980 166424 195675 235296 164491
4211 164491 233306 298285 297232 315507 327724 323215 287666 245115 271985 332112 380614 327715
4199 327715 294870 226095 228399 327197 411449 417424 333309 145053 261886 282537 327189 325099
4187 325099 292700 372391 422645 358686 370836 440049 519357 435782 471623 524166 394352
4176 394352 265474 341927 494430 550363 559083 572813 549460 530010 538351 559299 668183
4165 668183 614250 649894 618308 587633 575031 623945 539449 506497 548572 489724 508279 452465
4153 452465 375316 378546 383902 372622 461723 535316 486186 430500 367225 427854 515434 568594
4141 568594 542992 530520 565482 517333 393643 501535 527814 544662 568282 488708 498090
4130 498090 544952 513288 481456 485921 426436 459468 475786 519361 547584 494303 608310 763733
4118 763733 818969 754174 774990 751323 919504 1050547 1138089 1310578 1399482 1322365 1230057
4107 1230057 1163011 1063131 917420 858136 937257 854014 773152 724427 609740 563317 525595
4096 525595 647540 678038 669028 656552 765346 813063 837925 873414 877289 858556 815591 792579
4084 792579 772110 789450 815740 748241 664298 815019 817132 831781 967862 1015214 1035881
4073 1035881 1099829 942143 878916 842299 762351 804439 915614 946300 999595 1119709 1313699
4062 1313699 1346390 1248064 1043913 926534 818724 673471 668229 564035 463286 441608
4052 441608 422446 428863 472500 434396 399682 390607 361432 386386 309686 304740 350654 374889
4040 374889 329694 263873 214857 239555 273866 242452 284703 258009 321421 313267 226497 256420
4028 256420 297804 257278 104177 136397 242968 273267 227593 179484 108618 194642 184079
4017 184079 130676 159973 218022 220247 226433 296724 287363 218140 167826 190431 156229 103518
4005 103518 93513 155054 137964 79846 142945 220838 241825 304896 306495 250918 256253 247285
3993 247285 155007 212262 322379 321108 358067 282129 168868 146447 187625 241547 267334
3982 267334 230375 249581 224469 73911 148501 266054 196098 101489 94524 192795 261086
3971 261086 237894 274930 308624 334606 275668 266293 220587 229834 216137 277727 297887 376135
3959 376135 350911 370802 281231 304732 383286 189068 246640 320788 296774 298301 320165 283613
3947 283613 193383 279695 372769 357061 369010 252214 244010 327418 292913 352623 318433 332500
3935 332500 326580 287619 317397 346094 293215 343921 352929 322945 468492 400141 310699 340170
3923 340170 296270 250580 199757 262666 357669 348558 328642 332762 354511 297485 389698 391310
3911 391310 393026 357548 458858 416167 378014 333983 330726 471260 498050 452625 445799 455067
3899 455067 454076 422439 372902 385333 441388 485709 448115 399486 452930 468291 562650 483002
3887 483002 445511 460273 553168 448999 493561 499699 433230 394228 399474 429105 489499 508537
3875 508537 467152 548318 618449 701088 764065 685633 539650 605262 611451 672160 645762 633342
3863 633342 661936 619728 473453 587057 638801 722231 707963 667558 655527 740728 792857
3852 792857 752127 743733 682699 755509 804149 832022 844453 865573 806767 880341 973375 973180
3840 973180 965005 980837 957522 847750 929469 971087 974102 971363 1030012 1030187 1043406 1018372
3828 1018372 1123950 1144488 1069093 1056828 1085273 1131702 1185516 1318155 1432037 1505161 1496750
3817 1496750 1618993 1636191 1599703 1633737 1608227 1533755 1513601 1442958 1503692 1611723 1620226
3806 1620226 1756370 1770323 1968274 2042691 2089981 2067545 2095020 2135134 2102958 2100986 2173037
3795 2173037 2215214 2261531 2165199 2125540 2210902 2292689 2445945 2624173 2817237 2932691 2871365
3784 2871365 2716102 2608750 2419917 2197943 2038157 2003937 2047982 2116566 2038339 2016328
3774 2016328 2017871 1987813 1929535 1914763 1925509 1984362 1882551 1786655 1638980 1677992 1686102
3763 1686102 1590188 1597825 1580465 1661134 1698069 1780261 1801961 1715639 1707281 1687502 1662787 1577088
3751 1577088 1496195 1444919 1359736 1291677 1292945 1312246 1435908 1467990 1419655 1454135 1452949 1430241
3739 1430241 1413559 1359368 1344758 1438417 1320550 1208977 1350485 1283920 1295623 1336447 1244985
3728 1244985 1232062 1360470 1425763 1359226 1424404 1420456 1418863 1438153 1430195 1486643 1460892 1530976
3716 1530976 1571169 1689089 1683000 1616376 1690558 1722006 1738461 1762705 1731905 1777197 1836153
3705 1836153 1803294 1804081 1920737 1909177 1907650 1953846 2002285 2021675 2103727 2107879 2066368 2109509
3693 2109509 2175052 2234423 2172129 2274480 2331515 2295770 2298689 2429425 2521559 2518845 2619886
3682 2619886 2626920 2804087 2796844 2799983 2892657 2925072 3147601 3309162 3429897 3500057 3645369
3671 3645369 3629894 3802555 3998128 4134168 4353360 4556517 4791582 5142405 5437599 5971588
3661 5971588 6360116 6781258 7381129 7846028 8422261 9202003 9965748 10694707 11381697 11944455
3651 11944455 12131760 12035940 11567351 10897974 10181702 9300581 8473049 7753932 7111096 6533931
3641 6533931 6103618 5718963 5298983 4904199 4638847 4323956 4119633 3904070 3629628 3512507
3631 3512507 3451829 3376650 3235517 3149577 3154638 3010117 2898706 2786957 2668038 2667416 2626753
3620 2626753 2541082 2512753 2516458 2434913 2407396 2392588 2230343 2178355 2190513 2170767 2111659
3609 2111659 2148823 2077790 2066011 2045624 2039121 1982807 1972023 2073965 2121644 2115357 2045754 1944509
3597 1944509 2032195 2122526 1997573 1929831 1887391 1938048 1946390 1975379 1942586 1891480 1859123
3586 1859123 1884532 1749972 1817670 1882853 1849678 1899715 1846545 1936493 1953634 1906422 1950673
3575 1950673 1827750 1855278 1951123 1904828 1997103 2021923 2072034 2021237 1975385 2031399 2115173
3564 2115173 2014316 1900249 2010348 1988560 1982372 1878551 1900205 1995678 2050763 2134132 2176609
3553 2176609 2093072 2114110 2161144 2157069 2173175 2067779 1979652 2052393 2065949 2086702 2019055
3542 2019055 2143800 2142718 2102138 2205756 2151514 2173971 2158640 2177157 2195322 2249679 2282631
3531 2282631 2370787 2422763 2412963 2299095 2246188 2280466 2242236 2097511 2055928 2098114 2125909
3520 2125909 2205113 2124895 2113045 2176828 2184879 2169075 2121735 2106224 2098689 2149248 2146115 2226211
3508 2226211 2175487 2024831 2093711 2109206 2041991 2069703 2034236 2182654 2262015 2182687 2158010
3497 2158010 2180960 2155792 2232211 2130416 2109616 2095018 2043949 2108507 2164451 2021112 1997622
3486 1997622 1959132 1950829 2046604 1966039 1962820 1928075 1950943 1987730 1979124 2029465 2047379 1968143
3474 1968143 1901168 1955892 2017840 1971771 1989229 2040786 2021097 1960420 2049400 2051113 1975276 1927889
3462 1927889 1943131 2023443 2037807 2020422 2012490 2039937 2049894 1984648 1959224 1945152 1904802 1892663
3450 1892663 2010736 1962532 1953024 2004869 1991190 1865277 1955245 2023992 2015079 2039844 2037353 1966686
3438 1966686 1980380 2146534 2177400 2199607 2173554 2181382 2162434 2161638 2261113 2300363 2274940 2379879
3426 2379879 2336257 2335422 2495441 2577047 2477753 2384092 2481226 2450360 2503474 2581175 2523363 2482856
3414 2482856 2520040 2592449 2526631 2542602 2561883 2619316 2573630 2604182 2613460 2543235 2527347 2602732
3402 2602732 2615635 2744163 2878121 2824414 2923264 2879376 2957386 3031388 2968755 2917431 2986091
3391 2986091 3085031 3134730 3189128 3256619 3299264 3296343 3287711 3282803 3318785 3355611 3323393 3383087
3379 3383087 3510981 3649656 3654058 3678099 3707026 3660772 3738017 3753757 3790434 3731963 3762995
3368 3762995 3729334 3694167 3809311 3805076 3848706 3894523 3953876 4028443 4174901 4243555 4220883
3357 4220883 4323920 4479750 4621602 4789096 4795439 4804926 4874457 4976139 4993147 5137825 5252883
3346 5252883 5290658 5362818 5456502 5480487 5521571 5657671 5793484 5821625 5830337 5866374 5959641
3335 5959641 6134727 6279669 6309709 6334202 6395416 6575110 6664210 6722406 6790391 6934172 7151234
3324 7151234 7229061 7410147 7623257 7794876 7868426 7953954 8133534 8259067 8443929 8568511
3314 8568511 8718285 8948254 9141546 9330413 9468740 9669002 9771992 9894247 10079503 10430758
3304 10430758 10663610 10882611 10974907 11064804 11265730 11492234 11599027 11882976 12267786 12510951
3294 12510951 12907525 13160073 13445508 13870526 14231629 14822054 15440065 16069500 16684436
3285 16684436 17252622 17912588 18672958 19469208 20210062 21075409 22038776 22943028 23968831
3276 23968831 24834298 25606034 26398379 27078690 27540136 27906706 27922753 27500099 26887373 26144463
3266 26144463 25277206 24252947 23222418 22348815 21385627 20554347 19889879 19162338 18429242
3257 18429242 17977910 17484603 16999853 16499236 16090665 15758919 15501611 15360299 15057059
3248 15057059 14772405 14539078 14432729 14254759 14283823 14127754 14001053 13961997 13982054 13905410
3238 13905410 13789743 13559087 13353442 13220319 13221339 13259717 13299046 13326609 13504174 13801663
3228 13801663 14180548 14762623 15204436 15926348 16733294 17078021 17027873 16326814 15380626 14494410
3218 14494410 13728335 13072695 12525996 12064445 11590360 11331536 11005545 10872290 10580322
3209 10580322 10493812 10473892 10362635 10494846 10603124 10711844 10816804 11096738 11363956 11664482
3199 11664482 12107077 12656631 13288686 14240380 15355725 16589824 18086444 19700091 20829910
3190 20829910 21056631 20049598 18387463 16560312 14975900 13658564 12393718 11457355
3182 11457355 10591189 9931835 9451571 9163863 8839433 8585489 8277237 8031174 7897606
3173 7897606 7806019 7714563 7801267 7877485 7886038 8015439 8116365 8362603 8633886 8884295 9204776
3162 9204776 9725461 10332838 10906994 11402668 11651529 11337095 10459288 9485367 8572708 7740541
3152 7740541 7218903 6771883 6350721 5986382 5805376 5653992 5284750 5116344 4906259 4761561
3142 4761561 4635426 4506334 4407767 4365333 4309783 4200266 4232993 4214239 4057314 3976118 3945889
3131 3945889 3925192 3845105 3693450 3792161 3771011 3749338 3676416 3538967 3426431 3481355 3466290
3120 3466290 3437682 3416700 3343756 3254475 3267995 3331045 3218539 3187019 3118601 3033825 3128813
3109 3128813 2999524 2942964 2935131 2996944 2965226 2905698 2894454 2948442 2966778 2833801 2761195
3098 2761195 2816366 2742041 2698820 2770550 2696866 2777429 2688393 2747860 2699683 2651734 2627014
3087 2627014 2523273 2512178 2601187 2558742 2479680 2442549 2462918 2429322 2407054 2428412 2373864
3076 2373864 2360574 2389678 2366107 2325379 2359043 2312006 2222326 2172673 2239583 2261813 2181383
3065 2181383 2178283 2146724 2190850 2106265 2086262 2213643 2218258 2205450 2233683 2095948 2124750
3054 2124750 2095150 2084620 2112225 2123086 2258444 2161434 2179895 2230022 2161027 2111944 2123947
3043 2123947 2122277 2222170 2263406 2206704 2206458 2255944 2183681 2170518 2255220 2341575 2247604 2327188
3031 2327188 2384219 2378771 2298813 2207114 2356918 2412393 2404686 2373938 2437355 2502329 2584999 2595540
3019 2595540 2647867 2695820 2781720 2856807 2883693 2905773 2938613 3035047 3171262 3198155 3297709
3008 3297709 3450785 3529709 3725176 3862115 3955852 4011493 4100959 4171735 4151211 4276704 4226352
2997 4226352 4220654 4196763 4061206 4086185 4068055 4099950 4193866 4299213 4256231 4357709 4506814
2986 4506814 4614721 4755142 4918921 5032428 5084847 5257461 5232415 5261391 5442305 5479326
2976 5479326 5577057 5716698 5853522 6094153 6395241 6528148 6709292 6973085 7189873 7441304
2966 7441304 7469585 7436330 7524140 7456900 7471464 7674073 7687896 7646990 7739322 7927147 8022923
2955 8022923 8052765 8143296 8318329 8387793 8552189 8795867 8924663 8932360 8970370 9054085 9047876
2944 9047876 9105457 9298013 9460497 9724223 9978079 10276654 10594536 10826694 11207841 11503074
2934 11503074 11708842 11949390 12208431 12427791 12486203 12332573 12031387 11627877 11343301 10983668
2924 10983668 10617247 10410749 10264023 10181155 10190892 10202328 10259999 10292004 10374455 10534073 10566946
2913 10566946 10704042 10837237 10879598 10984582 11020919 11183639 11235519 11327680 11362094 11333878
2903 11333878 11235994 11074850 10808693 10627117 10407976 10006116 9660371 9382543 9105462 8809260
2893 8809260 8604301 8403425 8210642 8003857 7872872 7893464 7803608 7821293 7914366 7761103
2883 7761103 7609035 7538753 7408884 7327762 7221705 6957433 6641328 6408173 6272373 6018975
2873 6018975 5794991 5579917 5460155 5217319 5001784 4811429 4552262 4492776 4274176 4079629
2863 4079629 3976017 3838209 3787678 3636632 3606972 3543641 3444151 3352195 3268164 3239893 3203804
2852 3203804 3127483 3033454 2864438 2783823 2703000 2622580 2451236 2385982 2448775 2443098 2433513
2841 2433513 2273407 2083683 2027427 1881338 1888665 1934716 1936694 1921576 1924520 1891217 1761459
2830 1761459 1661312 1709096 1758685 1672909 1668460 1749057 1734082 1655154 1606169 1542682 1529944
2819 1529944 1392127 1371212 1429430 1382620 1371784 1373786 1295537 1311100 1237275 1265981 1218185
2808 1218185 1234114 1220958 1196682 1192979 1123932 1125324 1130239 1035716 979071 1033503 914887 923051
2796 923051 980736 1049476 944154 963995 961139 897318 902213 1041400 1083012 981466 915116
2785 915116 876946 806319 684098 764092 827384 836724 740525 701100 748837 788406 777540 728666
2773 728666 645786 645928 531975 651522 615613 559252 664084 653977 565075 577809 608943
2762 608943 659024 612349 521578 598535 629778 513805 459887 509504 450394 451801 512599 494359
2750 494359 507114 544444 446343 400766 367142 432368 527413 590230 564444 329648 247971
2739 247971 390604 414965 440604 368167 358882 425890 395359 343267 299984 226429 232165 267426
2727 267426 235956 168944 259437 352196 444873 438489 438829 346035 345605 306076 235560 284392 245498
2714 245498 216792 217847 352383 400120 280356 290817 298549 297221 252173 289147 210646 247228
2702 247228 247314 197869 147099 168874 256547 288264 280919 159194 262230 285888 340225 390802
2690 390802 345073 308424 327448 314502 97837 125520 201426 199422 216949 141623 129409 117374
2678 117374 220536 335669 372324 303831 293070 213647 183173 275586 309021 237350 288848
2667 288848 221243 238765 213648 248673 272643 237291 185715 161334 103698 89316 108927 158893
2655 158893 315892 321324 263288 231641 228109 261986 205691 229542 245932 221367 169701 211972
2643 211972 176532 290519 224658 191164 230717 262952 340158 289880 253276 216053 282436
2632 282436 242523 192206 178367 235648 170562 69335 82995 120382 137299 219199 241320
2621 241320 222189 133691 93107 135001 168004 190798 236793 219387 69247 46580 137750
2610 137750 148418 187459 144351 100337 141826 125655 107891 111786 62790 123359 177083 102279
2598 102279 139169 180957 154497 193241 128660 123482 67328 33508 -10033 -33642 -21599 67514
2586 67514 124388 93379 176573 162576 185204 143548 12862 50952 69289 24327 -36239 -34230
2574 -34230 52689 88533 -49526 2520 91691 42342 -9347 -13548 -16217 26219 67192 60822
2562 60822 12081 30097 79981 82022 52807 35815 35528 80652 76015 52091 37067 33026 7416
2549 7416 -2009 117005 84804 132675 35187 22011 45626 51212 -8571 -7134 69593 90447
2537 90447 126600 23169 231119 159005 91601 131106 205537 185061 165151 107369 39641
2526 39641 128739 186082 94127 77164 64056 47909 70090 64353 80775 -41013 -53100 -24435
2514 -24435 -96822 -71800 69168 77602 15905 18061 27136 28803 -7482 23282 45160 55929
2502 55929 23886 59307 73047 45804 149688 112701 96283 67914 92846 97701 107210 106928
2490 106928 81175 68073 83514 64757 99721 42741 63090 107696 103199 98386 79609 40688
2478 40688 -10910 9283 68046 43507 16980 18650 89601 37434 34977 -8745 44596 50087
2466 50087 -3153 15137 -15443 55827 101217 16603 491 13167 85111 33192 -83817 -72173
2454 -72173 -62229 -632 32224 -70998 -3722 -4933 51867 74954 73821 5232 -41565 30622
2442 30622 54707 4263 -97334 -129531 -81356 -63180 -42353 22218 -25380 -135894 -160813
2431 -160813 -118567 -70470 -58969 31733 -6926 -25205 -50143 -62235 86525 20071 -18363
2420 -18363 21336 80718 22907 -21977 -31202 -4529 18872 -11713 -46594 -31705 -116284 -52988
2408 -52988 55049 131891 132174 135489 46331 42046 98811 58546 -52606 -82784 -55353 -16993
2396 -16993 8859 16730 -109024 21922 34201 26611 3274 -92422 51970 24287 -68072 -74565
2384 -74565 -154482 -98581 -60417 -93525 -137500 -139187 -45633 14531 20553 -35171 -69610 -41382
2372 -41382 -11206 -99086 -102890 -81122 -74275 14994 -33603 -58587 -31932 5646 15497 47953
2360 47953 11910 -21059 -4657 -56584 -121399 -53085 45692 -52403 -89865 -44142 36976 -15960
2348 -15960 12310 -4838 -10843 110594 6568 -133338 -179299 -155535 34123 63481 -48970
2337 -48970 -93478 -28105 -12731 -23861 -63042 -6576 2587 -20644 54271 -38716 -30448 -57599
2325 -57599 -77329 14113 -48737 -33203 -35820 -63191 14526 16951 50333 2502 -74126 -22269
2313 -22269 8157 28637 15428 40720 -31508 -22246 -56603 -69271 9899 98382 93016 70801
2301 70801 85436 20581 49992 63333 110570 133366 76945 86907 79243 84219 -48169 -218777
2289 -218777 -66251 -10025 -63736 24859 39468 41938 84053 8943 20597 -13898 -11352 50612
2277 50612 134367 48555 -48677 -20706 34012 18898 17061 5945 -136221 -50500 25440 64747
2265 64747 10187 28819 -344 -2731 5859 57507 70902 14390 44418 6754 -331 -36227
2253 -36227 -68764 -13971 103484 154056 142008 65094 74144 67769 132929 100161 61404 18567
2241 18567 64054 38593 44158 111188 82177 53074 57114 232846 176043 111351 77187 147182
2229 147182 180761 272659 228239 198338 189485 139065 167101 197699 150735 142852 151378 148605
2217 148605 222305 263600 219668 241548 227653 240490 173023 256425 385304 417592 440707
2206 440707 406043 439064 527012 512004 457127 489457 442869 510640 585146 520885 454660 495579
2194 495579 548582 541588 567664 553729 572917 679652 617545 594623 597270 733273 792765 863278
2182 863278 851672 926403 986647 1011473 953025 925978 1037777 1105606 1140169 1152367 1113909
2171 1113909 1134608 1209906 1159819 1235420 1428424 1544106 1586318 1536392 1527595 1672613 1887262
2160 1887262 1851704 1837779 1894825 2079067 2175117 2334647 2501395 2569909 2829413 2961132
2150 2961132 3195491 3555960 3857296 4120317 4388014 4735103 5104096 5676245 6311540 6913340
2140 6913340 7699544 8848882 10447932 12179845 14354615 16865601 19108958 19576634 17511210
2131 17511210 14307190 11666643 9644405 8095643 6975819 6027095 5329935 4709282 4213772
2122 4213772 3886483 3515412 3427170 3241878 2963203 2745830 2477386 2166934 2042431 1855799
2112 1855799 1642267 1564132 1520796 1415956 1308697 1242406 1118871 1085654 992400 992273 928338
2101 928338 840092 804236 858671 867030 782973 783500 726457 695681 718441 610929 614068 557040
2089 557040 591695 608014 467937 380692 479087 532001 509538 489390 446207 451519 460602 455294
2077 455294 480577 367133 399404 330746 254087 175230 190589 234549 314332 285672 203724
2066 203724 286818 221269 216744 207377 166277 226673 148373 90103 233921 214796 120870 127595
2054 127595 263784 294407 226671 131545 49718 73602 181924 170043 188600 169265 134708
2043 134708 174243 145769 105420 117965 117424 157129 61263 -46818 43253 207026 132070 125695
2031 125695 48846 26806 97470 123993 31723 -98977 17495 125298 63974 48069 62597
2020 62597 65681 46502 130652 92386 62660 106545 102692 125101 69766 -18785 -26924 88229
2008 88229 125316 86882 75650 94039 39062 33508 82230 63068 30475 21179 53243 92152
1996 92152 40865 1635 -12276 14711 31398 -98287 -107497 -72692 -62541 -45823 -85905 -145108
1984 -145108 -127621 -53021 15026 38681 50450 43380 67694 49592 -9188 42760 -34861 3729
1972 3729 -2969 -7508 -95640 -93854 -109527 -147057 -43726 -32821 -56284 -22098 49851 -19773
1960 -19773 -74734 -15966 39139 75198 95193 51441 3110 -48846 -51557 -126892 -71994 47579
1948 47579 6033 38627 22322 -49674 -159504 -40772 21373 -66008 -53732 -19269 44877
1937 44877 49600 123718 104920 2128 -56771 -91928 -161103 -37405 37055 -3911 -4451 -50159
1925 -50159 50022 20248 -59058 -174802 -226592 -150953 -69821 -62995 -94405 -58798 -34838 37264
1913 37264 154083 54048 -103209 -104164 4541 9977 37779 -10260 -11154 4614 38419 36792
1901 36792 -5006 3398 14698 88454 42348 -42049 -21890 -47965 -21226 -49125 -50990 -8506
1889 -8506 -2524 -26966 -25380 -69464 -163031 -105019 -3590 30102 19448 115250 45092 49567
1877 49567 111289 34880 101387 88936 -55703 -60156 -111587 -88100 -80796 -41930 -13003 29703
1865 29703 100738 195267 185950 175085 20294 20977 37197 32261 -11295 27606 -30933 -115218
1853 -115218 -72533 -71189 -53796 -121210 -64586 -89569 -48166 -39648 -57351 -6542 -75601 -21269
1841 -21269 -86122 -60286 -2616 41730 70421 80696 106946 10570 4241 44991 138495 -881
1829 -881 -122699 -164082 -133499 -128370 -153925 -113918 -102818 -144787 -121241 -133880 -69084 -23035
1817 -23035 -71427 -49183 -90580 -10499 -32631 -93123 -29609 -49823 -41719 20488 -16122 -92460
1805 -92460 -47848 -34474 -90465 -95831 -28836 -64104 -117456 -106351 -7267 -18865 -111511 -8574
1793 -8574 84495 -20646 -13273 13257 -10295 -79261 -72918 -77559 -29725 53706 57390 -5936 5928
1780 5928 -162376 -161091 -31599 60996 40618 82159 102646 -18476 -114469 -171717 -175577 -233621
1768 -233621 -68880 -32512 -64261 -88224 -103623 25049 11986 -64064 -173932 -220660 -166834
1757 -166834 -57874 -40816 -45020 -83509 -90219 22923 62141 21064 -43651 -30523 -70510 -108303
1745 -108303 -114540 -127132 -128266 -14156 -37392 -92685 -119075 -56761 -50567 -73857 -169506 -158560
1733 -158560 -268592 -203398 -134593 -128979 -90488 -6861 50581 -43230 -69538 -45358 -59424 -19289
1721 -19289 -51200 -14658 -67677 -28081 -6337 -31390 -215035 -230745 -187443 -91863 -42673 -149737
1709 -149737 -236115 -175393 -50670 -1861 21708 -40092 -26043 -36594 -85270 -43179 67004
1698 67004 -1805 -124626 -43885 -14520 -130962 -22811 -70620 -140852 -67414 98800 14182
1687 14182 -91037 -160966 -162089 -127777 -66361 -57764 -66617 2589 -51987 -73883 38774 -110514
1675 -110514 -98734 -92734 -32693 -99027 -12941 -81778 -75864 -66844 -59869 -86447 -123281 -12828
1663 -12828 -68339 -88757 -100589 -42707 -32122 30158 -17718 24732 9723 -23908 -66733 -108759
1651 -108759 -26781 16694 -21926 -105440 -55907 -37914 -135969 -67898 -62450 -48415 -46763 10036
1639 10036 34199 -29600 37633 55384 45712 -41142 -1036 -9937 24499 32724 -828 -44370
1627 -44370 -18218 -26907 -111359 -71127 -66379 -20773 -51637 -44829 -36259 12557 -89239 -46727
1615 -46727 -36505 57352 103365 -37227 -43040 20480 43499 18870 17360 -66682 -93853 -101465
1603 -101465 -81404 -95806 -108693 -54414 -53435 -35169 74728 46305 -77762 -113569 -94497 -46101
1591 -46101 -3399 -15090 18589 -40154 -43450 -6427 -92711 -80771 -68274 -124616 -123786 -128368 -64254
1578 -64254 -95 23189 -21290 -37347 -11239 -79478 -184077 -184069 -107885 -74090 15113 42432
1566 42432 64205 70297 21497 69273 -62414 -89619 34169 36388 13310 44680 96734 55765
1554 55765 16935 -40841 -75511 -85805 -62042 -94182 -132571 -68107 764 -70730 -1936 -9252
1542 -9252 17156 -14463 136281 128999 -48556 -57885 -9277 -46415 -119718 -21843 -31667 -79300
1530 -79300 -62585 -44445 2381 -50593 -57675 -142825 -227328 -144045 6218 9239 10512 41403
1518 41403 8124 43935 -34122 -44476 1438 -34775 406 -58299 -26403 32513 -7044 -22395
1506 -22395 110833 128313 59037 33455 -23035 -1995 -28976 21203 -68965 13549 87621 -41684
1494 -41684 -75992 -144524 -130671 -157299 -66582 -70421 -220023 -84590 -64049 -104052 -20275 -86800
1482 -86800 -165367 62779 49976 -37722 -35341 17195 -1251 -83325 -1610 -31944 -52162 -51177
1470 -51177 -136874 -154413 -172718 -98150 -162905 -90143 -104683 16100 40319 7297 -23102 -83463
1458 -83463 -45646 -70534 -112449 -54309 -61789 -18930 -12093 34382 17921 -4041 -8911 -110548
1446 -110548 -86325 22887 22012 -51250 -235353 -286253 -101992 -45357 -39267 -120133 -120892 -60917
1434 -60917 -46493 6749 85825 29479 -81098 -110809 -25318 12735 -24784 -95482 59126
1423 59126 -54673 -68297 58001 -41327 -137565 -105438 -137366 -111750 -58915 29604 159164
1412 159164 111048 68765 72264 55057 24360 -24498 8015 -16071 -54648 -71811 47191 97919
1400 97919 50556 31156 -32678 -49974 -13990 -102654 -39156 99475 82681 -5310 3547 -70915
1388 -70915 -60097 -53551 -147956 38597 93534 -4687 909 88544 -17457 -64334 -20860 34437
1376 34437 -19219 -111115 -147008 -20793 -53785 -96270 9356 86167 39417 -4430 26385
1365 26385 -12284 -28945 8083 -60280 -128781 -76194 -95536 -71573 -154822 -100960 -1217 -17656
1353 -17656 -64735 -147769 -154528 -119213 -39570 56632 41286 71189 49602 45057 27132 -43625
1341 -43625 -1240 30567 58585 44464 89937 116072 -34039 78060 71455 -71962 -43601
1330 -43601 22851 66188 75050 55853 -9813 -16798 -10814 -87599 -109708 -15518 -83298 -81587 -24419
1317 -24419 -76038 -25776 49619 30788 54526 -26609 -16479 -40333 -20827 5589 -68884 -127720
1305 -127720 -90857 33118 -14539 -67256 -53611 -26181 19973 37576 21615 -9369 -11613 9479
1293 9479 -40631 -113654 -97323 -32439 -104961 -177671 -102253 -59712 -106362 -21341 -21102 -107839
1281 -107839 -43418 -19708 -20884 -100681 -172506 -115702 16818 -31813 -202642 -183619 -50086
1270 -50086 -29550 6316 9730 -65928 8739 -121890 -150145 -67649 -32692 -32662 58213 -65121
1258 -65121 14120 80770 48290 18279 -139927 -59293 5971 -28664 -47925 -18830 -127577
1247 -127577 -131778 -7372 3845 -103444 -29269 6065 -31273 196 509 -171269 -89758 -14570
1235 -14570 -105403 -161696 -113400 -43151 -15494 25954 -31126 -117912 -111990 -56296 1354 -35322
1223 -35322 -24953 -87846 -98088 -86904 -61615 -23556 71021 50737 -24578 89896 150691 30219
1211 30219 -32097 54961 71573 -59647 -28030 21484 -35400 -5997 67253 -14456 38665 23143
1199 23143 331 21708 -3984 -17865 -28105 84420 23359 -4059 55525 170787 20592
1188 20592 -35419 -96162 28659 74199 65481 22967 14020 38143 -22720 31893 -33675 -81508
1176 -81508 -75274 -145930 -5766 95704 25064 -4703 5258 27409 63420 -20378 27490 -35777
1164 -35777 -1355 58940 43907 75602 14123 -24631 -60621 -149475 -145042 -116498 -17788 104774
1152 104774 -885 -2825 -37160 -71313 -126815 -142854 -138796 -81355 -72929 -59822 -63581 -63168 -87805
1139 -87805 -69106 -81654 -80459 -101052 -58799 493 -70157 12262 -59747 -25775 -84234 -49546
1127 -49546 34319 -13900 14226 -10604 -2027 -48597 -26212 -51628 -54629 -123973 -134668 -66187
1115 -66187 -34528 -17188 -59072 -137819 -92455 -14650 -123248 -56410 -16965 -79161 -84919 -78329
1103 -78329 -2671 -16333 -2277 -15769 8749 17825 19082 -95192 -75238 -37566 -107369 -185022
1091 -185022 -189681 -78123 -11922 -28674 -127528 -9327 15203 -49980 -1627 -82221 -79682 -57705
1079 -57705 -51668 -30507 -65155 -51772 -74362 -35553 -2691 -40937 -24137 -9568 83780 119404
1067 119404 -15365 -60559 15379 19600 109049 159086 118224 -19587 22480 -679 13210
1056 13210 37491 41155 61287 42973 49613 -67698 -15379 -77022 -47287 -65489 -54579 -37063
1044 -37063 -10533 9176 -57748 -99921 -9628 -40781 -85116 11653 -30779 -113112 -24381 -1716
1032 -1716 -68616 -82583 -15320 -18193 55592 95975 27829 -23168 482 94431 105636 232509
1020 232509 188698 72632 122302 53326 49447 133734 146299 95828 -78274 -150096 -76162
1009 -76162 -37848 66749 127505 112449 99703 100254 -208 -86046 -63634 20039 112669 132796
997 132796 91866 -16807 -26656 35585 79492 18819 -50819 -112464 -115680 -44088 108080 194741
985 194741 121265 57620 -17144 -49754 -25752 31390 6347 -41543 -101869 -129516 -108031 -92616
973 -92616 -164375 -141408 -25562 80195 99729 51319 131606 73936 30884 35743 69359 20339
961 20339 22791 -20598 30437 34749 3574 59678 19744 73768 16408 -19351 2302 -53151
949 -53151 -57513 -2528 6443 -46986 -15349 30675 -5625 -6880 -3211 2388 -19648 25634 -61905
936 -61905 -68170 -10557 -55696 -35843 70246 -40554 -81899 5969 65316 101494 7440 -32241
924 -32241 -63799 13299 61347 106845 56341 62561 94791 -56023 -26938 36663 48472 39951
912 39951 3136 72443 -13152 -40847 -146538 -86043 -160434 -99829 59845 103983 -18673
901 -18673 22969 23779 -102633 -73933 65918 98052 -11676 -61149 -54374 23004 8102 -9774
889 -9774 1923 63636 -43665 -24742 15635 -53584 -101295 32947 -59706 -67370 59974 17085
877 17085 -42251 -58353 -9596 10701 49537 12337 -131846 -117837 28250 -41939 -91653 24010
865 24010 -1149 -1101 29225 53642 25439 -26120 -86753 -24379 -32549 376 32439 -58289 -12282
852 -12282 13868 61478 -3483 -78722 -25878 16019 42470 -10691 -40474 45464 22992 -21102
840 -21102 39299 17153 50864 63435 79197 19645 -60961 -28425 10134 -3668 9687 47977
828 47977 -7293 -49303 -70658 -38954 36814 35473 -57428 -75796 -29520 -89180 -26592 -29715
816 -29715 4877 -26171 16878 52592 39616 41960 35148 26180 15436 -48146 -22415 -46793 33516
803 33516 101470 -6486 -30194 -88022 -26001 -44189 -31242 -33347 -64665 -7622 17549 634
791 634 17006 -33278 12158 -9827 -8514 69357 -23327 -37561 -39206 -84056 -45977 -1330 194644
778 194644 121015 147301 51327 -4787 39588 66847 106352 55809 -6034 -84580 -163438 -44495
766 -44495 61226 -5167 -21672 -31187 -46952 -92906 -174276 -75363 -8844 -49619 -49 -17610
754 -17610 -3814 -85097 -28717 4188 -251 29361 57764 23077 -55339 -63116 -108082 -139803
742 -139803 -125260 -37650 -14141 -22123 52400 -31680 -131241 -114813 -33091 -94027 -144219 -46824
730 -46824 -61501 -127418 -111773 -48076 80384 131098 69842 87954 73549 37944 -12450 -5269
718 -5269 46169 27437 -10475 -68277 -62595 15150 29763 -80556 -61265 -15892 16650 -3909
706 -3909 42417 21113 -19425 -3926 63068 66923 114057 121988 37883 41175 -69258 -58459 33068
693 33068 10334 -31953 -40017 8869 65853 737 -121618 -82703 37059 64018 -8517 -62894
681 -62894 -85281 -164663 -42172 48202 -87454 -79946 46458 32922 82860 72477 149950 72028
669 72028 -503 19234 47661 31406 31398 -44195 -88436 -110354 -49169 44508 72631 108791 160734
656 160734 65885 -5976 112703 129201 91891 138207 110203 89722 140675 186903 211260 10050
644 10050 -16363 -69556 -115334 23262 4739 26000 -19076 -42702 -60138 -8146 79178 102245
632 102245 2914 -42058 29002 52223 38221 15288 50086 59509 90544 89303 110304 16674
620 16674 80470 -23169 -7419 41488 87108 70269 55784 45116 12290 -18442 14311 -9947
608 -9947 4329 93622 173261 36203 -17591 61788 31373 28782 -17902 30348 134714 103471
596 103471 930 62152 81767 64805 14909 50330 14412 -31612 -18121 -15094 -6625 -22599
584 -22599 -75721 -129335 8613 57601 65444 47214 7378 5360 -51250 -40105 -47 -40380
572 -40380 88092 123027 85897 28688 2829 -39958 -82797 -10339 -32990 -39296 34389 93563
560 93563 53322 -39289 -95907 -63990 -43218 -50685 -12802 7773 -44643 745 53070 29191
548 29191 35721 122526 216988 123623 65048 60395 68504 115629 42993 -15432 -21162 -63029 -57564
535 -57564 55022 32272 149050 145839 85219 -14024 34984 90589 30392 3032 82442 68942
523 68942 -40692 -131815 -37858 -6635 -56431 37638 73931 25419 52029 73368 154097 114341
511 114341 58921 120836 127012 125214 66280 39625 96031 -23481 -71021 65086 33249 58756
499 58756 73322 106287 -6799 -102738 -116022 -35665 11993 65883 19454 31032 89809 107930
487 107930 -5632 -63810 20938 83271 99223 133655 117636 -19322 31604 67449 48667
476 48667 19357 46462 57648 57410 -32779 -79419 -118144 2018 17602 35629 129129 115476
464 115476 71893 56071 72412 70240 149680 128268 92209 23045 56502 141961 67511 94169
452 94169 124853 94294 56413 91210 33293 -64604 46615 35009 -16084 3819 -36987 4275
440 4275 113086 75953 88296 71185 42377 60368 86232 54162 83265 68621 32998 29459
428 29459 15967 79772 94237 79776 -7884 25438 66564 128945 32981 58653 134867 24446
416 24446 41393 -64242 -62088 -26493 -9509 28689 14317 66406 -98136 -63550 -6199 -147948
404 -147948 -140686 -120076 -152562 -82238 83111 41595 10401 47795 57994 73744 70331 47823
392 47823 65514 32700 -10052 787 64600 22944 14651 15188 -40342 78225 83736 19412 -8285
379 -8285 -98204 -15895 22955 20644 13122 -20576 30990 94870 90637 90153 94423 133664 65877
366 65877 76394 66332 33565 -22507 45107 19885 -45817 6890 45976 28719 47035 -50632
354 -50632 -9875 -108567 -24120 77972 19258 16394 -15303 50937 -32969 -106059 -72366 57974
342 57974 77405 60358 357 -8233 -1198 -30340 -33831 7878 -48135 -4341 83540 24953 104579
329 104579 71465 30228 46235 -18911 -42730 -70557 -96046 17522 56800 -37353 -8510 -53517
317 -53517 11442 17580 66496 42195 -26727 -37584 28419 50961 107810 48015 -7259 61939
305 61939 84356 51566 85216 76762 99232 95082 27708 74648 54982 14831 111985 -21263
293 -21263 1294 -20974 -51468 -33751 -24500 -18742 8688 -6912 -5762 -21480 -81807 -55323 -40168
280 -40168 31266 113857 113790 85462 114925 125894 28352 -10122 149880 140678 -5251 -11863 1124
267 1124 87681 63385 -49949 -26869 22729 78703 88825 24999 -12706 -21806 -65623 -96511
255 -96511 -39190 53967 34849 50511 -24112 -45057 22573 34651 12817 9840 87928 -12715
243 -12715 -52108 -73810 -8420 14917 -29800 -61872 -31330 113893 36372 21383 -12 38127
231 38127 23788 90921 96176 76564 121348 88881 67762 -6571 -31317 33117 81139 53842
219 53842 21789 5054 -704 -26383 -57349 -20004 15342 91300 111181 75093 32763 45396
207 45396 55874 52485 -45425 57540 52794 85447 66282 77004 -3579 -25167 140748 153865
195 153865 29451 17799 12811 57252 53006 74747 76615 97784 98412 90126 88081 82556 56673
182 56673 -2858 -4712 48237 19168 -205 66842 41883 87102 83256 98610 134627 93312
170 93312 93907 67496 73543 133353 59654 72697 53237 9342 29629 93740 78444 93591 21949
157 21949 4137 31961 54341 67243 87612 89115 55705 31457 14163 24946 33896 2860
145 2860 35418 52858 76526 -14913 -7066 -48257 -26645 33818 45503 102892 93636 123148 75098
132 75098 71943 46559 103252 153486 149374 72081 -72800 -34450 51327 97737 33315 17285
120 17285 -9934 54807 44867 42052 -19000 -66564 -22543 1297 34491 69936 55698 21096
108 21096 102273 -12693 -39072 42674 43170 17544 76355 83757 -69864 -14037 47621 22239
96 22239 87757 107770 109469 95248 125755 169788 151487 93304 62858 98429 77782 30627
84 30627 42084 92759 66275 127717 98137 97308 13663 -15331 73483 56107 33680 53904 54431
71 54431 91162 121606 145603 152445 123003 178985 110014 77952 93330 71406 53375 39924
59 39924 36063 51796 67505 15043 24926 47063 -10763 43819 87437 51540 14198 -14676 5921
46 5921 26208 91855 66892 14879 20656 50020 -9459 -20913 -33924 -51071 80753 94450
34 94450 138028 97375 45206 44239 90583 119576 99821 99025 150063 106917 93777 55217 106262
21 106262 71364 69329 88656 75037 24807 86433 14643 -8182 74415 72922 29435 22341 111697
8 111697 101902 93560 82967 75512 142173 128867 91765 89255
0 89255
$$ Imaginary data points
##PAGE= N=2
##DATA TABLE= (X++(I..I)), XYDATA
16383 -806271 -845512 -862544 -836930 -783300 -761635 -747709 -703406 -638154 -537251 -536647 -465982 -504731
16371 -504731 -578698 -504915 -424417 -398070 -440469 -397614 -383615 -289293 -303670 -268728 -206995
16360 -206995 -214031 -239142 -158907 -114498 -103212 -56539 -16178 4551 -5779 -3038 64385 77872
16348 77872 102724 197295 246516 244722 266176 289923 231104 312720 360321 356686 327053 361862
16336 361862 394286 434367 465035 511993 491494 514027 515264 599221 594351 624806 670846 743786
16324 743786 762723 776077 834313 918562 903782 881950 884745 838768 884615 946553 964001 978354
16312 978354 1025575 1086200 1064978 1009689 1040737 1111659 1143648 1096573 1220859 1191358 1207167
16301 1207167 1290811 1365295 1401316 1401544 1387856 1459520 1429945 1479610 1560623 1628180 1637866 1522887
16289 1522887 1526662 1549639 1700407 1659791 1574177 1636234 1646494 1641217 1621121 1722386 1735720
16278 1735720 1756506 1807345 1831021 1799689 1792931 1884814 1933528 1955063 1943884 2012128 2058867
16267 2058867 1971977 1942768 2050583 2033091 1996680 2034959 2033417 2166829 2232525 2177293 2156235
16256 2156235 2197856 2227767 2200982 2221764 2247885 2171162 2186502 2239698 2337866 2358128 2323943
16245 2323943 2465556 2426779 2415013 2412360 2445659 2438818 2411151 2431965 2458963 2519158 2498696
16234 2498696 2535112 2554584 2453992 2501768 2536887 2524529 2500256 2475972 2535613 2577552 2578291
16223 2578291 2605959 2586901 2616955 2700172 2710459 2720427 2730519 2773288 2817581 2731478 2783222
16212 2783222 2790669 2781486 2831077 2763393 2786368 2853659 2919622 2928919 2859600 2819556 2870441 2911729
16200 2911729 2938527 2898826 2899980 2937277 2982797 2954319 2939177 2894468 2917600 2918955 2970171 3011839
16188 3011839 3029477 2997491 3017117 3016941 3012740 3091248 3092715 3071391 3039267 3091522 3052305 3025757
16176 3025757 3072896 3184240 3239302 3170034 3084486 3143067 3122259 3194162 3173047 3181068 3205722
16165 3205722 3194225 3151307 3131476 3213014 3132084 3113552 3114949 3199553 3369338 3331170 3297856
16154 3297856 3253525 3245334 3259768 3259037 3305769 3343202 3351631 3369948 3356827 3320328 3388310 3363780
16142 3363780 3373364 3426506 3434148 3418759 3482774 3436788 3389624 3437931 3420600 3342535 3347318 3358971
16130 3358971 3417654 3425782 3454296 3500811 3467517 3416207 3353735 3415520 3347196 3350700 3455437
16119 3455437 3449070 3458255 3426668 3429927 3406681 3425356 3524479 3494659 3481842 3467862 3412256 3342616
16107 3342616 3404531 3504986 3481277 3436407 3488256 3458770 3476375 3512100 3384980 3375214 3368245
16096 3368245 3394443 3431900 3411843 3472301 3472220 3503616 3468784 3494976 3517871 3373794 3392663 3476264
16084 3476264 3502110 3469758 3498781 3529119 3533917 3549939 3546748 3580049 3586227 3597452 3587814 3623166
$$ [...]
##END NTUPLES=NMR SPECTRUM
##END=
