##TITLE=1H_EC-3309(2)
 CDCl3
 8 sc, 
 12.1.2024
##JCAMPDX= 6.0         $$ Bruker NMR JCAMP-DX V2.0
##DATA TYPE= NMR SPECTRUM
##DATA CLASS= NTUPLES
##ORIGIN= UXNMR, Bruker Analytische Messtechnik GmbH
##OWNER= root
$$ XWIN-NMR		Version 3.5
$$ Fri Jan 12 14:02:36 2024 Russian Standard Time (UT+4h)  she@DPX200
##.OBSERVE FREQUENCY= 200.1313
##.OBSERVE NUCLEUS= ^1H
##.ACQUISITION MODE= SIMULTANEOUS
##.ACQUISITION SCHEME= undefined
##.AVERAGES= 8
##.DIGITISER RES= 18
##SPECTROMETER/DATA SYSTEM= spect
##.PULSE SEQUENCE= zg30
##.SOLVENT NAME= CDCl3
##.SHIFT REFERENCE= (INTERNAL, CDCl3, 0, 15.4009)
##AUDIT TRAIL= $$ (NUMBER, WHEN, WHO, WHERE, WHAT)
$$ ##TITLE= Audit trail, XWIN-NMR		Version 3.5
$$ ##JCAMPDX= 5.01
$$ ##ORIGIN= Bruker BioSpin GmbH
$$ ##OWNER= she
$$ F:/spectra/data/she/nmr/H-F/1/pdata/1/auditp.txt
$$ ##AUDIT TRAIL=  $$ (NUMBER, WHEN, WHO, WHERE, WHAT)
(   1,<2024-01-12 14:01:26.90 +0400>,<she>,<DPX200>,
      <created by zg, POWCHK disabled, PULCHK disabled
       configuration hash MD5:
       00 E9 B6 7A A2 85 ED C7 34 08 36 98 17 FE 4E 26
       data hash MD5: 16K
       BB 55 12 1E A1 2A 57 C6 6D 48 DD 3D D6 6C 1E DB>)
(   2,<2024-01-12 14:01:29.09 +0400>,<she>,<DPX200>,
      <Start of raw data processing
       efp BC_mod = 2 LB = 0.24 FT_mod = 6 PKNL = 1 PHC0 = -24576.63 PHC1 = 6.452703 SI = 16K 
       data hash MD5: 16K
       40 B8 6C E6 F5 5B DC 79 84 2A F1 E5 9F 51 75 D3>)
(   3,<2024-01-12 14:01:51.43 +0400>,<she>,<DPX200>,
      <pk PHC0 = 1.052823 PHC1 = 4 
       data hash MD5: 16K
       0B 4F 52 C1 E4 6D CE 10 F2 26 2F D5 14 CA 39 4F>)
(   4,<2024-01-12 14:01:54.71 +0400>,<she>,<DPX200>,
      <abs ABSG = 5 
       data hash MD5: 16K
       39 DD 18 EA CB 20 16 86 FD C9 1E 22 22 72 6E 99>)
$$ ##END=
$$ 
$$ hash MD5
$$ F9 CB 6C C8 88 55 40 5E 1D 4D C4 69 0C 0E E8 D4
##$RELAX= 
##$RELAX= 
##$RELAX= 
##$RELAX= 
##$RELAX= 
##$RELAX= 
$$ Bruker specific parameters
$$ --------------------------
##$DU= <F:/spectra>
##$EXPNO= 1
##$NAME= <H-F>
##$PROCNO= 1
##$TYPE= <nmr>
##$USER= <she>
##$AMP= (0..31)
100 100 100 100 100 100 100 100 100 100 100 100 100 100 100 100 100 100 
100 100 100 100 100 100 100 100 100 100 100 100 100 100 
##$AQSEQ= 0
##$AQ_mod= 1
##$AUNM= <au_zg>
##$AUTOPOS= <>
##$BF1= 200.13
##$BF2= 200.13
##$BF3= 200.13
##$BF4= 200.13
##$BF5= 200.13
##$BF6= 200.13
##$BF7= 200.13
##$BF8= 200.13
##$BYTORDA= 1
##$CFDGTYP= 0
##$CFRGTYP= 5
##$CHEMSTR= <none>
##$CNST= (0..31)
1 1 145 1 1 1 1 1 1 1 1 1 1 1 1 1 1 1 1 1 1 1 1 1 1 1 1 1 1 1 1 1 
##$CPDPRG= <>
##$CPDPRG1= <>
##$CPDPRG2= <>
##$CPDPRG3= <>
##$CPDPRG4= <mlev>
##$CPDPRG5= <mlev>
##$CPDPRG6= <mlev>
##$CPDPRG7= <mlev>
##$CPDPRG8= <mlev>
##$CPDPRGB= <>
##$CPDPRGT= <>
##$D= (0..31)
0 1.2 0 0 0 0 0 0 0 0.06 0 0.03 0 0 0 0 0.0002 0 0 0 0 0 0 0 0 0 0 0 0 
0 0 0 
##$DATE= 1705053686
##$DBL= (0..7)
120 120 120 120 120 120 120 120 
##$DBP= (0..7)
150 150 150 150 150 150 150 150 
##$DBP07= 0
##$DBPNAM0= <>
##$DBPNAM1= <>
##$DBPNAM2= <>
##$DBPNAM3= <>
##$DBPNAM4= <>
##$DBPNAM5= <>
$$ [...]
##$SUBNAM3= <"">
##$SUBNAM4= <"">
##$SUBNAM5= <"">
##$SUBNAM6= <"">
##$SUBNAM7= <"">
##$SUBNAM8= <"">
##$SUBNAM9= <"">
##$SW= 18.0517328524113
##$SWIBOX= (0..15)
0 0 2 0 0 0 0 0 0 0 0 0 0 0 0 0 
##$SW_h= 3612.71676300578
##$TD= 16384
##$TD0= 1
##$TE= 0
##$TE2= 300
##$TE3= 300
##$TEG= 300
##$TL= (0..7)
0 120 120 120 120 120 120 120 
##$TP= (0..7)
150 150 150 150 150 150 150 150 
##$TP07= 0
##$TPNAME0= <>
##$TPNAME1= <>
##$TPNAME2= <>
##$TPNAME3= <>
##$TPNAME4= <>
##$TPNAME5= <>
##$TPNAME6= <>
##$TPNAME7= <>
##$TPOAL= (0..7)
0.5 0.5 0.5 0.5 0.5 0.5 0.5 0.5 
##$TPOFFS= (0..7)
0 0 0 0 0 0 0 0 
##$TUNHIN= 0
##$TUNHOUT= 0
##$TUNXOUT= 0
##$USERA1= <user>
##$USERA2= <user>
##$USERA3= <user>
##$USERA4= <user>
##$USERA5= <user>
##$V9= 5
##$VALIST= <valist>
##$VCLIST= <CCCCCCCCCCCCCCC>
##$VD= 0
##$VDLIST= <DDDDDDDDDDDDDDD>
##$VPLIST= <PPPPPPPPPPPPPPP>
##$VTLIST= <TTTTTTTTTTTTTTT>
##$WBST= 1024
##$WBSW= 4
##$XGAIN= (0..3)
0 0 0 0 
##$XL= 0
##$YL= 0
##$YMAX_a= 615984
##$YMIN_a= -734798
##$ZGOPTNS= <>
##$ZL1= 120
##$ZL2= 120
##$ZL3= 120
##$ZL4= 120
##$ABSF1= 15.50119
##$ABSF2= -2.550659
##$ABSG= 5
##$ABSL= 3
##$ALPHA= 0
##$AQORDER= 0
##$ASSFAC= 0
##$ASSFACI= 0
##$ASSFACX= 0
##$ASSWID= 0
##$AUNMP= <proc_1d>
##$AZFE= 0.1
##$AZFW= 0.1
##$BCFW= 0
##$BC_mod= 2
##$BYTORDP= 0
##$COROFFS= 0
##$CY= -3
##$DATMOD= 1
##$DC= 0
##$DFILT= <>
##$DTYPP= 0
##$F1P= 0
##$F2P= 0
##$FCOR= 1
##$FTSIZE= 16384
##$FT_mod= 6
##$GAMMA= 0
##$GB= 0
##$INTBC= 1
##$INTSCL= 3.70164e-10
##$ISEN= 128
##$LB= 0.24
##$LEV0= 0
##$LPBIN= 0
##$MAXI= 10000
##$MC2= 0
##$MEAN= 0
##$ME_mod= 0
##$MI= 1.114404
##$NCOEF= 0
##$NC_proc= -5
##$NLEV= 6
##$NOISF1= 3.799351
##$NOISF2= 2.8
##$NSP= 0
##$NTH_PI= 0
##$NZP= 0
##$OFFSET= 15.40092
##$PC= 1
##$PHC0= -24575.58
##$PHC1= 10.4527
##$PH_mod= 1
##$PKNL= yes
##$PPARMOD= 0
##$PSCAL= 0
##$PSIGN= 0
##$REVERSE= no
##$SF= 200.130024170639
##$SI= 16384
##$SIGF1= 3
##$SIGF2= 2
##$SINO= 5.538805
##$SIOLD= 16384
##$SREGLST= <1H.CDCl3>
##$SSB= 0
##$STSI= 16384
##$STSR= 0
##$SW_p= 3612.71676300578
##$SYMM= 0
##$S_DEV= 0
##$TDeff= 16384
##$TDoff= 0
##$TI= <>
##$TILT= no
##$TM1= 0
##$TM2= 0
##$TOPLEV= 0
##$USERP1= <user>
##$USERP2= <user>
##$USERP3= <user>
##$USERP4= <user>
##$USERP5= <user>
##$WDW= 1
##$XDIM= 16384
##$YMAX_p= 355034241
##$YMIN_p= -200448
$$ End of Bruker specific parameters
$$ ---------------------------------
##NTUPLES= NMR SPECTRUM
##VAR_NAME=  FREQUENCY,     SPECTRUM/REAL,   SPECTRUM/IMAG
##SYMBOL=    X,             R,               I
##VAR_TYPE=  INDEPENDENT,   DEPENDENT,       DEPENDENT
##VAR_FORM=  AFFN,          ASDF,            ASDF
##VAR_DIM=   16384,         16384,           16384
##UNITS=     HZ,            ARBITRARY UNITS, ARBITRARY UNITS
##FACTOR=    0.220516191357247, 1,           1
##FIRST=     3082.18647468805, 0,            0
##LAST=      -530.530288317732, 0,           0
##MIN=       -530.530288317732, -200448,     0
##MAX=       3082.18647468805, 355034241,    0
$$ Real data points
##PAGE= N=1
##DATA TABLE= (X++(R..R)), XYDATA
$$ [...]
$$ plain form
8684 382272 391558 380161 387367 382657 392026 348558 387390 364516 348162 411632 409588 348832 364980
8671 364980 386834 348673 334910 420737 418847 405232 370809 391540 465670 418099 433330 473750
8659 473750 420715 370595 452223 415397 407043 390187 393679 385139 342685 304200 283139 284645
8647 284645 323009 375193 354139 331899 294090 309999 307385 269374 254295 267505 280124 264111
8635 264111 288575 282038 260033 252034 241893 234205 209282 299428 238709 234836 239621 252926 266059
8622 266059 267503 256138 258317 220888 281778 313157 243415 313601 322367 331624 334899 331051 334308
8609 334308 342989 320515 299962 359744 351197 292007 250688 288821 311289 317560 335485 316439
8597 316439 322868 334728 340379 326686 321679 323043 347744 390815 348744 355563 363455 354360 290841
$$ packed form
8684C82272R286j1397P206m710R369m3468L8832k2874j6354O3470k044o0756J6148
8671C64980K1854l8161j3763Q5827j890j3615l4423K0731P4130m7571J5231M0420
8659D73750n3035n0120Q1628l6826q354j6856L492q540m2454l8485k1061J506
8647B84645L8364N2184k1054k2240l7809J5909k614l8011j5079J3210J2619j6013
8635B64111K4464o537k2005p999j0141p688k4923R0146o0719l873M785J3305J3133
8622B66059J444j1365K179l7429O0890L1379o9742P0186Q766R257L275l848L257
8609C34308Q681k2474k0553N9782q547n9190m1319L8133K2468O271J7925j9046
8597C16439O429J1860N651j3693n007J364K4701M3071m2071O819P892r095o3519
$$ plain form
8584 290841 319294 400404 398076 439051 452327 456712 448970 420020 430014 452567 515061 449597
8572 449597 365793 383476 405253 392461 355956 308758 334560 342283 304106 335300 361877 365481
8560 365481 289804 306796 308864 325532 310254 271217 320067 353413 295772 327367 277496 270937
8548 270937 265537 239371 285948 258052 271230 288000 255188 253796 207065 184162 130702 134142
8536 134142 153840 156340 119265 138643 68924 73043 78635 145167 138197 134636 148153 174590 138612
8523 138612 68551 85921 79916 77731 84630 43658 32624 37364 43356 16231 -4513 65384 29972
8510 29972 19198 -22771 -35418 -10162 -4001 -2779 -4440 -10195 -5934 31636 -9703 -3068 3486
8497 3486 -10208 34237 42831 38625 15771 -39800 -33172 5904 527 12695 -11024 -11141 -12051 -29530
$$ packed form
8584B90841K8453Q1110k328M0975J3276M385p742k8950R994K2553O2494o5464
8572D49597q3804J7683K1777j2792l6505m7198K5802P723l8177L1194K6577L604
8560C65481p5677J6992K068J6668j5278l9037M8850L3346n7641L1595m9871o559
8548B70937n400k6166M6577k7896J3178J6770l2812j392m6731k2903n3460L440
8536A34142J9698K500l7075J9378o9719M119N592O6532o970l561J3517K6437l5978
8523A38612p0061J7370o005k185O899m0972j1034M740N992k7125k0744O9897l5412
8510B9972j0774m1969j2647K5256O161J222j661n755M261L7570m1339O635O554
8497C486j3694M4445Q594m206k2854n5571O628L9076n377J2168k3719j17r10j7479
$$ plain form
8483 -29530 -29496 -11289 35019 13230 57730 81821 4881 -24479 -2365 -10287 -23793 16707 26256
8470 26256 34738 -1901 14018 -17488 -6700 9609 53419 23010 25696 63961 91949 76018
8458 76018 36188 51321 35768 22946 53584 91615 108388 146428 218759 259049 329340 357817
8446 357817 297149 221154 192450 52882 88863 76129 28869 3583 25724 -29115 -22727 -465
8434 -465 18445 -1432 6945 8719 14985 -15584 -50665 -18270 -37435 -85888 -80628 -97866 -98446
8421 -98446 -68068 -33668 1253 -99785 -105783 -65836 -74331 -85150 -69929 -102510 -72532 -84659
8409 -84659 -89714 -73573 -12013 -82803 -60729 -28948 -36092 -65279 -80652 -58734 -122888 -160044
8397 -160044 -129642 -116944 -151275 -77056 -70115 -30667 -66291 -143128 -154177 -184833 -128296 -83203
$$ packed form
8483b9530L4J8207M6308k1789M4500K4091p6940k9360K2114p922j3506M0500R549
8470B6256Q482l6639J5919l1506J0788J6309M3810l0409K686L8265K7988j5931
8458G6018l9830J5133j5553j2822L0638L8031J6773L8040P2331M0290P0291K8477
8446C57817o0668p5995k8704j39568L5981j2734m7260k5286K2141n4839O388K2262
8434d65J8910j9877Q377J774O266l0569l5081L2395j9165m8453N260j7238n80
8421i8446L0378L4400L4921j01038n998L9947q495j0819J5221l2581K9978j2127
8409h4659n055J6141O1560p0790K2074L1781p144k9187j5373K1918o4154l7156
8397a60044L0402J2698l4331P4219O941L9448l5624p6837j1049l0656N6537M5093
$$ plain form
8385 -83203 -109851 -174669 -130166 -131521 -120926 -96673 -111992 -120645 -37329 -56740 -67195 -77583
8373 -77583 -91389 -80510 -85766 -67358 -60513 -69461 -105850 -137729 -129812 -110128 -70895 -87074 -98266
8360 -98266 -69207 -92359 -63582 -42165 -68261 -80366 -60224 -53250 -117698 -145581 -135001 -92650
8348 -92650 -57985 -82577 -112862 -71999 -59727 -100932 -53297 -73191 -59566 -65379 -104609 -68472
8336 -68472 -106529 -85805 -79325 -93561 -104344 -73086 -47614 -73129 -102151 -46474 -110950 -121503
8324 -121503 -67314 -115411 -126942 -134969 -124231 -83835 -80705 -111779 -95867 -69964 -77901 -42239
8312 -42239 -60912 -65156 -67692 -73986 -19856 -4997 2966 -1622 4669 17714 7922 8160 -17742 -13712
8298 -13712 -50447 -78739 -108484 -83081 -71001 -71754 -60022 -47041 -24349 -54332 -21689 -23992
$$ packed form
8385h3203k6648o4818M4503j355J0595K4253j5319q653Q3316j9411j0455j0388
8373g7583j3806J0879n256J8408O845q948l6389l1879P917J9684L9233j6179j1192
8360i8266K9059k3152K8777K1417k6096j2105K0142O974o4448k7883J0580M2351
8348i2650L4665k4592l0285M0863J2272m1205M7635j9894J3625n813l9230L6137
8336f8472l8057K0724O480j4236j0783L1258K5472k5515k9022N5677o4476j0553
8324a21503N4189m8097j1531q027J0738M0396L130l1074J5912K5903p937L5662
8312d2239j8673m244k536o294N4130J4859P963m588O291J3045r792K38k5902M030
8298a3712l6735k8292k9745K5403J2080p53J1732J2981K2692k9983L2643k303
$$ plain form
8286 -23992 4055 -53273 -76864 -92397 -32657 -28233 -74714 -74162 -68801 -66985 -97093 -93517 -104913
8273 -104913 -115345 -82491 -50734 -15695 1416 12252 3793 30908 -24043 -25432 -42255 -39332
8261 -39332 -19801 7585 -5495 -58278 -84664 -55536 5313 2423 -40469 -100240 -86673 -54798
8249 -54798 -61413 -80598 -105839 -75536 17079 66114 -15637 -44843 -54007 -54320 -7783 -403 17498
8236 17498 -26597 -43378 5063 31741 28731 5913 12411 -63636 -52264 39556 -5527 -52945
8224 -52945 -99461 -73182 -86867 -91322 -127082 -134661 -110971 -87815 -76734 -58765 -91418 -93145
8212 -93145 -66757 -37803 -78186 -44383 -36916 -55181 -21153 -71107 -72425 -72343 -8046 -7259 -37401
8199 -37401 -31148 -52869 -20872 -31339 -47654 -25460 -34002 25272 -58537 -80740 -104704 -109435
$$ packed form
8286b3992K8047n7328k3591j5533N9740M424m6481N52N361J816l0108L576j1396
8273a04913j0432L2854L1757L5039J7111J0836q459K7115n4951j389j6823K923
8261c9332J9531K7386j3080n2783k6386K9128O0849k890m2892n9771J3567L1875
8249e4798o615j9185k5241L0303R2615M9035q1751k9206r164l13M6537P380J7901
8236A7498m4095j6781M8441K6678l010k2818O498p6047J1372R1820m5083m7418
8224e2945m6516K6279j3685m455l5760p579K3690K3156J1081J7969l2653j727
8212i3145K6388K8954m0383L3803P467j8265L4028m9954j318Q2O4297P87l0142
8199c7401O253k1721L1997j0467j6315K2194q542N9274q3809k2203k3964m731
$$ plain form
8187 -109435 -82893 -64415 -56254 -32121 -73721 -38756 -71458 -85569 -29783 -35666 -57904 -46683
8175 -46683 -50372 -71861 -54965 -74506 -44596 -54049 -31348 -21141 23815 11053 -39190 -41469
8163 -41469 -71 -30100 -21151 -27871 2078 6080 -37694 -73305 -43952 463 -3918 -45171 -75034
8150 -75034 -60784 -92422 -84973 -72695 -79890 -102624 -150352 -175242 -142753 -134778 -106356 -80859
8138 -80859 -101497 -121256 -106511 -101231 -112685 -97408 -67264 -54198 -53319 -42242 -78463 -85536 -125569
8125 -125569 -82527 -104613 -98215 -45627 -60106 -49746 -23584 -52193 -55045 -126053 -108174 -36640
8113 -36640 -74186 -96624 -73799 -67100 -75725 -30166 -21857 -12602 -72013 -64113 -53249 -112449 -110563
8100 -110563 -52007 -113680 -120627 -130588 -117584 -82267 -82705 -84983 -136274 -118866 -89664 -112417 -124164
$$ packed form
8187a09435K6542J8478Q161K4133m1600L4965l2702j4111N5786n883k2238J1221
8175d6683l689k1489J6896j9541K9910r453K2701J0207M4956j2762n0243k279
8163d1469M1398l0029Q949o720K9949M002m3774l5611K9353M4415m381m1253k9863
8150g5034J4250l1638P449J2278p195k2734m7728k4890L2489P975K8422K5497
8138h0859k0638j9759J4745N280j1454J5277L0144J3066Q79J1077l6221p073m0033
8125a25569M3042k2086O398N2588j4479J0360K6162k8609k852p1008J7879P1534
8113c6640l7546k2438K2825O699q625M5559Q309R255n9411P900J0864n9200J886
8100a10563N8556o1673o947r961J3004L5317m38k278n1291J7408K9202k2753j1747
$$ plain form
8087 -124164 -122125 -151287 -141882 -144565 -115226 -93170 -74859 -78634 -51663 -65028 -91669 -84867 -104251
8074 -104251 -150825 -137724 -115475 -75372 -109319 -125285 -92441 -93357 -81289 -70254 -62382 -100954
8062 -100954 -102265 -39830 -74730 -115219 -57698 -53386 -88318 -51484 -98269 -148782 -115131 -120592
8050 -120592 -117137 -71493 -47284 -94000 -101068 -106309 -124226 -111882 -49824 -69140 -118613 -170115
8038 -170115 -200448 -181698 -133889 -155340 -120730 -106978 -90031 -146377 -119552 -150962 -192654 -161255
8026 -161255 -115299 -81622 -41277 -70220 -66520 -85533 -115137 -75426 -53683 -29024 -46236 -79600
8014 -79600 -34964 -48991 -65723 -61421 -77602 -107844 -76961 -45095 -71041 -99674 -164914 -122470
8002 -122470 -62860 -57384 -60245 -106128 -119292 -66091 -68906 -86390 -151951 -136030 -148036 -109463
$$ packed form
8087a24164K039k9162R405k683K9339K2056J8311l775K6971j3365k6641O802j9384
8074a04251m6574J3101K2249M0103l3947j5966L2844r16J2068J1035P872l8572
8062a00954j311O2435l4900m0489N7521M312l4932L6834m6785n0513L3651n461
8050a20592L455M5644K4209m6716p068n241j7917J2344O2058j9316m9473n1502
8038a70115l0333J8750M7809k1451L4610J3752J6947n6346K6825l1410m1692L1399
8026a61255M5956L3677M0345k8943L700j9013k9604L9711K1743K4659j7212l3364
8014g9600M4636j4027j6732M302j6181l0242L0883L1866k5946k8633o5240M2444
8002a22470N9610N476k861m5883j3164N3201k815j7484o5561J5921j2006L8573
$$ plain form
7990 -109463 -89559 -76883 -112142 -137096 -114498 -48189 -90847 -105752 -106713 -36796 -40636 -84293
7978 -84293 -88125 -83986 -78319 -105091 -108432 -82355 -61648 -47023 -95595 -108728 -69726 -87248 -31250
7965 -31250 -112184 -164183 -153965 -140993 -85265 -70649 -97069 -63845 -42701 -62805 -80469 -106388
7953 -106388 -130741 -68513 -74382 -84664 -118153 -84927 -73960 -90629 -77221 -91916 -82228 -102606
7941 -102606 -120796 -126329 -118307 -99454 -46567 -58380 -71331 -76846 -109507 -148073 -137995 -137097 -145248
7928 -145248 -119065 -124635 -98686 -68072 -71617 -68024 -91919 -141013 -102413 -109321 -118340 -81261 -139797
7915 -139797 -139353 -151143 -118424 -140701 -102983 -99468 -151928 -109171 -83703 -84800 -67370 -80553
7903 -80553 -110498 -80038 -87135 -100490 -104940 -109366 -128873 -150849 -135546 -117327 -78634 -93712
$$ packed form
7990a09463J9904J2676l5259k4954K2598O6309m2658j4905r61O9917l840m3657
7978h4293l832M139N667k6772l341K6077K0707J4625m8572j3133L9002j7522N5998
7965c1250q0934n1999J0218J2972N5728J4616k6420L3224K1144k0104j7664k5919
7953a06388k4353O2228n869j0282l3489L3226J0967j6669J3408j4695R688k0378
7941a02606j8190n533Q022J8853N2887j1813j2951n515l2661l8566J0078Q98q151
7928a45248K6183n570K5949L0614l545L593k3895m9094L8600o908r019L7079n8536
7915a39797M44j1790L2719k2277L7718L515n2460M2757K5468j097J7430j3183
7903h0553k9945L0460p097j3355m450m426j9507k1976J5303J8219L8693j5078
$$ plain form
7891 -93712 -132316 -131209 -90907 -106697 -137103 -141748 -152493 -116776 -104193 -145537 -184450 -138080
7879 -138080 -115799 -115155 -140460 -87672 -55999 -82537 -70669 -46343 -60490 -113516 -94209 -89161
7867 -89161 -92207 -39013 -83878 -71546 -59275 -81726 -85231 -102959 -114029 -100787 -74589 -116203
7855 -116203 -100667 -99300 -82225 -61328 -84405 -133354 -199748 -169177 -154475 -160878 -156600 -92162
7843 -92162 -74781 -93534 -128008 -121451 -139872 -124144 -108551 -49360 -29671 -92113 -76484 -71573
7831 -71573 -83975 -99018 -75016 -123976 -85520 -55174 -76817 -109947 -137175 -54081 -63911 -99733
7819 -99733 -118150 -118019 -138903 -114726 -126591 -115071 -63147 -122634 -120790 -127764 -121493 -100487 -120634
7806 -120634 -96863 -119278 -72308 -8829 -57445 -57773 -124654 -71342 -85975 -94425 -64951 -62723
$$ packed form
7891i3712l8604J107M0302j5790l0406m645j0745L5717J2583m1344l8913M6370
7879a38080K2281O44k5305N2788L1673k6538J1868K4326j4147n3026J9307N048
7867h9161l046N3194m4865J2332J2271k2451l505j7728j1070J3242K6198m1614
7855a16203J5536J367J7075K0897k3077m8949o6394L0571J4702o403M278O4438
7843i2162J7381j8753l4474O557j8421J5728J5593N9191J9689o2442J5629M911
7831g1573j2402j5043K4002m8960L8456L0346k1643l3130k7228Q3094r830l5822
7819i9733j8417J31k0884K4177j1865J1520N1924n9487J844o974O271K1006k0147
7806a20634K3771k2415M6970O3479m8616l28o6881N3312j4633q450K9474K228
$$ plain form
7794 -62723 -100268 -86331 -106892 -95541 -77258 -99284 -65530 -50712 -56736 -35617 -44694 -103773
7782 -103773 -118449 -111771 -70977 -87393 -128912 -110691 -142622 -157798 -124684 -130156 -103603 -121393
7770 -121393 -117798 -63881 -84647 -50681 -58524 -61987 -72438 -101357 -79513 -109325 -140864 -123190
7758 -123190 -58620 -28565 -32846 -34070 -53540 -77069 -68193 -92009 -109475 -97034 -76177 -67873
7746 -67873 -62664 -57019 -66304 -97399 -65186 -34708 -32924 -73302 -75236 -85896 -71452 -81360 -29582
7733 -29582 -50977 6324 -22061 -53568 -33567 -80873 -114350 -108714 -126885 -106755 -76068 -102584
7721 -102584 -53685 -43413 -8443 -39180 -40209 -17751 -10250 -46237 -68075 -49648 -136986 -132607
7709 -132607 -103344 -88434 -97667 -123654 -102620 -71458 -74710 -111943 -108337 -112730 -78017 -84792 -111118
$$ packed form
7794f2723l7545J3937k0561J1351J8283k2026L3754J4818o024K1119r077n9079
7782a03773j4676O678M0794j6416m1519J8221l1931j5176L3114n472K6553j7790
7770a21393L595N3917k0766L3966p843l463j0451k8919K1844k9812l1539J7674
7758a23190O4570L0055m281j224j9470k3529Q876k3816j7466J2441K0857Q304
7746f7873N209N645r285l1095L2213L0478J784m0378j934j0660J4444r908N1778
7733b9582k1395N7301k8385l1507K0001m7306l3477N636j8171K0130L0687k6516
7721a02584M8899J0272L4970l0737j029K2458P501l5987k1838J8427q7338M379
7709a32607K9263J4910r233k5987K1034L1162l252l7233L606m393L4713o775k6326
$$ plain form
7696 -111118 -95268 -109966 -67607 -31697 -78457 -75223 -104097 -90348 -94432 -125692 -141107 -126145
7684 -126145 -110049 -101449 -121029 -116937 -77481 -91066 -84820 -72029 -108280 -90567 -93260 -109108
7672 -109108 -132188 -111035 -91748 -42247 -26104 -51242 -112210 -103854 -64640 -68597 -77733 -57305
7660 -57305 -26738 -42847 -65020 -98483 -93394 -33139 6070 -48140 -57661 -58383 -79580 -93835 -80467
7647 -80467 -64248 -71306 -85238 -95450 -92107 -108411 -104209 -64467 -63967 -91464 -68913 -61876 -82234
7634 -82234 -66973 -52184 -81607 -61706 -91356 -85475 -43751 -41218 -78379 -61516 -25416 -58788
7622 -58788 -55563 -87465 -86357 -72986 -72671 -101158 -55550 -57261 -24526 -71840 -111956 -103095 -51743
7609 -51743 4777 -53064 -47896 -34357 -71964 -11375 -34 -20039 1581 -16637 -39426 -39644
$$ packed form
7696a11118J5850j4698M2359L5910m6760L234k8874J3749m084l1260j5415J4962
7684a26145J6096Q600j9580M092L9456j3585O246J2791l6251J7713k693j5848
7672a09108k3080K1153J9287M9501J6143k5138o0968Q356L9214l957r136K0428
7660e7305L0567j6109k2173l3463N089O0255L9209n4210r521p22k1197j4255J3368
7647h0467J6219p058j3932j0212L343j6304M202L9742N00k7497K2551P037k0358
7634h2234J5261J4789k9423J9901k9650N881M1724K533l7161J6863L6100l3372
7622e8788L225l1902J108J3371L15k8487M5608j711L2735m7314m0116Q861N1352
7609e1743N6520n7841N168J3539l7607O0589J1341k0005K1620j8218k2789k18
$$ plain form
7597 -39644 -43126 -85905 -105634 -114304 -94655 -77367 -61026 -69051 -124777 -86249 -77049 -76044 -115592
7584 -115592 -89770 -65437 -52514 -48456 -110239 -110165 -65355 -38213 -73238 -92097 -82188 -51264 -61552
7571 -61552 -62932 -103543 -124303 -77120 -49510 -78155 -74649 -91187 -108173 -103229 -112234 -72924 -45354
7558 -45354 -74481 -80037 -25827 5218 -59083 -44196 -38556 -61772 -85732 -59487 -58921 -32314 -57530
7545 -57530 -67069 -61687 -15456 -15973 -9563 -38123 -93333 -72237 -53083 -34804 -11068 -17406 -55190
7532 -55190 -65834 -71481 -88199 -108314 -69422 -90560 -58674 -46347 -62682 -35170 -19562 -47151
7520 -47151 -62063 -58005 -85479 -93849 -51141 -15717 3544 -15138 -55462 -110467 -112178 -97929
7508 -97929 -78181 -127162 -105468 -79664 -39673 -28056 -65666 -68331 -111918 -88954 -31497 -11345
$$ packed form
7597c9644l482m2779j9729q670J9649J7288J6341q025n5726L8528R200J005l9548
7584a15592K5822K4333J2923M058o1783P4M4810K7142l5025j8859R909L0924j0288
7571f1552j380m0611k0760M7183K7610k8645L506j6538j6986M944r005L9310K7570
7558d5354k9127n556N4210L1045o4301J4887N640k3216k3960K6245N66K6607k5216
7545e7530r539N382M6231n17O410k8560n5210K1096J9154J8279K3736o338l7784
7532e5190j0644n647j6718k0115L8892k1138L1886J2327j6335K7512J5608k7589
7520d7151j4912M058k7474q370M2708L5424J9261j8682m0324n5005j711J4249
7508i7929J9748m8981K1694K5804L9991J1617l7610k665m3587K2964N7457K0152
$$ plain form
7496 -11345 -31446 -45069 -76427 -44532 -58059 -108025 -64437 -9782 -30298 -80046 -55372 -9474
7484 -9474 -85152 -103924 -52219 -62898 -80297 -83691 -76240 -93734 -44396 -34722 -37058 -26958 -51085
7471 -51085 -36213 -18495 -74697 -51217 -36875 -21571 -44530 -59898 -55263 -72221 -71727 -60693
7459 -60693 -97699 -76570 -4469 -11102 1496 22258 -52291 -75307 -17625 -14108 21426 9598
7447 9598 -29971 -87841 -45029 -46198 -33655 -85505 -90513 664 -24963 5043 12563 41143 71387
7434 71387 29432 43420 96834 99886 127043 169052 144918 83161 49337 93192 91458 39228
7422 39228 1642 18350 10352 647 -18205 -334 3107 -36035 -23721 -44596 -37150 -51456 -68182
7409 -68182 -125141 -87403 -45193 -46317 -10866 -44389 -76416 -43034 -58405 -60734 -25170 -60876
$$ packed form
7496a1345k0101j3623l1358L1895j3527m9966M3588N4655k0516m9748K4674M5898
7484i474p5678j8772N1705j0679j7399l394P451j7494M9338R674k336J0100k4127
7471e1085J4872J7718n6202K3480J4342J5304k2959j5368M635j6958M94J1034
7459f0693l7006K1129P2101o633J2598K0762p4549k3016N7682L517L5534j1828
7447I598l9569n7870M2812j169J2543n1850n008R1177k5627L0006P520K8580L0244
7434G1387m1955J3988N3414L052K7157M2009k4134o1757l3824M3855j734n2230
7422C9228l7586J6708p998r705j8852J7871L441l9142J2314k0875P446j4306j6726
7409f8182n6959L7738M2210j124L5451l3523l2027L3382j5371k329L5564l5706
$$ plain form
7397 -60876 -74655 -76483 -52655 -103487 -88767 -36786 -78847 -64857 -81194 -131384 -76153 -46690
7385 -46690 -37138 -50737 -50446 -28600 24364 -1302 -89415 -51368 -37699 5047 11264 -38624 -30842
7372 -30842 -14776 -24115 -57608 -39520 -51029 -22358 -20189 -15625 -18536 -35974 -19786 3697 39986
7359 39986 31570 40017 51825 31460 24921 37088 83000 84354 23306 29351 12466 -26032 -46586
7346 -46586 -24147 -23468 -15958 -9896 -24052 -37215 -46515 -49592 -27526 -49890 -125318 -83341 -36377
7333 -36377 -63127 -59152 -86149 -63522 -70266 -81375 -93936 -136385 -110526 -34356 -28782 -64791
7321 -64791 -73692 -57860 -90428 -57497 -50727 -70241 -45995 -45804 -567 -1342 -25738 -72029 -49461
7308 -49461 -84191 -88867 -55747 -1982 -14213 51224 26208 -12627 -27800 -85773 -15444 36269
$$ packed form
7397f0876j3779j828K3828n0832J4720N1981m2061J3990j6337n0190N5231K9463
7385d6690R552j3599K91K1846N2964k5666q8113L8047J3669M2746O217m9888P782
7372c0842J6066r339l3493J8088j1509K8671K169M564k911j7438J6188K3483L6289
7359C9986q416Q447J1808k0365o539J2167M5912J354o1048O045j6885l8498k0554
7346d6586K2439O79P510O062j4156j3163r300l077K2066k2364p5428M1977M6964
7333c6377k6750L975k6997K2627o744j1109j2561m2449K5859P6170N574l6009
7321f4791q901J5832l2568L2931O770j9514K4246J91M5237p75k4396m6291K2568
7308d9461l4730m676L3120N3765j2231O5437k5016l8835j5173n7973P0329N1713
$$ plain form
7296 36269 16688 -64557 -26670 -45632 -18614 -28967 -43357 -8382 -22323 -20928 -34884 -34547
7284 -34547 -45655 -62541 -40517 -44902 -60832 -56988 -61843 -7979 -6811 -33692 -56055 -23173 -9440
7271 -9440 40568 17108 -11818 7449 -20209 -23246 -6914 -62441 -48474 -44820 -81699 18856
7259 18856 9730 4288 7794 -14697 -32102 -48947 -34400 -3850 -12823 -17496 -38071 -54328 -52627
7246 -52627 -73356 -36412 -874 -37397 -55926 -57166 11788 -21048 12921 20840 -14279 5250
7234 5250 5988 21914 1963 16870 -10820 -12945 22952 -5711 -45624 -33484 -86793 -91839 -89502
7221 -89502 -89475 -25747 -24377 -14641 -4439 -12288 -85787 -60237 -30128 -39384 -15802 -2510 -12363
7208 -12363 -22809 -63928 -101212 -51301 -40287 -31752 2904 -43523 -25266 10808 -9403 6876
$$ packed form
7296C6269j9581q1245L7887j8962K7018j0353j4390L4975j3941J395j3956L37
7284c4547j1108j6886K2024m385j5930L844m855N3864J168k6881k2363L2882J3733
7271i440N0008k3460k8926J9267k7658l037J6332n5527J3967L654l6879J00555
7259A8856r126n442L506k2491j7405j6845J4547L0550q973m673k0575j6257J701
7246e2627k0729L6944L5538l6523j8529j240O8954l2836L3969P919l5119J9529
7234E250P38J5926j9951J4907k7690k125L5897k8663l9913J2140n3309n046K337
7221h9502K7O3728J370R736J0202p849p3499K5550L0109r256K3582J3292r853
7208a2363j0446m1119l7284M9911J1014Q535L4656m6427J8257L6074k0211J6279
$$ plain form
7196 6876 -33583 -43712 -85334 -81327 -63854 -17506 -11231 -45931 -42458 -20902 -13241 -28917 -45895
7183 -45895 -3369 -16175 -20673 -20377 -41255 -3904 16089 47349 27110 -43213 -32678 4806
7171 4806 -51796 -36885 -19231 12212 6222 -60436 -44357 -35635 -20041 -35665 -39995 -17214 -75492
7158 -75492 -66160 -14557 13721 -20585 -54767 -61713 4420 -4446 -6656 -51802 -36634 -18896 -13826
7145 -13826 -16299 -27593 36525 -4562 48008 59888 72377 55281 2872 -14021 -42026 12163
7133 12163 9559 7252 -4276 -40059 -9754 -20026 2118 43036 65939 68375 50203 18584
7121 18584 24158 27391 1794 33681 54494 64736 41298 15659 -18306 -24091 21412 15690 48138
7108 48138 43577 27781 -38794 -61486 -39374 -25634 -1989 -9762 -44865 4312 15546 21746
$$ packed form
7196F876m0459j0129m1622M007J7473M6348O275l4700L473K1556P661j5676j6978
7183d5895M2526j2806m498K96k0878L7351J9993L1260k0239p0323J0535L7484
7171D806n6602J4911J7654L1443n990o6658J6079Q722J5594j5624m330K2781n8278
7158g5492R332N1603K8278l4306l4182o946O6133q866k210m5146J5168J7738N070
7145a3826k473j1294O4118m1087N2570J1880J2489j7096n2409j6893k8005N4189
7133A2163k604k307j1528l5783L0305j0272K2144M0918K2903K436j8172l1619
7121A8584N574L233k5597L1887K0813J0242k3438k5639l3965n785M5503n722L2448
7108D8138m561j5796o6575k2692K2112J3740K3645p773l5103M9177J1234O200
$$ plain form
7096 21746 -9551 14876 7709 42736 13652 -6155 -53017 -8146 29845 -7114 22004 35388
7084 35388 59311 55219 -11980 -20842 30581 31503 28760 -17757 -25614 -900 7577 34379 40035
7071 40035 25286 26054 67302 84696 84863 109408 112488 59086 28592 127593 77772 92707 111176
7058 111176 160177 177133 164860 155836 140068 146194 160870 136014 151605 115094 119302 108655
7046 108655 50924 48929 70131 61100 43146 11106 47847 66281 36184 17404 40414 84852
7034 84852 99678 59382 51179 52737 62268 55527 35139 39705 30106 -10765 21769 27502 4294
7021 4294 29968 76725 96736 100998 137858 134866 103435 137374 187154 231345 229460 242270 184282
7008 184282 158329 196595 157957 132423 72732 48062 49145 90351 78253 57900 24315 -6471
$$ packed form
7096B1746l1297K4427p167L5027k9084j9807m6862M4871L7991l6959K9118J3384
7084C5388K3923m092o7199q862N1423R22k743m6517p857K4714Q477K6802N656
7071D0035j4749P68M1248J7394J67K4545L080n3402l0494R9001m9821J4935J8469
7058A11176M9001J6956j2273r024j5768O126J4676k4856J5591l6511M208j0647
7046A08655n7731j995K1202r031j7954l2040L6741J8434l0097j8780K3010M4438
7034H4852J4826m0296q203J558R531o741k0388M566r599m0871L2534N733k3208
7021D294K5674M6757K0011M262L6860k992l1431L3939M9780M4191j885J2810n7988
7008A84282k5953L8266l8638k5534n9691k4670J083M1206j2098k0353l3585l0786
$$ plain form
6996 -6471 -6613 35401 47613 48274 51248 7380 -30823 41271 42750 21445 -20038 -20171 -15112 22904
6982 22904 -19583 -43654 4411 21071 17164 -4171 -5491 23548 53040 37215 4165 -51537
6970 -51537 -4994 27630 -23816 -19362 32314 19712 -11959 7966 39625 -9006 33413 28484
6958 28484 15635 14139 849 -7128 -36490 -45816 -23343 -13652 -47475 -72602 9690 18538 -9912
6945 -9912 9428 44 10018 -12001 38400 -719 -11823 -12358 -64895 -45826 15369 8514 -1914
6932 -1914 29123 26967 15183 -2150 -1487 13792 -533 -21353 -25038 10206 13797 -16086 -32117
6919 -32117 39903 12877 44013 28498 -295 11180 11537 -39848 -60389 -48981 -35589 -60257
6907 -60257 -94178 -49317 2872 59951 64097 34563 41980 2896 5206 51748 91789 97936 73737
$$ packed form
6996f471j42M2014J2212O61K974m3868l8203P2094J479k1305m1483j33N059L8016
6982B2904m2487k4071M8065J6660l907k1335j320K9039K9492j5825l3050n5702
6970e1537M6543L2624n1446M454N1676j2602l1671J9925L1659m8631M2419m929
6958B8484j2849j496j3290p977k9362r326K2473R691l3823k5127Q2292Q848k8450
6945i912J9340r384R974k2019N0401l9119j1104n35n2537J9069O1195o855j0428
6932a914L1037k156j1784j7333O63J5279j4325k0820l685L5244L591k9883j6031
6919c2117P2020k7026L1136j5515k8793J1475L57n1385k0541J1408J3392k4668
6907f0257l3921M4861N2189N7079M146k9534P417l9084K310M6542M0041O147k4199
$$ plain form
6894 73737 60282 35730 8224 -7087 10164 -2160 57031 85708 86062 19523 -24661 -16594
6882 -16594 -3222 -10251 -5791 -49161 -73740 -5040 1059 15636 18871 22890 -5130 12936 -12163
6869 -12163 -13269 48356 80210 75673 8575 39502 33288 33393 23086 18832 6713 -12241 -40676
6856 -40676 16810 17059 17947 17983 22020 30140 -6911 -6955 3479 21371 36102 23518 -3956 -23019
6842 -23019 -15865 54109 117647 83835 82965 27012 29048 99586 106829 68601 74469 55539 72678
6829 72678 64509 78418 51822 35906 50447 74264 115856 102441 82907 47592 32080 18695
6817 18695 39770 41458 62440 54449 54873 113797 77121 63232 63540 47133 98430 94247 63500
6804 63500 71209 112862 81226 61826 72612 91641 91267 81802 62211 38375 67501 50503 97682
$$ packed form
6894G3737j3455k4552k7506j5311J7251j2324N9191K8677L54o6539m4184Q067
6882a6594J3372p029M460m3370k4579O8700O099J4577L235M019k8020J8066k5099
6869a2163j106O1625L1854m537o7098L0927o214J05j0307m254j2119j8954k8435
6856d0676N7486K49Q88L6M037Q120l7051m4J0434J7892J4731j2584k7474j9063
6842b3019P154O9974O3538l3812q70n5953K036P0538P243l8228N868j8930J7139
6829G2678q169J3909k6596j5916J4541K3817M1592j3415j9534l5315j5512j3385
6817A8695K1075J688K0982p991M24N8924l6676j3889L08j6407N1297m183l0747
6804F3500P709M1653l1636j9400J0786J9029l74r465j9591k3836K9126j6998M7179
$$ plain form
6791 97682 132414 130548 133466 85084 82134 116599 196309 152170 79386 54596 109331 126268
6779 126268 117139 79068 98403 115521 115803 99648 125181 177202 160256 154313 182133 158572
6767 158572 120233 147279 168130 132140 155776 212566 233408 218326 176914 191221 239079 243123
6755 243123 251304 193436 153996 190492 170991 194868 186195 235153 258182 270663 307666 295215
6743 295215 318222 361622 385976 423500 361598 340316 357287 337170 320141 276134 281000 274165
6731 274165 254540 243775 342451 338647 279133 308337 328006 328238 321422 364711 386074 421132
6719 421132 421764 392929 425711 510140 560869 617539 647005 633825 591334 538130 548571 493373
6707 493373 425356 408129 434293 362602 338230 379297 370177 365213 391555 381641 389968 400051
$$ packed form
6791I7682L4732j866K918m8382k950L4465P9710m4139p2784k4790N4735J6937
6779A26268r129l8071J9335J7118K82j6155K5533N2021j6946n943K7820k3561
6767A58572l8339K7046K0851l5990K3636N6790K0842j5082m1412J4307M7858M044
6755B43123Q181n7868l9440L6496j9501K3877q673M8958K3029J2481L7003j2451
6743B95215K3007M3400K4354L7524o1902k1282J6971k0117j7029m4007M866o835
6731B74165j9625j0765R8676l804n9514K9204J9669K32o816M3289K1363L5058
6719D21132O32k8835L2782Q4429N0729N6670K9466j3180m2491n3204J0441n5198
6707D93373o8017j7227K6164p1691k4372M1067r120m964K6342r914Q327J0083
$$ plain form
6695 400051 389961 347475 390818 442234 466074 432824 503182 554624 463107 420234 438062 456141
6683 456141 398594 333530 348415 393435 350214 368508 351640 339205 341631 379435 399053 377149
6671 377149 412088 421480 358338 315747 404148 474891 467167 370371 331486 416180 447475 421617
6659 421617 391212 378133 376022 393864 335646 348655 372721 408355 364998 371398 414208 427899
6647 427899 431783 485293 458121 357219 375640 399593 397147 465825 458357 447790 429883 473359
6635 473359 483556 449493 450931 463146 481708 529654 581173 545666 532402 524847 477213 519095
6623 519095 540771 535537 516060 557535 554634 533577 535771 557325 635941 656863 661645 696769
6611 696769 726977 713601 737885 734322 761910 716139 686717 671513 716831 712467 722770 715357
$$ packed form
6695D00051j0090m2486M3343N1416K3840l3250P0358N1442r1517m2873J7828J8079
6683D56141n7547o5064J4885M5020m3221J8294j6868j2435K426L7804J9618k1904
6671C77149L4939R392o3142m2591Q8401P0743p724r6796l8885Q4694L1295k5858
6659D21617l0405j3079k111J7842n8218J3009K4066L5634m3357O400M2810J3691
6647D27899L884N3510k7172j00902J8421K3953k446O8678p468j0567j7907M3476
6635D73359J0197l4063J438J2215J8562M7946N1519l5507j3264p555m7634M1882
6623E19095K1676n234j9477M1475k901k1057K194K1554P8616K0922M782L5124
6611F96769L0208j3376K4284l563K7588m5771k9422j5204M5318m364J0303p413
$$ plain form
6599 715357 671587 669678 809839 857712 811704 781761 760345 744318 720328 761503 816294 852559
6587 852559 850361 824861 862410 828352 841094 862322 885233 907606 933037 962481 932190 909253
6575 909253 931881 1003447 1065934 1094069 1111704 1128776 1162666 1145269 1156754 1145819 1175450 1163176
6563 1163176 1118094 1193922 1221363 1288425 1265987 1254186 1215084 1211881 1264131 1323294 1377801 1416168
6551 1416168 1426969 1404970 1458662 1485435 1561229 1590314 1621007 1674861 1682317 1755695 1785395 1835265
6539 1835265 1815715 1808641 1822387 1775252 1730159 1720021 1769159 1797467 1783671 1838544 1921580 1944334
6527 1944334 1948719 2007215 2035859 2072637 2110502 2167323 2179401 2227431 2275468 2294961 2311947 2364676
6515 2364676 2365486 2389032 2447269 2486008 2607658 2658725 2691051 2736493 2878196 2951440 2999125
$$ packed form
6599G15357m3770j909J40161M7873m6008k9943k1416j6027k3990M1175N4791L6265
6587H52559k198k5500L7549l4058J2742K1228K2911K2373K5431K9444l0291k2937
6575I09253K2628P1566O2487K8135J7635J7072L3890j7397J1485j0935K9631j2274
6563A163176m5082P5828K7441O7062k2438j1801l9102l203N2250N9163N4507L8367
6551A416168J0801k1999N3692K6773P5794K9085L0693N3854P456P3378K9700M9870
6539A835265j9550p074J3746m7135m5093j0138M9138K8308j3796N4873Q3036K2754
6527A944334M385N8496K8644L6778L7865N6821J2078M8030M8037J9493J6986N2729
6515B364676Q10K3546N8237L8739J21650N1067L2326M5442J41703P3244M7685
$$ plain form
6504 2999125 3080434 3165843 3239982 3327272 3418269 3471455 3532374 3643197 3716411 3782811 3895544
6493 3895544 3969549 4038859 4136889 4272185 4390191 4456464 4577943 4655485 4798159 4980459
6483 4980459 5152686 5298388 5416892 5597154 5749299 5936336 6029719 6156158 6319710 6475118
6473 6475118 6666727 6915736 7196616 7427838 7628893 7864369 8130314 8371390 8563991 8801807
6463 8801807 9005764 9174497 9416606 9702333 9918129 10234135 10582295 10951761 11366355 11748894
6453 11748894 12159219 12503940 12898889 13364107 13806648 14400304 15008297 15704415 16470358
6444 16470358 17247980 18261902 19396178 20714676 22206297 23914090 25879981 28122161
6436 28122161 30743917 33822407 37262964 40847132 44087679 46275261 46625397 45219759
$$ packed form
6504B999125Q1309Q5409P4139Q7290R0997N3186O0919J10823P3214O6400J12733
6493C895544P4005O9310R8030J35296J18006O6273J21479P7542J42674J82300
6483D980459J72227J45702J18504J80262J52145J87037R3383J26439J63552J55408
6473F475118J91609K49009K80880K31222K01055K35476K65945K41076J92601K37816
6463H801807K03957J68733K42109K85727K15796L16006L48160L69466M14594L82539
6453A1748894M10325L44721L94949M65218M42541N93656O07993O96118P65943
6444A6470358P77622J013922J134276J318498J491621J707793J965891K242180
6436B8122161K621756L078490L440557L584168L240547K187582L50136j405638
$$ plain form
6428 45219759 42459793 39300842 36358028 34027596 32425359 31393945 30982307 30939819 31234601
6419 31234601 31902864 32809934 33929756 35470704 37376104 39729699 42516169 45805291
6411 45805291 49838063 54759471 60807126 67760939 75252177 81979068 86236485 86313673
6403 86313673 81324523 72876760 63429562 55049141 48379717 43376375 39731576 37072464
6395 37072464 35270022 33993736 33106668 32576936 32426512 32535977 32933150 33434545 34095817
6386 34095817 35037101 36413879 38287273 40742536 43713481 46808619 49377210 50476023
6378 50476023 49334138 45920642 41156458 36068425 31513959 27721375 24709342 22316824
6370 22316824 20490188 18997444 17807341 16836710 16026517 15315833 14637268 13909110 13124672
$$ packed form
6428D5219759k759966l158951k942814k330432j602237j031414m11638m2488K94782
6419C1234601O68263R07070J119822J540948J905400K353595K786470L289122
6411D5805291M032772M921408O047655O953813P491238O726891M257417P7188
6403H6313673m989150q447763r447198q380421o669424n003342l644799k659112
6395C7072464j802442j276286q87068n29732j50424J09465L97173N01395O61272
6386C4095817R41284J376778J873394K455263K970945L095138K568591J098813
6378E0476023j141885l413496m764184n088033m554466l792584l012033k392518
6370B2316824j826636j492744j190103r70631q10193p10684o78565p28158p84438
$$ plain form
6361 13124672 12402718 11686361 11008478 10406554 9892165 9474945 9007233 8667139 8363483
6352 8363483 8086684 7845221 7565049 7299136 7119740 6938330 6809358 6649305 6504703 6376854
6342 6376854 6328479 6258232 6121334 6061804 6015075 5942704 5815223 5795798 5747329 5699440 5725404
6331 5725404 5748872 5760125 5840490 5892014 5954020 6039691 6119596 6214245 6199136 6106505 6033889
6320 6033889 5929536 5859288 5840733 5904438 5973301 6097354 6218779 6320621 6455734 6549930
6310 6549930 6598185 6715985 6900346 7059083 7200223 7409585 7621901 7681656 7746249 7927623
6300 7927623 8136133 8402986 8796205 9291208 9735628 10302480 10905823 11572917 12428885 13390643
6290 13390643 14477191 15710501 16771328 17532611 17825349 17532075 16702921 15644937 14533087
$$ packed form
6361A3124672p21954p16357o77883o01924n14389m17220m67712l40094l03656
6352H363483k76799k41463k80172k65913j79396j81410j28972j60053j44602j27849
6342F376854m8375p0247j36898n9530m6729p2371j27481j9425m8469m7889K5964
6331E725404K3468J1253Q0365N1524O2006Q5671P9905R4649j5109r2631p2616
6320F033889j04353p0248j8555O3705O8863J24053J21425J01842J35113R4196
6310F549930M8255J17800J84361J58737J41140K09362K12316N9755O4593J81374
6300G927623K08510K66853L93219M95003M44420N66852O03343O67094Q55968R61758
6290A3390643J086548J233310J060827P61283K92738k93274q29154j057984j111850
$$ plain form
6281 14533087 13544454 12768305 12171990 11845327 11595703 11497744 11612215 11758293 12020202 12454915
6271 12454915 13070483 13813715 14719508 15805847 17078863 18666998 20480195 22712052 25122865
6262 25122865 27604275 29602081 30490110 29898386 27829645 24922527 21828849 19144939
6254 19144939 16954917 15245704 13984367 13062726 12363958 11779958 11360777 11101043 10949481
6245 10949481 10985623 11122021 11355279 11722454 12241221 12890288 13628461 14562299 15591756
6236 15591756 16681148 17549046 17944060 17615352 16676261 15326713 13725884 12259326 10917905
6227 10917905 9820221 8893504 8080144 7442303 6940247 6504501 6147738 5783916 5491099
6218 5491099 5348106 5162933 5112569 4920624 4710435 4589939 4494336 4408093 4301409 4148143
$$ packed form
6281A4533087r88633p76149n96315l26663k49624r7959J14471J46078K61909M34713
6271A2454915O15568P43232R05793J086339J273016J588135J813197K231857K410813
6262B5122865K481410J997806Q88029n91724k068741k907118l093678k683910
6254A9144939k190022j709213j261337r21641o98768n84000m19181k59734j51562
6245A0949481L6142J36398K33258L67175N18767O49067P38173R33838J029457
6236A5591756J089392Q67898L95014l28708r39091j349548j600829j466558j341421
6227A0917905j097684r26717q13360o37841n02056m35746l56763l63822k92817
6218E491099j42993j85173n0364j91945k10189j20496r5603q6243j06684j53266
$$ plain form
6208 4148143 4044325 3998244 3929262 3923803 3932555 3858268 3787344 3721439 3587115 3510903 3376199
6197 3376199 3323243 3281515 3281906 3202196 3128304 3103164 3083346 3101566 3019254 2958548 2942327 2965682
6185 2965682 3003424 2977963 3020642 3093191 3068296 3112181 3191302 3202606 3201692 3186016 3184816 3218056
6173 3218056 3143569 3143565 3141759 3184534 3222606 3219623 3277983 3321764 3371779 3415993 3453673 3441234 3460241
6160 3460241 3499667 3563076 3664035 3771533 3828529 3918965 4068480 4186435 4193783 4262162 4238132
6149 4238132 4221470 4312664 4328343 4369722 4401225 4448884 4513352 4561812 4642672 4732458 4861225
6138 4861225 4976317 5035919 5137527 5219458 5273043 5385945 5513448 5673469 5849545 5986871
6128 5986871 6182206 6319462 6492931 6663241 6800804 6947834 7173443 7348185 7497413 7735017
$$ packed form
6208D148143j03818m6081o8982n459Q752p4287p0924o5905j34324p6212j34704
6197C376199n2956m1728L91p9710p3892k5140j9818J8220q2312o0706j6221K3355
6185B965682L7742k5461M2679P2549k4895M3885P9121J1304r14j5676j200L3240
6173C218056p4487mj806M2775L8072k983N8360M3781N0015M4214L7680j2439J9007
6160C460241L9426O3409J00959J07498N6996R0436J49515J17955P348O8379k4030
6149D238132j6662R1194J5679M1379L1503M7659O4468M8460Q0860Q9786J28767
6138D861225J15092N9602J01608Q1931N3585J12902J27503J60021J76076J37326
6128E986871J95335J37256J73469J70310J37563J47030K25609J74742J49228K37604
$$ plain form
6118 7735017 7966330 8155888 8315336 8517985 8834238 9162414 9524557 9914382 10316038 10787382
6108 10787382 11314973 11822367 12269752 12716193 12943928 13042884 13207167 13334264 13544259 13934557
6098 13934557 14389256 14973090 15596773 16283592 17065941 17875823 18667769 19435393 20407900
6089 20407900 21634631 23043398 24743162 26611668 28818819 31390962 34615103 38645970
6081 38645970 43688371 49528483 55042076 58057425 56847884 52502760 47537832 43569720
6073 43569720 41041100 39975944 40171052 41595043 44124521 47679020 51711786 54800675
6065 54800675 55705324 54782018 53964947 54598096 56970355 60508078 63724904 64549979 62076360
6056 62076360 57416737 52513730 49025989 47263933 47213320 48552458 50079980 50054330 47773986
$$ packed form
6118G735017K31313J89558J59448K02649L16253L28176L62143L89825M01656M71344
6108A0787382N27591N07394M47385M46441K27735R8956J64283J27097K09995L90298
6098A3934557M54699N83834O23683O86819P82349Q09882P91946P67624R72507
6089B0407900J226731J408767J699764J868506K207151K572143L224141M030867
6081C8645970N042401N840112N513593L015349j209541m345124m964928l968112
6073D3569720k528620j065156J95108J423991K529478L554499M032766L088889
6065E4800675R04649r23306q17071O33149K372259L537723L216826Q25075k473619
6056F2076360m659623m903007l487741j762056n0613J339138J527522k5650k280344
$$ plain form
6047 47773986 44235491 41084901 39301308 38915382 39983058 42350250 45910236 50595308
6039 50595308 55294533 57918565 55885065 49484802 41707668 34674860 29166184 25005796
6031 25005796 21845679 19445848 17496050 15952877 14742393 13760363 12835836 12074981 11413394
6022 11413394 10882441 10453407 10028082 9631349 9198500 8759623 8402912 8018846 7686211
6013 7686211 7417344 7166487 6939320 6683490 6463050 6235671 6091862 5916901 5709525 5548539
6003 5548539 5450934 5270321 5116169 4989079 4869247 4790036 4663865 4566796 4496958 4407513
5993 4407513 4308279 4200001 4141889 4077512 4061847 4026545 4005519 3931577 3869463 3828415 3824748
5982 3824748 3821890 3796335 3830242 3861522 3745153 3624008 3605819 3578947 3584374 3556897 3513975
$$ packed form
6047D7773986l538495l150590j783593l85926J067676K367192L559986M685072
6039E0595308M699225K624032k033500o400263p777134p032808n508676m160388
6031B5005796l160117k399831j949798j543173j210484r82030r24527p60855o61587
6022A1413394n30953m29034m25325l96733m32849m38877l56711l84066l32635
6013G686211k68867k50857k27167k55830k20440k27379j43809j74961k07376j60986
6003E548539r7605j80613j54152j27090j19832p9211j26171r7069o9838q9445
5993D407513r9234j08278n8112o4377j5665l5302k1026p3942o2114m1048l667
5982C824748k858k5555L3907L1280j16369j21145j8189k6872N427k7477m2922
$$ plain form
5971 3513975 3504968 3464646 3411374 3355142 3353371 3370663 3341879 3328543 3355036 3391453 3369527 3388576
5959 3388576 3391034 3415626 3470178 3457153 3526227 3617176 3652984 3713268 3738663 3738701 3679175 3688072
5947 3688072 3643783 3622560 3582238 3590385 3628745 3668434 3688428 3668433 3731133 3879261 3953151
5936 3953151 4069152 4239771 4389614 4419097 4433799 4471894 4450149 4462420 4476581 4576642 4611731
5925 4611731 4657045 4647700 4675748 4732069 4771017 4839958 4872789 4953063 5056373 5120056 5208345
5914 5208345 5332092 5408777 5500378 5611697 5748614 5863829 6019992 6169365 6354645 6534868
5904 6534868 6743451 6909338 7053897 7278405 7422719 7624432 7850855 7986177 8222293 8446223
5894 8446223 8630426 8930588 9194947 9435301 9680676 9920080 10202486 10518764 10833864 11142452
$$ packed form
5971C513975r007m0322n3272n6232j771J7292k8784j3336K6493L6417k1926J9049
5959C388576K458K4592N4552j3025O9074R0949L5808O0284K5395L8n9526Q897
5947C688072m4289k1223m0322Q147L8360L9689J9994j9995O2700J48128P3890
5936C953151J16001J70619J49843K9483J4702L8095k1745J2271J4161J00061L5089
5925D611731M5314r345K8048N6321L8948O8941L2831Q0274J03310O3683Q8289
5914E208345J23747P6685R1601J11319J36917J15215J56163J49373J85280J80223
5904F534868K08583J65887J44559K24508J44314K01713K26423J35322K36116K23930
5894H446223J84203L00162K64359K40354K45375K39404K82406L16278L15100L08588
$$ plain form
5884 11142452 11519489 11925170 12353709 12832059 13289583 13799426 14332312 14916918 15552385
5875 15552385 16248640 16937749 17741515 18638304 19690678 20946888 22409186 24109802 26129394
5866 26129394 28447661 31300780 34622346 38589588 43059699 47842521 52334266 55503951
5858 55503951 56228983 54180184 50174718 45636567 41591615 38380508 36064032 34418405
5850 34418405 33380119 32741758 32487657 32518717 32866583 33633239 34870449 36685480 39024011
5841 39024011 41980950 45597700 50102339 55812889 62734458 70864575 79710371 87730761
5833 87730761 92257142 90845191 83735865 73809301 63823582 55320442 48723490 43714280
5825 43714280 39745470 36566889 34060688 32120014 30636721 29566664 28902527 28583667
$$ packed form
5884A1142452L77037M05681M28539M78350M57524N09843N32886N84606O35467
5875A5552385O96255O89109Q03766Q96789J052374J256210J462298J700616K019592
5866B6129394K318267K853119L321566L967242M470111M782822M491745L169685
5858E5503951P25032k048799m005466m538151m044952l211107k316476j645627
5850C4418405j038286o38361k54101L1060L47866P66656J237210J815031K338531
5841C9024011K956939L616750M504639N710550O921569Q130117Q845796Q020390
5833H7730761M526381j411951p109326r926564r985719q503140o596952n009210
5825D3714280l968810l178581k506201j940674j483293j070057o64137l18860
$$ plain form
5817 28583667 28647796 29099583 29852591 30996780 32459971 34383886 36802286 39598258 42552290
5808 42552290 45048472 46094424 45050616 41932236 37436632 32767392 28679306 25330187
5800 25330187 22694753 20543159 18861833 17430099 16222657 15207040 14265951 13434988
5792 13434988 12816864 12310429 11816166 11378213 10943534 10467771 10080898 9704353 9364538
5783 9364538 9098856 8874923 8666234 8493990 8298471 8128760 7972065 7793656 7578966 7510188
5773 7510188 7347617 7175874 7094603 7031657 6984624 6990879 6986164 6942589 6959681 6976676 7034512
5762 7034512 7112708 7150945 7087858 6892004 6672138 6476910 6309177 6297728 6299271 6298169 6359981
5751 6359981 6478215 6558670 6618379 6630502 6634167 6580871 6662174 6715128 6794015 6910754 7005689
$$ packed form
5817B8583667O4129M51787P53008J144189J463191J923915K418400K795972K954032
5808D2552290K496182J045952j043808l118380m495604m669240m088086l349119
5800B5330187k635434k151594j681326j431734j207442j015617r41089q30963
5792A3434988o18124n06435m94263m37953m34679m75763l86873l76545l39815
5783I364538k65682k23933k08689j72244j95519j69711j56695j78409k14690o8778
5773G510188j62571j71743q1271o2946m7033O255m715m3575J7092J6995N7836
5762G034512P8196L8237o3087j95854k19866j95228j67733j1449J543j102O1812
5751F359981J18234Q0455N9709J2123L665n3296Q1303N2954P8887J16739R4935
$$ plain form
5740 7005689 7119916 7257698 7288467 7281685 7206149 7161004 7165836 7161535 7165296 7098417 7026022 6936229
5728 6936229 6927909 6916778 6989342 7094186 7167431 7321935 7423845 7583549 7665848 7657611 7659993
5717 7659993 7723900 7773152 7835327 7881438 7891796 7975927 8067896 8106622 8123523 8132478 8144787 8231174
5705 8231174 8344990 8538681 8781304 9015021 9331236 9648698 10011704 10477705 11016124 11654582
5695 11654582 12325982 13100364 13999559 15121281 16446230 17967495 19488778 20780960 21618096
5686 21618096 21568470 20720399 19413156 18053975 16800724 15879753 15172136 14670739 14331040
5677 14331040 14239873 14278099 14441178 14724143 15221360 15934186 16804375 17902158 19220995
5668 19220995 20852933 22833242 25174148 28077261 31494340 34859543 37341456 38135540
$$ packed form
5740G005689J14227J37782L0769o782p5536m5145M832m301L761o6879p2395q9793
5728F936229q320j1131P2564J04844P3245J54504J01910J59704Q2299q237K382
5717G659993O3907M9252O2175M6111J0358Q4131R1969L8726J6901Q955J2309Q6387
5705H231174J13816J93691K42623K33717L16215L17462L63006M66001N38419O38458
5695A1654582O71400P74382Q99195J121722J324949J521265J521283J292182Q37136
5686B1618096m9626q48071j307243j359181j253251r20971p07617n01397l39699
5677A4331040r1167L8226J63079K82965M97217P12826Q70189J097783J318837
5668A9220995J631938J980309K340906K903113L417079L365203K481913P94084
$$ plain form
5660 38135540 37003061 34211627 30564744 26896676 23766167 21202342 19276095 17719081
5652 17719081 16489885 15528322 14790696 14305532 13981799 13749137 13682418 13691660 13797420 14068055
5642 14068055 14383577 14712110 15205269 15841038 16597839 17440512 18273773 18911922 18991332 18421421
5632 18421421 17258888 15795330 14365934 13180474 12107461 11197331 10550866 10014959 9555947
5623 9555947 9246934 8953813 8710155 8491707 8343394 8236292 8108858 7910426 7756051 7717946
5613 7717946 7587875 7537490 7496812 7442766 7413729 7334454 7275843 7256057 7268545 7309556 7354410
5602 7354410 7320364 7341717 7386345 7352329 7348509 7410902 7506525 7543719 7677719 7767675 7887154
5591 7887154 8018349 8214339 8399578 8583950 8775284 8937310 9096879 9297050 9511815 9731993
$$ packed form
5660C8135540j132479k791434l646883l668068l130509k563825j926247j557014
5652A7719081j229196r61563p37626m85164l23733k32662o6719R242J05760K70635
5642A4068055L15522L28533M93159O35769P56801Q42673Q33261O38149P9410n69911
5632A8421421j162533j463558j429396j185460j073013r10130o46465n35907m59012
5623I555947l09013k93121k43658k18448j48313j07102j27434j98432j54375l8105
5613G717946j30071n0385m0678n4046k9037p9275n8611j9786J2488M1011M4854
5602G354410l4046K1353M4628l4016l820O2393R5623L7194J34000Q9956J19479
5591G887154J31195J95990J85239J84372J91334J62026J59569K00171K14765K20178
$$ plain form
5581 9731993 9916947 10119655 10310869 10495944 10588232 10745850 10920256 11044983 11159952 11279802
5571 11279802 11446343 11621340 11821126 12017381 12234820 12582300 12883125 13180334 13555640
5562 13555640 13950425 14375487 14843507 15345464 15944617 16587903 17301274 18032358 18779193
5553 18779193 19448176 20085385 20649150 21054659 21231045 21297014 21362984 21450707 21720637 22094418
5543 22094418 22648979 23332960 24075321 24908457 25686445 26361380 27128988 27960575 28992859
5534 28992859 30024595 31003894 32003378 32959559 33846640 34619719 35435768 36358510 37358908
5525 37358908 38681421 40182709 41950102 44021301 46401902 49111519 52233268 55492977
5517 55492977 58230593 59549109 59613393 59427632 59592674 60212514 61089672 61796701 62016514
$$ packed form
5581I731993J84954K02708J91214J85075R2288J57618J74406J24727J14969J19850
5571A1279802J66541J74997J99786J96255K17439L47480L00825K97209L75306
5562A3555640L94785M25062M68020N01957N99153O43286P13371P31084P46835
5553A8779193O68983O37209N63765M05509J76386O5969O5970Q7723K69930L73781
5543B2094418N54561O83981P42361Q33136P77988O74935P67608Q31587J032284
5534B8992859J031736R79299R99484R56181Q87081P73079Q16049R22742J000398
5525C7358908J322513J501288J767393K071199K380601K709617L121749L259709
5517E5492977K737616J318516O4284j85761J65042O19840Q77158P07029K19813
$$ plain form
5508 62016514 61944398 61988971 62534652 63923140 66109192 69040169 72603468 76787043 81708669
5499 81708669 87529338 94760543 103647831 114293689 127187885 143059841 162994686 188105475
5491 188105475 219122823 256528936 298365844 335956243 355034241 340517977 297658775
5484 297658775 247116020 202682462 168894103 144401403 126840294 114046359 104778598
5477 104778598 98265199 94010714 91593357 90986871 92106890 95026436 99099987 102496397
5469 102496397 102695921 98068556 90353826 82478088 76069855 71637018 68956108 67754067
5461 67754067 67926202 69354098 71443505 73099342 72932507 70859322 68449180 67294324
5453 67294324 67849222 70132674 73592978 77093545 78789855 77394330 73213701 68152688
$$ packed form
5508F2016514p2116M4573N45681J388488K186052K930977L563299M183575M921626
5499H1708669N820669P231205Q887288J0645858J2894196J5871956J9934845K5110789
5491A88105475L1017348L7406113M1836908L7590399J9077998j4516264m2859202
5484B97658775n0542755m4433558l3788359k4492700j7561109j2793935r267761
5477A04778598o513399m254485k417357o06486J120019K919546M073551L396410
5469A02496397J99524m627365p714730p875738o408233m432837k680910j202041
5461F7754067J72135J427896K089407J655837j66835k073185k410142j154856
5453F7294324N54898K283452L460304L500567J696310j395525m180629n061013
$$ plain form
5445 68152688 64064101 61625764 60808849 60799705 60064815 57385112 53375697 49622376 47008776
5436 47008776 45666567 45582303 46604055 48697665 51839655 55616069 59140558 60456286
5428 60456286 57817826 51839379 45126675 39265494 34667965 31051085 28267900 26039525
5420 26039525 24191046 22638694 21375103 20381171 19560328 18770901 18161673 17683417 17136030
5411 17136030 16748735 16347866 15940200 15558113 15194438 14870169 14587113 14289235 14044759
5402 14044759 13883220 13691212 13519021 13344297 13199817 13056860 12967819 12930482 12948371 12950434
5392 12950434 13037307 13119977 13168388 13210740 13273029 13311940 13376124 13445722 13562496 13791244 14024973
5381 14024973 14310089 14633180 15060904 15645884 16355319 17123611 17947718 18899575 20018396
$$ packed form
5445F8152688m088587k438337q16915r144p34890k679703m009415l753321k613600
5436D7008776j342209q4264J021752K093610L141990L776414L524489J315728
5428F0456286k638460n978447o712704n861181m597529l616880k783185k228375
5420B6039525j848479j552352j263591r93932q20843p89427o09228m78256n47387
5411A7136030l87295m00869m07666l82087l63675l24269k83056k97878k44476
5402A4044759j61539j92008j72191j74724j44480j42957q9041l7337J7889K063
5392A2950434Q6873Q2670M8411M2352O2289L8911O4184O9598J16774K28748K33729
5381A4024973K85116L23091M27724N84980P09435P68292Q24107R51857J118821
$$ plain form
5372 20018396 21516801 23347494 25468134 28200378 31580129 35812983 40997688 47184657
5364 47184657 54072263 60502993 64313220 63171625 57124787 49087663 41408056 35084144
5356 35084144 30163891 26292189 23183178 20667781 18647907 17068613 15740523 14696089
5348 14696089 13851456 13152007 12622600 12108835 11695930 11312464 10987605 10676524 10314847
5339 10314847 9971688 9712893 9444086 9173939 9055329 8929035 8882049 8972602 9114812 9394193
5329 9394193 9843654 10451186 11169685 12035212 12687326 12786937 12202458 11144721 9927052
5320 9927052 8886663 8044594 7438182 6950354 6550747 6191389 5957498 5844476 5654251
5311 5654251 5451430 5365871 5278880 5191209 5169022 5164262 5234019 5278205 5343248 5445667 5635693
$$ packed form
5372B0018396J498405J830693K120640K732244L379751M232854N184705O186969
5364D7184657O887606O430730L810227j141595o046838q037124p679607o323912
5356C5084144m920253l871702l109011k515397k019874j579294j328090j044434
5348A4696089q44633o99449n29407n13765m12905l83466l24859l11081l61677
5339A0314847l43159k58795k68807k70147j18610j26294m6986R0553J42210K79381
5329I394193M49461O07532P18499Q65527O52114R9611n84479j057737j217669
5320I927052j040389q42069o06412m87828l99607l59358k33891j13022j90225
5311E654251k02821q5559q6991q7671k2187m760O9757M4186O5043J02419J90026
$$ plain form
5300 5635693 5843437 6207175 6574053 7038717 7727850 8620586 9552503 10396075 10761725 10525483
5290 10525483 9599948 8442314 7328957 6428692 5809174 5299541 4899744 4587176 4401203
5281 4401203 4219249 4075118 3925678 3790557 3705421 3626128 3550798 3515118 3474379 3488786 3507689
5270 3507689 3499388 3503981 3518025 3623243 3768968 3942359 4142655 4456600 4817009 5183121
5260 5183121 5497457 5609480 5571624 5454382 5337216 5277884 5188685 5004358 4675104 4209053
5250 4209053 3734555 3431806 3168763 2991562 2831564 2776586 2640900 2487549 2407342 2308217
5240 2308217 2328826 2317329 2221005 2187338 2192259 2229085 2209713 2182228 2155544 2132749 2225049 2252135
5228 2252135 2347840 2484711 2556844 2614589 2678653 2747065 2745777 2753293 2771711 2658226 2600900
$$ packed form
5300E635693K07744L63738L66878M64664O89133Q92736R31917Q43572L65650k36242
5290A0525483r25535j157634j113357r00265o19518n09633l99797l12568j85973
5281D401203j81954j44131j49440j35121q5136p9293p5330l5680m0739J4407J8903
5270C507689q301M593J4044J05218J45725J73391K00296L13945L60409L66112
5260E183121L14336J12023l7856j17242j17166n9332q9199j84327l29254m66051
5250D209053m74498l02749k63043j77201j59998n4978j35686j53351q0207r9125
5240B308217K0609j1497r6324l3667M921L6826j9372k7485k6684k2795R2300K7086
5228B252135R5705J36871P2133N7745O4064O8412j288P516J8418j13485n7326
$$ plain form
5217 2600900 2498170 2466428 2471918 2401887 2298735 2216779 2156222 2152896 2079694 2041474 1979828
5206 1979828 1948910 2009790 1996293 1926273 1965788 1982379 2025904 2065489 2130218 2121114 2126457 2166424
5194 2166424 2149057 2229439 2317166 2433903 2526852 2662266 2755544 2787651 2875535 2888384 2808392
5183 2808392 2684791 2587897 2474577 2382702 2365869 2306479 2283402 2240086 2166763 2160077 2138035
5172 2138035 2166999 2154814 2135798 2115780 2100255 2125956 2129960 2169611 2181863 2180526 2204059 2201422
5160 2201422 2163921 2151612 2107185 2078391 2104877 2114594 2184642 2214319 2191344 2262358 2341409 2310191
5148 2310191 2283697 2293612 2283536 2175727 2166585 2191568 2213324 2247150 2201293 2195867 2192115 2171938
5136 2171938 2208676 2281070 2339219 2446231 2514352 2516965 2566147 2649848 2713184 2856139 3030722
$$ packed form
5217B600900j02730l1742N490p0031j03152q1956o0557l326p3202l8220o1646
5206A979828l0918O0880j3497p0020L9515J6591M3525L9585O4729r104N343L9967
5194B166424j7367Q0382Q7727J16737R2949J35414R3278L2107Q7884J2849p9992
5183B808392j23601r6894j13320r1875j6833n9390k3077m3316p3323o686k2042
5172B138035K8964j2185j9016k0018j5525K5701M004L9651J2252j337K3533k637
5160B201422l7501j2309m4427k8794K6486R717P0048K9677k2975P1014P9051l1218
5148B310191k6494R915j0076j07809r142K4983K1756L3826m5857n426l752k0177
5136B171938L6738P2394N8149J07012O8121K613M9182Q3701O3336J42955J74583
$$ plain form
5125 3030722 3268055 3552207 3889035 4285970 4852389 5511389 5963104 5931668 5271738 4520604
5115 4520604 3911730 3550066 3397223 3373191 3375887 3490028 3671397 3739951 3757564 3656459
5105 3656459 3424214 3169536 2910712 2841733 2783820 2683965 2673220 2731729 2753234 2779463 2734568
5094 2734568 2630706 2509222 2512630 2454055 2404607 2417991 2404088 2415188 2410167 2376487 2313618
5083 2313618 2280446 2255037 2163682 2119776 2101835 2039416 2055160 2101272 2153989 2131697 2203284
5072 2203284 2221662 2178319 2221400 2235489 2191221 2228105 2302389 2348300 2375845 2434915 2453741
5061 2453741 2562296 2555640 2520782 2556938 2700214 2676808 2698886 2696452 2739710 2773503 2828657
5050 2828657 2837687 2932115 3040963 3230622 3380266 3496066 3610163 3703040 3834119 3962145
$$ packed form
5125C030722K37333K84152L36828L96935N66419O59000M51715l1436o59930p51134
5115D520604o08874l61664j52843k4032K696J14141J81369O8554J7613j01105
5105C656459k32245k54678k58824o8979n7913r9855j0745N8509K1505K6229m4895
5094B734568j03862j21484L408n8575m9448J3384j3903J1100n021l3680o2869
5083B313618l3172k5409r1355m3906j7941o2419J5744M6112N2717k2292P1587
5072B203284J8378m3343M3081J4089m4268L6884P4284M5911K7545N9070J8826
5061B453741J08555o656l4858L6156J43276k3406K2078k434M3258L3793N5154
5050B828657R030R4428J08848J89659J49644J15800J14097R2877J31079J28026
$$ plain form
5040 3962145 4066084 4170083 4212653 4386371 4512824 4627637 4697606 4719112 4731736 4796012
5030 4796012 4786212 4802385 4844020 4917855 4922234 4925631 5000194 5104554 5177448 5236225 5314109 5429616
5018 5429616 5546517 5676542 5842903 5966789 6142398 6309785 6435570 6594558 6664802 6864051
5008 6864051 7042742 7200950 7365527 7514890 7706374 7917522 8152910 8361648 8573503 8755330
4998 8755330 8876845 9026123 9231304 9454282 9784562 10074380 10398366 10728115 11136638 11641701
4988 11641701 12185663 12736729 13232510 13682886 14085433 14455934 14900406 15400852 15979711
4979 15979711 16585391 17106951 17562438 18109726 18675463 19388955 20075075 20830324 21506047
4970 21506047 22194045 22763389 23356454 23860202 24564448 25183968 25896203 26565810 27264998
$$ packed form
5040C962145J03939J03999M2570J73718J26453J14813O9969K1506J2624O4276
5030D796012r800J6173M1635P3835M379L397P4563J04360P2894N8777P7884J15507
5018E429616J16901J30025J66361J23886J75609J67387J25785J58988P0244J99249
5008F864051J78691J58208J64577J49363J91484K11148K35388K08738K11855J81827
4998H755330J21515J49278K05181K22978L30280K89818L23986L29749M08523N05063
4988A1641701N43962N51066M95781M50376M02547L70501M44472N00446N78859
4979A5979711O05680N21560M55487N47288N65737P13492O86120P55249O75723
4970B1506047O87998N69344N93065N03748P04246O19520P12235O69607O99188
$$ plain form
4961 27264998 27990731 28839094 29792806 31308257 33270992 35947781 38896395 42215034 45710498
4952 45710498 49915445 54970871 61447451 69036435 78358878 89494193 104340072 123591523
4944 123591523 148817560 180691606 223332638 269171817 299566450 286791976 235765180
4937 235765180 182396279 139254578 109205274 88592484 74320076 63590447 55616019
4930 55616019 49497260 44918151 41089207 37996899 35287289 33187651 31536150 30443965
4922 30443965 29307309 28103695 26492213 24723205 23041050 21692338 20476136 19495123
4914 19495123 18575795 17876861 17212884 16638407 16173358 15802022 15376889 14929313 14468382
4905 14468382 14146179 13866504 13658311 13475384 13417157 13462072 13612583 13929828 14411299 15112011
$$ packed form
4961B7264998P25733Q48363R53712J515451J962735K676789K948614L318639L495464
4952D5710498M204947N055426O476580P588984R322443J1135315J4845879J9251451
4944A23591523K5226037L1874046M2641032M5839179L0394633j2774474n1026796
4937B35765180n3368901m3141701l0049304k0612790j4272408j0729629p974428
4930E5616019o118759m579109l828944l092308k709610k099638j651501j092185
4922C0443965j136656j203614j611482j769008j682155j348712j216202r81013
4914A9495123r19328o98934o63977n74477m65049l71336m25133m47576m60931
4905A4468382l22203k79675k08193j82927n8227M4915J50511L17245M81471P00712
$$ plain form
4895 15112011 16103489 17585547 19743460 22377914 24856278 25927210 24621646 21164836
4887 21164836 17423580 14363628 12229380 10741421 9658363 8860872 8196441 7685362 7287654
4878 7287654 6917627 6608235 6323560 6152591 6007544 5841599 5690415 5442067 5285707 5079219
4868 5079219 4932553 4737790 4577696 4385921 4260859 4143081 4034255 3878351 3739270 3666595
4858 3666595 3585093 3419786 3363235 3210286 3128048 3012884 2875428 2767547 2695259 2643216
4848 2643216 2543833 2489178 2585372 2577907 2565867 2549923 2421903 2312865 2307037 2242772 2201620
4837 2201620 2147544 2150046 2141884 2152153 2113786 2087547 2001841 1990398 2010247 1958182 1897530 1813260
4825 1813260 1775046 1740232 1730985 1735441 1683980 1662459 1698526 1733474 1665602 1702765 1688333 1628420
$$ packed form
4895A5112011R91478J482058K157913K634454K478364J070932j305564l456810
4887B1164836l741256l059952k134248j487959j083058p97491o64431n11079l97708
4878G287654l70027l09392k84675j70969j45047j65945j51184k48348j56360k06488
4868E079219j46666j94763j60094j91775j25062j17778j08826j55904j39081p2675
4858C666595q1502j65307n6551j52949q2238j15164j37456j07881p2288n2043
4848B643216r9383n4655R6194p465j2040j5944j28020j09038n828o4265m1152
4837B201620n4076K502q162J0269l8367k6239q5706j1443J9849n2065o0652q4270
4825A813260l8214l4814r247M456n1461k1521L6067L4948o7872L7163j4432n9913
$$ plain form
4813 1628420 1543188 1520852 1456307 1429729 1401387 1399986 1325046 1250933 1255912 1308569 1245722 1226765
4801 1226765 1241431 1252698 1178656 1118734 1138733 1121883 1132122 1138687 1152711 1074516 980758 1006605
4789 1006605 999106 985938 937364 969022 990909 971030 936485 897152 974381 1038326 1052109 1079080
4777 1079080 1047168 1061652 1058104 1066528 1098193 1070994 1076208 1072175 1076335 1083615 1108195 1132019 1142392
4764 1142392 1108937 1070306 1030635 1050492 1022028 1046563 1021349 1016118 945059 965703 1019514 1065899
4752 1065899 1094837 1098589 1107260 1150481 1122557 1202457 1249065 1225112 1239394 1257368 1289256 1281839
4740 1281839 1320614 1371572 1413228 1409616 1488575 1510429 1522205 1589312 1595603 1587683 1613887 1618017
4728 1618017 1639892 1699911 1690639 1720733 1758570 1797482 1803893 1816431 1860187 1942060 2016967 2120911
$$ packed form
4813A628420q5232k2336o4545k6578k8342j401p4940p4113M979N2657o2847j8957
4801A226765J4666J1267p4042n9922J9999j6850J0239O565J4024p8195r3758K5847
4789A006605p499j3168m8574L1658K1887j9879l4545l9333P7229O3945J3783K6971
4777A079080l1912J4484l548Q424L1665k7199N214m033M160P280K4580K3824J0373
4764A142392l3455l8631l9671J9857k8464K4535k5214n231p1059K0644N3811M6385
4752A065899K8938L752Q671M3221k7924P9900M6608k3953J4282J7974L1888p417
4740A281839L8775N0958M1656l612P8959K1854J1776O7107O291p920K6204M130
4728A618017K1875O0019r272L0094L7837L8912O411J2538M3756Q1873P4907J03944
$$ plain form
4716 2120911 2236728 2389045 2580189 2725344 3001018 3296830 3645451 4022174 4501673 5055550
4706 5055550 5807330 6716625 7939933 9565056 11576521 13750066 15339498 14936413 12471343
4697 12471343 9767089 7508486 5965786 4898676 4173854 3622799 3239322 2918297 2690597
4688 2690597 2470912 2288804 2130886 2017119 1901755 1872763 1805956 1720371 1621835 1499480
4678 1499480 1404925 1317509 1242238 1145745 1104593 1083750 1051702 1025933 994560 999597 974490 907215
4666 907215 875998 881146 929197 891620 860624 927543 873422 850349 877783 871939 832321 819320
4654 819320 787761 844807 891047 862875 858838 841207 854485 874414 892312 922309 858654 802398
4642 802398 768585 784116 778100 728165 785573 743340 742304 771524 787537 850700 944953 961254
$$ packed form
4716B120911J15817J52317J91144J45155K75674K95812L48621L76723M79499N53877
4706E055550P51780R09295J223308J625123K011465K173545J589432m03085k465070
4697A2471343k704254k258603j542700j067110p24822n51055l83477l21025k27700
4688B690597k19685j82108j57918j13767j15364k8992o6807q5585r8536j22355
4678A499480r4555q7416p5271r6493m1152k0843l2048k5769l1373N037k5107o7275
4666I07215l1217N148M8051l7577l0996O6919n4121k3073K7434n844l9618j3001
4654H19320l1559N7046M6240k8172m037j7631J3278J9929J7898K9997o3655n6256
4642H02398l3813J5531o016m9935N7408m2233j036K9220J6013O3163R4253J6301
$$ plain form
4630 961254 1029809 1088615 1211193 1321148 1446957 1672224 1937632 2047059 1990045 1715589
4620 1715589 1441365 1234148 1009183 867331 807727 788500 730330 683952 681049 694414 690109
4609 690109 681435 641052 593164 561450 577718 607403 567707 554758 584794 589477 589349 592927 577955
4596 577955 630837 633149 608186 574519 597320 592450 581244 574878 647142 660005 684493 716386
4584 716386 794000 934007 1081119 1191297 1441796 1763648 2065284 2317388 2486175 2318489
4574 2318489 1878337 1544798 1237560 1023178 842287 726507 659242 650492 641282 633134 581228
4563 581228 532224 492680 493098 486528 479371 454257 424013 438317 376682 330448 336125 384826 403367
4550 403367 330039 394337 407691 342016 323923 322024 319917 298607 276182 197872 224818 213859
$$ packed form
4630I61254O8555N8806J22578J09955J25809K25267K65408J09427n7014k74456
4620A715589k74224k07217k24965j41852n9604j9227n8170m6378k903J3365m305
4609F90109q674m0383m7888l1714J6268K9685l9696j2949L0036M683j28L578j4972
4596E77955N2882K312k4963l3667K2801m870j1206o366P2264J2863K4488L1893
4584G16386P7614J40007J47112J10178K50499L21852L01636K52104J68787j67686
4574B318489m40152l33539l07238k14382j80891j15780o7265q750r210q148n1906
4563E81228m9004l9544M18o570p157k5114l0244J4304o1635m6234N677M8701J8541
4550D03367p3328O4298J3354o5675j8093j899k107k1310k2425p8310K6946j0959
$$ plain form
4538 213859 254250 270168 261020 256800 243883 225789 215001 239353 215780 188948 213457 210671
4526 210671 205832 217428 233326 216690 223399 251282 241240 245808 245976 211002 193997 205671 185446
4513 185446 210420 216901 184036 208107 270168 276545 224399 234031 193432 152521 217087 188862
4501 188862 201155 180746 200188 257451 274228 261262 272452 275265 265781 261498 256256 303096
4489 303096 348829 292506 263048 222901 200576 179514 162466 171164 223765 186155 202857 218666
4477 218666 184489 157691 167230 170582 238106 254720 247022 232758 212502 219555 201564 237199
4465 237199 265088 245146 274959 264886 236901 231564 284894 278182 236779 213825 199523 218462
4453 218462 213744 222420 237543 250558 248193 309327 293012 249850 276042 238969 239347 274797 313255
$$ packed form
4538B13859M0391J5918r148m220j2917j8094j0788K4352k3573k6832K4509k786
4526B10671m839J1596J5898j6636O709K7883j0042M568J68l4974j7005J1674k0225
4513A85446K4974O481l2865K4071O2061O377n2146R632m0599m0911O4566k8225
4501A88862J2293k0409J9442N7263J6777j2966J1190K813r484m283n242M6840
4489C03096M5733n6323k9458m0147k2325k1062j7048Q698N2601l7610J6702J5809
4477B18666l4177k6798R539L352O7524J6614p698j4264k0256P053j7991L5635
4465B37199K7889j9942K9813j0073k7985n337N3330o712m1403k2954j4302J8939
4453B18462m718Q676J5123J3015k365O1134j6315m3162K6192l7073L78L5450L8458
$$ plain form
4440 313255 331262 317074 349671 406077 426709 459869 517137 529528 568174 499254 530914 515307
4428 515307 448492 401140 373371 424742 413846 424555 370830 339016 306390 261268 235829 271774
4416 271774 306306 280501 266418 254775 255356 215423 214301 186189 163676 202714 217807 237809
4404 237809 273571 271115 256106 234609 210288 188416 263556 250902 288785 294644 307948 308890
4392 308890 314058 318832 305011 289372 317524 317732 256102 356156 431593 463943 505082 497686
4380 497686 476113 579418 695052 764775 709236 631814 594605 507459 434515 401248 414554
4369 414554 375283 303212 264404 217781 184232 157509 175298 185771 148987 139036 115307 127789
4357 127789 119216 124472 91355 87296 132505 135297 154684 134333 79923 65366 110626 105610 81820
$$ packed form
4440C13255J8007j4188L2597N6406K0632L3160N7268J2391L8646o8920L1660j5607
4428E15307o6815m7352k7769N1371j0896J0709n3725l1814l2626m5122k5439L5945
4416B71774L4532k5805j4083j1643N81l9933j122k8112k2513L9038J5093K0002
4404B37809L5762k456j5009k1497k4321k1872P5140j2654L7883N859J3304R42
4392C08890N168M774j3821j5639K8152K08o1630J00054P5437L2350M1139p396
4380D97686k1573J03305J15634O9723n5539p7422l7209q7146p2944l3267J3306
4369D14554l9271p2071l8808m6623l3549k6723J7789J0473l6784r951k3729J2482
4357A27789q573N256l3117m059M5209K792J9387k0351n4410j4557M5260n016k3790
$$ plain form
4344 81820 57393 44708 99729 63506 63360 31751 47565 78975 89500 50933 45700 47846 54837
4331 54837 51948 75705 30302 23585 79862 56810 80923 40510 21198 68225 68709 57380 81642
4318 81642 102498 96224 80674 118580 137758 99988 95487 111293 112012 89148 104580 83175 9225
4305 9225 1269 73398 64873 56113 68597 85861 108472 83685 76239 58252 56333 20291 42451
4292 42451 100261 83817 45138 67142 40242 29745 42353 51551 41225 52347 24520 55542
4280 55542 61108 80978 72304 55570 65192 94324 24988 50432 44945 34896 44299 72702 88193
4267 88193 45426 36563 44395 44797 67254 86646 89724 108689 108869 65638 51206 99005 155238
4254 155238 115237 74968 98634 93897 54102 31128 86188 85960 62838 91900 98028 144866
$$ packed form
4344H1820k4427j2685N5021l6223j46l1609J5814L1410J0525l8567n233K146O991
4331E4837k889K3757m5403o717N6277k3052K4113m0413j9312M7027M84j1329K4262
4318H1642K0856o274j5550L7906J9178l7770m501J5806P19k2864J5432k1405p3950
4305I225p956P2129q525q760J2484J7264K2611k4787p446j7987j919l6042K2160
4292D2451N7810j6444l8679K2004k6900j0497J2608R198j0326J1122k7827L1022
4280E5542N566J9870q674j6734R622K9132o9336K5444n487j0049R403K8403J5491
4267H8193m2767q863P832M02K2457J9392L078J8965J80m3231j4432M7799N6233
4254A55238m0001m0269K3666m737l9795k2974N5060k28k3122K9062O128M6838
$$ plain form
4242 144866 137541 99748 94076 144181 113348 84396 148963 138229 163251 116633 132598 177466
4230 177466 173295 160877 120819 162988 140385 116190 144607 138830 169450 129879 136312 134617
4218 134617 116464 182321 199174 148687 123011 87532 35070 76303 141392 154596 189539 168827
4206 168827 151571 135391 106988 141475 165031 129584 122759 153251 170835 120428 80338 103369
4194 103369 160964 136996 118381 169548 213772 173092 152335 182873 170651 151859 182162 144609
4182 144609 130629 130841 188810 144198 105462 127787 147193 130461 119532 165445 115265 160981
4170 160981 153049 99838 104563 70188 94894 128798 147649 169552 133057 156164 184746 198361
4158 198361 207468 192555 186003 205583 217665 205822 206017 184760 151978 170275 181275 182178 214377
$$ packed form
4242A44866p325l7793n672N0105l0833k8952O4567j0734K5022m6618J5965M4868
4230A77466m171j2418m0058M2169k2603k4195K8417n777L0620l9571O433j695
4218A34617j8153O5857J6853n0487k5676l5479n2462M1233O5089J3204L4943k0712
4206A68827j7256j6180k8403L4487K3556l5447o825L0492J7584n0407m0090K3031
4194A03369N7595k3968j8615N1167M4224m0680k0757L0538j2222j8792L0303l7553
4182A44609j3980K12N7969m4612l8736K2325J9406j6732j0929M5913n0180M5716
4170A60981p932n3211M725l4375K4706L3904J8851K1903l6495K3107K8582J3615
4158A98361R107j4913o552J9580J2082j1843J95k1257l2782J8297J1000R03L2199
$$ plain form
4145 214377 194072 201961 236636 191900 180687 177442 217442 210109 176001 188999 206423 244252
4133 244252 204729 261038 261652 200469 210343 202935 216439 196330 199167 212448 225797 229384 231176
4120 231176 239589 227331 242847 210548 214318 231524 254426 205106 234470 237833 217246 215914
4108 215914 208345 237575 247522 272871 251460 229437 279113 263395 233626 219689 201449 258663
4096 258663 239588 231279 271477 229923 269158 295178 263794 249298 255555 269314 281678 282687
4084 282687 252943 266001 319801 344461 314257 315986 268890 319604 342762 327081 294403 253142
4072 253142 298955 327272 325752 334911 344603 324355 251121 260190 309030 332750 344390 427355
4060 427355 468192 426294 408065 426862 372897 391385 375342 362767 358482 416117 403965 382741
$$ packed form
4145B14377k0305P889L4675m4736j1213l245M0000p333l4108J2998J7424L7829
4133B44252l9523N6309O14o1183R874p408J3504k0109K837J3281J3349L587J792
4120B31176Q413j2258J5516l2299L770J7206K2902m9320K9364L363k0587j332
4108B15914p569K9230R947K5349k1411k2023M9676j5718k9769j3937j8240N7214
4096B58663j9075q309M0198m1554L9235K6020l1384j4496O257J3759J2364J009
4084B82687k9744J3058N3800K4660l0204J729m7096N0714K3158j5681l2678m1261
4072B53142M5813K8317j520R159R692k0248p3234R069M8840K3720J1640Q2965
4060D27355M0837m1898j8229J8797n3965J8488j6043j2575m285N7635j2152k1224
$$ plain form
4048 382741 356275 403866 428738 386552 382675 377477 361684 359465 418273 382970 371730 370376
4036 370376 327451 340398 371224 357389 393292 419586 419394 370046 365965 446711 437104 424302
4024 424302 427178 447671 398079 395638 409522 454458 455105 457261 463242 498638 524677 477456 518720
4011 518720 507140 514984 552971 557303 499513 543863 543347 552565 511497 533054 539656 530900 494281
3998 494281 496339 521755 568758 508577 519981 586238 610940 639690 624371 610776 588799 594182
3986 594182 616242 599323 621132 702012 717871 661021 683322 706485 713008 700397 745643 762144
3974 762144 765421 793492 789178 791157 815588 816742 853870 847906 797550 821762 817957 849210 872993
3961 872993 873620 865651 891605 927707 949618 932369 1005779 1022503 1025639 1051922 1093752 1077676
$$ packed form
4048C82741k6466M7591K4872m2186l877n198j5793k219N8808l5303j1240j354
4036C70376m2925J2947L0826j3835L5903K6294j92m9348m081Q0746r607j2802
4024D24302K876K0493m9592k441J3884M4936O47K156N981L5396K6039m7221M1264
4011E18720j1580P844L7987M332n7790M4350n16R218m1068K1557O602q756l6619
3998D94281K058K5416M7003o0181J1404O6257K4702K8750j5319j3595k1977N383
3986E94182K2060j6919K1809Q0880J5859n6850K2301K3163O523j2611M5246J6501
3974G62144L277K8071m314J979K4431J154L7128n964n0356K4212l805L1253K3783
3961H72993O27p969K5954L6102K1911j7249P3410J6724L136K6283M1830j6076
$$ plain form
3949 1077676 1101310 1099010 1166763 1151634 1142920 1204549 1236633 1241412 1218157 1251999 1321269 1374330
3937 1374330 1443011 1502151 1547296 1636881 1766998 1955339 2133151 2354079 2581799 2946454
3927 2946454 3408540 3873205 4307877 4597174 4583909 4428001 4199853 3799269 3295316 2857948
3917 2857948 2488494 2199585 2018216 1840311 1688824 1573738 1527654 1492290 1439503 1363082
3907 1363082 1306469 1279559 1227544 1213751 1233600 1209165 1134948 1146224 1078713 1040052 978916
3896 978916 972639 1011447 981367 1049481 1071314 1076704 1025305 984429 1010258 1044671 1032174 1011391
3884 1011391 946833 963105 1044973 1025555 1043766 1039685 1051400 1044933 1037954 1015996 968380 979461
3872 979461 1003517 1009538 994724 997111 1039633 1012426 998418 956450 946528 1007546 1072727 1047241
$$ packed form
3949A077676K3634k300O7753j5129q714O1629L2084M779k3255L3842O9270N3061
3937A374330O8681N9140M5145Q9585J30117J88341J77812K20928K27720L64655
3927B946454M62086M64665M34672K89297j3265j55908k28148m00584n03953m37368
3917B857948l69454k88909j81369j77905j51487j15086m6084l5364n2787p6421
3907A363082n6613k6910n2015j3793J9849k4435p4217J1276o7511l8661o1136
3896I78916o277L8808l0080O8114K1833N390n1399m0876K5829L4413j2497k0783
3884A011391o4558J6272Q1868j9418J8211m081J1715o467o979k1958m7616J1081
3872I79461K4056O021j4814K387M2522k7207j4008m1968r922O1018O5181k5486
$$ plain form
3860 1047241 1043595 1085007 1119119 1106174 1091540 1143183 1088226 1088787 1121869 1084398 1114187 1145959
3848 1145959 1137348 1122312 1107510 1136594 1139270 1172453 1169852 1138546 1157218 1176462 1147655 1165863
3836 1165863 1226464 1258131 1241067 1274739 1255037 1305274 1299726 1327168 1325835 1269752 1311647 1312851
3824 1312851 1299802 1302602 1300766 1284512 1345833 1366202 1304022 1362711 1435198 1448576 1465676 1495241
3812 1495241 1487722 1454989 1483914 1478635 1447166 1445719 1456347 1451894 1428220 1431017 1404577 1420805
3800 1420805 1440369 1471678 1495998 1499762 1489285 1532871 1560874 1552353 1545039 1534053 1522216 1471949
3788 1471949 1431685 1434230 1466108 1424228 1411030 1363187 1340126 1373620 1422510 1464365 1482145 1506920
3776 1506920 1488072 1451507 1439952 1472382 1442457 1385502 1408608 1386835 1391022 1425796 1482223 1451021
$$ packed form
3860A047241l646M1412L4112j2945j4634N1643n4957N61L3082l7471K9789L1772
3848A145959q611j5036j4802K9084K676L3183k601l1306J8672J9244k8807J8208
3836A165863O0601L1667j7064L3672j9702N0237n548K7442j333n6083M1895J204
3824A312851j3049K800j836j6254O1321K0369o2180N8689P2487J3378J7100K9565
3812A495241p519l2733K8925n279l1469j447J0628m453k3674K797k6440J6228
3800A420805J9564L1309K4320L764j0477M3586K8003q521p314j0986j1837n0267
3788A471949m0264K545L1878m1880j3198m7843k3061L3494M8890M1855J7780K4775
3776A506920j8848l6565j1555L2430k9925n6955K3106k1773M187L4774N6427l1202
$$ plain form
3764 1451021 1440312 1411604 1422146 1491414 1499864 1501455 1481396 1473294 1462930 1443200 1408948 1382240
3752 1382240 1404995 1401257 1413060 1409720 1371665 1395919 1441487 1392719 1312866 1328958 1328283 1304622
3740 1304622 1303458 1291905 1336346 1341571 1340275 1352834 1354034 1345562 1331878 1344017 1329918 1346384
3728 1346384 1426535 1389600 1398107 1367445 1394491 1414754 1403619 1446270 1410072 1394236 1350089 1374265
3716 1374265 1345190 1338546 1387547 1411315 1350604 1358462 1348767 1325192 1334997 1349634 1387859 1390126
3704 1390126 1472041 1483354 1438947 1439771 1459386 1480503 1454854 1509181 1558905 1611575 1567966 1607476
3692 1607476 1673042 1635393 1624687 1560593 1528990 1590029 1582675 1584569 1612720 1591601 1574067 1596907
3680 1596907 1634164 1668096 1741447 1725433 1784521 1806205 1804083 1834999 1856857 1834768 1854061 1834133
$$ packed form
3764A451021j0709k8708J0542O9268Q450J591k0059q102j0364j9730l4252k6708
3752A382240K2755l738J1803l340l8055K4254M5568m8768p9853J6092o75k3661
3740A304622j164j1553M4441N225j296J2559J200q472j3684J2139j4099J6466
3728A346384Q0151l6935Q507l0662K7046K0263j1135M2651l6198j5836m4147K4176
3716A374265k9075o644M9001K3768o0711P858r695k3575R805J4637L8225K267
3704A390126Q1915J1313m4407Q24J9615K1117k5649N4327M9724N2670m3609L9510
3692A607476O5566l7649j0706o4094l1603O1039p354J894K8151k1119j7534K2840
3680A596907L7257L3932P3351j6014N9088K1684k122L0916K1858k2089J9293j9928
$$ plain form
3668 1834133 1831810 1859526 1900034 1894241 1893312 1928069 1945258 2033866 2102162 2131476 2134423 2120621
3656 2120621 2127447 2169091 2147954 2094226 2145594 2203892 2220862 2304223 2365821 2387753 2417874 2467565
3644 2467565 2554346 2669090 2749765 2764729 2736431 2742520 2762946 2756949 2736649 2728980 2735514 2744499
3632 2744499 2767502 2808048 2896205 2906232 2964407 3088190 3085572 3100487 3073673 3032568 3122680
3621 3122680 3141103 3201942 3245119 3259323 3275636 3307567 3417534 3487069 3546899 3628502 3731625
3610 3731625 3778856 3883464 3906844 3886172 3937172 4063497 4123750 4112848 4157340 4171500 4203474
3599 4203474 4323692 4359167 4405292 4511204 4607569 4672828 4743181 4780955 4893117 4928946 4956758
3588 4956758 4991678 5054321 5094784 5197001 5315893 5454923 5558389 5645028 5718142 5755863 5916756
$$ packed form
3668A834133k323K7716M0508n793r29L4757J7189Q8608O8296K9314K947j3802
3656B120621O826M1644k1137n3728N1368N8298J6970Q3361O1598K1932L0121M9691
3644B467565Q6781J14744Q0675J4964k8298O089K0426n997k0300p669O534Q985
3632B744499K3003M0546Q8157J0027N8175J23783k618J4915k6814m1105R0112
3621C122680J8423O0839M3177J4204J6313L1931J09967O9535N9830Q1603J03123
3610C731625M7231J04608K3380k0672N1000J26325O0253j0902M4492J4160L1974
3599D203474J20218L5475M6125J05912R6365O5259P0353L7774J12162L5829K7812
3588D956758L4920O2643M0463J02217J18892J39030J03466Q6639P3114L7721J60893
$$ plain form
3577 5916756 6057601 6182052 6300751 6411509 6583387 6734830 6818461 6930385 7139088 7294615
3567 7294615 7399886 7503720 7605032 7820692 7987805 8156252 8336745 8558576 8806127 9094086
3557 9094086 9398571 9719787 10083572 10515145 10982415 11487938 12008808 12550499 13104995 13660472
3547 13660472 14158496 14676661 15078149 15441466 15745101 15891040 15899525 15708477 15349209 14800256
3537 14800256 14160478 13619016 13021611 12428977 11981087 11555652 11130007 10807001 10398210
3528 10398210 9980313 9697714 9460648 9243827 9039465 8895676 8725126 8563068 8400616
3519 8400616 8236222 8125416 8000164 7907093 7828056 7684816 7600779 7543516 7463759 7365058 7295073
3508 7295073 7227166 7106105 7042172 6946367 6975994 6932576 6984111 6987648 6992149 7027465 6942725 6826181
$$ packed form
3577E916756J40845J24451J18699J10758J71878J51443Q3631J11924K08703J55527
3567G294615J05271J03834J01312K15660J67113J68447J80493K21831K47551K87959
3557I094086L04485L21216L63785M31573M67270N05523N20870N41691N54496N55477
3547A3660472M98024N18165M01488L63317L03635J45939Q485j91048l59268n48953
3537A4800256o39778n41462n97405n92634m47890m25435m25645l23006m08791
3528A0398210m17897k82599k37066k16821k04362j43789j70550j62058j62452
3519H400616j64394j10806j25252r3071p9037j43240q4037n7263p9757r8701o9985
3508G295073o7907j21061o3933r5805K9627m3418N1535L537M501L5316q4740j16544
$$ plain form
3496 6826181 6754668 6756406 6774828 6831435 6900303 7060132 7243011 7507473 7802890 8138080 8634774
3485 8634774 9351538 10201210 11276981 12421317 13259676 13279097 12489573 11351434 10321688
3476 10321688 9504814 8896182 8378415 7895213 7503717 7194716 6949636 6888887 6811178 6682089
3466 6682089 6614149 6614932 6612150 6702698 6813232 6950412 7184529 7478273 7879358 8343564 8891814
3455 8891814 9557738 10525332 11727341 13232849 15151477 17391418 19417803 20041749 18716365
3446 18716365 16372761 13978304 11943912 10309529 9039700 8044824 7323345 6827041 6423606
3437 6423606 6061308 5738530 5526554 5439811 5349850 5295621 5249490 5279848 5278155 5277463 5291594
3426 5291594 5357697 5515884 5708643 5951137 6248103 6690997 7221580 8035350 8930461 9783054
$$ packed form
3496F826181p1513J738J8422N6607O8868J59829J82879K64462K95417L35190M96694
3485H634774P16764Q49672J075771J144336Q38359J9421p89524j138139j029746
3476A0321688q16874o08632n17767m83202l91496l09001k45080o0749p7709j29089
3466F682089o7940P83k782R0548J10534J37180K34117K93744M01085M64206N48250
3455H891814O65924R67594J202009J505508J918628K239941K026385O23946j325384
3446A8716365k343604k394457k034392j634383j269829r94876p21479m96304m03435
3437F423606l62298l22778k11976q6743q9961n4229m6131L0358j693o92J4131
3426E291594O6103J58187J92759K42494K96966M42894N30583Q13770Q95111Q52593
$$ plain form
3416 9783054 10242827 9902338 8903143 7605170 6470776 5627941 4985729 4538765 4179344
3407 4179344 3913437 3774643 3569006 3329451 3202990 3112908 3027903 2915844 2830311 2776565
3397 2776565 2717109 2690473 2627613 2547915 2519855 2458798 2450058 2410777 2365752 2246596 2244073 2212640
3385 2212640 2204910 2190790 2110996 2115487 2065150 2061796 2047288 1982489 1964170 1964373 1926735 1901628
3373 1901628 1852368 1853166 1832366 1812312 1785017 1766277 1784349 1775415 1732467 1710800 1677273 1629196
3361 1629196 1692120 1667650 1632158 1630562 1600784 1591483 1614832 1641166 1629595 1665254 1638748 1579100
3349 1579100 1577491 1595389 1546324 1506896 1516793 1501542 1461955 1495218 1524337 1445633 1400175 1430313
3337 1430313 1434239 1399254 1414255 1425812 1441214 1422192 1428383 1387028 1351918 1429712 1436824 1390228
$$ packed form
3416I783054M59773l40489r99195j297973j134394q42835o42212m46964l59421
3407D179344k65907j38794k05637k39555j26461r0082q5005j12059q5533n3746
3397B776565n9456k6636o2860p9698k8060o1057q740l9281m5025j19156k523l1433
3385B212640p730j4120p9794M491n0337l354j4508o4799j8319K03l7638k5107
3373A901628m9260P98k0800k0054k7295j8740J8072q934m2948k1667l3527m8077
3361A629196O2924k4470l5492j596k9778r301K3349K6334j1571L5659k6506n9648
3349A579100j609J7898m9065l9428R897j5251l9587L3263K9119p8704m5458L0138
3337A430313L926l4985J5001J1557J5402j9022O191m1355l5110P7794P112m6596
$$ plain form
3325 1390228 1384930 1431630 1432953 1445251 1421997 1395763 1379684 1427708 1411904 1444216 1465428 1416135
3313 1416135 1432323 1446042 1434715 1435396 1445834 1511983 1523078 1478674 1488944 1498841 1517645 1570245
3301 1570245 1585869 1647762 1668722 1698569 1698726 1710418 1717668 1704419 1754355 1766063 1763134 1822337
3289 1822337 1776835 1832658 1905046 1846281 1875924 1897087 1941095 2008707 2012860 2044789 2090735 2176340
3277 2176340 2279896 2300324 2388242 2460300 2555051 2638507 2760047 2898198 3028220 3202103
3267 3202103 3297864 3324081 3354609 3301063 3277005 3217094 3117961 3045739 2986858 2990220 2953750 2929513
3255 2929513 2996063 3077962 3134825 3235035 3284973 3416555 3573518 3711017 3846650 4009845
3245 4009845 4181650 4247364 4337794 4300792 4285021 4433294 4540723 4777709 5064517 5354197
$$ packed form
3325A390228n298M6700J323J2298k3254k6234j6079M8024j5804L2312K1212m9293
3313A416135J6188J3719j1327O81J0438O6149J1095m4404J0270R897J8804N2600
3301A570245J5624O1893K0960K9847J57J1692P250j3249M9936J1708k929N9203
3289A822337m5502N5823P2388n8765K9643K1163M4008O7612M153L1929M5946Q5605
3277B176340J03556K0428Q7918P2058R4751Q3456J21540J38151J30022J73883
3267C202103R5761K6217L0528n3546k4058n9911r9133p2222n8881L362l6470k4237
3255B929513O6550Q1899N6863J00210M9938J31582J56963J37499J35633J63195
3245D009845J71805O5714R0430l7002j5771J48273J07429K36986K86808K89680
$$ plain form
3235 5354197 5644857 5855589 6018563 5995838 5869963 5729113 5575434 5423089 5304872 5169086
3225 5169086 5130693 5111817 5083276 5141034 5263492 5311966 5409457 5506436 5731592 5956546 6100883
3214 6100883 6279864 6475513 6692952 6859945 6870642 6893300 6954915 7105174 7275614 7457636
3204 7457636 7692098 7894284 8001910 8022459 7828064 7529095 7192037 6826923 6560320 6396163
3194 6396163 6185432 6056076 5970680 5871784 5879171 5952860 5980969 5980992 6057322 6147368 6239976 6333477
3182 6333477 6408927 6496319 6627471 6743663 6788409 6741243 6715270 6625485 6504172 6394750 6267314
3171 6267314 6106151 5878144 5614504 5405811 5237444 5082561 4892972 4822366 4718438 4598214
3161 4598214 4596685 4585985 4556833 4533050 4475959 4417331 4364526 4325912 4221074 4148320 4041880
$$ packed form
3235E354197K90660K10732J62974k2725j25875j40850j53679j52345j18217j35786
3225E169086l8393j8876k8541N7758J22458M8474R7491R6979K25156K24954J44337
3214F100883J78981J95649K17439J66993J0697K2658O1615J50259J70440J82022
3204G457636K34462K02186J07626K0549j94395k98969l37058l65114k66603j64157
3194F396163k10731j29356q5396r8896P387P3689K8109K3P6330R0046R2608R3501
3182F333477P5450Q7392J31152J16192M4746m7166k5973q9785j21313j09422j27436
3171F267314j61163k28007k63640k08693j68367j54883j89589p0606j03928j20224
3161D598214j529j0700k9152k3783n7091n8628n2805l8614j04838p2754j06440
$$ plain form
3150 4041880 3940636 3811234 3712299 3520156 3378206 3188751 3091508 2999676 2886888 2737759
3140 2737759 2634597 2593653 2432240 2336397 2273644 2269678 2227744 2151831 2132735 2076406 1997686
3129 1997686 1955002 1939504 1868419 1848752 1849379 1787825 1650862 1667448 1665991 1536480 1518834 1495863
3117 1495863 1435700 1347264 1325687 1315448 1256401 1245519 1281848 1266237 1205099 1179051 1171911 1128289
3105 1128289 1106328 1069848 1064014 1013196 953215 953896 947656 974114 985517 912202 892198 886333
3093 886333 886860 869161 858286 863274 830950 785069 802833 855852 819257 781655 785955 777174 739663
3080 739663 689941 679497 659251 698216 637141 616269 588696 595858 637441 624162 553473 522607
3068 522607 505193 531458 562485 541646 520374 544708 519122 465148 505830 513859 467450 480414
$$ packed form
3150D041880j01244j29402r8935j92143j41950j89455r7243r1832j12788j49129
3140B737759j03162m0944j61413r5843o2753l966m1934p5913j9096n6329p8720
3129A997686m2684j5498p1085j9667O27o1554j36963J6586j457j29511j7646k2971
3117A495863o0163q8436k1577j0239n9047j0882L6329j5611o1138k6048p140m3622
3105A128289k1961l6480n834n0818n9981O81o240K6458J1403p3315k0004n865
3093H86333N27j7699j0875M988l2324m5881J7764N3019l6595l7602M300q781l7511
3080G39663m9722j0444k0246L8965o1075k0872k7573P162M1583j3279p0689l0866
3068E22607j7414K6265L1027k0839k1272K4334k5586n3974M0682Q029m6409J2964
$$ plain form
3056 480414 471179 443086 453437 512469 461722 432360 394613 405154 396854 402839 385569 373042
3044 373042 387874 385366 387456 318930 325053 343481 336768 348284 328289 317055 330547 304423
3032 304423 307228 305817 311329 263115 282482 275234 270234 301421 345437 308680 282622 278428 277942
3019 277942 260475 229816 183710 237662 250028 211519 228483 179053 181038 179480 155587 184807
3007 184807 174989 139684 181311 228177 216342 187994 118905 121953 138846 134087 169188 190028
2995 190028 189143 187749 204071 194354 166739 124950 98892 156115 174423 195814 163572 118171
2983 118171 146506 168281 139739 123750 77868 119087 148242 163563 160447 152366 146877 147243 180562
2970 180562 182200 121409 108643 87491 119686 173497 94871 133906 184786 143632 97119 60063
$$ packed form
3056D80414r235k8093J0351N9032n0747k9362l7747J0541q300N985j7270j2527
3044C73042J4832k508K090o8526O123J8428o713J1516j9995j1234J3492k6124
3032C04423K805j411N512m8214J9367p248n000L1187M4016l6757k6058m194m86
3019B77942j7467l0659m6106N3952J2366l8509J6964m9430J985j558k3893K9220
3007A84807r818l5305M1627M6866j1835k8348o9089L048J6893m759L5101K0840
2995A90028q85j394J6322r717k7615m1789k6058N7223J8308K1391l2242m5401
2983A18171K8335K1775k8542j5989m5882M1219K9155J5321l116q081n489L66L3319
2970A80562J638o0791j2766k1152L2195N3811p8626L9035N0880m1154m6513l7056
$$ plain form
2958 60063 73042 115086 120264 92123 111666 138252 118265 124713 153841 172871 148225 139641
2946 139641 127385 87950 102886 84896 79826 149987 87001 65682 68471 78628 114178 115956
2934 115956 90704 34804 56031 79180 69819 94181 134538 98086 74354 55629 35070 61580
2922 61580 76641 90743 102865 130792 121359 162389 166218 125546 168363 144535 76437 60238
2910 60238 68356 92105 68365 33896 35140 -12570 49150 81691 52622 106042 77115 68448
2898 68448 48373 69975 54270 66143 63562 55181 35365 28071 34848 91399 58680 25585 36153
2885 36153 74657 63727 16046 58137 73184 67385 91460 110936 102318 94894 128987 101822
2873 101822 69177 59349 40913 83063 43019 31071 56285 29395 34215 74962 49389 30660
$$ packed form
2958F0063J2979M2044N178k8141J9543K6586j9987O448K9128J9030k4646q584
2946A39641j2256l9435J4936j7990n070P0161o2986k1319K789J0157L5550J778
2934A15956k5252n5900K1227K3149r361K4362M0357l6452k3732j8725k0559K6510
2922F1580J5061J4102J2122K7927r433M1030L829m0672M2817k3828o8098j6199
2910F0238Q118K3749k3740l4469J244m7710O1720L2541k9069N3420k8927q667
2898F8448k0075K1602j5705J1873k581q381j9816p294O777N6551l2719l3095J0568
2885C6153L8504j0930m7681M2091J5047n799K4075J9476q618p424L4093k7165
2873A01822l2645r828j8436M2150m0044j1948K5214k6890M820M0747k5573j8729
$$ plain form
2861 30660 25393 31144 6405 20666 57054 34730 43062 25363 -327 25952 32632 4846 -12427
2848 -12427 -31886 10282 8063 -4049 24798 4966 -29975 29168 24342 14792 -6728 -19003
2836 -19003 5862 3958 43330 40663 31235 1662 -48334 -28664 -19041 3201 31353 20244 13902
2823 13902 -21040 -39162 -78932 -30661 -42082 -10201 -22487 -14493 9054 -21337 -18774 -541
2811 -541 -46787 -44935 -11558 -3991 33982 13707 -3104 -15826 -75910 -39733 -15172 26266 30806
2798 30806 3285 632 -25725 -47003 -40264 -57901 -28190 4519 -18237 -39352 -57579 6215
2786 6215 20658 -14316 9240 14872 12720 -20154 -43359 -32144 -19445 -9289 20532 66117
2774 66117 94047 30952 -18550 -42005 -21486 -14658 3738 5898 35762 103 -2248 18790
$$ packed form
2861C0660n267N751k4739J4261L6388k2324Q332j7699k5690K6279O680k7786j7273
2848a2427j9459M2168k219j2112K8847j9832l4941N9143m826r550k1520j2275
2836a9003K4865j904L9372k667r428k9573m9996J9670R623K2242K8152j1109o342
2823A3902l4942j8122l9770M8271j1421L1881j2286P994K3547l0391K563J8233
2811e41m6246J852L3377P567L7973k0275j6811j2722o0084L6177K4561M1438M540
2798C0806k7521k653k6357k1278O739j7637K9711L2709k2756k1115j8227O3794
2786F215J4443l4974K3556N632k152l2874k3205J1215J2699J0156K9821M5585
2774F6117K7930o3095m9502k3455K0519O828J8396K160K9864l5659k351K1038
$$ plain form
2762 18790 -20344 -5279 -104126 -87178 -46530 -47695 -57833 -9732 -46389 -41355 -40623 -51663 -25193
2749 -25193 -49366 -66840 -79472 -52995 -33030 -22691 -29316 -68772 -64538 -9302 12795 14364
2737 14364 9317 -17840 -67032 -76273 -30850 -33508 -2844 78802 48564 -5015 -27490 -14812
2725 -14812 10126 -18976 -36633 -4221 -2825 -1814 -24843 -51958 -103652 -96901 -37706 -38156 -32454
2712 -32454 -44031 -15539 -44494 -51179 625 17841 -22894 -8048 12887 -6150 -8266 8022
2700 8022 34277 -20665 -22685 4621 -41046 -37706 -85252 -79673 -103849 -64709 19091 24605 1297
2687 1297 37140 7133 -14344 18050 14704 -15131 26329 57155 73331 109410 122830 84300
2675 84300 85713 140369 205275 199832 126817 150781 140860 144353 139152 75596 29536 26014 19551
$$ packed form
2762A8790l9134J5065r8847J6948M0648j165j0138M8101l6657N034P32j1040K6470
2749b5193k4173j7474j2632K6477J9965J0339o625l9456M234N5236K2097J569
2737A4364n047k7157m9192r241M5423k658L0664Q1646l0238n3579k2475J2678
2725a4812K4938k9102j7657L2412J396J011k3029k7115n1694O751N9195m50N702
2712c2454j1577K8492k8955o685N1804J7216m0735J4846K0935j9037k116J6288
2700H022K6255n4942k020K7306m5667L340m7546N579k4176L9140Q3800N514k3308
2687A297L5843l0007k1477L2394l346k9835M1460L0826J6176L6079J3420l8530
2675H4300J413N4656O4906n443p3015K3964r921L493n201o3556m6060l522o463
$$ plain form
2662 19551 74196 55971 49928 32127 -2943 51507 -17739 13782 -9598 -5261 6710 -53880
2650 -53880 -50957 -38572 9955 -6904 20884 -2887 9147 -5025 -19510 -29805 -69545 -28721
2638 -28721 -10176 -32089 -26746 -4552 -35965 -72505 -6853 31766 6519 17193 50854 44396
2626 44396 39036 35773 -5244 13871 11106 -7193 9336 5758 -14315 10408 -41499 -30236 56769
2613 56769 -17388 -112113 -84275 -32378 -25082 -1681 -20193 -37395 -24404 -12542 -15041 20410
2601 20410 29487 1280 -48878 -47718 4445 11567 30487 17608 39713 21910 4514 1510 -3644
2588 -3644 -21626 18023 54879 21862 56920 55979 66129 36406 84964 82170 51129 -197 48084
2575 48084 64221 35138 34642 81441 121074 116388 108814 86640 40739 -2734 6598 48781 39285
$$ packed form
2662A9551N4645j8225o043j7801l5070N4450o9246L1521k3380M337J1971o0590
2650e3880K923J2385M8527j6859K7788k3771J2034j4172j4485j0295l9740M0824
2638b8721J8545k1913N343K2194l1413l6540O5652L8619k5247J0674L3661o458
2626D4396n360l263m1017J9115k765j8299J6529l578k0073K4723n1907J1263Q7005
2613E6769p4157r4725K7838N1897P296K3401j8512j7202J2991J1862k499L5451
2601B0410R077k8207n0158J160N2163P122J8920j2879K2105j7803j7396l004n154
2588c644j7982L9649L6856l3017L5058r41J0150k9723M8558k794l1041n1326M8281
2575D8084J6137k9083m96M6799L9633m686p574k2174m5901m3473R332M2183r496
$$ plain form
2562 39285 73998 73117 70299 43845 41194 65214 115350 91917 121004 105064 125024 135803 97334
2549 97334 69422 70309 53673 97766 120434 70156 69602 124589 71414 26641 69300 78551 49258
2536 49258 13123 74966 62386 107197 116173 141321 131648 129041 117927 106473 113137 108905 139841
2523 139841 80270 82675 141627 152034 162049 126264 163081 127034 137481 153065 137934 121354
2511 121354 116657 177017 256932 208860 305008 311440 301007 355639 397733 355657 383636 413569
2499 413569 414292 367918 374470 360815 375455 431290 438001 455097 450896 440832 414568 410588 447278
2486 447278 477556 484193 493103 542446 527985 546324 576467 610042 620175 575745 576039 603124
2474 603124 734562 747678 715164 732104 738249 752008 768576 813534 809733 818042 825167 862118
$$ packed form
2562C9285L4713q81k818k6454k651K4020N0136k3433K9087j5940J9960J0779l8469
2549I7334k7912Q87j6636M4093K2668n0278n54N4987n3175m4773M2659R251k9293
2536D9258l6135O1843j2580M4811Q976K5148r673k607j1114j1454O664m232L0936
2523A39841n9571K405N8952J0407J0015l5785L6817l6047J0447J5584j5131j6580
2511A21354m697O0360P9915m8072R6148O432j0433N4632M2094m2076K7979K9933
2499D13569P23m6374O552j3655J4640N5835O711J7096m201j0064k6264l980L6690
2486D47278L0278O637Q910M9343j4461J8339L0143L3575J0133m4430K94K7085
2474F03124J31438J3116l2514J6940O145J3759J6568M4958l801Q309P125L6951
$$ plain form
2462 862118 864323 912840 979343 1030979 1016781 1065737 1170283 1181510 1257302 1351542 1362000 1403263
2450 1403263 1481144 1529005 1578524 1628824 1618561 1663081 1775647 1852647 1928487 2011924 2084135
2439 2084135 2148427 2248273 2335718 2403199 2470113 2575435 2642112 2771823 2852033 2863404 2967986
2428 2967986 3089882 3215098 3360531 3507905 3760724 4145162 4557174 5008269 5280923 5509553
2418 5509553 5819712 6299753 6935555 7796858 8791419 10081744 11913538 14365336 17466657
2409 17466657 21535882 26221951 31620429 34545857 30557766 24417074 19029914 14667336
2401 14667336 11615845 9547136 8101274 6935811 6121627 5565899 5107036 4761046 4574700
2392 4574700 4410718 4226191 3960912 3695216 3420207 3096360 2774645 2571109 2353925 2218578
$$ packed form
2462H62118K205M8517O6503N1636j4198M8956J04546J1227P5792R4240J0458M1263
2450A403263P7881M7861M9519N0300j0263M4520J12566P7000P5840Q3437P2211
2439B084135O4292R9846Q7445O7481O6914J05322O6677J29711Q0210J1371J04582
2428B967986J21896J25216J45433J47374K52819L84438M12012M51095K72654K28630
2418E509553L10159M80041O35802Q61303R94561J290325J831794K451798L101321
2409A7466657M069225M686069N398478K925428l988091o140692n387160m362578
2401A4667336l051491k068709j445862j165463q14184n55728m58863l45990j86346
2392D574700j63982j84527k65279k65696k75009l23847l21715k03536k17184j35347
$$ plain form
2382 2218578 2107282 1968852 1887272 1784756 1678394 1614458 1556863 1445695 1356127 1281792
2372 1281792 1234868 1174210 1175329 1153624 1078862 1021609 939658 887033 885088 837848 747778 693991
2360 693991 756557 732166 672381 663307 635574 625300 661425 629328 560309 502740 502526 531412
2348 531412 485098 475206 466487 440313 414079 364272 317997 335844 346791 373579 391592 381555
2336 381555 392703 431303 415405 355749 324592 387205 330857 274341 303668 284902 236114 237126
2324 237126 208020 183082 182112 201389 131786 101950 106689 131111 181733 195489 198702 165778
2312 165778 114720 147458 178631 196023 145515 163508 185003 205153 168896 169562 134679 163563
$$ packed form
2382B218578j11296j38430q1580j02516j06362o3936n7595j11168q9568p4335
2372A281792m6924o0658J119k1705p4762n7253q1951n2625j945m7240r0070n3787
2360F93991O2566k4391n9785r074k7733j0274L6125l2097o9019n7569k14K8886
2348E31412m6314r892q719k6174k6234m9807m6275J7847J0947K6788J8013j0037
2336C81555J1148L8600j5898n9656l1157O2613n6348n6516K9327j8766m8788J012
2324B37126k9106k4938r70J9277o9603k9836M739K4422N0622J3756L213l2924
2312A65778n1058L2738L1173J7392n0508J7993K1495K0150l6257O66l4883K8884
$$ [...]
##END NTUPLES=NMR SPECTRUM
##END=
