##TITLE=1H_EC-3309(1)
 CDCl3
 8 sc, 
 11.1.2024
##JCAMPDX= 6.0         $$ Bruker NMR JCAMP-DX V2.0
##DATA TYPE= NMR SPECTRUM
##DATA CLASS= NTUPLES
##ORIGIN= UXNMR, Bruker Analytische Messtechnik GmbH
##OWNER= root
$$ XWIN-NMR		Version 3.5
$$ Thu Jan 11 13:50:09 2024 Russian Standard Time (UT+4h)  she@DPX200
##.OBSERVE FREQUENCY= 200.1313
##.OBSERVE NUCLEUS= ^1H
##.ACQUISITION MODE= SIMULTANEOUS
##.ACQUISITION SCHEME= undefined
##.AVERAGES= 8
##.DIGITISER RES= 18
##SPECTROMETER/DATA SYSTEM= spect
##.PULSE SEQUENCE= zg30
##.SOLVENT NAME= CDCl3
##.SHIFT REFERENCE= (INTERNAL, CDCl3, 0, 15.4108)
##AUDIT TRAIL= $$ (NUMBER, WHEN, WHO, WHERE, WHAT)
$$ ##TITLE= Audit trail, XWIN-NMR		Version 3.5
$$ ##JCAMPDX= 5.01
$$ ##ORIGIN= Bruker BioSpin GmbH
$$ ##OWNER= she
$$ F:/spectra/data/she/nmr/H-F/1/pdata/1/auditp.txt
$$ ##AUDIT TRAIL=  $$ (NUMBER, WHEN, WHO, WHERE, WHAT)
(   1,<2024-01-11 13:49:03.56 +0400>,<she>,<DPX200>,
      <created by zg, POWCHK disabled, PULCHK disabled
       configuration hash MD5:
       00 E9 B6 7A A2 85 ED C7 34 08 36 98 17 FE 4E 26
       data hash MD5: 16K
       A2 51 E3 95 A7 40 6E 19 88 92 72 A0 86 48 A4 47>)
(   2,<2024-01-11 13:49:05.87 +0400>,<she>,<DPX200>,
      <Start of raw data processing
       efp BC_mod = 2 LB = 0.24 FT_mod = 6 PKNL = 1 PHC0 = -24589.25 PHC1 = 12.25273 SI = 16K 
       data hash MD5: 16K
       66 E9 35 9D FA 97 E3 2F C9 E3 36 41 30 5F 01 E2>)
(   3,<2024-01-11 13:49:22.60 +0400>,<she>,<DPX200>,
      <pk PHC0 = 1.004579 PHC1 = -2.4 
       data hash MD5: 16K
       87 8E B1 6C A3 D4 F7 B2 7E 17 06 90 81 A2 7A 84>)
(   4,<2024-01-11 13:49:26.25 +0400>,<she>,<DPX200>,
      <abs ABSG = 5 
       data hash MD5: 16K
       46 89 21 F1 75 86 21 B5 C4 97 C4 68 DA 2B 99 74>)
$$ ##END=
$$ 
$$ hash MD5
$$ 8F 48 AD 62 9F E7 06 F9 70 48 90 E6 00 10 F0 11
##$RELAX= 
##$RELAX= 
##$RELAX= 
##$RELAX= 
##$RELAX= 
##$RELAX= 
$$ Bruker specific parameters
$$ --------------------------
##$DU= <F:/spectra>
##$EXPNO= 1
##$NAME= <H-F>
##$PROCNO= 1
##$TYPE= <nmr>
##$USER= <she>
##$AMP= (0..31)
100 100 100 100 100 100 100 100 100 100 100 100 100 100 100 100 100 100 
100 100 100 100 100 100 100 100 100 100 100 100 100 100 
##$AQSEQ= 0
##$AQ_mod= 1
##$AUNM= <au_zg>
##$AUTOPOS= <>
##$BF1= 200.13
##$BF2= 200.13
##$BF3= 200.13
##$BF4= 200.13
##$BF5= 200.13
##$BF6= 200.13
##$BF7= 200.13
##$BF8= 200.13
##$BYTORDA= 1
##$CFDGTYP= 0
##$CFRGTYP= 5
##$CHEMSTR= <none>
##$CNST= (0..31)
1 1 145 1 1 1 1 1 1 1 1 1 1 1 1 1 1 1 1 1 1 1 1 1 1 1 1 1 1 1 1 1 
##$CPDPRG= <>
##$CPDPRG1= <>
##$CPDPRG2= <>
##$CPDPRG3= <>
##$CPDPRG4= <mlev>
##$CPDPRG5= <mlev>
##$CPDPRG6= <mlev>
##$CPDPRG7= <mlev>
##$CPDPRG8= <mlev>
##$CPDPRGB= <>
##$CPDPRGT= <>
##$D= (0..31)
0 1.2 0 0 0 0 0 0 0 0.06 0 0.03 0 0 0 0 0.0002 0 0 0 0 0 0 0 0 0 0 0 0 
0 0 0 
##$DATE= 1704966543
##$DBL= (0..7)
120 120 120 120 120 120 120 120 
##$DBP= (0..7)
150 150 150 150 150 150 150 150 
##$DBP07= 0
##$DBPNAM0= <>
##$DBPNAM1= <>
##$DBPNAM2= <>
##$DBPNAM3= <>
##$DBPNAM4= <>
$$ [...]
##$SUBNAM3= <"">
##$SUBNAM4= <"">
##$SUBNAM5= <"">
##$SUBNAM6= <"">
##$SUBNAM7= <"">
##$SUBNAM8= <"">
##$SUBNAM9= <"">
##$SW= 18.0517328524113
##$SWIBOX= (0..15)
0 0 2 0 0 0 0 0 0 0 0 0 0 0 0 0 
##$SW_h= 3612.71676300578
##$TD= 16384
##$TD0= 1
##$TE= 0
##$TE2= 300
##$TE3= 300
##$TEG= 300
##$TL= (0..7)
0 120 120 120 120 120 120 120 
##$TP= (0..7)
150 150 150 150 150 150 150 150 
##$TP07= 0
##$TPNAME0= <>
##$TPNAME1= <>
##$TPNAME2= <>
##$TPNAME3= <>
##$TPNAME4= <>
##$TPNAME5= <>
##$TPNAME6= <>
##$TPNAME7= <>
##$TPOAL= (0..7)
0.5 0.5 0.5 0.5 0.5 0.5 0.5 0.5 
##$TPOFFS= (0..7)
0 0 0 0 0 0 0 0 
##$TUNHIN= 0
##$TUNHOUT= 0
##$TUNXOUT= 0
##$USERA1= <user>
##$USERA2= <user>
##$USERA3= <user>
##$USERA4= <user>
##$USERA5= <user>
##$V9= 5
##$VALIST= <valist>
##$VCLIST= <CCCCCCCCCCCCCCC>
##$VD= 0
##$VDLIST= <DDDDDDDDDDDDDDD>
##$VPLIST= <PPPPPPPPPPPPPPP>
##$VTLIST= <TTTTTTTTTTTTTTT>
##$WBST= 1024
##$WBSW= 4
##$XGAIN= (0..3)
0 0 0 0 
##$XL= 0
##$YL= 0
##$YMAX_a= 583271
##$YMIN_a= -598331
##$ZGOPTNS= <>
##$ZL1= 120
##$ZL2= 120
##$ZL3= 120
##$ZL4= 120
##$ABSF1= 15.48356
##$ABSF2= -2.56829
##$ABSG= 5
##$ABSL= 3
##$ALPHA= 0
##$AQORDER= 0
##$ASSFAC= 0
##$ASSFACI= 0
##$ASSFACX= 0
##$ASSWID= 0
##$AUNMP= <proc_1d>
##$AZFE= 0.1
##$AZFW= 0.1
##$BCFW= 0
##$BC_mod= 2
##$BYTORDP= 0
##$COROFFS= 0
##$CY= -3
##$DATMOD= 1
##$DC= 0
##$DFILT= <>
##$DTYPP= 0
##$F1P= 0
##$F2P= 0
##$FCOR= 1
##$FTSIZE= 16384
##$FT_mod= 6
##$GAMMA= 0
##$GB= 0
##$INTBC= 1
##$INTSCL= 3.70164e-10
##$ISEN= 128
##$LB= 0.24
##$LEV0= 0
##$LPBIN= 0
##$MAXI= 10000
##$MC2= 0
##$MEAN= 0
##$ME_mod= 0
##$MI= 1.114404
##$NCOEF= 0
##$NC_proc= -5
##$NLEV= 6
##$NOISF1= 3.799351
##$NOISF2= 2.8
##$NSP= 0
##$NTH_PI= 0
##$NZP= 0
##$OFFSET= 15.41084
##$PC= 1
##$PHC0= -24588.25
##$PHC1= 9.85273
##$PH_mod= 1
##$PKNL= yes
##$PPARMOD= 0
##$PSCAL= 0
##$PSIGN= 0
##$REVERSE= no
##$SF= 200.130022187101
##$SI= 16384
##$SIGF1= 3
##$SIGF2= 2
##$SINO= 5.538805
##$SIOLD= 16384
##$SREGLST= <1H.CDCl3>
##$SSB= 0
##$STSI= 16384
##$STSR= 0
##$SW_p= 3612.71676300578
##$SYMM= 0
##$S_DEV= 0
##$TDeff= 16384
##$TDoff= 0
##$TI= <>
##$TILT= no
##$TM1= 0
##$TM2= 0
##$TOPLEV= 0
##$USERP1= <user>
##$USERP2= <user>
##$USERP3= <user>
##$USERP4= <user>
##$USERP5= <user>
##$WDW= 1
##$XDIM= 16384
##$YMAX_p= 351934598
##$YMIN_p= -292331
$$ End of Bruker specific parameters
$$ ---------------------------------
##NTUPLES= NMR SPECTRUM
##VAR_NAME=  FREQUENCY,     SPECTRUM/REAL,   SPECTRUM/IMAG
##SYMBOL=    X,             R,               I
##VAR_TYPE=  INDEPENDENT,   DEPENDENT,       DEPENDENT
##VAR_FORM=  AFFN,          ASDF,            ASDF
##VAR_DIM=   16384,         16384,           16384
##UNITS=     HZ,            ARBITRARY UNITS, ARBITRARY UNITS
##FACTOR=    0.220516191357247, 1,           1
##FIRST=     3084.17175802332, 0,            0
##LAST=      -528.54500498246, 0,            0
##MIN=       -528.54500498246, -292331,      0
##MAX=       3084.17175802332, 351934598,    0
$$ Real data points
##PAGE= N=1
##DATA TABLE= (X++(R..R)), XYDATA
$$ [...]
8686D54580l4696q4012L8828M2273l5107j5954l4511K4042n875j050J1206M599
8674C64323n4259m1983K8715M4659M9863n2574o0264j6663N4440M206N1791M2689
8662D14943l2200j9076j2115k8789K5951n0868J4927J09099L8216k8236n5711
8651C76141J5816N0423n5859K477L987L1032J2688m1450j7598k6223R449q764
8639C52119j3460j9215q888o2444J7560K2710M3136J2512n7647m9573L5353K0179
8627B92342L0723j685n865m7268l0088J6380J8241J5821m222R201j8489J5943
8615B91034j9578K4088R146J9556L0221K1530l7912r991J7629K8659k3755q714
8603C41913J8462K5225n2987L1160O5880Q199l4337l0483o919q975J4929l403
$$ plain form
8686 454580 419884 335872 374700 416973 381866 365912 331401 355443 349568 348518 359724 364323
8674 364323 310064 268081 296796 341455 391318 338744 278480 261817 316257 320463 372254 414943
8662 414943 382743 363667 351552 322763 348714 297846 312773 421872 460088 431852 376141
8651 376141 391957 442380 386521 388998 392985 424017 436705 395255 377657 351434 360883 352119
8639 352119 338659 319444 310556 248112 265672 288382 331518 344030 286383 236810 272163 292342
8627 292342 323065 321380 315515 268247 238159 254539 272780 288601 284379 293580 275091 291034
8615 291034 271456 295544 304690 324246 354467 375997 338085 328094 345723 374382 350627 341913
8603 341913 360375 385600 332613 363773 429653 437852 403515 373032 366113 357138 372067 368664
8591C68664k6385l1584K5229k012Q5155j9088K2179N9265m9286L6654J4435o0818
8579D22408J7086K0378K5011n701j7899K4523J5325j4229M7565j16l1615n480
8567D97256n3284n3728J0337j3031l252K0545k8703j7242o8828N2039r905k5269
8555C06935N8711o3526k1030K7999k5431j1415K0687P2j5094K0219j7518L7994
8543C18603N837m3243L647j267k6157k3463O9648J3489n0661k9681l112l9297
8531A94343k7911l0628O953N7830j7748r993j3097m0j1590O1566j6391M089k9349
8518A68034l2003M086K3001J1838l0978l4238l4462j6674K114L5930p428l7256
8506E1964k0498Q927L1765K96L8658m955j7717L2571j7134k1577o2348L4512J6483
$$ plain form
8591 368664 342279 310695 335924 333912 419067 399979 422158 481423 432137 468791 483226 422408
8579 422408 439494 459872 484883 479182 461283 485806 501131 486902 534467 534351 502736 497256
8567 497256 443972 390244 400581 387550 384298 404843 376140 358898 290070 342109 332204 306935
8555 306935 365646 302120 281090 309089 283658 272243 292930 293002 277908 298127 280609 318603
8543 318603 324440 281197 284844 283577 257420 233957 303605 317094 266433 236752 233640 194343
8531 194343 166432 135804 142757 200587 182839 172846 159749 159709 148119 209685 193294 197383 168034
8518 168034 136031 140117 163118 174956 143978 109740 75278 58604 60718 96648 89220 51964
8506 51964 31466 40393 72158 72454 111112 106157 88440 121011 103877 82300 19952 54464 70947
8493G0947K1570l7090M1090J3291J1134M628m4636l8432j4527O960Q6945J2659
8481A34539k6972l9602L7841k1479j068l6752l6610j0387M4072k262M4923M7212
8469A33455k0100n1897K0261K7364q406J1520p4823N8744j0369K664j9995M1735
8457A10153L4718j1182J773q691L6404n688R371O5276Q4053R2656K0949o0165
8445C69627j42550l2189o6216l1430m6860j423K7893j4225k802m3748L6587K550
8433E5214N01j935j5984K9256j6852m4140K2549L2787K9442l1852p1729J1907
8421h36L9135R252n4048N9432j0418m6936J1227K0841l6819l806N2690K8270r0481
8408b2497M9623K9204n3839l5773p327O932J6221m4494K5076L357l1659K5688
$$ plain form
8493 70947 92517 55427 96517 109808 120942 125570 80934 42502 27975 34935 121880 134539
8481 134539 107567 67965 105806 84327 83259 46507 9897 -490 43582 41320 86243 133455
8469 133455 113355 61458 81719 109083 100677 112197 37374 96118 85749 88413 68418 110153
8457 110153 144871 133689 135462 126771 163175 157487 166858 232134 316187 408843 429792 369627
8445 369627 227077 194888 128672 97242 50382 48959 76852 62627 59825 16077 52664 55214
8433 55214 55715 53780 37796 67052 50200 6060 28609 61396 90838 58986 -12743 -836
8421 -836 38299 47551 -6497 52935 42517 -4419 6808 27649 -9170 -12976 39714 67984 -22497
8408 -22497 27126 56330 2491 -33282 -40609 -33677 -17456 -61950 -36874 -33517 -65176 -39488
8396c9488M1256J2248L0790l4482q5218L9911K9214K1231l4474K2765m4714J6597
8384b4364m697J1615j980k1209K8182J7693P465O59l0692J2442K0086j7140K8751
8371B6811k8799p71r061k7804J3413J1179J9634M617m6989j7320N6879J8706j8736
8358A759k1148j3831j4757l29L3312O806j0391Q471n4479l6202K5320J8773q877
8345f5573l0888L1244N2102j5798K8572l5945k8693L1750L521J4859o657M3947
8333B2441k2258K6441l0632k1831m510L1778j7106J6970M4635l3196R269l5098
8321a3097P895k0969M5126l0980l5366j2492n789N2973J0469m7594L2365q167
8309b5626J6570k5457L8595L029j1767m3788L3208M2287m4616r377L8426L476
$$ plain form
8396 -39488 1768 14016 44806 10324 -74894 -34983 -5769 15462 -19012 3753 -40961 -24364
8384 -24364 -29061 -17446 -19426 -40635 -12453 5240 12705 13364 -17328 -4886 15200 -1940 26811
8371 26811 -1988 -2759 -11820 -39624 -26211 -15032 4602 9219 -37770 -55090 1789 20495 1759
8358 1759 -19389 -33220 -47977 -48306 -14994 -8188 -18579 -10108 -64587 -100789 -75469 -56696 -65573
8345 -65573 -96461 -65217 -13115 -28913 -341 -36286 -64979 -33229 -29708 -14849 -21506 22441
8333 22441 183 26624 -4008 -25839 -30349 1429 -15677 1293 45928 12732 22001 -13097
8321 -13097 -5202 -26171 18955 -12025 -47391 -59883 -65672 -12699 -2230 -49824 -17459 -25626
8309 -25626 -9056 -34513 4082 7111 -4656 -48444 -15236 27051 -17565 -26942 11484 14960
8297A4960l892K8861r469K6848m0271L244J5445j8724J1620j2792m0821j8401
8285d3392q639J8229L0730L7363K8738O162m525m3242l2143j0227K64J0248J1869
8272A435N0799J1139j6960M0761P620m0384p337m8184j6065N3030O904Q764J3441
8259F4963j3747m5611J0286K1117J3879j7956l5637J1968k8183K0977p114l0186
8247c5244J6485P182k1946K4439J6116n950P31j2345k4784L6831j0237M8066r332
8234C0012K1612l832J5132L2783j5164k1379j1495k2750l3290M2848K134p305
8222B9306P1339L515k9257m0952l4079J8167j6938J6345n06n386J5192k1448M069
8209I367j2297P788L2830K7346J7346k5796J2965j933j5214k0814K566L5940K9211
$$ plain form
8297 14960 11068 39929 30460 57308 17037 20281 35726 17002 28622 15830 -24991 -43392
8285 -43392 -52031 -33802 -3072 34291 63029 69191 64666 21424 -10719 -20946 -20682 -10434 1435
8272 1435 52234 63373 46413 87174 94794 54410 47073 -1111 -17176 35854 42758 51522 64963
8259 64963 51216 5605 15891 37008 50887 32931 -2706 9262 -18921 2056 -5058 -35244
8247 -35244 -18759 -11577 -33523 -9084 7032 1082 1813 -10532 -35316 1515 -8722 39344 30012
8234 30012 51624 47792 62924 95707 80543 59164 47669 24919 -8371 34477 36611 29306
8222 29306 100645 104160 74903 33951 -128 18039 1101 17446 16940 11554 26746 5298 9367
8209 9367 -2930 4858 37688 65034 82380 56584 69549 67616 52402 31588 34154 70094 99305
8196I9305J0702K4806k0832J77395l69364k14343J99495l1413l258l610Q8028
8185d3089P449l4861M4N4983K1326Q142k4893j6401l4707p383Q3230k6086k4962
8172c7208k0859l3403K3760N3473L7074m4432p427l5913O687L6174P2652j9133
8160C1445K206l0238k2692l0994K855K0485k765J2291n9250k3897K7840O1666
8148a1048L6048K1335J4577o7439j7563K8020k9056m133Q20Q907K3347J483o6870
8135f1572R505o771P499q340O8297q597O05K0743n4255l4219l8359J1055J6819
8122g7590K3090J6690L2440p243J0022j0889o8611q162K9108K3250J4047n581
8110b9429j2886q284J6654k0655r826K9663l0282J8547K7634j1121O231K329j5570
$$ plain form
8196 99305 110007 134813 113981 291376 -77988 -292331 -92836 -124249 -127507 -131117 -43089
8185 -43089 -35640 -70501 -70457 -15474 5852 13994 -10899 -27300 -62007 -69390 13840 -12246 -37208
8172 -37208 -58067 -91470 -67710 -14237 22837 -21595 -29022 -64935 -58248 -22074 50578 31445
8160 31445 33651 3413 -19279 -50273 -47418 -26933 -29698 -17407 -76657 -100554 -72714 -11048
8148 -11048 25000 46335 60912 -6527 -24090 3930 -25126 -29259 -28439 -19532 3815 5298 -61572
8135 -61572 -52067 -58838 -51339 -59679 8618 21 626 21369 -32886 -67105 -105464 -94409 -77590
8122 -77590 -54500 -37810 -5370 -12613 -2591 -13480 -82091 -90253 -61145 -37895 -23848 -29429
8110 -29429 -42315 -50599 -33945 -54600 -64426 -34763 -65045 -46498 -18864 -29985 -23754 -21425 -36995
8097c6995l2558L7249p744l5409k0699R094k8472m667K5183l2145K1446N0961
8085e4756J7403m721L7254k8678k2553L6602k5035M738p347j2781q842L0481j3316
8072e1551J8712K0306j4953R934o51J2269k1486m9297J8748J6500l2657j8156
8060i2282K7100k3933M3191K8224n9412N67l1938L4743j316K1904j8453o8512
8048a40117J9442K8332Q067k3189m1859O4763K7622k6018J0078O5710m6444O992
8036d6621m2746L556J4403k7564O858P2141M9555l1521k0848l1838O0j0291J2491
8023e2365K4011k5899m1135L3801J5815L6396n0625o230K8782J9819K1336l2604
8011b8898j4062L8035K0086n0369K3976l1057l434R839n6852P536N6214k125l7335
$$ plain form
8097 -36995 -69553 -32304 -40048 -75457 -96156 -87062 -115534 -120201 -95018 -127163 -105717 -54756
8085 -54756 -37353 -42074 -4820 -33498 -56051 -19449 -44484 -39746 -47093 -59874 -68716 -38235 -51551
8072 -51551 -32839 -12533 -27486 -17552 -18203 -5934 -27420 -76717 -57969 -41469 -74126 -92282
8060 -92282 -65182 -89115 -45924 -17700 -77112 -76545 -108483 -73740 -75056 -53152 -71605 -140117
8048 -140117 -120675 -92343 -84276 -107465 -149324 -84561 -56939 -82957 -72879 -7169 -53613 -46621
8036 -46621 -89367 -85811 -71408 -98972 -92114 -19973 29582 -1939 -22787 -54625 -54565 -64856 -52365
8023 -52365 -28354 -54253 -95388 -61587 -45772 -9376 -60001 -66231 -37449 -17630 3706 -28898
8011 -28898 -42960 -4925 15161 -35208 -11232 -42289 -45723 -35884 -92736 -85200 -28986 -31111 -68446
7998f8446L1194N471n3148J0825n1506k8254J3132N2437O8083n6879Q518L4422
7986c4151k8656J9192L0418K893M285r500j2797L186m0638M2812k4078l1509K3331
7973e5212K2772K0731n5334K9044j3231j6212p795j5192p397N3630q614o889J3798
7960d5901J7752K020n259J2993r604j2601K7437k5965m2107l9011k0576Q1112
7948e9710L9998k9957J0335r617j6477J5644J9420k8821k5695j1627L2153l6161
7936a00515l844K2396J8661K2442p09K3336k1804l4014R377m133K1113K517j3876
7923e9053J0837j1052K2936J7754k4069k420l5404j8929j2284L8303L0986M693
7911c7702m668m353k4222J812O745R440O823K7789j9214n5456n481r493n487M6180
$$ plain form
7998 -68446 -37252 -31781 -84929 -74104 -125610 -153864 -140732 -88295 -20212 -77091 -68573 -34151
7986 -34151 -62807 -43615 -13197 -10304 -6019 -15519 -28316 -25130 -65768 -22956 -47034 -78543 -55212
7973 -55212 -32440 -11709 -67043 -37999 -51230 -67442 -75237 -90429 -97826 -44196 -52810 -59699 -45901
7960 -45901 -28149 -26129 -31388 -18395 -27999 -40600 -13163 -39128 -81235 -120246 -140822 -59710
7948 -59710 -19712 -49669 -39334 -48951 -65428 -49784 -30364 -59185 -84880 -96507 -64354 -100515
7936 -100515 -104359 -81963 -63302 -40860 -41569 -18233 -40037 -74051 -64674 -68807 -47694 -45177 -59053
7923 -59053 -48216 -59268 -36332 -18578 -42647 -45067 -80471 -99400 -111684 -73381 -42395 -37702
7911 -37702 -42370 -46723 -70945 -69133 -62388 -52948 -46125 -18336 -37550 -93006 -98487 -107980 -113467 -67287
7897f7287R494l2582j3212L0299K2492n4433q061l979K3692L0488j3245L3833
7885d2501J8515l3997l0555j8957N840N2602m9548n1920N0191R473M3493L0578
7873a6786k2964n8936K7662k7579l8464k3207M6548j2855K1907J6042m1078M7959
7861h1751J3326j9376L278l3299N9123k0127j896R782J4871k3193k9055L6678
7849g1639L2819k7851J9832L1452j2562k6499o877O5717J9913k8619k6236k4233
7837e4783o976J1817J9916l9857K8416k7786l1211J4156k589j4314p994l999N0190
7824f5014J3879m8106M9907R991K6208n5888J6264L300q065M4054j596j575n2949
7811f9590k2892j1959L3756l5287p193l434M3297M1344l6667l25k4730j2185m4396
$$ plain form
7897 -67287 -57793 -90375 -103587 -73288 -50796 -105229 -113290 -117269 -93577 -63089 -76334 -42501
7885 -42501 -23986 -57983 -88538 -107495 -101655 -49053 -98601 -150521 -100330 -90857 -47364 -16786
7873 -16786 -39750 -98686 -71024 -98603 -137067 -160274 -113726 -126581 -104674 -88632 -129710 -81751
7861 -81751 -68425 -87801 -84523 -117822 -58699 -78826 -80722 -70940 -56069 -79262 -108317 -71639
7849 -71639 -38820 -66671 -46839 -15387 -27949 -54448 -61325 4392 24305 -4314 -30550 -54783
7837 -54783 -61759 -49942 -30026 -69883 -41467 -69253 -100464 -86308 -88897 -103211 -111205 -115204 -65014
7824 -65014 -51135 -99241 -49334 -39343 -13135 -69023 -52759 -49459 -57524 -13470 -15066 -16641 -69590
7811 -69590 -92482 -104441 -70685 -105972 -113165 -116599 -73302 -31958 -68625 -68950 -93680 -105865 -150261
7798a50261K5495J39441L8877o6096j4676j8964K4957j1521j0141J5452Q341p835
7786b6931J7167J4412M0683r1562l3997o545L0623J7633J7006o1304k3488M0906
7774f5397J8514K9207q2J9051p0897j2174L3498j9763m538N6563p9963J5442L8785
7761d1754n2608J2293L196J6954j0056O471J5017k5799P897O4526K8668n7052
7749c2247K6545j50k9673J9167J7900M1306n098N483n8727k5525k5075J2832j8371
7736g1633K0795L5947j6039o133k6181K299J4559j976K8671o5024K6233M0957
7724a7525O1819M089m2186N888n9514M911j3282L9200l7763N3444L4577o3077
7712b9419K939L0080l253k5087j5554J5167n9557J0057k9302L3125L7950K368
$$ plain form
7798 -150261 -124766 14675 53552 -12544 -27220 -46184 -21227 -32748 -42889 -27437 -19096 -26931
7786 -26931 -9764 4648 45331 -46231 -80228 -86773 -56150 -38517 -21511 -82815 -106303 -65397
7774 -65397 -46883 -17676 -17758 1293 -69604 -81778 -48280 -68043 -72581 -16018 -95981 -80539 -41754
7761 -41754 -94362 -82069 -78873 -61919 -71975 -65504 -50487 -76286 -68389 -3863 24805 -32247
7749 -32247 -5702 -5852 -35525 -16358 1542 42848 37750 43233 -15494 -41019 -66094 -53262 -71633
7736 -71633 -50838 -14891 -30930 -37063 -63244 -60945 -46386 -48362 -19691 -84715 -58482 -17525
7724 -17525 44294 48383 6197 12085 -47429 -42518 -55800 -16600 -54363 -919 33658 -29419
7712 -29419 -26480 3600 347 -24740 -40294 -25127 -84684 -74627 -103929 -70804 -32854 -30486
7700c0486K119J392k0588j8449J5414K7985p713J472L5672m4114J1795n265m794
7687c5560L0999j702j3997K6221k8757l8318k543M0104o77m182J1866p2110P080
7674h1576J2661K635K9595j6661j4203o1590P8801k9893L9983m1988j5458N9178
7662c8516K6237K5329o6329k5290J2586J1734J1386O071j9631o74K6111J6622
7650a4364k4023o064J6047J1623M3732n1153K5424n042j3586K593l995M1001j830
7637B0363m4490j2976J769j5697K3827n1513J2270j6773M7731J3349j4210m1987
7625g8337j8133M1294M6017m5732K7858l6173k987O584J6883M2763p6701M9611
7613b7053J6963m9319m358k1221k331K7874P38j3960k921j2940M5287l1214L0077
$$ plain form
7700 -30486 -28367 -26975 -47563 -66012 -50598 -22613 -30326 -28854 6818 -37296 -25501 -30766 -35560
7687 -35560 -4561 -6263 -20260 5961 -22796 -61114 -63657 -23553 -24230 -28412 -16546 -88656 -81576
7674 -81576 -68915 -66280 -36685 -53346 -67549 -129139 -50338 -80231 -40248 -82236 -97694 -38516
7662 -38516 -12279 13050 -53279 -78569 -65983 -54249 -42863 -36792 -56423 -57097 -30986 -14364
7650 -14364 -38387 -44451 -28404 -16781 26951 -24202 1222 -3820 -17406 -14813 -18808 22193 20363
7637 20363 -24127 -37103 -35334 -51031 -27204 -78717 -66447 -83220 -35489 -22140 -36350 -78337
7625 -78337 -96470 -55176 -9159 -54891 -27033 -63206 -66193 -59609 -42726 37 -76664 -27053
7613 -27053 -10090 -59409 -63767 -84988 -87319 -59445 -58707 -72667 -75588 -88528 -43241 -74455 -44378
7600d4378K0861Q489l1209l1876J2474J9036J3256R927k6401J155j3134l8060
7588i9860K1209M4799r95k1476l0229J3386O4721n055m0591m2500L4598Q715L064
7575e0214L1162L4942j249l0153M6329K152k1675n7298k668M937L4959L871q761
7562a3666K8593M300o9965n7488J4002K8847L7769n7183k150j8916M8549K5591
7550c1717k4102L5127n0894j8203n988k4547M2521L6663j8437R794K9120l3284
7538e3947p591K853L326o319L6635k5917j7105l080J2675K583M4950l7098j0358
7525e8393J7478K5913l1388M844J3197p803L1678l654p5947J7267M0974j9431
7513d5265q4556Q068M9848K174J8526K0606J8567m6409o1137M939M8260j514L256
$$ plain form
7600 -44378 -23517 -15028 -46237 -78113 -65639 -46603 -33347 -23420 -49821 -48666 -61800 -99860
7588 -99860 -78651 -33852 -34847 -56323 -86552 -73166 -8445 -13500 -54091 -96591 -61993 -53278 -50214
7575 -50214 -19052 15890 14641 -15512 30817 32969 11294 -46004 -48672 -43735 -8776 -4905 -13666
7562 -13666 14927 19227 -50738 -108226 -94224 -65377 -27608 -84791 -86941 -105857 -57308 -31717
7550 -31717 -55819 -20692 -71586 -89789 -95777 -120324 -77803 -41140 -59577 -49783 -20663 -53947
7538 -53947 -61538 -58685 -55359 -61678 -25043 -50960 -68065 -71145 -58470 -55887 -10937 -48035 -58393
7525 -58393 -40915 -15002 -46390 -41546 -28349 -36152 -4474 -8128 -84075 -66808 -25834 -45265
7513 -45265 -129821 -121753 -71905 -69731 -51205 -30599 -12032 -58441 -119578 -114639 -66379 -67893 -64637
7500f4637J4465K9499m972r551j3062K1138J8107k0181k0474K5174n309m7363
7488g7166k666K3099J5726j7012k1832j1617K1222L2919L585l147K3309j3203
7476b6783j2668k211K1052M940l435J0669K9108K327O651m5372m3045K7973O626
7463b4168L7456l3023j4630N8146m5217j6517L8789j4347j6841j5548j6414j2214
7451g4528J3224k5577M3082K3355J8389O777l2887l7241J187J7870K4959O7442
7439D6052m6392k2544J8826m349k4591M842O2613L3423j5146k632K5134L7672
7427A12908N936r136L317O748P430J3969k683l2717m6132o8343p335M4883k4656
7414D189j8140O934k782L8910l6750n45M0167n8089l6103J0466K43L9812k1293
$$ plain form
7500 -64637 -50172 -20673 -25645 -35196 -48258 -27120 -9013 -29194 -49668 -24494 -29803 -77166
7488 -77166 -79832 -56733 -41007 -58019 -79851 -91468 -70246 -37327 -33742 -36889 -13580 -26783
7476 -26783 -39451 -41662 -20610 -15670 -19105 -8436 20672 22999 29650 -15722 -58767 -30794 -24168
7463 -24168 13288 -19735 -34365 23781 -21436 -37953 836 -13511 -30352 -45900 -62314 -74528
7451 -74528 -61304 -86881 -43799 -20444 -2055 4722 -28165 -65406 -64219 -46349 -21390 46052
7439 46052 -340 -22884 -4058 -8407 -32998 -28156 34457 67880 52734 50102 75236 112908
7427 112908 118844 109708 113025 119773 127203 141172 138489 105772 59640 -8703 -16038 28845 4189
7414 4189 -13951 -7017 -9799 29111 -7639 -8184 31983 -26106 -62209 -51743 -51500 -11688 -32981
7401c2981m5776L7500J4367M2566M3996n3375k1266Q475J6712K5212l513o8122
7389c6205k3852N2643J2905k2657k6305j109N5953l1282Q615k6324K084l762L6957
7376b339k5434m531m6074R367Q565M2289L0092M421j1767o7066K0927M506L1613
7363e431N7038n2843m3731j0304K9097q102N2622N0009p093o665R834L0532R818
7350A04781j2109l0860l9301l1550M1741p546J2581l5491J0812j2579l0381M8873
7338A8971N091m2000R419l127O1436J2810m2839q8753r992Q079j7853k081L8681
7325e2158o890J4580L389L507k5969m6Q659j6411K4538K6284L6970o899o004k2607
7311a9057P233q66o756j1666L334j9606k6597N865J6419j7243j7000M5485N486
$$ plain form
7401 -32981 -78757 -41257 -26890 15676 59672 6297 -14969 -6494 10218 35430 31917 -36205
7389 -36205 -60057 -7414 5491 -17166 -43471 -44580 11373 -19909 -11294 -37618 -35534 -39296 -2339
7376 -2339 -27773 -32304 -78378 -69011 -60446 -18157 11935 16356 4589 -62477 -41550 -37044 -5431
7363 -5431 51607 -1236 -44967 -55271 -26174 -34276 18346 68355 61262 54597 64431 94963 104781
7350 104781 92672 61812 22511 -9039 32702 25156 37737 2246 13058 479 -29902 18971
7338 18971 24062 -17938 -8519 -11646 49790 62600 19761 -68992 -78984 -70905 -88758 -90839 -52158
7325 -52158 -59048 -44468 -41079 -37572 -63541 -63587 -54928 -71339 -46801 -20517 16453 9554 3550 -19057
7311 -19057 -11824 -12690 -19446 -31112 -27778 -47384 -73981 -68116 -51697 -68940 -85940 -40455 -34969
7298c4969M580o718N677J8086k0140n2097J2573L7060L1172K0791k7571l7164
7286d8720Q221K5890N9814m0386J6776J2613k7905l3384k2275j6486R369q119
7274f4592K9460o284j9079K1570R279l1176k9045L1573k1521j1440M0139k6331
7262g7447J675N7438m501J1338j3328j4447L4403k7740j1379J470M3284j2032
7250a1266m5711R062K6370M1384K004M991m533J904m1590m0008K2661M6792m7739
7237c5679k9600K7405j9439J5432M2918K0707k3627o5221k2792N1879L6466k72
7225a823l2791M234J1358k5028K5240k2843L0029L381j3250k0865L1795m7919
7213e8482L4017J6040j596M5317l7688k3141J862k7750j3080N2470L0449m6811
$$ plain form
7298 -34969 -30389 -37107 -31430 -13344 -33484 -85581 -73008 -35948 -4776 16015 -11556 -48720
7286 -48720 -40499 -14609 45205 4819 21595 34208 6303 -27081 -49356 -65842 -56473 -64592
7274 -64592 -35132 -41416 -60495 -38925 -29646 -60822 -89867 -58294 -79815 -91255 -51116 -77447
7262 -77447 -75772 -18334 -22835 -11497 -24825 -39272 -4869 -32609 -43988 -42518 766 -11266
7250 -11266 -56977 -47915 -21545 19839 21843 26834 22301 24205 -17385 -57393 -34732 12060 -35679
7237 -35679 -65279 -37874 -57313 -41881 1037 21744 -1883 -67104 -89896 -38017 -1551 -1823
7225 -1823 -34614 -30380 -19022 -44050 -18810 -41653 -11624 -8243 -21493 -42358 -10563 -58482
7213 -58482 -24465 -8425 -10021 35296 -2392 -25533 -23671 -51421 -64501 -12031 18418 -28393
7201b8393k516r67j1498L4016k820L81N209o064L0477O287k2444q056n842N0064
7187C7834K5793k5794m9436m37J4484j6809K8150L4567n955m654O878o59K9920
7174G3882m2991k8276Q273P0k490j9789o431N8208m576l5656J8719M979J3611
7161C7533j4539k712J0204J503J4815J0996K0049j9715l6448M7746M5104J1447
7149A25983l2355k4773l6876J9357M5338J6426O0813j9485l8834K1321Q2909K6888
7137B46712P2823K5484N9127J16378O5623n5084j22208q6755q8420l5264l1656
7126A66760m874j9888J723m5007O0360k9468q9398Q414L2510j6034K192k4929
7114D2361O015K6143k3783O5428j7888l3209l9566j9306n133M0611l7698K3319
$$ plain form
7201 -28393 -30909 -31876 -43374 -9358 -12178 -11797 -6588 -12652 17825 24112 1668 -6388 -12230 37834
7187 37834 63627 37833 -11603 -12040 2444 -14365 13785 48352 42397 37743 44621 43962 73882
7174 73882 30891 2615 10888 10958 8468 -11321 -17752 40456 35880 224 18943 23922 37533
7161 37533 22994 20282 30486 31989 46804 57800 77849 58134 21686 69432 114536 125983
7149 125983 93628 68855 31979 51336 96674 113100 173913 154428 115594 136915 219824 246712
7137 246712 319535 345019 404146 520524 586147 531063 408855 322100 233680 198416 166760
7126 166760 161886 141998 143721 98714 159074 129606 40208 48622 81132 65098 67290 42361
7114 42361 48376 74519 50736 116164 98276 65067 25501 6195 1062 41673 3975 27294
7102B7294l4233n89M9573K8719l0434k7570J0631J1500r87k7224L1495n4288Q691
7089g422N598K7084K898l3682j6240j16J6278P576l34N2454l3321l1934K7633
7076A6472L5932P576k6615m875J8952M454J3717p789r237K4086N607O6461p9409
7063F5332j8619n76r862J4515j184r79j5668O9302J0610J9064J1305k6394K7700
7050A44546K3662k1353l0977J1127J3301m6050K1665k6008j8198l2096K6586k2359
7038D3846l51k0455K3427J363K7935j6629j2529K7973n147o782l0140L1441K1827
7025H5779n699j3307k6822L3433j8604M1125j203M159M943O7785l738K6123M6200
7012B40174n5823L3824K5846k2773k900m3044l2446o2284j5926K5134j9397q040
$$ plain form
7102 27294 -6939 -7528 42045 70764 40330 12760 23391 34891 33904 6680 38175 -16113 -7422
7089 -7422 -1824 25260 28158 -5524 -21764 -21880 -5602 1974 1640 54094 20773 -11161 16472
7076 16472 52404 59980 33365 28490 47442 51896 65613 57824 48587 72673 78280 144741 65332
7063 65332 46713 46137 36275 50790 49606 48627 32959 102261 112871 131935 143240 116846 144546
7050 144546 168208 146855 115878 127005 140306 94256 115921 89913 71715 39619 66205 43846
7038 43846 43495 23040 46467 47830 75765 59136 46607 74580 69433 62651 32511 63952 85779
7025 85779 80080 66773 39951 73384 54780 95905 94702 98861 103804 171589 167851 193974 240174
7012 240174 184351 218175 244021 221248 218348 175304 142858 80574 64648 89782 70385 62345
7000F2345K158Q452l6163L6429j5027k8641K6946m587l1502k2549K4124m999M24
6987A7410k485j8274M9938r723r643k4081K6301j7522K6811M0480J1782m1674
6975D9320J6667l4005K9170m030k8809M059L979j7815N5945m1835l06r866l6531
6962a4057K2992J7788K3761j3936j5505K6755p930p124r909P4522k4788q275J460
6949F5754L4331j770k0202j14418m1517L4077k5305K3011N1723L5820j929K828
6937D2403j9195M192l6558l682j8629Q415K0401n545J5270J2754J5424k5253J2797
6924B2794j6118R87l690j3315O2121l8033k136k7900J6803j5374k3608O0906L0181
6911E3618k3738O034j8676l5726P4146L5025l9864J2834o2277p0460J4451Q8046
$$ plain form
7000 62345 64503 72955 36792 73221 58194 29553 56499 51912 20410 -2139 21985 16986 17410
6987 17410 14925 -3349 46589 36866 27223 3142 29443 11921 38732 79212 90994 49320
6975 49320 65987 31982 61152 57122 28313 32372 36351 18536 74481 32646 32340 22474 -14057
6962 -14057 8935 26723 50484 36548 21043 47798 39868 32744 22835 97357 72569 64294 65754
6949 65754 100085 98315 78113 -36305 -77822 -43745 -69050 -46039 5684 41504 39575 42403
6937 42403 23208 27400 -9158 -12840 -31469 -23054 -2653 -8198 7072 19826 35250 9997 22794
6924 22794 6676 7663 3973 -9342 52779 14746 12610 -15290 1513 -13861 -37469 23437 53618
6911 53618 29880 35914 17238 -18488 55658 90683 50819 63653 1376 -69084 -54633 33413
6899C3413K0394Q403p603K0866p850q2265K8837j1777L808L1799l8507R3265J5374
6886A08157l0557m245P74k514J2230l3902k0449O972L5116l3065N593l3353l4951
6873b4194R083O8100L576r468l198m0454K8532L4770k8153l4183M2941K2291k1367
6860D8276O400k353J055L5102j4478m700k185J0167J0364l420l0753m55j3447
6847C9573l636l3753j6760M9207j5721J8875K0309l5441o384j3783K8886M7722
6835G9094l0129l3754j3798N0309L4623j6805j2346L6065J1765j8996K8190n1608
6823F2610l6488N4451J3369l0933K4063m0258n538K3454M3891o2192n5688N1118
6811D1859N799J1496J8108N2460o6911p917K6183k083Q266l9586K5840N0044k1522
$$ plain form
6899 33413 53807 62210 54607 75473 67623 -14642 14195 2418 6226 38025 -482 92783 108157
6886 108157 77600 73355 74129 71615 83845 49943 29494 36466 71582 38517 44110 10757 -24194
6873 -24194 -15111 52989 56565 47097 43899 3445 31977 66747 38594 4411 47352 69643 48276
6860 48276 54676 52323 53378 88480 74002 69302 67117 77284 87648 84228 53475 53020 39573
6847 39573 35937 2184 -14576 34631 18910 37785 58094 22653 16269 2486 31372 79094
6835 79094 48965 15211 1413 51722 86345 69540 57194 93259 105024 86028 114218 62610
6823 62610 26122 80573 93942 63009 87072 46814 41276 64730 108621 46429 -9259 41859
6811 41859 47658 59154 77262 129722 62811 54894 81077 78994 87260 47674 73514 123558 102036
6798A02036J4434o677m9836j4185K8050Q153P3132o887K192K530O098J9839r5068
6785H3811q605j3366J8297K3438N2231Q796K2066j7870r174n5709j666j7841N614
6772I0022K0648m558J7350j637M7011L703o3815l7605N2908L0436q627j1003M218
6759A39051L0516J8299J0717M4107l46o3459K8986K0832M0407N965m8808M8527
6747B74794L9442o175j5167K2314O5145K4017l9453N4001M729m0770l9113k2676
6735C21088k5426q863M2956j1394K000K5148J4657J2957J3963j7618M1703m3l6408
6722C74720l3983O0527J07220L0212J6888K9059n830O0645k7410o5824j6503j9503
6710E10218M5873l9552m7663o354R680m7752l2032J2330P669L116K6851K3137
$$ plain form
6798 102036 116470 109793 59957 45772 73822 81975 155107 148220 150412 152942 159040 178879 83811
6785 83811 75206 61840 80137 103575 155806 164602 186668 168798 159624 103915 102249 84408 90022
6772 90022 110670 106112 123462 121825 168836 172539 108724 71119 124027 154463 145836 134833 139051
6759 139051 169567 187866 198583 242690 242344 178885 207871 228703 269110 275075 226267 274794
6747 274794 314236 308061 292894 315208 380353 404370 364917 418918 423647 382877 343764 321088
6735 321088 295662 286799 329755 318361 320361 345509 360166 373123 387086 369468 411171 411128 374720
6722 374720 340737 401264 508484 538696 555584 584643 578813 639458 612048 546224 529721 510218
6710 510218 556091 516539 468876 462522 472202 424450 392418 404748 412417 415533 442384 465521
6698D65521j5348R370k3421K1752J05251p678m140J8692j9683l2939K2488m6441
6686D93424m0024J0717l5604P093J2585M2627J3761l5956n3634N3967M0479R654
6674E19089k7011l7653o6469r138M9348J9340M4635L622j984o0169R574O531L3544
6661D83259n0195j0764L7889J4802p4935O3116K2630k821K56l9975K9822l3791
6649D39293M5328J8286J1875K9150N9443m2783m0253N631j2516M4000O365l7879
6637E25940j3905L5234J1669j9903q361M439N2843L0577j4885o11M7582o67p60
6624F49192j7786K6987K4084k2534j0421l1152L1810K7304l9816J7822K2937N1970
6612G30397n242K6495O2101J5994L0849N5697j6072l964Q9434M1421J5478R431
$$ plain form
6698 465521 450173 459543 436122 457874 563125 555447 551307 569999 550316 517377 539865 493424
6686 493424 453400 464117 428513 435606 448191 490818 504579 468623 414989 468956 509435 519089
6674 519089 492078 454425 387956 378818 428166 447506 492141 495763 493779 433610 443184 449715 483259
6661 483259 433064 422300 460189 474991 400056 463172 485802 482981 483237 443262 473084 439293
6649 439293 484621 502907 514782 543932 603375 560592 520339 525970 513454 557454 563819 525940
6637 525940 512035 547269 558938 539035 530674 535113 587956 618533 603648 603037 650619 649952 649192
6624 649192 631406 658393 682477 659943 649522 618370 650180 677484 637668 655490 678427 730397
6612 730397 725155 751650 813751 829745 860594 916291 900219 896255 985689 1027110 1042588 1052019
6600A052019p936k2293j8984l0435l8478J843Q820J2194k6852N4284K0907k8489
6588I76600N0780j1433l4096J590n1843k5605M6898J04772j9288M8303k105O2627
6576A147200P8262n4983L784j4525k5203M8727O2590K336L4633k4893L6150m3805
6564A250273N4879L9031K0674n3246J5267K4515k2395L2127L1360L3533M9495
6553A475513P9231P9674M6013R0932K8202k6403N6024Q9271j0976P605k1209J7854
6541A911731L1681l7455P850J2938j0127K3247J1746O8108L2550m3131N6331O5364
6529B130833M7310M7428J6228O3274L5767L0895M8120O8755K4447l1480M4904
6518B526481M8100O5595P1849N1420O8930Q0634J04224J04699L7939L2209j8364
$$ plain form
6600 1052019 1044083 1021790 1002806 972371 933893 935736 944556 956750 929898 984182 1005089 976600
6588 976600 1027380 1015947 981851 983441 931598 905993 952891 1057663 1038375 1086678 1084573 1147200
6576 1147200 1225462 1170479 1174263 1159738 1134535 1183262 1245852 1248188 1282821 1257928 1294078 1250273
6564 1250273 1305152 1344183 1364857 1311611 1326878 1351393 1328998 1361125 1392485 1426018 1475513
6553 1475513 1554744 1634418 1680431 1771363 1799565 1773162 1829186 1918457 1907481 1915086 1893877 1911731
6541 1911731 1943412 1905957 1913807 1926745 1916618 1939865 1951611 2019719 2052269 2009138 2065469 2130833
6529 2130833 2178143 2225571 2241799 2305073 2340840 2371735 2419855 2488610 2513057 2481577 2526481
6518 2526481 2574581 2640176 2712025 2763445 2832375 2913009 3017233 3121932 3159871 3192080 3173716
6507C173716N7822J07001O7544J13924R8878K782Q7186J22235R2469Q9761P4100
6496D087418J25851N4472J8528J20976J56693Q7069O2204J18756P4172O9401P4925
6485E050465J07884Q0014J30681J49623K06933J28401J81311J74154J48557K05637
6475F563660J91816J20813J73797K07268J23559J86181J29920J44786K33947K31390
6465H307137J81039K58688K81852J82547K51416K99584L04498K42984K93991L56468
6455A0960204L95802M64862M49942M99127N22670N70098P13375P51475P76441
6446A6103996Q19119Q85497R53830J184948J340458J547753J763725K139162K676021
6437B9414509L042210L485514L692443L569027K588467Q37670j103883k561561
$$ plain form
6507 3173716 3231538 3338539 3406083 3520007 3618885 3621667 3708853 3831088 3923557 4013318 4087418
6496 4087418 4213269 4267741 4286269 4407245 4563938 4651007 4713211 4831967 4906139 4975540 5050465
6485 5050465 5158349 5238363 5369044 5518667 5725600 5854001 6035312 6209466 6358023 6563660
6475 6563660 6755476 6876289 7050086 7257354 7380913 7567094 7697014 7841800 8075747 8307137
6465 8307137 8488176 8746864 9028716 9211263 9462679 9762263 10066761 10309745 10603736 10960204
6455 10960204 11356006 11820868 12270810 12769937 13292607 13862705 14576080 15327555 16103996
6446 16103996 16923115 17808612 18762442 19947390 21287848 22835601 24599326 26738488 29414509
6437 29414509 32456719 35942233 39634676 43203703 45792170 46629840 45525957 42964396
6429D2964396l157081l003552k377392j735241j105158o22969k15454J54771M24718
6420C1327038O87877R20804J185529J573722J957645K489281L032400L800703
6412D6974999M792130N943627P070219P703276P482809N511181J571504l630860
6404H3418885p816888r475443q930336p263387n495991l992846k871947k077460
6396C5494587j533992j136159p67550n88916m80559k63109Q1017M57893Q60075
6387C2123287J419198K104015K725238L171354L435009L147147J881007k83308
6379D9722947k647718m376976n077928m851959m059230l227005k595126k097111
6371B0789894j660862j336755j179259j052662r85681r58022q81691p65714o91266
$$ plain form
6429 42964396 39807315 36803763 34426371 32691130 31585972 30963003 30747549 30902320 31327038
6420 31327038 32014915 32935719 34121248 35694970 37652615 40141896 43174296 46974999
6412 46974999 51767129 57710756 64780975 72484251 79967060 85478241 87049745 83418885
6404 83418885 75601997 66126554 57196218 49932831 44436840 40443994 37572047 35494587
6396 35494587 33960595 32824436 32056886 31467970 30987411 30724302 30805319 31263212 32123287
6387 32123287 33542485 35646500 38371738 41543092 44978101 48125248 50006255 49722947
6379 49722947 47075229 42698253 37620325 32768366 28709136 25482131 22887005 20789894
6371 20789894 19129032 17792277 16613018 15560356 14574675 13616653 12734962 11969248 11277982
6362A1277982n88543n67546m11517l83916l73357l01367k78263l28853l03820
6353G740800k56205k67435k22569j96678j85157j76630j60295j14408j33202j32929
6343E895292j02014o1692n1710j12468j17536o3197o0410l7110n1529l4050j7943
6332E185633j381Q1843O8738K2147J13704J25753J22763J31349M2046j11487j43036
6321E638072j25755j27629j4139k4041j4606L9525J64965J32003J47457R8834
6311E914686N9480R4142M6391J21749J96501J50063J41118O9500L3892o195j5776
6300F805551J51643K19326L42426L48683L44510L30539L47101M72926O09840P30076
6290A0702621R00252R01793P50015M15190O5284l50375p16883q41398q61700p45818
$$ plain form
6362 11277982 10689439 10121893 9710376 9326460 8953103 8651736 8373473 8044620 7740800
6353 7740800 7484595 7217160 6994591 6797913 6612756 6436126 6275831 6161423 6028221 5895292
6343 5895292 5793278 5731586 5679876 5567408 5449872 5386675 5326265 5289155 5237626 5203576 5185633
6332 5185633 5184252 5266095 5334833 5356980 5470684 5596437 5719200 5850549 5892595 5781108 5638072
6321 5638072 5512317 5384688 5370549 5346508 5331902 5371427 5536392 5668395 5815852 5914686
6311 5914686 5974166 6068308 6114699 6236448 6432949 6583012 6724130 6793630 6827522 6821327 6805551
6300 6805551 6957194 7176520 7518946 7867629 8212139 8542678 8889779 9362705 9972545 10702621
6290 10702621 11602873 12504666 13254681 13669871 13735155 13384780 12667897 11826499 10964799 10218981
6280A0218981o11555m16456k51284j87114l2881O5326Q6516K39365L20321M41746
6270I872965N68331P04304P41595R32557J206739J465624J748915J819089J685019
6261B0745138J148708J22200r68450j901142k252031k069160j775959j356513
6253A1692791j025862p19983n24979m75063l27590k36511j82086j01692m649J55660
6243H250036K07654K65118L66407N71954O82578P65355Q04051P20009N31098O1319
6233A3225579m84640r09364j088204j199023j062910r31057p35021n25740m17293
6224E872327m15163l50898k47322k03651k10694j17081j59164r7759j06608j15092
6214C848895j50877l7305n9774l3888p366l4270k1731n0702o9375l0057r1482
$$ plain form
6280 10218981 9607426 9190970 8939686 8752572 8719691 8785017 8871533 9110898 9431219 9872965
6270 9872965 10441296 11145600 11887195 12819752 14026491 15492115 17241030 19060119 20745138
6261 20745138 21893846 22016046 21047596 19146454 16894423 14825263 13049304 11692791
6253 11692791 10666929 9946946 9421967 8946904 8619314 8382803 8200717 8099025 8094376 8250036
6243 8250036 8457690 8722808 9089215 9661169 10343747 11109102 11913153 12633162 13164260 13225579
6233 13225579 12740939 11831575 10743371 9544348 8481438 7550381 6815360 6289620 5872327
6224 5872327 5457164 5106266 4858944 4655293 4444599 4327518 4168354 4070595 3963987 3848895
6214 3848895 3698018 3660713 3600939 3567051 3559685 3525415 3503684 3452982 3383607 3353550 3262068
6203C262068r5671m3630o9615N680m5523K733q134l4386o7526k7780n5948l9258
6191B783010J5506j5737K2378L2427m4675p363m0377N88R1522Q2407O3974n2177
6179B931483J8849P3521K3980J3721q480P772J4159M979k810O055K9045N2604
6167C164878L9846J4446O1437O2607J4704O3681L0012N5432J00230R5637Q6605
6156C789515J09090M8028J7910O8484R127K9214O6638P2P5862L7670o370M3347
6144D288587J22300Q040Q4768R2529O4077O4207J05765Q4171J00105Q6145P9739
6133E180433J34441J24661J01940R2811J34412J24770J15982J52620J89095J71779
6123F522944J19483J48928K34562K09490J18870K16529K40378K05706K75872L05031
$$ plain form
6203 3262068 3166397 3122767 3053152 3058832 3013309 3016042 3007908 2973522 2905996 2878216 2822268 2783010
6191 2783010 2798516 2782779 2805157 2837584 2792909 2785546 2745169 2745757 2837279 2919686 2983660 2931483
6179 2931483 2950332 3023853 3047833 3061554 3053074 3060846 3075005 3079984 3077174 3083229 3112274 3164878
6167 3164878 3204724 3219170 3280607 3343214 3357918 3421599 3451611 3507043 3607273 3702910 3789515
6156 3789515 3898605 3946633 3964543 4033027 4042154 4071368 4138006 4138078 4213940 4251610 4245240 4288587
6144 4288587 4410887 4418927 4503695 4596224 4660301 4724508 4830273 4914444 5014549 5100694 5180433
6133 5180433 5314874 5439535 5541475 5634286 5768698 5893468 6009450 6162070 6351165 6522944
6123 6522944 6642427 6791355 7025917 7235407 7354277 7570806 7811184 8016890 8292762 8597793
6113H597793L37323M12258L51581L86843L11398K52830J00283R6317J94704J77186
6103A1218516J94190L01576M20184M43507N02152N18292N33495M26002M82544
6094A5040458N48588O62855O92831P64103Q88290R46577R34921J077186J317273
6085B2873082J596693K066966K688740L505067M395099N326753N898492N570339
6077E3921231K673110j847320m461258m804037l829948k343719q96716L27500
6069C8738843J384913K377742L174338L538104K511573L78023r14052m54768J033562
6060E1768278K732120L835674L366147Q68951k562711m653253m720929l450269
6052D7184008j672331J65061J401243J471629k61802k640086l532009l023122
$$ plain form
6113 8597793 8935116 9347374 9698955 10085798 10397196 10650026 10750309 10846626 11041330 11218516
6103 11218516 11412706 11714282 12134466 12577973 13080125 13598417 14131912 14557914 15040458
6094 15040458 15589046 16251901 16944732 17708835 18597125 19543702 20478623 21555809 22873082
6085 22873082 24469775 26536741 29225481 32730548 37125647 42452400 48350892 53921231
6077 53921231 56594341 54747021 50285763 45481726 41651778 39308059 38411343 38738843
6069 38738843 40123756 42501498 45675836 49213940 51725513 52103536 51189484 50734716 51768278
6060 51768278 54500398 58336072 61702219 62571170 60008459 55355206 50634277 47184008
6052 47184008 45511677 45676738 47077981 48549610 48287808 45647722 42115713 39092591
6044C9092591j789025l38379J105878K485632L752959M904822M989221K637104
6036E6840803k425129o545569p667912o918845n528909m047172k989512k314817
6028A8402938j818017j492159j131105r78125q58029p66451o22581m62035m74618
6019I799818m94239l78343l20278l24192l38562k68552k90524l37971k65963j67926
6009F613268j94850j86933j63826k13292j90011j62287r9919j20051j22246j11003
5999E048850j09675p3546q0656q7424j12296p9681j41035p1345l9539j17117l6312
5988D100224m0219n6586n9132l7612k1254J4270p6544o8545m0133k9445J7625
5977C702649l879l3847K1239L6463l5810m0655J5827o9520j5535k3856J1156n229
$$ plain form
6044 39092591 37303566 36965187 38071065 40556697 44309656 49214478 54203699 56840803
6036 56840803 54415674 47870105 40202193 33283348 27754439 23707267 20717755 18402938
6028 18402938 16584921 15092762 13961657 12983532 12125503 11359052 10736471 10274436 9799818
6019 9799818 9305579 8927236 8606958 8282766 7944204 7675652 7385128 7047157 6781194 6613268
6009 6613268 6418418 6231485 6067659 5854367 5664356 5502069 5402150 5282099 5159853 5048850
5999 5048850 4939175 4865629 4784973 4697549 4585253 4505572 4364537 4293192 4253653 4136536 4100224
5988 4100224 4060005 4003419 3944287 3906675 3885421 3899691 3823147 3754602 3714469 3685024 3702649
5977 3702649 3698770 3664923 3686162 3722625 3686815 3646160 3661987 3592467 3576932 3553076 3564232 3559003
5965C559003N2265j4864l461L3995K1127k7434N524j4340o180Q4735J3230K4129
5953C727729P5164K8366K9167M6173J7481j737l6024l5433K2354P5611P8268K8983
5941D056102n6714O1875O1730J16479K6789J14110J12714J53816J43249J15514
5931D905664Q0058Q3382L0878Q791o185k995m7001J3777N900L7732L9743L1455
5919E181199J12164J20775R2884M9986P7468J46683J15073P6575J92302J56667
5909F321776J04594R4419J33674J52196J63679J94368J95924J69683J36680J85659
5899G852652J98796J64792K07101K57768J96792K09207K18003K91382K11199K17316
5889A0025008L10795L13745L06160L55541L12348M06326M83471M48325N66062
$$ plain form
5965 3559003 3611268 3596404 3592943 3626938 3648065 3620631 3626155 3611815 3605635 3690370 3703600 3727729
5953 3727729 3802893 3831259 3860426 3906599 3924080 3922343 3886319 3850886 3873240 3948851 4027119 4056102
5941 4056102 3999388 4061263 4122993 4239472 4266261 4380371 4493085 4646901 4790150 4905664
5931 4905664 4985722 5069104 5099982 5108773 5102588 5099593 5052592 5066369 5072269 5110001 5149744 5181199
5919 5181199 5293363 5414138 5507022 5557008 5634476 5781159 5896232 5972807 6165109 6321776
5909 6321776 6426370 6520789 6654463 6806659 6970338 7164706 7360630 7530313 7666993 7852652
5899 7852652 8051448 8216240 8423341 8681109 8877901 9087108 9305111 9596493 9807692 10025008
5889 10025008 10335803 10649548 10955708 11311249 11623597 12029923 12513394 12961719 13527781
5880A3527781N86228O46596O99213P06494O91348P03547Q72974R54880J113938
5871B0502999J344002J512823J792715K116824K529858L056126L539935M059592
5863D0454874M462696M392353L544099J711062r47149l135315m160697m028074
5855D2293849l199606k239393j494652r93587n71776l97615j44262Q3536M16675
5846C3753169Q98760J386583J867489K460515L111463L973608M933402O031424
5838E8416413P206779Q111898P964669O171709J490657m532962q504312r653549
5830F6671302q810036p017678n268905l878250k823668k141266j756482j627102
5822C3347915j479631j150436p46974l87259m9220L88982Q05405J225614J595878
$$ plain form
5880 13527781 14114009 14760605 15459818 16166312 16857660 17561207 18434181 19389061 20502999
5871 20502999 21847001 23359824 25152539 27269363 29799221 32855347 36395282 40454874
5863 40454874 44917570 49309923 52854022 54565084 53617935 50482620 46321923 42293849
5855 42293849 39094243 36854850 35360198 34366611 33794835 33397220 33252958 33336494 33753169
5846 33753169 34651929 36038512 37906001 40366516 43477979 47451587 52384989 58416413
5838 58416413 65623192 73735090 81699759 87871468 89362125 84829163 76324851 66671302
5830 66671302 57861266 50843588 45574683 41696433 38872765 36731499 34975017 33347915
5822 33347915 31868284 30717848 29970874 29583615 29534395 29923377 30728782 31954396 33550274
5813C3550274J993332K455967K781290K640624J854812K61016j965589l706396
5805C9865330m299550m073309l414414k665765k106639j728331j395087j154416
5797A9027819j076974r83559q35334p95227p16103n57601n39938m81241m70415
5788A2571427l93829l30526l14751k16691j49128k12758k62250j85215k09639
5779A0296640q7411J1877m6185L4295R5641J20456J49942K35051O3130k03453
5769A0669983k00856j31375j19258j05345o270o8253n1662j22030k34360k35881
5759I394693j86017l06983j75858j24848j05700K9311J03696R3346m212m2755
5749H674673r1535L9715J42510J34958K08058K30984J31655J07887l6050j89955
$$ plain form
5813 33550274 35543606 37999573 40780863 43421487 45276299 45537315 43571726 39865330
5805 39865330 35565780 31492471 28078057 25412292 23305653 21577322 20182235 19027819
5797 19027819 17950845 16967286 16131952 15336725 14620622 14063021 13523083 13041842 12571427
5788 12571427 12177598 11847072 11532321 11315630 11166502 10953744 10691494 10506279 10296640
5779 10296640 10209229 10221106 10174921 10209216 10304857 10425313 10575255 10810306 10873436 10669983
5769 10669983 10469127 10337752 10218494 10113149 10106879 10038626 9986964 9864934 9630574 9394693
5759 9394693 9208676 8901693 8725835 8600987 8495287 8524598 8628294 8721640 8717428 8674673
5749 8674673 8583138 8622853 8765363 8900321 9108379 9339363 9471018 9578905 9542855 9352900
5739I352900r5997m0300J0524m2579j00243j53265k24518k31603j61739j62900
5729H150280j41906q5717k0161J6411J31778K02194J07576O4513k6020p8251p2210
5718H248487l3678R8220Q3051Q7227R3121r034J1099M5882k2655p0578p3631p9461
5706H378050l1800N3253J10492M0802K13120K50077K24454K85972L95305M68219
5696A0387944M99015N48837O90168P68563R15511J036763J082523J040246O87036
5687A7656606J00747m89616q79068j019933q82271p24925n30789l73318k40501
5678A2616932o1861o717J43773K85744M42763N45775P13822R00143J148352J480412
5668A8209138J926052K431583K947364L196448L356116K431701M63040j362443
$$ plain form
5739 9352900 9256903 9216603 9227127 9184548 9084305 8931040 8706522 8474919 8313180 8150280
5729 8150280 8008374 7922657 7902496 7918907 8050685 8252879 8360455 8424968 8398948 8320697 8248487
5718 8248487 8214809 8313029 8396080 8483307 8576428 8567394 8578493 8624375 8601720 8531142 8457511 8378050
5706 8378050 8346250 8399503 8509995 8550797 8763917 9013994 9238448 9524420 9919725 10387944
5696 10387944 10886959 11435796 12125964 12894527 13810038 14846801 15929324 16969570 17656606
5687 17656606 17757353 17267737 16388669 15368736 14486465 13761540 13230751 12857433 12616932
5678 12616932 12555071 12548354 12692127 12977871 13420634 13966409 14680231 15580374 16728726 18209138
5668 18209138 20135190 22566773 25514137 28710585 32066701 34498402 34961442 33598999
5660C3598999k797578l443502l341480k912907k297258j762922j361583j048931
5652A4632838q10550o22527m18220l28424j31788n0419P1652J45570J19271K05059
5642A2812462L18609M99935O01531N03440N37374N50024L63681N2322l03738p00516
5632A5235124r71622j032865j004566q05440o91523m81692m32018l61018k94367
5623I160013k25074q9196o5382n0248j7796n7517r7384q3344m3405K2603p95Q246
5611H460721Q6869N0828o9307n5857p0341j23966q5823k271O9403Q4803J01103
5600H446162J70677J21418R1952J54640P1625Q8251J00474J04994J85581J76285
5590I712059J66348J93674J52266K56842K17531K06322K66195J52480J97728J71973
$$ plain form
5660 33598999 30801421 27357919 24016439 21103532 18806274 17043352 15681769 14632838
5652 14632838 13822288 13199761 12781541 12453117 12321329 12270910 12342562 12488132 12607403 12812462
5642 12812462 13131071 13631006 14232537 14735977 15273351 15823375 16187056 16239378 15935640 15235124
5632 15235124 14263502 13230637 12226071 11420631 10729108 10247416 9815398 9454380 9160013
5623 9160013 8934939 8845743 8780361 8730113 8712317 8654800 8557416 8474072 8430667 8453270 8452475 8460721
5611 8460721 8547590 8598418 8529111 8473254 8402913 8278947 8193124 8190853 8260256 8345059 8446162
5600 8446162 8616839 8738257 8830209 8984849 9056474 9144725 9245199 9350193 9535774 9712059
5590 9712059 9878407 10072081 10224347 10481189 10698720 10905042 11171237 11323717 11521445 11693418
5580A1693418K04847J71325J41390J33297J30585Q2091L6462J08309J72324K39917
5570A3113965K31141K86381K57014L10137K61961L49519L17953L71425L88062
5561A5887558N39528M92612N10251O14198N47131M75167L80820M13570M92852
5552B0353687M75749N02560M83051M86827M21383L25013K59402K54736K45413
5543B3807821L51815M81455O14404Q09683R60864J057843J054332R98358R52779
5534C1089354P97638P87179Q22789R39405R48706R15018R03407R18293R61835
5525C9083624J103690J328897J627409J873947K232138K700802L113240L346387
5517E6410134L459734L041723K724845J834311N07253k75422o2907M79737J387135
$$ plain form
5580 11693418 11898265 12069590 12210980 12344277 12474862 12556953 12593415 12701724 12874048 13113965
5570 13113965 13345106 13631487 13888501 14198638 14460599 14810118 15128071 15499496 15887558
5561 15887558 16427086 16919698 17429949 18044147 18591278 19066445 19447265 19860835 20353687
5552 20353687 20829436 21331996 21815047 22301874 22723257 23048270 23307672 23562408 23807821
5543 23807821 24159636 24641091 25255495 26065178 27026042 28083885 29138217 30136575 31089354
5534 31089354 31886992 32674171 33496960 34436365 35385071 36300089 37203496 38121789 39083624
5525 39083624 40187314 41516211 43143620 45017567 47249705 49950507 53063747 56410134
5517 56410134 59869868 62911591 65636436 67470747 67978000 67702578 67639671 68119408 69506543
5508F9506543K212134K734732K868143K432157J852286J688065K126300K944642
5500H8365002M173080N698642P354489R221849J1601365J4822860J9155624K4904593
5492A85297504L1586839L8037475M1236457L7064073J8712250j6824862m2403977
5485B92705759m8514785m4137915l3847549k4391696j7641450j2867853r431743
5478A01872768o707138m438613k569546q36832Q89979K625447L719532L572865
5470I8128462J160179l586169o800867p221215o449402m708234l015119j488489
5462F6019146j53912J027484J862165J844260K53551j860527k382729j459614
5454F5149824J24601J905923L277478L772830K356157o10067l632971m971462
$$ plain form
5508 69506543 71718677 74453409 77321552 79753709 81605995 83294060 85420360 88365002
5500 88365002 92538082 98236724 105591213 114813062 126414427 141237287 160392911 185297504
5492 185297504 216884343 254921818 296158275 333222348 351934598 335109736 292705759
5485 292705759 244190974 200053059 166205510 141813814 124172364 111304511 101872768
5478 101872768 95165630 90727017 88157471 87320639 88210618 90836065 94555597 98128462
5470 98128462 99288641 95702472 88901605 81680390 75230988 70522754 67507635 66019146
5462 66019146 65865234 66892718 68754883 70599143 70852694 68992167 66609438 65149824
5454 65149824 65274425 67180348 70457826 74230656 76586813 75976746 72343775 67372313
5446F7372313m449108k840378j186639n9789m22334k251593l748253l741815k923756
5437D5748648j836187m94548P05682J820930L004886L756463L682075K170469
5429E8558418j723323n501280o674816o222873m961805l680101k683915k006382
5421B5103923j653754j437963j307340j155317j027064r00394p74401o43155o09210
5412A5595325n13784m23785l31902l16480l19529k93500l57841l20159k46542
5403A2471803k31583j92614k49576k15792k00775j80409j20272j03514p8186r1144
5393A0807938m440m4085l6496n7123p315L5061n3541l2034J31991J22980K48956
5382A1111892K12762K70203K68685K74301M13305M56327N85789O69852Q32842
$$ plain form
5446 67372313 62923205 60082827 58896188 58836399 58414065 56162472 52414219 48672404 45748648
5437 45748648 43912461 43417913 44123595 45944525 48949411 52705874 56387949 58558418
5429 58558418 56835095 51333815 44658999 38436126 33474321 29794220 27110305 25103923
5421 25103923 23450169 22012206 20704866 19549549 18522485 17622091 16847690 16204535 15595325
5412 15595325 15081541 14657756 14325854 14009374 13689845 13396345 13038504 12718345 12471803
5403 12471803 12240220 12047606 11798030 11582238 11381463 11201054 11080782 10977268 10899082 10807938
5393 10807938 10803498 10759413 10722917 10665794 10658479 10693540 10639999 10607965 10739956 10862936 11111892
5382 11111892 11324654 11594857 11863542 12137843 12551148 13007475 13593264 14263116 15095958
5373A5095958J050346J187203J499930J851941K282771K943821L743205M563839
5365C4219014M878140M370048K480715j375818m599184n597620n314387m258665
5357B4802243l227795k493417k115001j703491j440962j238226j038878q43506
5349A0700967o33031n15888m20134l42255k86041k26886j91839k01042k10303
5340G673548j66413r7899j26589j75317k32969j15629j35844n7295k394N7048
5330F620247J29878K69112M17321M35742O32955O62227L74174j14215o31341q28695
5320G967405q55357p50495n43443m14465l02856k13850j63945j06588j28410j12250
5310D375746k8303q8137m5603j63o2532K8992M9117Q2476J6158R9183J77080J47740
$$ plain form
5373 15095958 16146304 17333507 18833437 20685378 22968149 25911970 29655175 34219014
5365 34219014 39097154 43467202 45947917 44572099 39972915 34375295 29060908 24802243
5357 24802243 21574448 19081031 16966030 15262539 13821577 12583351 11544473 10700967
5349 10700967 10067936 9552048 9131914 8789659 8503618 8276732 8084893 7883851 7673548
5340 7673548 7507135 7409236 7282647 7107330 6874361 6758732 6622888 6565593 6563199 6620247
5330 6620247 6750125 7019237 7436558 7872300 8505255 9167482 9541656 9427441 8796100 7967405
5320 7967405 7112048 6361553 5818110 5403645 5100789 4886939 4722994 4616406 4487996 4375746
5310 4375746 4347443 4259306 4213703 4213540 4151008 4180000 4229117 4311593 4327751 4426934 4604014 4751754
5298D751754K15700K79405M09998N29045O59258P28039N60756J04812m94138p83532
5288F961097q73707p55039n36419m89363l25149k17438j98607j54814j00116j00738
5278C209707p5204m1560l2926n5911n0246n1961J992m4505o3210J06740O3453
5267B966369k7940Q2620J04466J83841J68183K60821K54272K70246J74446K5583
5257D462907k4808j1273k5105K2795k7743k42897l75593l98327l12990k46024
5247B820942j37570j44479j48492q5256o9324r2346k8676l3154k7833q0763m3937
5236A929112k2137K2748j2074j5675K4128j316L5402P0331L5333M493j2214J7194
5224B075325L4080J00106J20951L8811J3282J8362O153q5783q9142j8933q19k3107
$$ plain form
5298 4751754 4967454 5246859 5656857 6185902 6845160 7573199 8133955 8238767 7744629 6961097
5288 6961097 6087390 5332351 4795932 4306569 3981420 3763982 3565375 3410561 3310445 3209707
5278 3209707 3134503 3092943 3060017 3004106 2953860 2901899 2903891 2859386 2796176 2902916 2966369
5267 2966369 2938429 3021049 3125515 3309356 3477539 3738360 3992632 4262878 4437324 4462907
5257 4462907 4438099 4426826 4401721 4424516 4396773 4153876 3778283 3379956 3066966 2820942
5247 2820942 2683372 2538893 2390401 2305145 2235821 2143475 2114799 2081645 2053812 1973049 1929112
5236 1929112 1906975 1929723 1917649 1901974 1926102 1924786 1960188 2030519 2065852 2070345 2058131 2075325
5224 2075325 2109405 2209511 2330462 2369273 2382555 2400917 2407070 2321287 2232145 2213212 2212393 2189286
5212B189286j2469o2787L6717k6833p2339m7519q723k0227o5892M543q500K0552
5200A925809Q181m6031M0958P5751N9489p295M2748J01040L7674K3753M1374O5566
5188B369017O3690L0246P3661J06575l956L4973k5972q9917k1182j55334o3469
5177B318332l5182J108j0127k6557m0334p980K2167J9818k9577J9821J022O2245
5165B294756K963j9281L2166j0371m8995J7764j249K803K770m754K3964j375Q3183
5152B374344O6293N4115N3003Q1558K0329q063O9782K6707j8558l7654n4030q774
5140B619052m4614k6315L8428N5475O0068L8492P5783R8708O8310Q6364J04704
5129C174455J59634J65099K66250K79895L55230M55791N57314Q39770J063064
$$ plain form
5212 2189286 2176817 2114030 2150747 2123914 2051575 2004056 1995333 1975106 1909214 1913757 1905257 1925809
5200 1925809 1933990 1887959 1928917 2004668 2064157 2056862 2099610 2200650 2238324 2262077 2303451 2369017
5188 2369017 2432707 2462953 2536614 2643189 2639233 2674206 2648234 2558317 2537135 2381801 2318332
5177 2318332 2283150 2284258 2274131 2247574 2207240 2199260 2221427 2241245 2211668 2231489 2232511 2294756
5165 2294756 2297719 2278438 2310604 2300233 2251238 2269002 2267753 2270556 2273326 2268572 2292536 2291161 2374344
5152 2374344 2440637 2494752 2547755 2629313 2649642 2641579 2711361 2738068 2719510 2681856 2627826 2619052
5140 2619052 2574438 2548123 2586551 2642026 2702094 2740586 2816369 2915077 2983387 3069751 3174455
5129 3174455 3334089 3499188 3765438 4045333 4400563 4856354 5413668 6253438 7316502
5120G316502J071058R73762j26372j151562j164891j044423p50422m75576j98687
5111D449389j44327q1884n626n5654m0454j56959k15308k89817j80883q7152k3504
5100C167821j9023J8651K6488N955o3206j17439q1697m6695r005l9502p8081n3617
5088B710650J5641k1044k7624o7005m5857k0227o3670J5237R555j7385k8957J2632
5076B471946k8067K4003J3668M1790n654P588K4468J5039R869M4333J25476J4436
5064B758895J0005J20132N079J7026J6216L0227j6190K7144L1947O9111N3594
5053C123186J13358Q7853J25704J24617J48661J68370K28337J64814R8197l76
5043D382721M3106q091P2665O2056J63932J44351N4077r729J7489O0558L4057
$$ plain form
5120 7316502 8387560 9361322 9234950 8083388 6918497 5874074 5123652 4648076 4449389
5111 4449389 4305062 4223178 4217552 4161898 4121444 3964485 3749177 3459360 3278477 3191325 3167821
5100 3167821 3148798 3167449 3193937 3199892 3136686 3019247 2937550 2890855 2881850 2842348 2764267 2710650
5088 2710650 2726291 2705247 2677623 2610618 2564761 2544534 2480864 2496101 2505656 2488271 2459314 2471946
5076 2471946 2443879 2467882 2481550 2523340 2517686 2525274 2549742 2564781 2574650 2618983 2744459 2758895
5064 2758895 2768900 2889032 2894111 2911137 2927353 2957580 2941390 2968534 3000481 3069592 3123186
5053 3123186 3236544 3324397 3450101 3574718 3723379 3891749 4120086 4284900 4383097 4382721
5043 4382721 4425827 4417736 4490401 4552457 4716389 4860740 4914817 4905088 4922577 4983135 5017192
5032E017192k129O9223N4664k1194j6938M2651O8643N2937P7784J65003Q6976
5021E594812M6945J19247R9808J33109N2948M8070J20824O0190M1458J21372P3354
5010F512137J00564J37765J26846Q7013J25492J71001K15217J41666J49960P7245
5000G844906J69210K11712K36260Q6362J80386J54081K36071L03509L04531L20501
4990A0047529L83896M55452N30326N59337O13109N50994N04851M11278M80573
4981A4537345M36352N18173M96500N14248M50520N99986M93963O42877N61922
4972A9251886P04760M81305P03131N41959N45475N39602N23313M94171O16466
4963B4402068O85864R79287R94795J294602J381714J723738J676762K030996K309493
$$ plain form
5032 5017192 5015063 5084286 5138950 5117756 5100818 5143469 5212112 5265049 5342833 5507836 5594812
5021 5594812 5641757 5761004 5860812 5993921 6046869 6094939 6215763 6275953 6317411 6438783 6512137
5010 6512137 6612701 6750466 6877312 6964325 7089817 7260818 7476035 7617701 7767661 7844906
5000 7844906 8014116 8225828 8462088 8548450 8728836 8882917 9118988 9422497 9727028 10047529
4990 10047529 10431425 10886877 11417203 11976540 12589649 13140643 13645494 14056772 14537345
4981 14537345 14973697 15491870 15988370 16502618 16953138 17553124 18047087 18689964 19251886
4972 19251886 19956646 20437951 21141082 21683041 22228516 22768118 23291431 23785602 24402068
4963 24402068 25087932 26067219 27062014 28356616 29738330 31462068 33138830 35169826 37479319
4954C7479319K820313L059439L816223M389555N581478O270056P823054R444627
4946H0684064J2605110J6523850K3110248L0288839L9973756M6089658M0304622
4939B89580147J935009m3609363n1201322m6996024l4775353k3217057j5876085
4932G5839952j1595875q719319o794510n168121m236027l400186k863542k325696
4924C0736676j985184j590256j422394j163936j053380r59612j066735j099097
4916B0396082j151965j132785r80858q95048o89736n83481m22292l28031l28613
4907A3883273l79348l37537l02905l37448k88409k36850k01250j15866m0115J41166
4897A1784711K51453M36681O81013J250291J762561K088623J740291M08667j880893
$$ plain form
4954 37479319 40299632 43359071 47175294 51564849 57146327 63416383 71239437 80684064
4946 80684064 93289174 109813024 132923272 163212111 203185867 249275525 289580147
4939 289580147 291515156 247905793 196704471 149708447 114933094 91716037 75839952
4932 75839952 64244077 55524758 48730248 43562127 39326100 35925914 33062372 30736676
4924 30736676 28751492 27161236 25738842 24574906 23521526 22561914 21495179 20396082
4916 20396082 19244117 18111332 17130474 16235426 15545690 14962209 14539917 14211886 13883273
4907 13883273 13503925 13166388 12863483 12526035 12237626 12000776 11799526 11683660 11643545 11784711
4897 11784711 12036164 12472845 13153858 14404149 16166710 18255333 19995624 20404291 18523398
4888A8523398k740533k647432k065184j418809j004673p37960o17215n13736l36949
4879F440907l69662k56968k10880k17686k20186j27527j83322j51087j49212r1837
4869D462540p6038j16420j51069j44522j16144j24064j14802j53421j06257j00360
4859C259443n9015K9648r1892j30763j6716q3377j49679p2658j34602j42028o2855
4848B345506q2055j07779m7133m5448l5070j25545J3064j8365q058o5191L587
4837A827513q8541M968m6547L7535l3018j5748j8878j3153J8996k4920j2624M3411
4825A678994j3865j0324n1353q5585n0134o9417l7967J8892k5j1577M7920M7347
4813A462906j5305l2328m7916K078j2054j3879l1097K172o2418j1496o5031l0100
$$ plain form
4888 18523398 15782865 13135433 11070249 9651440 8646767 7908807 7291592 6777856 6440907
4879 6440907 6071245 5814277 5603397 5385711 5165525 5037998 4854676 4703589 4554377 4462540
4869 4462540 4386502 4270082 4119013 3974491 3858347 3734283 3619481 3466060 3359803 3259443
4859 3259443 3200428 3230076 3138184 3007421 2990705 2907328 2757649 2684991 2550389 2408361 2345506
4848 2345506 2263451 2155672 2108539 2063091 2028021 1902476 1915540 1897175 1889117 1823926 1827513
4837 1827513 1738972 1743940 1697393 1734928 1701910 1686162 1667284 1654131 1673127 1648207 1635583 1678994
4825 1678994 1665129 1654805 1603452 1517867 1467733 1398316 1360349 1379241 1379216 1367639 1415559 1462906
4813 1462906 1447601 1415273 1367357 1369435 1357381 1343502 1312405 1314577 1252159 1240663 1175632 1145532
4801A145532N014m349k8214j1831N0820L2622j8635k7314J3137L5283J7883j9704
4789A190244p2710l1423m0343n9559J3902R6J0710Q645m1961l7924q548K4690
4777I55819L3155J7304Q339j9689J0137k5608L7965K4488l0202o722M4848j9038
4765A030796j4034r71J574r335L075n0197L128N7733N007O759j498L2000p357
4752A056680K9450J54l7801N7319K9765m1017l0470J6031L7343P7536J0814j6638
4740A189166K0285N283j187M551M3088j7045k1756P2568j7885N6531M0267k0815
4728A353051L1216L8728j8071J03116M2382m8553J2689Q8405M5871M7927Q3710
4717A780471M9937J00011J33459N4585R8241K28993K43928K91492L14598L25683
$$ plain form
4801 1145532 1150546 1146197 1117983 1106152 1156972 1189594 1170959 1143645 1156782 1192065 1209948 1190244
4789 1190244 1117534 1086111 1045768 986209 1000111 1000207 1010917 1019562 977601 939677 931129 955819
4777 955819 988974 1006278 1014617 994928 1005065 979457 1017422 1041910 1011708 1004986 1049834 1030796
4765 1030796 1016762 1015791 1017365 1008030 1011105 960908 964036 1021769 1026776 1033535 1032037 1064037 1056680
4752 1056680 1086130 1086284 1048483 1105802 1135567 1094550 1064080 1080111 1117454 1194990 1205804 1189166
4740 1189166 1209451 1214734 1213547 1218098 1261186 1244141 1222385 1294953 1277068 1333599 1373866 1353051
4728 1353051 1384267 1422995 1404924 1508040 1550422 1501869 1514558 1602963 1648834 1696761 1780471
4717 1780471 1830408 1930419 2063878 2118463 2216704 2445697 2689625 2981117 3295715 3621398
4707C621398N23120O82607R68849J228633J591956J702681J196903o07192j793244
4698I115711j825013j628237j173772p63726n21683m61831k84740k42767k54602
4689A959340j53553o9870p9401j06321o3221m2922m8935r3684l7623o1933m139
4678A197738l0114o8285l4864p290m4466m9058p7619k979p3307L099j9401M0002
4666H33456J1161k7494L2896n1252l2066j1150m926J5359m3466J7910J5873j5894
4654G40407K3750j1577J2867j4012K0655J7588L1218M1909K7636J6974k110k2024
4642H83281p784l0007k4972n907k8596p2199l9658M6496M0597M505P9758K3504
4630H69018N4100M8634R2010P9640J65472K58586J93396J71488K0262k31144k52796
$$ plain form
4707 3621398 4144518 4827125 5795974 7024607 8616563 10319244 11516147 10908955 9115711
4698 9115711 7290698 5662461 4488689 3724963 3203280 2741449 2456709 2213942 1959340
4689 1959340 1805787 1735917 1656516 1550195 1486974 1444052 1395117 1301433 1263810 1201877 1197738
4678 1197738 1167624 1099339 1064475 1057185 1012719 963661 886042 883063 809756 812855 793454 833456
4666 833456 844617 817123 850019 798767 766701 755551 750625 765984 722518 740428 756301 740407
4654 740407 764157 752580 765447 751435 772090 789678 820896 862805 890441 907415 905305 883281
4642 883281 875497 845490 820518 814611 786015 713816 674158 720654 761251 765756 845514 869018
4630 869018 923118 971752 1063762 1143402 1308874 1567460 1760856 1932344 1952606 1721462 1468666
4619A468666k04416j66447j46996q3744r2703l9848l9827k3782n5548k7717k8113
4608E59525k644m5846M4192l36n8366j7322P3713J8039O661K808K6161l5782k087
4595E68716n858O1877Q735O382r138n782M7521M2443Q3707P7609N9725J99682
4583A135619K18089J38739J81969J57353r6254k14981k15991k20474j95543q7104
4573H01422p8650o9994n3313k3934j0459o8605o8541J0048K7917K4588M421l8584
4561D56316J4038l6987J7998J9801n2637N585J1816j132l0520l3179j157m0769
4549C29173K5779j9980M3462J1510o2272O107m3019n3611J8981J8637K9336n3647
4537B50456K0363o2325K1113M7995O558k9483p882L449J5811J7406J251j2771
$$ plain form
4619 1468666 1264250 1097803 950807 867063 774360 734512 694685 670903 615355 587638 559525
4608 559525 556881 511035 555227 554891 496525 479203 552916 570955 577616 580424 606585 570803 568716
4595 568716 562858 624735 633470 639852 630714 624932 672453 714896 798603 876212 935937 1135619
4583 1135619 1353708 1492447 1674416 1831769 1735515 1520534 1304543 1084069 888526 801422
4573 801422 722772 652778 599465 575531 565072 496467 427926 437974 465891 490479 494900 456316
4561 456316 470354 433367 451365 471166 418529 424114 435930 434798 404278 371099 369942 329173
4549 329173 354952 334972 378434 389944 327672 333779 290760 237149 256130 274767 304103 250456
4537 250456 270819 208494 229607 277602 284160 254677 246795 250244 266055 283461 284712 271941
4525B71941j2276m0198K0348o040j1086Q722J7678j3098m718r385L0348K1997
4513B74233r062j4829k3224N4266l1911K4702j533m5576L0725L5664k9945l1295
4501B32215q508m963J0376o486K4239K3002k2945l1170K9571K1486O892L875N697
4488B83281J7467K7415j4198l0890N4003r311l8560J4689q287j0888k8997L2717
4476B88441j3652k2260l097j057n058M8559Q764j4272j1548O3034L0582r339O421
4463C65518j1206J4300j6547l2967j8929K5573k5535j7512J1217Q1122j802P80
4451C74012J4843o5733j525N247j3966K9873K502l3135R9031j1754l8264O2604
4439D23735l1620L7099M2762K4662k245k4275M9253M2901K8860O3760O2187P3709
$$ plain form
4525 271941 259665 219467 239815 233775 222689 231411 249089 235991 231273 221888 252236 274233
4513 274233 265171 250342 227118 281384 249473 274175 272642 227066 257791 293455 263510 232215
4501 232215 223707 218744 229120 222634 246873 269875 246930 215760 245331 266817 273709 277584 283281
4488 283281 300748 328163 313965 283075 337078 327767 289207 303896 295609 284721 255724 288441
4476 288441 274789 252529 249432 248375 243317 291876 300640 286368 274820 337854 368436 359097 365518
4463 365518 354312 368612 352065 319098 300169 325742 300207 282695 293912 375034 373232 374012
4451 374012 388855 323122 321597 326844 312878 342751 345253 312118 411149 399395 361131 423735
4439 423735 392115 429214 471976 496638 494393 470118 519371 562272 591132 654892 717079 790788
4427G90788P8959N6044m7789r0966n9148r2700l9050j0742k0921o1809j1164N2593
4415E44095l1742k7056R555j5182J7814l0721k8856N137m3219p596j4935l9711
4403C37583K0032J4831L4283m2705j1488K676L7870L8283J3610L1236l6713K3833
4391D63331j7076m7898J183K9565q937j6904m1246K5973J7688M47r141J195L0056
4378D28236m092L8770L4038R3815Q8200P7160R5625J39867J19957m5075o6515
4367I99986j17642j50352j57355J2432n1022j6062n9439l9709l3203m1563q010
4356C38061j1260m9106l7084J5242J3502j5868J9688m5818n5337L6673l380L7446
4344B42759K281J8676n0329J42K3214l0016K82K9809L1754l6107p8642K3046N593
$$ plain form
4427 790788 869747 925791 878002 787036 727888 635188 596138 585396 564475 502666 491502 544095
4415 544095 512353 485297 494852 479670 497484 466763 437907 443044 399825 392229 377294 337583
4403 337583 357615 372446 406729 364024 352536 355212 393082 431365 444975 476211 439498 463331
4391 463331 446255 398357 399540 429105 420168 403264 362018 387991 405679 406126 396985 398180 428236
4378 428236 424144 462914 496952 590767 678967 756127 851752 991619 1111576 1066501 999986
4367 999986 882344 731992 574637 587069 536047 519985 460546 420837 387634 346071 338061
4356 338061 326801 277695 240611 255853 269355 253487 273175 227357 172020 208693 205313 242759
4344 242759 245040 263716 213387 213529 236743 206727 207009 236818 268572 232465 153823 176869 182462
4331A82462k504M3552J2119K0209K7318j4314o6095N3714N3701m0823M541L9733
4319C13613o581L1071M5675l7878j2980l4027m5509j7272n1887q802j6993M3201
4307B01631J0793J4443q807l0536L175K4391j1130L5510K8775m4583l3944L565
4295A93283M030K5652k8566k1384J557l4334L8978K1595p0214n504N4000j3511
4283A65582o90l1448K1528m494L9752P252l0409j0179L8047R771M016J584J2991
4270B23303K186J1082K6964n981l5516J3631O0761k9274j8899j5019j2696L3830
4258B54372K087m0086m353P71j1358L8717q768K8771k115j8634L042k6082k729
4245B13635j4253O498J03800q22k6044k2143m783l2040l3400J723J499p238P3521
$$ plain form
4331 182462 179958 223510 235629 255838 283156 268842 202747 256461 310162 269339 273880 313613
4319 313613 307032 338103 383778 345900 332920 298893 253384 236112 184225 175423 158430 201631
4307 201631 212424 226867 218060 187524 190699 215090 203960 239470 268245 223662 189718 193283
4295 193283 197313 222965 194399 173015 174572 140238 179216 200811 130597 125093 179093 165582
4283 165582 164892 133444 154972 150478 190230 197482 167073 156894 194941 204712 208728 210312 223303
4270 223303 225489 236571 263535 257554 222038 235669 296430 267156 248257 233238 220542 254372
4258 254372 256459 216373 212020 212791 201433 240150 231382 260153 258038 239404 242446 216364 213635
4245 213635 199382 205880 309680 308858 282814 260671 255888 223848 190448 192171 193670 186432 259953
4232B59953J04903l9683o2422l7253L1834J7936l911j6230l9774M6356N3837l0856
4220B84690j2744K0637o4130j0869L7878l068n2583L3595P960j7695O3733J116
4208B88520j0483j4982l5858Q2883K2416K5061j9837p1008r057L2683K5177j7993
4196B97522m4308O8270O428m9639N868m3293J4246J2408r44L8971P623k4456O1172
4183C49868k6834O683J9957K427M4647l7520l9294K9238k4751o0807l7850K4882
4171B50646M4434J0289k4629Q3713O5863l4615k5421L0881k3722j8554j7190j1785
4159C29910P357K1374J5378o423K2773l7K5688n5509L0804n710l3300M349L9904
4146C96558N4205n0353L1770L5084M7137l9659k378L0337j3621j6912j4122J5946
$$ plain form
4232 259953 364856 325173 262751 225498 257332 275268 271357 255127 215353 261709 315546 284690
4220 284690 271946 292583 228453 217584 255462 252394 199811 233406 241366 223671 287404 288520
4208 288520 278037 263055 227197 310080 332496 357557 337720 266712 257655 290338 315515 297522
4196 297522 253214 321484 327912 278273 284141 240848 255094 267502 266558 305529 313152 288696 349868
4183 349868 323034 329717 349674 352101 396748 359228 319934 349172 324421 263614 225764 250646
4171 250646 295080 305369 280740 364453 430316 395701 370280 401161 377439 358885 341695 329910
4159 329910 337267 358641 374019 367596 390369 390332 416020 360511 391315 385605 352305 356654 396558
4146 396558 450763 400410 432180 467264 514401 474742 472364 502701 489080 472168 458046 473992
4134D73992l6701L5204N4177n643K1770K762R601M6689n0301K2492L2338P216
4122F13596K1373k4943j7856M970K0124L8561L0628j6763R780k6668k3324o209
4110F23269M3860k8087O0291j1240M4216K8075N5291o211j4180J6365L7284j1870
4098H37063l2780Q158J5804J0919K5586q431M2470k025K4562N2388R368K3300
4086A006382J06106L1537M4825R4619N9171j4003R810N8721O3774J36055J31695
4075A728692J59841J21275Q0044k0995k2995q1013m2688q8490p6473M863O5494
4064A827555K6411J49887J00017J47861P3880J09467k665r104M2271j1936j7424
4053B436220J5619q687K7119J796O5991J86953K28351K86996K91046L54272J62317
$$ plain form
4134 473992 437291 472495 526672 521029 542799 545561 555162 601851 551550 574042 606380 613596
4122 613596 634969 610026 592170 597140 617264 655825 686453 669690 679470 652802 629478 623269
4110 623269 667129 639042 699333 688093 732309 760384 815675 809464 795284 811649 848933 837063
4098 837063 804283 812441 828245 839164 864750 856319 898789 896764 921326 973714 983082 1006382
4086 1006382 1112488 1144025 1188850 1283469 1342640 1328637 1338447 1397168 1460942 1596997 1728692
4075 1728692 1888533 2009808 2089852 2068857 2045862 1964849 1922161 1833671 1757198 1762061 1827555
4064 1827555 1853966 2003853 2103870 2251731 2325611 2435078 2432413 2423309 2465580 2453644 2436220
4053 2436220 2451839 2443152 2470271 2472067 2538058 2725011 2953362 3240358 3531404 3885676 4047993
4042D047993k20716l06969l62124l32955k06980j54365q4212k6514k694j6494
4032B333970L7868J1781n0822L0244O217L029n6725r5114j02490j31212q1304
4021A905442q8051l3732K9410K7773j7626N0471K6173Q7297O6176m9307j70763
4010A833263j64903j15194j22029l4509N159o8057n9604m670k6757J254l6872
3999A207081k8471o740o854l9348K7754O103n0137J569K3648o287j1618M8370
3987A165070J3682J2919M506L3990l85J391o881j5386r235L0545Q881K739l9810
3974A202026O039O6881m0654j3586P331N5457Q3799j3157q034N8058J2786l5163
3962A381783M7461L2666k0778j656M8832M0374L2789k0168k4491O9514J6331O8528
$$ plain form
4042 4047993 3827277 3520308 3158184 2825229 2618249 2463884 2379672 2353158 2350464 2333970
4032 2333970 2371838 2383619 2332797 2363041 2369258 2372287 2315562 2220448 2117958 1986746 1905442
4021 1905442 1817391 1783659 1813069 1840842 1823216 1873687 1899860 1987157 2053333 2004026 1833263
4010 1833263 1668360 1553166 1431137 1396628 1401787 1333730 1274126 1269456 1242699 1243953 1207081
3999 1207081 1178610 1171870 1165016 1125668 1153422 1159525 1109388 1110957 1134605 1128318 1116700 1165070
3987 1165070 1178752 1191671 1196177 1230167 1229782 1231173 1224292 1208906 1199671 1230216 1239097 1241836 1202026
3974 1202026 1208065 1274946 1234292 1220706 1228037 1283494 1367293 1354136 1346102 1404160 1416946 1381783
3962 1381783 1429244 1461910 1441132 1439476 1488308 1528682 1561471 1541303 1516812 1586326 1602657 1671185
3950A671185O7549M4365O1047Q6201Q2829R5253M3232J79679K16267K12120L17017
3939C076744L79472M89693M76838M13658L39732Q8722k00950k54723j30087M7567
3929D726666L0142k48571m85580m77413m12136l36933k80739j52561j52583j28075
3919B082217j16326o9648k2668p4510o8018l4197l4038k1632n5808l4471m2523
3908A508378r246M552l5726n2737l7106p258J4154j4447m965j4397n1897K4816
3896A324121J4857o682j454O972k1771J0564L1226j222l4759l5350j2267N236
3884A279471L9710M753K357j6451n0159J9122L5406N4945m9694l4572M850K6600
3872A316338l7534O36K4742r199J7319l6943K3864m2151K0354K7894o871k2491
$$ plain form
3950 1671185 1738734 1783099 1844146 1930347 2013176 2108429 2151661 2331340 2547607 2759727 3076744
3939 3076744 3456216 3945909 4422747 4836405 5176137 5264859 5063909 4809186 4679099 4726666
3929 4726666 4756808 4508237 4022657 3545244 3133108 2796175 2515436 2362875 2210292 2082217
3919 2082217 1965891 1896243 1873575 1799065 1731047 1696850 1662812 1641180 1585372 1550901 1508378
3908 1508378 1499132 1503684 1467958 1415221 1378115 1370857 1385011 1370564 1365599 1351202 1299305 1324121
3896 1324121 1338978 1332296 1330842 1337814 1316043 1326607 1357833 1356611 1321852 1286502 1274235 1279471
3884 1279471 1319181 1323934 1326291 1309840 1259681 1278803 1314209 1369154 1319460 1284888 1289738 1316338
3872 1316338 1278804 1279440 1304182 1294983 1312302 1275359 1299223 1257072 1277426 1305320 1298449 1275958
3860A275958N051N8430j9316N812K6684L0446M5665l7317j1450N7082k9169o5261
3848A342615p4418L6747P7515j8217n587M7185M7114J0944J0705l7549J9441r103
3836A447392K587l4343L6582l3948j9391L1775J06091p548k4499L0386l2131O5632
3824A568585M4409p7356m1418M8925k3477j8616R8336k6374q374Q587m1276P7127
3812A609078O5067J8637m7511K2340O793j2738k1202K090k4232J048M4248M2062
3800A705680K9642k2707L800K3507j4658N4247P723l6556K4632P0226k7006m7206
3788A771324j3633K7575M131J8483J574k6416n0471J3493l74r67k3419L1459N8319
3775A811078J8065J7432j235k2222k9535j3225l4235N1174O9984m9115k8620R285
$$ plain form
3860 1275958 1281009 1339439 1320123 1325935 1352619 1383065 1428730 1391413 1379963 1437045 1407876 1342615
3848 1342615 1268197 1304944 1382459 1364242 1358655 1405840 1452954 1463898 1474603 1437054 1456495 1447392
3836 1447392 1449979 1415636 1452218 1418270 1398879 1430654 1536745 1529197 1504698 1535084 1502953 1568585
3824 1568585 1612994 1535638 1494220 1543145 1519668 1501052 1599388 1573014 1564640 1573227 1531951 1609078
3812 1609078 1674145 1692782 1645271 1667611 1674404 1661666 1640464 1642554 1618322 1619370 1663618 1705680
3800 1705680 1735322 1712615 1716415 1739922 1725264 1779511 1787234 1750678 1775310 1845536 1818530 1771324
3788 1771324 1757691 1785266 1789397 1807880 1809454 1783038 1732567 1746060 1745686 1744719 1721300 1752759 1811078
3775 1811078 1829143 1846575 1845340 1823118 1793583 1780358 1746123 1797297 1867281 1818166 1789546 1798831
3763A798831L3516M000k405K8789J7880k6621J9226K4674n4695l2337m5044j3763
3751A752051J7954M624J8129P965l3802r919j0287k3196K9294J082O951Q275j954
3738A767167k6994J0650J5143m5331r037M7078L8934P926J3215j910k3583p444
3726A785814M987L5361J3635l6371k3029L9139N0941L740J9j8163o532j5878J8674
3713A852337m5218j2981k6660j9009O0658J9974J8945J2453K0017j8882L2725
3702A894359n849j7949L8011L8031J0845l49M5618L7279l4565j7735N9729J4239
3690B061664J0107J7399j2722J8280K9581q83L9625N241J1190J4565P8818J8985
3678B291850l4917K2644O3091R3244K346M9212J4473o3102L1087O0526L1779k1368
$$ plain form
3763 1798831 1832347 1836347 1833942 1862731 1880611 1853990 1873216 1897890 1843195 1810858 1765814 1752051
3751 1752051 1770005 1774629 1792758 1800723 1766921 1757002 1746715 1723519 1752813 1753895 1760846 1769121 1767167
3738 1767167 1740173 1750823 1765966 1720635 1711598 1758676 1797610 1805536 1818751 1816841 1793258 1785814
3726 1785814 1790801 1826162 1839797 1803426 1780397 1819536 1870477 1874217 1874236 1856073 1849541 1833663 1852337
3713 1852337 1807119 1794138 1767478 1748469 1809127 1829101 1848046 1860499 1880516 1861634 1894359
3702 1894359 1888510 1870561 1908572 1946603 1957448 1957099 2002717 2039996 2005431 1987696 2047425 2061664
3690 2061664 2071771 2089170 2076448 2094728 2124309 2123426 2163051 2168292 2179482 2194047 2272865 2291850
3678 2291850 2256933 2279577 2342668 2435912 2438258 2487470 2501943 2438841 2469928 2530454 2562233 2540865
3666B540865K6964n332P837j0208N2083N3243K7923L3673P4542P797M6069P0780
3654B926236n068N8239M6469p1779j2018M5311M1270N3906N7738M8474M7058O2340
3642C298176J19080O9821n6296l2602M6300L1451L8101Q5295l527K9235k3517
3631C601517J6566K5993J1200L4195Q9410J20123N3576K3089j5607m8105K4506
3620C936463R0265L7741R6364N9129K0291J04732Q3933N886R7437K9316R2478
3609D654035J47701N3909K8943N0195P9786j8646O5913P1107L0869P3940J02906
3598E340658M8023N6669P0494N0958O2734P6080R8974J16121J46282L5895Q2685
3587F185573O3932J48326J26276Q0138J20516Q6357J74177Q5106J33060J20535
$$ plain form
3666 2540865 2567829 2562497 2570334 2560126 2612209 2665452 2693375 2727048 2801590 2809387 2855456 2926236
3654 2926236 2921168 2979407 3025876 2954097 2942079 2987390 3028660 3082566 3140304 3188778 3235836 3298176
3642 3298176 3417256 3487077 3430781 3398179 3444479 3475930 3514031 3599326 3595799 3625034 3601517
3631 3601517 3618083 3644076 3655276 3689471 3778881 3899004 3952580 3975669 3960062 3911957 3936463
3620 3936463 4026728 4064469 4160833 4219962 4240253 4344985 4428918 4434804 4532241 4561557 4654035
3609 4654035 4801736 4855645 4884588 4934783 5014569 4995923 5061836 5132943 5163812 5237752 5340658
3598 5340658 5388681 5445350 5515844 5566802 5629536 5705616 5804590 5920711 6066993 6102888 6185573
3587 6185573 6249505 6397831 6524107 6604245 6724761 6811118 6985295 7070401 7203461 7323996
3577G323996J30739J49076J00214J30128J15667J80318J39792J12695J65665K17441
3567H765731J47096J61164J71293J50230J70568J42374K13359J87692K08213J71875
3557A0489595J81558K35011L01481K94870K92436K95211M24028M09469M74959
3548A3398618N21139N17827N88116O64512O99888Q06229Q15450R29943R50024
3539A9891746R41059R99723R70047Q38071O59413M32732J95701q1866m54575p46291
3529B3645760r69467j082178j051224j047403r40395q60408p85428o45936n81194
3520A5682127n00366m30699l77434l39416l40505l19087k57207j91081j28844
3511A2797488j79999j74950k02623k11301j91742k22905k20800j83771j87725
$$ plain form
3577 7323996 7454735 7603811 7704025 7834153 7949820 8130138 8269930 8382625 8548290 8765731
3567 8765731 8912827 9073991 9245284 9395514 9566082 9708456 9921815 10109507 10317720 10489595
3557 10489595 10671153 10906164 11207645 11502515 11794951 12090162 12514190 12923659 13398618
3548 13398618 13919757 14437584 15025700 15690212 16390100 17196329 18011779 18941722 19891746
3539 19891746 20832805 21832528 22802575 23640646 24300059 24732791 24928492 24846626 24392051 23645760
3529 23645760 22676293 21594115 20542891 19495488 18555093 17694685 16909257 16263321 15682127
3520 15682127 15181761 14751062 14373628 14034212 13693707 13374620 13117413 12926332 12797488
3511 12797488 12617489 12442539 12239916 12028615 11836873 11613968 11393168 11209397 11021672
3502A1021672j66697o3731j51929j68193r6215o4698r5926j74673j78807j54566
3492I706237j39671j00226n9971q3079J2422K8609Q5965J22867K63266L86400
3482A0222819N70324P01215Q22744P88428L33295l58061q40742r58803q61199
3473A0420020o19011n35609m21012l69176l62845k29402j97682j08176k6309J8610
3463G569408m8213J4627n0124n2165L8011J28103O1391J76775L10360K86379L91023
3452H825575N57356P29160R87833J342045J561425J800538J086338m27920j494072
3443A4968278j777590j670135j440425j057250q45723o84319m45086l57157l13142
3434F377451k35780j80080j29377r6093q8598j15591n8090m9519j838O2834M2302
$$ plain form
3502 11021672 10854975 10791244 10639315 10471122 10374907 10310209 10214283 10039610 9860803 9706237
3492 9706237 9566566 9466340 9406369 9323290 9335712 9364321 9450286 9573153 9836419 10222819
3482 10222819 10793143 11494358 12317102 13105530 13438825 13080764 12240022 11281219 10420020
3473 10420020 9801009 9265400 8844388 8475212 8112367 7882965 7685283 7577107 7550798 7569408
3463 7569408 7521195 7535822 7485698 7433533 7471544 7599647 7661038 7837813 8148173 8434552 8825575
3452 8825575 9382931 10112091 11099924 12441969 14003394 15803932 16890270 16462350 14968278
3443 14968278 13190688 11520553 10080128 9022878 8177155 7492836 7047750 6690593 6377451
3434 6377451 6141671 5961591 5832214 5736121 5647523 5531932 5473842 5424323 5422485 5485319 5527621
3423E527621R7403J64352J96197J30453J97967L74324M79630N58625O95193N45874
3413H967639K5525n36349q87601q91807p57089n79453l80073k76331k96340j73195
3403D214926j29452j04586q8498j46188j02567l7313o3192o4320m2841m6342j8509
3392C371118o8575m4924j175m7992K265j31729o3572J864l0580J9846n0955l0214
3380B925377m2456j7884Q577j3322l9416N40n8838J279j9070l2940K7781M87p7632
3367B662483o3421L71j4371j3815l3745l811K4172n9027q67j9094n1192M5572
3355B473255l799p1067j9673j047J5316o8830l4540j669J7365k1822r555r506
3343B264428j6852k1206q274J1321k3996k4124l6996K2820p013n3038L2406K1209
$$ plain form
3423 5527621 5625024 5789376 5985573 6116026 6313993 6688317 7167947 7726572 8421765 8967639
3413 8967639 8993164 8456815 7569214 6677407 5920318 5340865 4960792 4684461 4388121 4214926
3403 4214926 4085474 3980888 3892390 3746202 3643635 3606322 3543130 3478810 3435969 3389627 3371118
3392 3371118 3302543 3257619 3256444 3208452 3210717 3078988 3015416 3017280 2986700 3006546 2955591 2925377
3380 2925377 2882921 2865037 2873614 2860292 2820876 2821416 2762578 2763857 2744787 2711847 2739628 2740115 2662483
3367 2662483 2599062 2599433 2585062 2571247 2537502 2533691 2557863 2498836 2497969 2478875 2427683 2473255
3355 2473255 2469456 2398389 2378716 2377669 2392985 2324155 2289615 2287946 2305311 2283489 2273934 2264428
3343 2264428 2247576 2226370 2218096 2229417 2205421 2181297 2144301 2167121 2160108 2107070 2139476 2160685
3331B160685n5387l5854n9408l272J1749j2705l0036j7711K6035k3814r323N1689
3319B002648l2753l4850K0891L2976n884n021j6157R682k9441K4134M3312r052
3307B000485M9269k9663L3810j2324l2008J5697O0005N4249k0526p28J3596l5655
3295B096207j5834K1885K8274Q194K2519P5069L979N9854M0915R050J064n835
3283B345341j5009O5686Q3283K7833k292n2297J2854N3912O1484P4949P6150N7823
3271B789717N523L5852Q4355L7851R8575Q1149P8163J25306J15983P5212P7800
3260C605486K6873M7804k2551n3101k4983j09704J0794N6169R2K9872Q01M6732
3248C614284R2563K6829O6706R5218J84310J45181P3618J17073R7564R1991L3937
$$ plain form
3331 2160685 2105298 2069444 2010036 2006764 2018513 2005808 1975772 1958061 1984096 1960282 1950959 2002648
3319 2002648 1969895 1935045 1955936 1988912 1983028 1978007 1961850 1971532 1942091 1966225 2009537 2000485
3307 2000485 2049754 2020091 2053901 2041577 2009569 2025266 2085271 2139520 2118994 2118266 2131862 2096207
3295 2096207 2080373 2102258 2130532 2138726 2161245 2236314 2240293 2300147 2341062 2350112 2351176 2345341
3283 2345341 2330332 2396018 2479301 2507134 2504842 2452545 2465399 2519311 2580795 2655744 2731894 2789717
3271 2789717 2795240 2831092 2915447 2953298 3051873 3133022 3211185 3336491 3452474 3527686 3605486
3260 3605486 3632359 3680163 3657612 3604511 3579528 3469824 3480618 3536787 3536879 3566751 3567552 3614284
3248 3614284 3706847 3733676 3800382 3895600 4079910 4225091 4298709 4415782 4513346 4605337 4639274
3237D639274k9R6875Q2816J19995J55239K08270J91016K19892K31502K18391J67671
3226F330912M2165j8826l0837j5529o1461o3193k0671O0609r801O9268Q8879L2549
3214F404064M3997R9513J27726J13902J83836K14943J70686J42732J60527R3844
3204G755770J00541J86999J73831K06916K26664K67891K71000K55588L35890K57365
3194A0038455J40479m757o9651k47469l09033l85143l33846k51319k11702j11352
3184H254662q2299j3520L3359M6397L7580J31310J68944J14273J94960K11677
3174I097343J69290J83181J79415J32845M8485M7325k2123p8754j19575k03080
3164I434352k36635j90228k53905k86728k84358l10947j88162j91566k36849j66110
$$ plain form
3237 4639274 4639245 4736120 4818936 4938931 5094170 5302440 5493456 5713348 5944850 6163241 6330912
3226 6330912 6373077 6354251 6323414 6307885 6246424 6183231 6162560 6223169 6213368 6282636 6371515 6404064
3214 6404064 6448061 6547574 6675300 6789202 6973038 7187981 7358667 7501399 7661926 7755770
3204 7755770 7856311 8043310 8217141 8424057 8650721 8918612 9189612 9445200 9781090 10038455
3194 10038455 10178934 10174177 10104526 9857057 9548024 9162881 8829035 8577716 8366014 8254662
3184 8254662 8172363 8158843 8192202 8238599 8276179 8407489 8576433 8690706 8885666 9097343
3174 9097343 9266633 9449814 9629229 9762074 9810559 9857884 9835761 9757007 9637432 9434352
3164 9434352 9197717 9007489 8753584 8466856 8182498 7871551 7683389 7491823 7254974 7088864
3154G088864j72035j16607l0625l1386k0744r731j4238n7888l1231o979m0007
3143F557393q7390j68771j48883j62983j57725k38362k88901k76431k14439k14164
3133D599344k18533k25031j49756q7640j85516j54910p6697o8664r9185o4782
3123C268630j10921p8053q2124o0664p5439p7679p1123j16737j02239n0928m2959
3112B399764n980q3692k0071l9741o7361j7680r8259r6115k7498j2735k8144o5976
3100A836512p0691o9815l6625K9792o4587j5605n1231l3693l6305j5046K865l4771
3088A440800o0953n0260m7602k5661k7118N9736K0314m5069k3858l96j732n4551
3076A183650m261J0361R094p3371n0377Q572m6161j2355k0933l5959m499k3501
$$ plain form
3154 7088864 6916829 6800222 6769597 6738211 6717467 6707736 6693498 6635610 6604379 6597400 6557393
3143 6557393 6470003 6301232 6152349 5989366 5831641 5593279 5304378 5027947 4813508 4599344
3133 4599344 4380811 4155780 4006024 3918384 3732868 3577958 3501261 3432597 3333412 3268630
3123 3268630 3157709 3079656 2997532 2936868 2861429 2783750 2712627 2595890 2493651 2442723 2399764
3112 2399764 2393784 2310092 2290021 2250280 2182919 2165239 2066980 1970865 1943367 1930632 1902488 1836512
3100 1836512 1765821 1696006 1659381 1689173 1624586 1608981 1557750 1524057 1487752 1472706 1475571 1440800
3088 1440800 1379847 1329587 1281985 1256324 1229206 1288942 1309256 1264187 1240329 1239933 1238201 1183650
3076 1183650 1179389 1189750 1198844 1125473 1075096 1083668 1037507 1025152 1004219 968260 963761 940260
3064I40260l2135k1294J0955k889m7331k3599J8972l461j1884n926J2741J8565
3052H52974r433j12301n0431N7053J0934l3470n2356k220l2327k533O719j599
3040F31010K979j9623j7369M521K0875k5249o6606l2003M2251N4155n6835j3858
3028E24248P186m8178k7353m277K8299J5720m2318j2796O666L9585J7885r2465
3016D12202n9549K4925j9011L2584K4255j6319M1269k3533P376K2509l9575j0280
3004C96853l0535k4042n1946L0787k4516m601M5001m327M4638K5937q919N495
2992C99825j7390k5867k8332k500J0429o206L1760M4232l1022l5183K1611l0637
2980C30720j2061l9514l3733q60R689M7944K9148n0747J0287J6195j0649k2271
$$ plain form
3064 940260 908125 886831 897786 894897 847566 823967 842939 839478 827594 821668 834409 852974
3052 852974 843541 731240 680809 737862 748796 715326 662970 660750 628423 625890 632609 631010
3040 631010 633989 614366 596997 601518 622393 597144 530538 498535 540786 594941 538106 524248
3028 524248 531434 483256 455903 451626 479925 495645 453327 440531 447197 486782 504667 412202
3016 412202 352653 377578 358567 391151 415406 399087 440356 416823 424199 446708 407133 396853
3004 396853 366318 342276 290330 321117 296601 292000 337001 332674 377312 403249 394330 399825
2992 399825 382435 356568 328236 325736 336165 329959 361719 405951 374929 339746 361357 330720
2980 330720 318659 279145 245412 244552 254241 302185 331333 280586 290873 307068 296419 274148
2968B74148j8198n663N376M1494J4608j6122j4066K120L2437l4630l5466j1967
2956B34071p64k5626O2554k4439n044J2372J9032r2018l205N254j0837K2546P2756
2943B66652O4708m6371l9454j3994l3191M9551K7673j980K7100l8670k5470K6812
2931B63366k9851k7000J2586O9368p9843l1059P4736o453r544m3100N2037K0826
2919B66069k3214n7361p607K0902J1810l7620k4302K8109L4747k5604J5031j1916
2907A89044m5033M6276L3074q388k3319n0892o518J4659K0222J2043L8054j6555
2895B02667k6714J5609R887j3502l0543j8006j210L6549P1377K915k3488k9589
2883A95952q105r626j1907l3908o780J7894K3055l9786K0154j5086J3096J1544
$$ plain form
2968 274148 255950 250287 255663 297157 311765 295643 281577 283697 316134 281504 246038 234071
2956 234071 233307 207681 270235 245796 240752 253124 272156 180138 176933 182187 171350 193896 266652
2943 266652 331360 284989 245535 231541 198350 247901 275574 273594 300694 262024 236554 263366
2931 263366 233515 206515 219101 288469 208626 177567 252303 245850 236306 193206 245243 266069
2919 266069 242855 185494 177887 198789 210599 172979 148677 176786 211533 185929 200960 189044
2907 189044 144011 190287 223361 214973 191654 140762 134244 148903 169125 181168 219222 202667
2895 202667 175953 191562 201449 187947 157404 139398 138188 174737 246114 249029 225541 195952
2883 195952 187847 178221 166314 132406 125626 143520 166575 126789 146943 131857 144953 156497
2871A56497j9737k2015M6551k0850l5635K9309k7502M1434J1809m1875J0954k1677
2859A07263l5326M1070O2832K1506m2087q434M524k6937l0900M2791n797n1454
2847G9051M7545k1275N689r022n5120M6077L4618r505j7283l9377M981k8061L0330
2834F8648K0432J7285k5856J020l1915K4245L5353k2185M601J9437K638J5319
2822A29022J4312k2655L1110n5227l0923m5708J6451N8497J394p6385q617m544
2810F727N411K1684L3825M3086N111k5109M858j0964k411j6587M768K2250k6452
2797F6197p932P529q373J4376J4290j8290l6475J9571L7285J9883l5936o5676
2785F449J0245K5794j9671j6634n794N7812M0596K1642r7693k8115J8654L2184
$$ plain form
2871 156497 136760 114745 161296 140446 104811 134120 106618 148052 159861 117986 128940 107263
2859 107263 71937 113007 175839 197345 155258 146824 151348 124411 93511 136302 130505 79051
2847 79051 126596 105321 111010 101988 46868 92945 127563 118058 100775 61398 66379 38318 68648
2834 68648 89080 106365 80509 81529 49614 73859 109212 87027 91628 111065 113703 129022
2822 129022 143334 120679 151789 96562 65639 19931 36382 94879 96273 19888 11271 6727
2810 6727 12138 33822 67647 110733 115844 90735 95593 84629 82218 65631 70399 92649 66197
2797 66197 58265 65794 57421 71797 86087 67797 31322 50893 88178 108061 72125 6449
2785 6449 16694 42488 22817 6183 389 58201 98797 120439 22746 -5369 13285 45469
2773D5469L5915j078k1439l6126k7129r632M7099q951K6112k97m1590R052N3213
2760G0618m3578k1268M7233J0157m4354p384J0494J0906j9328k7176L8207j2551
2748A1976L2890J847k3340L6379j7617m0895K2517O926m8663K4496O3653P515
2736G7684M76K052o987j9395k080n0271J0842k2413L1564L0887k6584K3591Q531
2723E7897J0869k4666n91P540m1574j6563K7209K9757J0568m0097j2664J1783
2711A9468J9844m39Q339K7021J2035l4744j7873K1745J2388L809k8549P379l2774
2698A7649k2010K1685J697J0584j1181p652m910J2132L517J6937J8485k2681n5915
2685b1663K1273Q843L5201L2415j7159J5506M5004m8915r742K1998J0336l5510
$$ plain form
2773 45469 81384 80306 58867 22741 -4388 -14020 33079 24128 50240 49943 8353 17405 70618
2760 70618 27040 5772 53005 63162 18808 11424 21918 32824 13496 -13680 24527 11976
2748 11976 44866 46713 23373 59752 42135 1240 23757 30683 -17980 6516 70169 77684
2736 77684 78160 80212 73225 53830 51750 1479 12321 -10092 21472 52359 25775 49366 57897
2723 57897 68766 44100 43509 51049 9475 -7088 20121 49878 60446 20349 7685 19468
2711 19468 39312 38873 47212 74233 86268 51524 33651 55396 67784 71593 43044 50423 17649
2698 17649 -4361 17324 19021 29605 18424 10772 5862 17994 21511 38448 56933 34252 -21663
2685 -21663 -390 8453 43654 76069 58910 74416 119420 70505 60763 82761 93097 57587
2673E7587m373j0534N654n246L4410O0816J5503M1249K3982j594j9809m18k4995
2660A72232l3756j9860j8504l2750k2435Q819M3455O23L7135l430l802k7303j8516
2647H1908k6929j317K7570j5985O829K2558j4090k1539K900k7028k4012M2315
2635E3180p988J2876R865l9182k7737k0381O539L2505L6814p6172j7849L8216
2623F86P922L6631L6616q4730J9667R509J3620l7695n05M6534k8261j384l2607
2610a3997J5248J3325O891K0330K6932k1732k6417k2521J6077J7137L4050K2060
2598H7383l0955k5873L1793N442j1388M1855J2792n4000k4422J4295n4893j4515
2586b2486J8915J4701N312K5351n390Q981J1253n438L2229M758k0988j0662N4627
$$ plain form
2673 57587 53214 42680 48334 43088 77498 138314 153817 195066 219048 217454 197645 197227 172232
2660 172232 138476 118616 100112 67362 44927 53746 97201 97824 134959 131529 127727 100424 81908
2647 81908 54979 53662 81232 65247 72076 94634 80544 59005 61905 34877 10865 53180
2635 53180 45192 58068 67933 28751 1014 -19367 -12828 19677 56491 -19681 -37530 686
2623 686 8608 45239 81855 -2875 16792 26301 39921 2226 1721 48255 19994 18610 -13997
2610 -13997 1251 14576 21467 41797 68729 46997 20580 -1941 14136 31273 65323 87383
2598 87383 56428 30555 62348 67790 56402 98257 111049 57049 32627 46922 -7971 -22486
2586 -22486 -3571 11130 16442 41793 36403 45384 56637 51199 83428 88186 67198 56536 111163
2573A11163j1673L0746k0291k6319K1343j7338m325k6168r236J7545J9257M4327
2561A29031k0441j1212K7727L8280m977l5872K9552o0108m2796K1073M0411J621
2549A12289K0895J2086l9836Q85M882K7311l3542j4051K2930M7974K251k3361
2537A40713K0721J8060o476l3084l131J1406M2226j771n1678n514J1298o404K4563
2524A60929m0490L7734N8746M2524M085l2064J0606k9212M6764M078j1377N041
2512B57364k5983n6L0798M2369n8n7613j6528K7515Q2071K7335j6960L69M3239
2499C93862k3309r885O3086M3252j0261j4126P0598j0925j617k2851M151O6831
2487E48806m928j6770q149n0732M1001l347l7144M3028L0314K8621O5574k4779
$$ plain form
2573 111163 99490 130236 109945 83626 104969 87631 83306 57138 47902 65447 84704 129031
2561 129031 108590 97378 125105 163385 158408 122536 152088 91980 49184 70257 110668 112289
2549 112289 133184 145270 105434 106319 111201 138512 104970 90919 113849 161823 164074 140713
2537 140713 161434 179494 173018 139934 136803 148209 190435 188664 136986 131472 142770 136366 160929
2524 160929 120439 158173 216919 259443 263528 231464 242070 212858 259622 263700 252323 257364
2512 257364 231381 231325 262123 304492 304434 246821 230293 257808 339879 367214 350254 350623 393862
2499 393862 370553 360668 423754 467006 456745 442619 513217 502292 500675 477824 481975 548806
2487 548806 543878 527108 518959 468227 509228 505881 468737 511765 542079 570700 636274 611495
2475F11495L981k0335K4872p382K8990P0763l0043K6835L5088k460J3951l9399
2463G16356j8293N5930J6617j13J3923L6515L8673j4934J138K7192M0869Q7491
2451A001364M3879O5751n072M1314K8512L3401Q7021J25837O2717N8658M3894
2440A587276K4408J6754P2178L5836J529L4093J13694N8196K9747O5225R1257
2429B130193J02738J12809J08431R3524J31946J02806K5932N8601R2890J12326
2419C072196N6651J61138J82015K42756L26453K75673M12122L39043K90997L28073
2409E687117L15264L98750M79041O52199R11858J240955J720717K462009L301782
2400A7169692M321484N391419M717105J824953j708576m120673n009641m975935
$$ plain form
2475 611495 615476 595141 620013 612631 641621 712384 682341 709176 744264 741804 755755 716356
2463 716356 698063 753993 770610 770497 784420 820935 859608 844674 845812 873004 913873 1001364
2451 1001364 1045243 1110994 1105922 1147236 1175748 1209149 1296170 1422007 1484724 1543382 1587276
2440 1587276 1611684 1628438 1700616 1736452 1737981 1772074 1885768 1943964 1973711 2038936 2130193
2429 2130193 2232931 2345740 2454171 2547695 2679641 2782447 2808379 2866980 2959870 3072196
2419 3072196 3128847 3289985 3472000 3714756 4041209 4316882 4729004 5068047 5359044 5687117
2409 5687117 6002381 6401131 6880172 7532371 8444229 9685184 11405901 13867910 17169692
2400 17169692 21491176 26882595 31599700 33424653 31716077 27595404 22585763 17609828
2392A7609828m062802k652332j838772j349418j039565p39186o07475m02104k72187
2383D645987k29736k32354k73669l22256k51423k63560k83264j60488j54364k20100
2373B254773j58090q6072j36489j08351q0839r6271r7050q9358q7531n2247j0286
2362A252189r8476j6656k3029j21249j2214N524o2183p1838o1435p5776k1919
2351F92938j520K2196j7837l1334K9818K723j8442o5576m2325l9503L7849J6762
2339E85749n5757O648k1174J9254l9424j5845l2241j9261n4083L932P4567l4930
2327D17435k8640k3170k5847j3412k4536j5408L62j1j9456L5387N1397p1850M432
2314B86683L1983k8923k332n0061j7902k4373n315J0701L6513l2441k2261p2453
$$ plain form
2392 17609828 13547026 10894694 9055922 7706504 6666939 5927753 5320278 4918174 4645987
2383 4645987 4416251 4183897 3910228 3587972 3336549 3072989 2789725 2629237 2474873 2254773
2373 2254773 2096683 2010611 1874122 1765771 1684932 1588661 1491611 1402253 1314722 1262475 1252189
2362 1252189 1153713 1137057 1114028 992779 980565 986089 923906 852068 790633 714857 692938
2351 692938 691418 713614 695777 664443 694261 696984 678542 612966 570641 531138 568987 585749
2339 585749 529992 536640 515466 534720 495296 479451 447210 427949 373866 377798 452365 417435
2327 417435 388795 365625 339778 326366 301830 286422 286784 286773 267317 302704 354101 282251 286683
2314 286683 318666 289743 287411 237350 219448 195075 189760 200461 236974 204533 182272 109819
$$ [...]
##END NTUPLES=NMR SPECTRUM
##END=
