##TITLE=1H_EC-3308
 CDCl3
 8 sc, 
 25.12.2023
##JCAMPDX= 6.0         $$ Bruker NMR JCAMP-DX V2.0
##DATA TYPE= NMR SPECTRUM
##DATA CLASS= NTUPLES
##ORIGIN= UXNMR, Bruker Analytische Messtechnik GmbH
##OWNER= root
$$ XWIN-NMR		Version 3.5
$$ Mon Dec 25 14:52:12 2023 Russian Standard Time (UT+4h)  she@DPX200
##.OBSERVE FREQUENCY= 200.1313
##.OBSERVE NUCLEUS= ^1H
##.ACQUISITION MODE= SIMULTANEOUS
##.ACQUISITION SCHEME= undefined
##.AVERAGES= 8
##.DIGITISER RES= 18
##SPECTROMETER/DATA SYSTEM= spect
##.PULSE SEQUENCE= zg30
##.SOLVENT NAME= CDCl3
##.SHIFT REFERENCE= (INTERNAL, CDCl3, 0, 15.4527)
##AUDIT TRAIL= $$ (NUMBER, WHEN, WHO, WHERE, WHAT)
$$ ##TITLE= Audit trail, XWIN-NMR		Version 3.5
$$ ##JCAMPDX= 5.01
$$ ##ORIGIN= Bruker BioSpin GmbH
$$ ##OWNER= she
$$ F:/spectra/data/she/nmr/H-F/1/pdata/1/auditp.txt
$$ ##AUDIT TRAIL=  $$ (NUMBER, WHEN, WHO, WHERE, WHAT)
(   1,<2023-12-25 14:51:15.45 +0400>,<she>,<DPX200>,
      <created by zg, POWCHK disabled, PULCHK disabled
       configuration hash MD5:
       00 E9 B6 7A A2 85 ED C7 34 08 36 98 17 FE 4E 26
       data hash MD5: 16K
       45 B7 E5 22 43 B9 E3 0C 18 8F A6 F4 EA D5 B6 D7>)
(   2,<2023-12-25 14:51:17.68 +0400>,<she>,<DPX200>,
      <Start of raw data processing
       efp BC_mod = 2 LB = 0.24 FT_mod = 6 PKNL = 1 PHC0 = -24597.67 PHC1 = 17.45273 SI = 16K 
       data hash MD5: 16K
       C5 D2 DD FC BA 4E 6A 60 17 49 B3 79 5A EF 22 49>)
(   3,<2023-12-25 14:51:34.85 +0400>,<she>,<DPX200>,
      <pk PHC0 = 3.32353 PHC1 = -3.4 
       data hash MD5: 16K
       4E D9 B0 83 A0 42 43 32 27 4D 26 AB 00 FB 5A 56>)
(   4,<2023-12-25 14:51:38.37 +0400>,<she>,<DPX200>,
      <abs ABSG = 5 
       data hash MD5: 16K
       DF 54 10 C0 B9 A7 EB FD 68 46 F5 09 C9 63 FC 5B>)
$$ ##END=
$$ 
$$ hash MD5
$$ 8A B1 72 2F 0F 04 BF A3 B6 9F D2 98 01 13 86 CC
##$RELAX= 
##$RELAX= 
##$RELAX= 
##$RELAX= 
##$RELAX= 
##$RELAX= 
$$ Bruker specific parameters
$$ --------------------------
##$DU= <F:/spectra>
##$EXPNO= 1
##$NAME= <H-F>
##$PROCNO= 1
##$TYPE= <nmr>
##$USER= <she>
##$AMP= (0..31)
100 100 100 100 100 100 100 100 100 100 100 100 100 100 100 100 100 100 
100 100 100 100 100 100 100 100 100 100 100 100 100 100 
##$AQSEQ= 0
##$AQ_mod= 1
##$AUNM= <au_zg>
##$AUTOPOS= <>
##$BF1= 200.13
##$BF2= 200.13
##$BF3= 200.13
##$BF4= 200.13
##$BF5= 200.13
##$BF6= 200.13
##$BF7= 200.13
##$BF8= 200.13
##$BYTORDA= 1
##$CFDGTYP= 0
##$CFRGTYP= 5
##$CHEMSTR= <none>
##$CNST= (0..31)
1 1 145 1 1 1 1 1 1 1 1 1 1 1 1 1 1 1 1 1 1 1 1 1 1 1 1 1 1 1 1 1 
##$CPDPRG= <>
##$CPDPRG1= <>
##$CPDPRG2= <>
##$CPDPRG3= <>
##$CPDPRG4= <mlev>
##$CPDPRG5= <mlev>
##$CPDPRG6= <mlev>
##$CPDPRG7= <mlev>
##$CPDPRG8= <mlev>
##$CPDPRGB= <>
##$CPDPRGT= <>
##$D= (0..31)
0 1.2 0 0 0 0 0 0 0 0.06 0 0.03 0 0 0 0 0.0002 0 0 0 0 0 0 0 0 0 0 0 0 
0 0 0 
##$DATE= 1703501474
##$DBL= (0..7)
120 120 120 120 120 120 120 120 
##$DBP= (0..7)
150 150 150 150 150 150 150 150 
##$DBP07= 0
##$DBPNAM0= <>
##$DBPNAM1= <>
##$DBPNAM2= <>
##$DBPNAM3= <>
##$DBPNAM4= <>
##$DBPNAM5= <>
$$ [...]
##$SUBNAM3= <"">
##$SUBNAM4= <"">
##$SUBNAM5= <"">
##$SUBNAM6= <"">
##$SUBNAM7= <"">
##$SUBNAM8= <"">
##$SUBNAM9= <"">
##$SW= 18.0517328524113
##$SWIBOX= (0..15)
0 0 2 0 0 0 0 0 0 0 0 0 0 0 0 0 
##$SW_h= 3612.71676300578
##$TD= 16384
##$TD0= 1
##$TE= 0
##$TE2= 300
##$TE3= 300
##$TEG= 300
##$TL= (0..7)
0 120 120 120 120 120 120 120 
##$TP= (0..7)
150 150 150 150 150 150 150 150 
##$TP07= 0
##$TPNAME0= <>
##$TPNAME1= <>
##$TPNAME2= <>
##$TPNAME3= <>
##$TPNAME4= <>
##$TPNAME5= <>
##$TPNAME6= <>
##$TPNAME7= <>
##$TPOAL= (0..7)
0.5 0.5 0.5 0.5 0.5 0.5 0.5 0.5 
##$TPOFFS= (0..7)
0 0 0 0 0 0 0 0 
##$TUNHIN= 0
##$TUNHOUT= 0
##$TUNXOUT= 0
##$USERA1= <user>
##$USERA2= <user>
##$USERA3= <user>
##$USERA4= <user>
##$USERA5= <user>
##$V9= 5
##$VALIST= <valist>
##$VCLIST= <CCCCCCCCCCCCCCC>
##$VD= 0
##$VDLIST= <DDDDDDDDDDDDDDD>
##$VPLIST= <PPPPPPPPPPPPPPP>
##$VTLIST= <TTTTTTTTTTTTTTT>
##$WBST= 1024
##$WBSW= 4
##$XGAIN= (0..3)
0 0 0 0 
##$XL= 0
##$YL= 0
##$YMAX_a= 90447
##$YMIN_a= -139108
##$ZGOPTNS= <>
##$ZL1= 120
##$ZL2= 120
##$ZL3= 120
##$ZL4= 120
##$ABSF1= 15.46831
##$ABSF2= -2.583539
##$ABSG= 5
##$ABSL= 3
##$ALPHA= 0
##$AQORDER= 0
##$ASSFAC= 0
##$ASSFACI= 0
##$ASSFACX= 0
##$ASSWID= 0
##$AUNMP= <proc_1d>
##$AZFE= 0.1
##$AZFW= 0.1
##$BCFW= 0
##$BC_mod= 2
##$BYTORDP= 0
##$COROFFS= 0
##$CY= -3
##$DATMOD= 1
##$DC= 0
##$DFILT= <>
##$DTYPP= 0
##$F1P= 0
##$F2P= 0
##$FCOR= 1
##$FTSIZE= 16384
##$FT_mod= 6
##$GAMMA= 0
##$GB= 0
##$INTBC= 1
##$INTSCL= 3.70164e-10
##$ISEN= 128
##$LB= 0.24
##$LEV0= 0
##$LPBIN= 0
##$MAXI= 10000
##$MC2= 0
##$MEAN= 0
##$ME_mod= 0
##$MI= 1.114404
##$NCOEF= 0
##$NC_proc= -7
##$NLEV= 6
##$NOISF1= 3.799351
##$NOISF2= 2.8
##$NSP= 0
##$NTH_PI= 0
##$NZP= 0
##$OFFSET= 15.45271
##$PC= 1
##$PHC0= -24594.35
##$PHC1= 14.05273
##$PH_mod= 1
##$PKNL= yes
##$PPARMOD= 0
##$PSCAL= 0
##$PSIGN= 0
##$REVERSE= no
##$SF= 200.130013807525
##$SI= 16384
##$SIGF1= 3
##$SIGF2= 2
##$SINO= 5.538805
##$SIOLD= 16384
##$SREGLST= <1H.CDCl3>
##$SSB= 0
##$STSI= 16384
##$STSR= 0
##$SW_p= 3612.71676300578
##$SYMM= 0
##$S_DEV= 0
##$TDeff= 16384
##$TDoff= 0
##$TI= <>
##$TILT= no
##$TM1= 0
##$TM2= 0
##$TOPLEV= 0
##$USERP1= <user>
##$USERP2= <user>
##$USERP3= <user>
##$USERP4= <user>
##$USERP5= <user>
##$WDW= 1
##$XDIM= 16384
##$YMAX_p= 393961317
##$YMIN_p= -1394966
$$ End of Bruker specific parameters
$$ ---------------------------------
##NTUPLES= NMR SPECTRUM
##VAR_NAME=  FREQUENCY,     SPECTRUM/REAL,   SPECTRUM/IMAG
##SYMBOL=    X,             R,               I
##VAR_TYPE=  INDEPENDENT,   DEPENDENT,       DEPENDENT
##VAR_FORM=  AFFN,          ASDF,            ASDF
##VAR_DIM=   16384,         16384,           16384
##UNITS=     HZ,            ARBITRARY UNITS, ARBITRARY UNITS
##FACTOR=    0.220516191357247, 1,           1
##FIRST=     3092.55109601787, 0,            0
##LAST=      -520.165666987908, 0,           0
##MIN=       -520.165666987908, -1394966,    0
##MAX=       3092.55109601787, 393961317,    0
$$ Real data points
##PAGE= N=1
##DATA TABLE= (X++(R..R)), XYDATA
$$ [...]
$$ plain form
10137 879036 924853 805715 720919 769551 889085 834373 587369 511396 589154 659939 707436
10126 707436 865249 707816 726414 853615 750227 655867 835256 809607 597496 647799
10116 647799 623817 827905 910879 826781 831538 958377 1009090 874159 787703 592499 726103
10105 726103 911086 911763 835458 987936 1053478 1081473 998630 1080905 1135893 1015594 1058218
10094 1058218 978258 908636 994158 1049888 999797 1108067 1019757 853158 847083 829283 926407
10083 926407 1049627 964689 939700 1019263 1188347 1286626 1170811 1114875 1159123 1230669 1334153
10072 1334153 1403702 1428072 1247888 1116597 1166909 1364632 1422738 1422481 1407019 1303868 1222392
10061 1222392 1431237 1357747 1382675 1401612 1199589 1023062 1029422 925629 872542 799890 784915
$$ packed form
10137H79036M5817j19138q4796M8632J19534n4712k47004p5973P7758P0785M7497
10126G07436J57813j57433J8598J27201j03388r4360J79389k5649k12111N0303
10116F47799k3982K04088Q2974q4098M757J26839N0713j34931q6456j95204J33604
10105G26103J84983O77p6305J52478O5542K7995q2843Q2275N4988j20299M2624
10094A058218p9960o9622Q5522N5730n0091J08270q8310j66599o075j7800R7124
10083I26407J23220q4938k4989P9563J69084R8279j15815n5936M4248P1546J03484
10072A334153O9549K4370j80184j31291N0312J97723N8106k57j5462j03151q1476
10061A222392K08845p3490K4928J8937k02023j76527O360j03793n3087p2652j4975
$$ plain form
10050 784915 802110 887539 893486 853651 876003 949492 1156581 1194594 1003222 1065960 1222913
10039 1222913 1166479 1046708 867241 958933 1264171 1244542 1271069 1346539 1353046 1308532 1332832
10028 1332832 1324213 1355713 1441761 1415826 1385012 1230343 1283070 1496807 1438966 1100188 1121351
10017 1121351 1111107 1296709 1296447 1232721 1146266 1455120 1554797 1522516 1235409 1374461 1559195
10006 1559195 1594498 1776465 1717063 1701260 1713537 1779684 2006132 2088285 2313497 2487142
9996 2487142 2583172 2760206 2857842 2842382 2557148 2405958 2241110 2200754 2133332 2157634 1900837
9985 1900837 1648921 1674828 1620036 1561545 1490192 1487494 1181028 1187513 1393357 1595493 1732352
9974 1732352 1672021 1717466 1625527 1531262 1571023 1532687 1383862 1349050 1285634 1357786 1550555
$$ packed form
10050G84915J7195Q5429N947l9835K2352P3489K07089L8013j91372O2738J56953
10039A222913n6434j19771j79467R1692L05238j9629K6527P5470O507m4514K4300
10028A332832q619L1500Q6048k5935l0814j54669N2727K13737n7841l38778K1163
10017A121351j0244J85602k62o3726q6455L08854R9677l2281k87107J39052J84734
10006A559195L5303J81967n9402j5803J2277O6147K26448Q2153K25212J73645
9996B487142R6030J77034R7636j5460k85234j51190j64848m0356o7422K4302k56797
9985A900837k51916K5907n4792n8491p1353k698l06466O485K05844K02136J36859
9974A732352o0331M5445r1939r4265L9761l8336j48825l4812o3416P2152J92769
$$ plain form
9963 1550555 1442379 1327709 1430285 1378535 1635263 1686101 1719342 1526841 1451528 1529881
9953 1529881 1527289 1599072 1526863 1618565 1804785 1888896 1812765 1558728 1531292 1553744 1595041
9942 1595041 1766643 1840474 1914378 2026278 1965195 2027226 1962085 1898694 1739136 1669992 1765480
9931 1765480 1857176 1650997 1648564 1735695 1748972 2051347 2089658 2269132 2341995 2185102 2103601
9920 2103601 2012607 1990977 2080941 2094776 2055098 2111173 2086621 2156234 2198496 2121662 2250668
9909 2250668 2139099 2252142 2095627 2133677 2142870 2279506 2451376 2373429 2504945 2594574
9899 2594574 2600940 2914953 2907406 2690343 2621459 2726403 2535588 2613293 2816248 2550152 2495401
9888 2495401 2585557 2670402 2818603 3013530 3166409 3036566 2975213 3080421 3173182 3212703
$$ packed form
9963A550555j08176j14670J02576n1750K56728N0838L3241j92501p5313P8353
9953A529881k592P1783p2209R1702J86220Q4111p6131k54037k7436K2452M1297
9942A595041J71602P3831P3904J11900o1083O2031o5141o3391j59558o9144R5488
9931A765480R1696k06179k433Q7131J3277L02375L8311J79474P2863j56893q1501
9920B103601r0994k1630Q9964J3835l9678N6075k4552O9613M2262p6834J29006
9909B250668j11569J13043j56515L8050R193J36636J71870p7947J31516Q9629
9899B594574O366L14013p547k17063o8884J04944j90815P7705K02955k66096n4751
9888B495401R0156Q4845J48201J94927J52879j29843o1353J05208R2761L9521
$$ plain form
9878 3212703 3147114 3325572 3300848 3643902 3692701 3585628 3777733 3820042 3537519 3445373
9868 3445373 3514379 3574086 3721724 3549466 3638438 3711069 3741778 3987282 4221322 4314056 4272621
9857 4272621 4176948 4260828 4354574 4411574 4599107 4767372 4854318 4879771 5003824 4943421 5065764
9846 5065764 5354925 5438445 5413592 5324880 5537393 5676050 5773695 5735656 5728086 5884612 6095482
9835 6095482 6200901 6016615 6251839 6439954 6432701 6606701 6993170 6815991 7004488 7029672
9825 7029672 7357671 7462372 7371099 7564778 7650557 7832165 7745211 7759824 7991337 7994931 8363574
9814 8363574 8531192 8435772 8560039 8726179 8861791 8790306 9057371 9241035 9345804 9468090
9804 9468090 9547150 9741047 10043191 10044111 10221533 10370849 10519020 10723891 10957236 11259689
$$ packed form
9878C212703o5589J78458k4724L43054M8799j07073J92105M2309k82523r2146
9868C445373O9006N9707J47638j72258Q8972P2631L0709K45504K34040R2734m1435
9857D272621r5673Q3880R3746N7000J87533J68265Q6946K5453J24053o0403J22343
9846E065764K89161Q3520k4853q8712K12513J38657R7645l8039p570J56526K10870
9835F095482J05419j84286K35224J88115p253J74000L86469j77179J88497K5184
9825G029672L27999J04701r1273J93679Q5779J81608q6954J4613K31513L594L68643
9814H363574J67618r5420J24267J66140J35612p1485K67065J83664J04769J22286
9804I468090P9060J93897L02144R20J77422J49316J48171K04871K33345L02453
$$ plain form
9794 11259689 11281114 11439582 11701436 11920955 12272612 12474985 12721158 12967539 13490268 13699773
9784 13699773 14087300 15050829 15823775 16429144 17540114 19004081 20666044 22898684 25581780
9775 25581780 28057749 30282970 32368970 33413112 33595759 33224941 32719549 32340675 32517987
9766 32517987 32959320 33328405 33798436 33458775 32198200 30107505 27786721 25156600 23029806
9757 23029806 21396280 20292917 19429357 18742483 18499763 18305213 18611871 18558487 18780045
9748 18780045 19129553 19438865 19892971 20092718 20445571 20639109 20722548 21016924 21190898 21450777
9738 21450777 21726406 22196570 22566874 22635812 22777327 22644707 22774184 22899118 23014040 23578789
9728 23578789 24081209 24395806 25028899 25653332 26487974 27347300 28311991 29218583 30574037
$$ packed form
9794A1259689K1425J58468K61854K19519L51657K02373K46173K46381N22729K09505
9784A3699773L87527R63529P72946O05369J110970J463967J661963K232640K683096
9775B5581780K475969K225221K086000J044142J82647l70818n05392l78874J77312
9766C2517987M41333L69085M70031l39661j260575k090695k320784k630121k126794
9757B3029806j633526j103363q63560o86874k42720j94550L06658n3384K21558
9748A8780045L49508L09312M54106J99747L52853J93538Q3439K94376J73974K59879
9738B1450777K75629M70164L70304O8938J41515j32620J29477J24934J14922N64749
9728B3578789N02420L14597O33093O24433Q34642Q59326R64691R06592J355454
$$ plain form
9719 30574037 32164297 33904177 36284035 39234073 43010563 47223681 52017734 57375004
9711 57375004 62875537 68511775 74772821 80487964 85465299 90414868 95637877 99985030
9703 99985030 102179230 102581625 101150051 97687720 93038790 88190774 84552087 82419836
9695 82419836 81509530 81079175 80528950 78343927 74271785 69125204 63183489 57088167 52054962
9686 52054962 48420540 45922966 44669685 44296536 44532851 45288440 47194593 50045364 53633914
9677 53633914 57494275 61318870 65127141 69165853 72064907 73161644 73026328 72381405
9669 72381405 70737858 67178293 62514759 57818237 53419332 48769758 44046586 39836294
9661 39836294 36628217 33983158 32078990 30651299 29578184 28714358 28204039 27797257 27430451
$$ packed form
9719C0574037J590260J739880K379858K950038L776490M213118M794053N357270
9711E7375004N500533N636238O261046N715143M977335M949569N223009M347153
9703I9985030K194200M02395j431574l462331m648930m848016l638687k132251
9695H2419836r10306m30355n50225k185023m072142n146581n941715o095322n033205
9686E2054962l634422k497574j253281l73149K36315P55589J906153K850771L588550
9677E3633914L860361L824595L808271M038712K899054J096737j35316o44923
9669G2381405j643547l559565m663534m696522m398905m649574m723172m210292
9661C9836294l208077k645059j904168j427691j073115q63826n10319m06782l66806
$$ plain form
9652 27430451 27163139 27204622 27393004 27642853 27879290 28152662 29253781 29975712 31153823
9643 31153823 32520601 34006720 35627860 36879250 38215805 38997102 39665980 39865244 39935785
9634 39935785 39903854 39126244 37856057 37230878 36552923 35752794 34904137 34115128 33696389
9625 33696389 33380899 32914317 32880960 32906744 33137354 33286834 33246206 33495456 33413794 33408199
9615 33408199 33568945 33759987 33977036 34707253 35319087 36529923 37763048 39092624 40759740
9606 40759740 42394427 43762956 45008331 45905775 46509999 46746990 46927713 46661068 45766957
9597 45766957 44360072 43218759 41755034 40286995 38757422 37317620 36035891 34986466
9589 34986466 34140903 33384335 32754797 32095215 31691748 31116588 30801180 30603710 30218412
$$ packed form
9652B7430451k67312M1483J88382K49849K36437K73372J101119P21931J178111
9643C1153823J366778J486119J621140J251390J336555P81297O68878J99264P0541
9634C9935785l1931p77610j270187o25179o77955q00129q48657p89009m18739
9625C3696389l15490m66582l3357K5784K30610J49480m0628K49250q1662n595
9615C3408199J60746J91042K17049P30217O11834J210836J233125J329576J667116
9606D0759740J634687J368529J245375Q97444O04224K36991J80723k66645q94111
9597D5766957j406885j141313j463725j468039j529573j439802j281729j049425
9589C4986466q45563p56568o29538o59582m03467n75160l15408j97470l85298
$$ plain form
9580 30218412 29748713 29328856 28999499 28707047 28357515 28220924 27779448 27394007 26885041
9571 26885041 26671842 26326677 26181823 26099117 25550059 25335693 25102143 24769842 24354461 23710293
9561 23710293 23390095 22912796 22229248 21303550 20478721 19764351 19017472 18582023 17995508
9552 17995508 17383845 16744983 16315430 15875383 15401415 14919078 14517629 14350860 13890194
9543 13890194 13548805 13523194 13383221 12841346 12320561 12039907 11824346 11558517 11459448 11218067
9533 11218067 11308073 11235811 11235029 11189478 11144789 11110655 11030171 10996280 10646071 10129813 9569413
9522 9569413 9184048 8986927 8635428 8249491 7927898 7514228 7408789 7505043 7481020 7481869
9512 7481869 7279100 7020377 6943023 6860134 6970585 7036413 6633826 6542767 6546255 6443706 6405332
$$ packed form
9580C0218412m69699m19857l29357k92452l49532j36591m41476l85441n08966
9571B6885041k13199l45165j44854q2706n49058k14366k33550l32301m15381o44168
9561B3710293l20198m77299o83548r25698q24829p14370p46879m35449n86515
9552A7995508o11663o38862m29553m40047m73968m82337m01449j66769m60666
9543A3890194l41389k5611j39973n41875n20785k80654k15561k65829r9069k41381
9533A1218067R0006p2262p82m5551m4689l4134q0484l3891l50209n16258n60400
9522I569413l85365j97121l51499l85937l21593m13670j05439R6254k4023Q49
9512G481869k02769k58723p7354q2889J10451O5828m02587r1059L488j02549l8374
$$ plain form
9501 6405332 6235229 6225928 6014033 6045518 5811547 5666187 5561873 5350769 5378293 5442860
9491 5442860 5283112 5086525 4931095 4980177 4877238 4774549 4965225 4924641 4906864 4942831
9481 4942831 4979222 4830580 4712149 4750050 4630235 4405830 4324092 4286324 4384803 4405665 4352590
9470 4352590 4375116 4342455 4220087 4307608 4185210 3850014 3975793 4140796 4014793 3920417
9460 3920417 3974681 3900129 4196437 4331756 4519898 4573607 4817079 4664454 4403343 4456398
9450 4456398 4662053 4472204 4387135 4566221 4759073 4333642 4353170 4516982 4340584 4296211
9440 4296211 4202993 4511038 4510538 4092909 3931083 3845393 3667211 3617680 3565889 3596318 3449191
9429 3449191 3366420 3232234 3257974 3294711 3454884 3475839 3368540 3461576 3613434 3561584 3425306
$$ packed form
9501F405332j70103r301k11895L1485k33971j45360j04314k11104K7524O4567
9491E442860j59748j96587j55430M9082j02939j02689J90676m0584j7777L5967
9481D942831L6391j48642j18431L7901j19815k24405q1738l7768R8479K0862n3075
9470D352590K2526l2661j22368Q7521j22398l35196J25779J65003j26003r4376
9460C920417N4264p4552K96308J35319J88142N3709K43472j52625k61111N3055
9450D456398K05655j89849q5069J79086J92852m25431J9528J63812j76398m4373
9440D296211r3218L08045n00m17629j61826q5690j78182m9531n1791L0429j47127
9429C449191q2771j34186K5740L6737J60173K0955j07299R3036J51858n1850j36278
$$ plain form
9418 3425306 3651086 4024201 4016087 4111949 4022744 4003664 4135961 4226923 4153051 4194492 4326985
9407 4326985 4345939 4263514 4314096 4157358 3967944 3966567 3913949 3637986 3511688 3330941 3395181
9396 3395181 3428481 3228843 3047333 3197208 3046334 2999608 3187272 3138143 3055119 2989883
9386 2989883 3023933 3115066 3191200 3101677 3191319 3342387 3415462 3473735 3773658 3810309 3713347
9375 3713347 3547964 3281154 3121644 2992526 3023848 3098003 2841398 2794697 3128014 3120409
9365 3120409 3133252 3218230 3249610 3081273 3080396 3465418 3260713 3144518 3127310 3275860 3219152
9354 3219152 3280329 3283796 3375438 3339217 3245680 3563189 3544433 3613087 3680055 3742669 3770847
9343 3770847 3704863 3844538 3945841 3885110 3823570 3982514 4142492 4289605 4577535 4728254
$$ packed form
9418C425306K25780L73115q114R5862q9205j9080J32297R0962p3872M1441J32493
9407D326985J8954q2425N0582j56738j89414j377n2618k75963j26298j80747O4240
9396C395181L3300j99638j81510J49875j50874m6726J87664m9129q3024o5236
9386B989883L4050R1133P6134q9523Q9642J51068P3075N8273K99923L6651r6962
9375C713347j65383k66810j59510j29118L1322P4155k56605m6701L33317p605
9365C120409J2843Q4978L1380j68337q77L85022k04705j16195j7208J48550n6708
9354C219152O1177L467R1642l6221r3537L17509j8756O8654O6968O2614K8178
9343C770847o5984J39675J01303o0731o1540J58944J59978J47113K87930J50719
$$ plain form
9333 4728254 5237055 5803160 6274713 6427656 6148424 5844389 6030801 6140419 6219903 6497178
9323 6497178 6386634 6205198 5770063 5375625 5018293 4847910 4796540 4586242 4639256 4749676
9313 4749676 4587491 4500552 4772564 4802015 4755696 4820522 4621586 4629108 4622275 4413863 4491884
9302 4491884 4382199 4215614 4170504 4346954 4490252 4221027 4219922 4118702 4187806 4173770
9292 4173770 4272540 4507056 4523843 4637640 5000474 5043736 4843444 4874974 4776529 4855652 4896414
9281 4896414 5049190 4953277 5035608 4995787 5061660 5121934 5264907 5377386 5614235 5773389
9271 5773389 5736859 5752845 5860441 5738351 5774045 6132491 6312400 6589907 6494413 6443128
9261 6443128 6315073 6381937 6394722 6633776 6921523 7342907 7573132 7891384 8213032 8599006
$$ packed form
9333D728254N08801N66105M71553J52943k79232l04035J86412J09618P9484K77275
9323F497178j10544j81436m35135l94438l57332j70383n1370k10298N3014J10420
9313D749676j62185q6939K72012K9451m6319O4826j98936P522o833k08412P8021
9302D491884j09685j66585m5110J76450J43298k69225j105j01220O9104j4036
9292D173770R8770K34516J6787J13797L62834M3262k00292L1530r8445P9123M0762
9281D896414J52776r5913Q2331l9821O5873O0274J42973J12479K36849J59154
9271E773389l6530J5986J07596j22090L5694L58446J79909K77507r5494n1285
9261F443128j28055O6864J2785K39054K87747M21384K30225L18252L21648L85974
$$ plain form
9251 8599006 8885595 9048630 9085299 8824275 8860135 8788892 8445961 8241563 8047938 8334846
9241 8334846 8506924 8564787 8660538 8764089 9159389 9382302 9432217 9428709 9685074 9721722 9725336
9230 9725336 9654631 9624150 9607738 9945321 10321509 10642443 11049206 11465981 12009399 12563584
9220 12563584 13188934 13734369 14274241 14437835 14751398 14749883 14936882 15212692 15337539 15396857
9210 15396857 15115888 15010619 15059601 15082230 15232093 15347436 15710151 16139104 16550475 17102241
9200 17102241 17346116 17657362 17732657 17620693 17793051 17848597 17975179 18234103 18606567 19200385
9190 19200385 19684531 20296786 20930988 22012647 23319618 24680305 26469357 28545633 31246565
9181 31246565 34995680 39174477 43109252 45308850 44738345 42905014 41110014 40302912
$$ packed form
9251H599006K86589J63035L6669k61024L5860p1243l42931k04398j93625K86908
9241H334846J72078N7863R5751J03551L95300K22913M9915l508K56365L6648L614
9230I725336p0705l0481j6412L37583L76188L20934M06763M16775N43418N54185
9220A2563584O25350N45435N39872J63594L13563j515J86999K75810J24847N9318
9210A5396857k80969j05269M8982K2629J49863J15343L62715M28953M11371N51766
9200A7102241K43875L11246P5295j11964J72358N5546J26582K58924L72464N93818
9190A9200385M84146O12255O34202J081659J306971J360687J789052K076276K700932
9181C1246565L749115M178797L934775K199598n70505j833331j795000q07102
$$ plain form
9173 40302912 41233091 43592238 46990813 50342171 52151590 51388150 49425870 47090961
9165 47090961 44297872 41304410 38942256 37451278 36696353 37040874 37535353 38198113 38543138
9156 38543138 37519944 36276592 35218734 34458114 34256728 34555547 35260622 36152350 37379025
9147 37379025 39140896 40950153 43280436 45977421 49474113 53617235 59027366 64580232
9139 64580232 67894124 67454269 64801460 62475645 61386306 62028221 64272758 68161889
9131 68161889 72386717 74744464 73630840 70704021 66931286 62124201 57597603 54401779
9123 54401779 52202310 51477945 51928796 53181522 54647151 54838141 53780478 51965744 50363448
9114 50363448 48816254 47732313 47762203 48372082 49409254 50776631 52690481 54580591 55758730
$$ packed form
9173D0302912R30179K359147L398575L351358J809419p63440j962280k334909
9165D7090961k793089k993462k362154j490978p54925L44521M94479O62760L45025
9156C8543138j023194j243352j057858p60620k01386K98819P05075Q91728J226675
9147C7379025J761871J809257K330283K696985L496692M143122N410131N552866
9139F4580232L313892m39855k652809k325815j089339O41915K244537L889131
9131F8161889M224828K357747j113624k926819l772735m807085m526598l195824
9123E4401779k199469p24365M50851J252726J465629J90990j057663j814734j602296
9114E0363448j547194j083941K9890O09879J037172J367377J913850J890110J178139
$$ plain form
9105 55758730 56917686 58787940 61100885 64262850 68165894 72381972 77382694 82169758
9097 82169758 84468665 84942550 85938442 88571260 92181785 95114730 96199208 97340112
9089 97340112 99563954 101564950 101678351 101693023 102513522 102527339 100216176 97712367 97438314
9080 97438314 99846997 105762605 115274478 127703279 143042239 159562607 171647899 174358745
9072 174358745 171464343 169250182 165509296 155198420 137503906 119486234 104545489
9065 104545489 92362667 83042546 75802297 69816390 64361560 58872175 53725860 49616025
9057 49616025 46075464 43421870 41530784 40314857 39625362 38798024 37770073 36468417
9049 36468417 35009594 33681041 32308170 30794050 28914883 27288262 26115547 25166279
$$ packed form
9105E5758730J158956J870254K312945L161965L903044M216078N000722M787064
9097H2169758K298907M73885R95892K632818L610525K932945J084478J140904
9089I7340112K223842K000996J13401J4672Q20499J3817k311163k503809k74053
9080I7438314K408683N915608R511873J2428801J5338960J6520368J2085292K710846
9072A74358745k894402k214161l740886j0310876j7694514j8017672j4940745
9065A04545489j2182822r320121p240249n985907n454830n489385n146315m109835
9057D9616025l540561k653594j891086j215927o89495q27338j027951j301656
9049C6468417j458823j328553j372871j514120j879167j626621j172715r49268
$$ plain form
9041 25166279 24553775 24386173 24075526 24004058 24227717 24226269 24061423 23950825 23763440 23189262
9031 23189262 22672386 22476787 22340115 22200558 22184719 22201306 21994173 21573886 21018160 20043639
9021 20043639 19106079 18413171 18195281 17989198 17918537 17724327 17535680 17434463 17110059 17051738
9011 17051738 17436931 17959523 18165264 18601468 18745220 18694508 18486209 18072871 17751442 17428214
9001 17428214 17238829 17171310 17054940 17098631 17143394 17452112 17922953 18264062 18685670 19108302
8991 19108302 19482765 20188380 21118234 22106462 23199566 24133640 24886793 25280874 25253997
8982 25253997 24989681 24559547 24200076 24157878 24304470 24693934 25052506 25754692 26463019 27183461
8972 27183461 27949694 28978507 30294392 31884818 33645507 35933725 38714154 42030137
$$ packed form
9041B5166279o12504j67602l10647p1468K23659j448j64846j10598j87385n74178
9031B3189262n16876j95599j36672j39557j5839J6587k07133m20287n55726r74521
9021B0043639r37560o92908k17890k06083p0661j94210j88647j01217l24404n8321
9011A7051738L85193N22592K05741M36204J43752n0712k08299m13338l21429l23228
9001A7428214j89385o7519j16370M3691M4763L08718M70841L41109M21608M22632
8991A9108302L74463P05615R29854R88228J093104R34074P53153L94081k6877
8982B5253997k64316m30134l59471m2198J46592L89464L58572P02186P08327P20442
8972B7183461P66233J028813J315885J590426J760689K288218K780429L315983
$$ plain form
8964 42030137 45981375 51158123 56536362 60426910 61260375 59113462 56408572 54568883
8956 54568883 54755356 56626597 60028803 64218848 67753710 69893687 70632581 70791352 69806261
8947 69806261 68254618 65874325 62308144 59029724 56824332 55970379 56385939 58233395
8939 58233395 61430565 65349423 68346809 70274221 73140244 77999839 85037870 94109707
8931 94109707 103568270 111085603 116682705 121305667 124242449 125242433 121612367 111719341
8923 111719341 99576884 87296420 76552605 69040622 64061067 61020329 59062564 58375473
8915 58375473 58836613 60435004 62283602 63685496 64242328 62624664 58167574 53658526
8907 53658526 50327824 48053052 47307837 47664544 48226772 47301940 45272114 43669767 42834814
$$ packed form
8964D2030137L951238N176748N378239L890548Q33465k146913k704890j839689
8956E4568883J86473J871241L402206M190045L534862K139977P38894J58771r85091
8947F9806261j551643k380293l566181l278420k205392q53953M15560J847456
8939E8233395L197170L918858K997386J927412K866023M859595P038031R071837
8931I4109707R458563P517333N597102M622962K936782R99984l630066r893026
8923A11719341j2142457j2280464j0743815p511983m979555l040738j957765o87091
8915E8375473M61140J598391J848598J401894N56832j617664m457090m509048
8907E3658526l330702k274772p45215L56707N62228r24832k029826j602347q34953
$$ plain form
8898 42834814 42779600 43597164 45137429 47434754 51163015 56296494 62051797 66370202 68449335
8889 68449335 68022915 63485499 55520967 46857654 39216284 33006095 28660719 25436571
8881 25436571 22875849 20694638 19065666 17778215 16736626 15641691 14807772 14135985
8873 14135985 13678129 13064384 12429073 12098071 11842100 11545960 11273437 11246103 10929366 10440230
8863 10440230 9985533 9503719 8973421 8402509 8319884 8257336 7788765 7692293 7678606 7578124
8853 7578124 7744176 7840489 8136490 8511053 8512391 8264983 7860453 7576994 6948884 6514332
8843 6514332 6229381 5877313 5669149 5250762 5091651 5108227 4974867 4826423 4957954 4886068
8833 4886068 4604051 4423783 4257472 4373988 4474064 4491761 4312541 4492201 4667873 4920409
$$ packed form
8898D2834814n5214Q17564J540265K297325L728261N133479N755303M318405K079133
8889F8449335m26420m537416p964532q663313p641370o210189m345376l224148
8881B5436571k560722k181211j628972j287451j041589j094935q33919o71787
8873A4135985m57856o13745o35311l31002k55971k96140k72523k7334l16737m89136
8863A0440230m54697m81814n30298n70912q2625o2548m68571r6472j3687j00482
8853G578124J66052R6313K96001L74563J338k47408m04530k83459o28110m34552
8843F514332k84951l52068k08164m18387j59111J6576j33360j48444J31531p1886
8833D886068k82017j80268j66311J16516J00076J7697j79220J79660J75672K52536
$$ plain form
8823 4920409 4868385 4967478 5133265 5135804 5499294 5948870 6394951 7022374 7643462 7892031
8813 7892031 7841108 7771650 7447744 6596826 5778425 5169318 4552100 4138314 3994899 3684092
8803 3684092 3424158 3238416 2988501 2897049 2903471 2797901 2492832 2709755 2712490 2690403 2794718
8792 2794718 2840419 2557850 2368680 2619659 2451167 2366025 2465604 2393649 2593217 2792951
8782 2792951 2744934 3037891 3178939 3428677 3456429 3415503 3305097 3134973 2906640 2533486
8772 2533486 2278162 2088133 2022711 1770343 1616166 1718295 1661829 1568085 1326050 1328649
8762 1328649 1544805 1620968 1398889 1456617 1549495 1434739 1515652 1536468 1393340 1197561
8752 1197561 1224123 1453666 1273446 1249832 880195 868224 1006445 906228 873399 875873 938057
$$ packed form
8823D920409n2024R9093J65787K539L63490M49576M46081O27423O21088K48569
8813G892031n0923o9458l23906q50918q18401o09107o17218m13786j43415l10807
8803C684092k59934j85742k49915r1452O422j05570l05069K16923K735k2087J04315
8792B794718M5701k82569j89170K50979j68492q5142R9579p1955J99568J99734
8782B792951m8017K92957J41048K49738K7752m0926j10406j70124k28333l73154
8772B533486k55324j90029o5422k52368j54177J02129n6466r3744k42035K599
8762A328649K16156P6163k22079N7728R2878j14756Q0913K0816j43128j95779
8752A197561K6562K29543j80220k3614l69637j1971J38221j00217l2829K474O2184
$$ plain form
8741 938057 998831 988235 1125988 1094770 859363 1015253 880715 986939 681660 690244 930012
8730 930012 841277 898783 913113 1014659 1359791 1255744 991475 1100009 1092031 825671 1011227
8719 1011227 1060150 831646 679797 703781 636367 726946 514617 304267 491773 667400
8709 667400 709686 504089 702933 682699 518850 429572 500707 694909 693975 429543 539924
8698 539924 726927 607173 495142 652537 792965 766603 799284 666243 697730 763914
8688 763914 748546 667092 567646 675991 676039 418773 302491 292437 461917 676851 560709
8677 560709 619680 417573 382073 382725 426136 194345 235624 459698 423083 312840 240852
8666 240852 327784 279793 337582 314345 190434 305790 146538 182974 29696 181546 172750
$$ packed form
8741I38057O0774j0596J37753l1218k35407J55890j34538J06224l05279Q584K39768
8730I30012q8735N7506J4330J01546L45132j04047k64269J08534p978k66360J85556
8719A011227M8923k28504j51849K3984o7414R0579k12329k10350J87506J75627
8709F67400M2286k05597J98844k0234j63849q9278P1135J94202r34k64432J10381
8698E39924J87003j19754j12031J57395J40428k6362L2681j33041L1487O6184
8688G63914j5368q1454r9446J08345M8k57266j16282j0054J69480K14934j16142
8677E60709N8971k02107l5500O52M3411k31791M1279K24074l6615j10243p1988
8666B40852Q6932m7991N7789k3237j23911J15356j59252L6436j53278J51850q796
$$ plain form
8655 172750 176746 296356 74090 -86063 49599 33288 -57288 209931 173681 227039 181648
8644 181648 149421 -22758 128074 265637 416555 476624 376125 236926 282689 160043
8634 160043 323981 627101 686184 401351 466654 385901 414627 353468 276702 348127 383838
8623 383838 406920 255514 143395 108172 113166 -84884 79229 94682 -45397 88838 357573
8612 357573 314085 125303 89606 180241 295715 249617 219961 91777 106832 134728 115007
8601 115007 113468 -2919 94820 231459 449008 428231 297331 425191 129341 213955 15941
8590 15941 15511 234917 363986 321810 126245 -52504 -10060 242361 174474 389346 502187
8579 502187 463332 501260 259712 363146 378088 289166 441058 333601 432189 396256 168198
$$ packed form
8655A72750L996J19610k22266j60153J35662j6311r0576K67219l6250N3358m5391
8644A81648l2227j72179J50832J37563J50918O0069j00499j39199M5763j22646
8634A60043J63938L03120N9083k84833O5303q0753K8726o1159p6766P1425L5711
8623C83838K3082j51406j12119l5223M994j98050J64113J5453j40079J34235K68735
8612C57573m3488j88782l5697R0635J15474m6098k9656j28184J5055K7896j9721
8601A15007j539j16387R7739J36639K17549k0777j30900J27860k95850Q4614j98014
8590A5941m30K19406J29069m2176j95565j78749M2444K52421o7887K14872J12841
8579E02187l8855L7928k41548J03434J4942q8922J51892j07457R8588l5933k28058
$$ plain form
8568 168198 116677 202458 100838 348340 443612 565211 420812 516493 565896 355895 403041
8557 403041 361683 540526 415015 267222 366558 138677 187915 280681 294467 171016 143262
8546 143262 217357 393863 413420 41452 42165 136902 213701 242782 108850 96030 67962
8535 67962 114789 239821 192465 318602 424480 324428 203828 92505 223132 273129
8525 273129 322066 476229 378934 283086 375956 262536 199120 -85264 -57846 -24930 -306627
8514 -306627 -239732 -65509 -57268 -187182 -196417 57095 230938 21159 19075 61924 -106985
8503 -106985 -34502 20543 -81770 -199237 -212670 11359 41903 -289396 -141381 85537
8493 85537 97916 202405 24737 -7386 -11887 17041 -54819 39555 365272 457242 232090
$$ packed form
8568A68198n1521Q5781j01620K47502R5272J21599j44399R5681M9403k10001M7146
8557D03041m1358J78843j25511j47793R9336k27881M9238R2766J3786j23451k7754
8546A43262P4095J76506J9557l71968P13R4737P6799K9081j33932j2820k8068
8535F7962M6827J25032m7356J26137J05878j00052j20600j11323J30627M9997
8525B73129M8937J54163r7295r5848R2870j13420o3416k84384K7418L2916k81697
8514c06627O6895J74223Q241j29914r235K53512J73843k09779k084M2849j68909
8503a06985P2483N5045j02313j17467j3433K24029L0544l31299J48015K26918
8493H5537J2379J04489j77668l2123m501K8928p1860R4374L25717R1970k25152
$$ plain form
8482 232090 280023 139304 -26036 62694 45127 79040 -41845 -103088 -87941 -92085 109521
8471 109521 241891 275057 65608 19091 -60760 42596 -56841 17138 168653 -124669 -185647
8460 -185647 -46899 133340 -36217 58018 25081 90753 -207147 -193195 -99867 -186304 -339972
8449 -339972 -184457 -209487 -64092 102068 -93509 103059 14813 -112546 -147149 -206732
8439 -206732 -144106 -231867 -312480 -280685 -363454 -285771 -197947 -142536 -138389 3225 -133404
8428 -133404 -151432 -161782 -224876 -98314 -13817 -29016 -26726 -151905 -64594 -263410 -281030
8417 -281030 -299459 -470981 -372354 -390193 -334031 -277792 -83689 -44505 -102636 -52240 -195871
8406 -195871 -305830 -41382 -11797 -137687 -121222 -181912 -150593 -160433 -127713 -134789 -154839
$$ packed form
8482B32090M7933j40719j65340Q8730j7567L3913j20885o1243J5147m144K01606
8471A09521J32370L3166k09449m6517p9851J03356r9437P3979J51515k93322o0978
8460a85647J38748J80239j69557R4235l2937O5672k97900J3952R3328q6437j53668
8449c39972J55515k5030J45395J66160j95577J96568q8246j27359l4603n9583
8439b06732O2626q7761q0613L1795q2769P7683Q7824N5411M147J41614j36629
8428a33404j8028j0350o3094J26562Q4497j5199K290j25179Q7311j98816j7620
8417b81030j8429j71522R8627j7839N6162N6239J94103L9184n8131N0396j43631
8406a95871j09959K64448K9585j25890J6465o0690L1319r840L2720p076k0050
$$ plain form
8395 -154839 -374502 -281078 -429380 -379244 -171909 -66194 -121430 -68652 -141934 -237879 -304612
8384 -304612 -346834 -45438 -110374 -288340 -260575 -118766 -207114 -299872 -183321 -81337 -105582
8373 -105582 -161887 -85079 -33281 -198891 -16658 52706 52233 25084 108344 83497 -75645
8362 -75645 -192803 -96378 39206 52830 -151070 -269413 -252744 -157289 -45735 -42807 -49723
8351 -49723 -89842 -202102 -148623 -78641 -82311 -361474 -319446 -91666 -151936 -35672 26942
8340 26942 -172305 -143772 7476 70910 -75181 -233997 -108470 -110493 -47763 -133389 86182
8329 86182 69373 -154209 4820 -141801 -59469 -4673 -74562 -87571 -286389 -201758 -53079
8318 -53079 83042 -8606 -48523 -108680 -88154 54210 -94186 -72848 22078 -14779 50163
$$ packed form
8395a54839k19663R3424j48302N0136K07335J05715n5236N2778p3282r5945o6733
8384c04612m2222L01396o4936j77966K7765J41809q8348r2758J16551J01984k4245
8373a05582n6305P6808N1798j65610J82233O9364m73k7149Q3260k4847j59142
8362g5645j17158R6425J35584J3624k03900j18343J6669R5455J11554K928o916
8351d9723m0119j12260N3479O9982l670k79163M2028K27780o0270J16264O2614
8340B6942j99247K8533J51248O3434j46091j58816J25527k023O2730q5626K19571
8329H6182j6809k23582J59029j46621Q2332N4796o9889j3009j98818Q4631J48679
8318e3079J36121r1648l9917o0157K0526J42364j48396K1338R4926l6857O4942
$$ plain form
8307 50163 21907 -71782 -87452 -214429 -124437 -64928 -109001 26697 -114852 -146736 -238632
8296 -238632 -355618 -261861 -375167 -330156 -253810 -179442 -70969 -180493 -326231 -257358 -144703
8285 -144703 -78720 -184519 -178045 -17493 -14504 -148811 -67941 -142967 -201312 -166536 -222082
8274 -222082 -207263 -412973 -193496 65691 -195270 13648 29037 19685 89087 -125123 -149671
8263 -149671 -400492 -391913 -140446 -128968 -145639 -191459 -236932 -374033 -326741 -329906 -325761 -210847
8251 -210847 -100043 -111320 -150410 -141109 -228460 -264704 -220817 -138749 -9308 -203236 -407192
8240 -407192 -290673 -177687 -98534 -303459 -476764 -246522 -115435 -109315 -126110 -460766
8230 -460766 -406030 -388121 -386871 -318177 -240814 -225696 -135813 -212034 -218533 -235380 -387980 -420536
$$ packed form
8307E0163k8256r3689j5670j26977Q9992N9509m4073J35698j41549l1884r1896
8296b38632j16986R3757j13306M5011P6346P4368J08473j09524j45738O8873J12655
8285a44703O5983j05799O474J60552K989j34307Q0870p5026n8345L4776n5546
8274b22082J4819k05710K19477K59187k60961K08918J5389r352O9402k14210k4548
8263a49671k50821Q579K51467J1478j6671m5820m5473j37101M7292l165M145J14914
8251b10847J10804j1277l9090R301q7351l6244M3887Q2068J29441j93928k03956
8240d07192J16519J12986P9153k04925j73305K30242J31087O120j6795l34656
8230d60766N4736J7909J250O8694P7363J5118Q9883p6221o499j6847j52600l2556
$$ plain form
8218 -420536 -407883 -588569 -424305 -320230 -237931 -78698 -332092 -596738 -648187 -529918
8208 -529918 -313903 -237072 -311153 -251610 -399047 -360169 -330706 -413991 -374987 -510961 -365209
8197 -365209 -411157 -733805 -654478 -723454 -1394966 -855551 490372 320073 30624 -83823
8187 -83823 -9201 -26367 -114169 -97311 -82858 -156762 -168852 -284935 -101148 -137580 -241360
8176 -241360 -53289 -161552 -209797 -204816 -59128 20958 19560 41079 -145655 -145631 4943 -148894
8164 -148894 -127426 -124372 80691 114281 -193043 -280086 -108217 -61875 -61394 -16317 75304 -27832
8152 -27832 2404 10334 -190836 -33643 -30253 -241760 -231526 -123938 -48271 -63370 -91984
8141 -91984 51923 16257 -27618 -78695 -279564 -177577 -159164 -13918 -65399 -202372 -138912
$$ packed form
8218d20536J2653j80686J64264J04075Q2299J59233k53394k64646n1449J18269
8208e29918K16015P6831p4081N9543j47437L8878K9463q3285L9004j35974J45752
8197c65209m5948l22648P9327o8976o71512N39415J345923j70299k89449j14447
8187h3823P4622j7166q7802J6858J4453p3904j2090j16083J83787l6432j03780
8176b41360J88071j08263m8245M981J45688Q0086j398K1519j86734K4J50574j53837
8164a48894K1468L054K05063L3590l07324q7043J71869M6342M81M5077R1621j03136
8152b7832L0236P930k01170J57193L390k11507J0234J07588P5667j5099k8614
8141i1984J43907l5666m3875n1077k00869J01987J8413J45246n1481j36973O3460
$$ plain form
8130 -138912 -113989 -178404 -188034 -157401 -74262 -103650 -143684 -235851 -221728 -168174 -211487 -73457
8118 -73457 15754 -38928 38242 -29156 -129830 -37742 -201710 -252972 -197342 -296191 -256761
8107 -256761 72748 -99586 -108446 -216085 -215180 -132565 -213978 -111785 -185191 -150401 -210284
8096 -210284 -94244 -197286 -203250 -58102 -176672 -30067 -14784 -8093 -215379 -261567 -426124
8085 -426124 -492352 -195732 -83654 -169863 -289015 -388950 -398687 -416283 -299978 -374194 -423244
8074 -423244 -174012 -202025 -272484 -372794 -313001 -405802 -361765 -81876 -272959 -340292 -199079
8063 -199079 -163628 -116847 -171359 -373428 -380572 -336354 -375977 -257849 -218654 -79501 -94356
8052 -94356 -219854 -171379 -134892 -56958 -151155 85531 51882 25399 61116 -27795 -23018 -14782
$$ packed form
8130a38912K4923o4415r630L0633Q3139k9388m0034r2167J4123N3554m3313J38030
8118g3457Q9211n4682P7170o7398j00674R2088j63968n1262N5630r8849L9430
8107b56761L29509j72334q860j07639R05Q2615q1413J02193p3406L4790n9883
8096b10284J16040j03042n964J45148j18570J46605J5283O691k07286m6188j64557
8085d26124o6228K96620J12078q6209j19152r9935r737j7596J16305p4216m9050
8074d23244K49232k8013p0459j00310N9793r2801M4037K79889j91083o7333J41213
8063a99079L5451M6781n4512k02069p144M4218l9623J18128L9195J39153j4855
8052i4356j25498M8475L6487P7934r4197K36686l3649k6483L5717q8911M777Q236
$$ plain form
8040 -14782 -107083 -179901 -25590 -244120 -408582 -211453 78993 -160793 -232990 -176835 -296604
8029 -296604 -344888 -283716 -265152 -290304 -89749 -126711 -201694 -134730 -352386 -219050 -250590
8018 -250590 -272189 -231563 -126589 -196264 -201912 -55209 -214177 -310060 -202365 -207616 -275391
8007 -275391 -271145 -97151 -9090 -97515 -160068 -323157 -271022 -91846 75584 41916 23774
7996 23774 148347 43268 1134 -16845 -75663 -114170 -338438 -277630 -250481 -285674 -333742
7985 -333742 -171582 -151825 -10167 9075 -40922 -265192 -234052 -348840 -206844 117915
7975 117915 -124127 -33110 -92065 -118452 -405802 -183070 -231691 -378347 -479715 -323865
7965 -323865 93144 -47390 -217504 -313130 -195422 -210750 -154446 -345563 -432653 -318679
$$ packed form
8040a4782r2301p2818J54311k18530j64462J97129K90446k39786p2197N6155j19769
8029b96604m8284O1172J8564k5152K00555l6962p4983O6964k17656J33336l1540
8018b50590k1599M0626J04974o9675n648J46703j58968r5883J07695n251o7775
8007b75391M246J73994Q8061q8425o2553j63089N2135J79176J67430l3668j8142
7996B3774J24573j05079m2134j7979n8818l8507k24268O0808K7149l5193m8068
7985c33742J62160J9757J41658J9242m9997k24270L1140j14788J41996L24759
7975A17915k42042R1017n8955k6387k87350K22732m8621j46656j01368J55850
7965c23865M17009j40534j70114r5626J17708j5328N6304j91117q7090J13974
$$ plain form
7955 -318679 -315988 -287373 -132459 -251165 -149934 -189933 -220822 -97618 -95796 -145234 -187912
7944 -187912 -13484 -207514 -358501 -323602 -168070 -188034 -134498 -94787 -157045 -219876 -124240
7933 -124240 -128991 -59309 -130493 -206138 -54860 -216686 -190943 -64441 -109507 -266446 -77866
7922 -77866 -188269 -182907 -35262 -174183 -43730 -63262 -159479 -122627 -118431 -190814 -183699 -256824
7910 -256824 -375994 -287803 -230157 -298670 -538646 -329178 -122035 -148799 -323329 -360526 -145253
7899 -145253 -163367 -104631 -97747 -1899 -83830 -351934 -511621 -324915 -294984 -24002 1876
7888 1876 -257807 -118427 -97688 -138917 -206260 -185495 -150451 -24911 -58392 -108677 -144683
7877 -144683 -391323 -263400 -224040 -291190 -280580 -217512 -310286 -442380 -494790 -334736 -249690
$$ packed form
7955c18679K691K8615J54914j18706J01231l9999l0889J23204J822m9438m2678
7944a87912J74428j94030j50987L4899J55532j9964N3536L9711o2258o2831R5636
7933a24240m751O9682p1184p5645J51278j61826K5743J26502m5066j56939J88580
7922g7866j10403N362J47645j38921J30453j9532r6217L6852M196p2383P115p3125
7910b56824j19170Q8191N7646o8513k39976K09468K07143k6764j74530l7197K15273
7899a45253j8114N8736O884R5848q1931k68104j59687J86706K9931K70982K5878
7888A876k59683J39380K0739m1229o7343K0765L5044J25540l3481n0285l6006
7877a44683k46640J27923L9360o7150J0610O3068r2774j32094n2410J60054Q5046
$$ plain form
7866 -249690 -106763 -136151 -208029 -328125 -417320 -236580 -103330 -277357 -182433 -126978 -49366
7855 -49366 121278 -195004 -178976 127239 237371 -101991 -287287 -144819 27282 95086
7845 95086 40846 -157247 -305516 -319248 -230169 -301710 -44606 -122812 -245496 -220994 -310793
7834 -310793 -441258 -144599 18987 -180356 -71432 -46540 -124907 -33146 -62488 -287739
7824 -287739 -267662 -320481 -238020 -33813 105442 102545 -55379 -102548 -188081 -222653 -216823
7813 -216823 -224777 -206186 -93112 -112573 5783 8432 -3643 -164788 -343862 -365211 -193665
7802 -193665 -155183 -408673 -418006 -293129 -483591 -225970 44183 -127354 -146562 -174850 -160653
7791 -160653 -179898 -101879 -95850 -52452 -40931 -195757 -178412 7538 -93609 -79499 -133686
$$ packed form
7866b49690J42927k9388p1878j20096q9195J80740J33250j74027R4924N5455P7612
7855d9366J70644l16282J6028L06215J10132l39362j85296J42468J72101O7804
7845I5086n4240j98093j48269j3732Q9079p1541K57104p8206j22684K4502q9799
7834c10793j30465K96659J63586j99343J08924K4892p8367R1761k9342k25251
7824b87739K0077n2819Q2461K04207J39255k897j57924m7169q5533l4572N830
7813b16823p954J8591J13074j9461J18356K649j2075j61145j79074k1349J71546
7802a93665L8482k53490r333J24877j90462K57621K70153j71537j9208k8288J4197
7791a60653j9245P8019O029M3398J1521j54826J7345J85950j01147J4110n4187
$$ plain form
7780 -133686 -279757 -165850 -22264 -165630 -365720 -305121 -212581 -237864 -189819 4986
7770 4986 -62195 -110087 70342 169270 -66934 -75307 43437 -79253 -180957 -113132 -66166
7759 -66166 -173089 -125983 -332659 -363752 -274946 -176185 -78458 -24356 42986 4982 -126617
7748 -126617 11605 -2169 26964 -27158 -201960 -33493 -9682 55787 -5310 -3269 6145
7737 6145 23778 102687 -121435 -76913 -179663 -404669 -467593 -284075 -237371 -355492 -195852
7726 -195852 -29813 -213501 -99652 -103018 -62587 -116191 -98925 -82639 -83617 -10925 13587 73436
7714 73436 148548 156863 -104192 -182460 -161878 -84767 -236304 -293535 -146385 -152198 -190396 -221021
7702 -221021 -284990 -160384 -75316 -47202 -167202 -37730 -32357 -172055 -28167 128243 14734
$$ packed form
7780a33686j46071J13907J43586j43366k00090O0599R2540k5283M8045J94805
7770D986o7181m7892J80429R8928k36204q373J18744j22690j01704O7825M6966
7759f6166j06923M7106k06676l1093Q8806R8761R7727N4102O7342l8004j31599
7748a26617J38222j3774K9133n4122j74802J68467K3811O5469o1097K041R414
7737F145J7633P8909k24122M4522j02750k25006o2924J83518M6704j18121J59640
7726a95852J66039j83688J13849l366M0431n3604J7266J6286r78P2692K4512N9849
7714G3436P5112Q315k61055p8268K0582P7111j51537n7231J47150n813l8198l0625
7702b21021o3969J24606Q5068K8114j20000J29472N373j39698J43888J56410j13509
$$ plain form
7691 14734 25530 60764 19056 -32530 -90143 20463 99899 -370944 -403468 -299193 -266644
7680 -266644 -173725 -96226 -173524 -187919 -110205 -105976 -117683 -16148 -73734 -124662 8657
7669 8657 -205543 -177796 -48623 -43570 -360494 -183916 -143020 -154848 45644 119931 56684
7658 56684 29887 119835 139297 164479 53422 83041 221840 128086 -203262 -182634 5921
7647 5921 81494 117412 42828 132046 208536 98075 -15024 142971 73820 5273 -61507
7636 -61507 32530 59037 -17567 187636 -30617 -31328 35806 -85511 -46875 302850 63828
7625 63828 -164992 -195852 -275255 -31506 361312 52730 -43559 -101436 -167064 -144553 -231789
7614 -231789 186330 -55796 -184809 163281 116961 157670 211277 220409 120660 -1170 168217
$$ packed form
7691A4734J0796L5234m1708n1586n7613J10606P9436m70843l2524J04275L2549
7680b66644R2919P7499p7298j4395P7714M229j1707J01535n7586n0928J33319
7669H657k14200K7747J29173N053l16924J76578M0896j1828K00492P4287o3247
7658E6684k6797Q9948J9462K5182j11057K9619J38799r3754l31348K0628J88555
7647E921P5573L5918p4584Q9218P6490j10461j13099J57995o9151o8547o6780
7636f1507R4037K6507p6604K05203k18253p11O7134j21317L8636L49725k39022
7625F3828k28820l0860p9403K43749L92818l08582r6289n7877o5628K2511q7236
7614b31789M18119k42126j29013L48090m6320M0709N3607R132r9749j21830J69387
$$ plain form
7603 168217 157592 130357 -172505 -42254 6760 -234753 -157616 74565 91567 -34368 -114551
7592 -114551 3759 19276 -570 -101989 -83872 31512 9444 62304 -74338 -57743 87444
7581 87444 -8315 176173 305708 50610 24326 -79851 112247 287213 362224 325871 136940
7570 136940 210623 260499 216314 339590 329159 204402 211048 338808 342063 207414 385854
7559 385854 390074 196035 108053 315090 530794 893850 913951 907959 1174680 1303797 1750114
7548 1750114 2094680 2182055 1929939 1569805 1141301 775532 858540 583953 459324 447618
7538 447618 368727 481262 495469 406512 242761 196130 159002 76489 17958 -180227 -328967
7527 -328967 57510 149071 107633 204109 272214 260650 282809 197330 -8824 -89355 42383
$$ packed form
7603A68217j0625k7235l02862J30251M9014k41513P7137K32181J7002j25935q0183
7592a14551J18310J5517j9846j01419J8117J15384k2068N2860j36642J6595J45187
7581H7444r5759J84488J29535k55098k6284j04177J92098J74966P5011l6353j88931
7570A36940P3683M9876m4185J23276j0431j24757O646J27760L255j34649J78440
7559C85854M220j94039q7982K07037K15704L63056K0101n992K66721J29117M46317
7548A750114L44566Q7375k52116l60134m28504l65769Q3008k74587j24629j1706
7538D47618p8891J12535J4207q8957j63751m6631l7128q2513n8531j98185j48740
7527c28967L86477R1561m1438R6476O8105j1564K2159q5479k06154q0531J31738
$$ plain form
7516 42383 252699 160718 90031 77105 -11164 -87282 -81415 141449 250038 171961 243962
7505 243962 204983 252283 427498 251420 207685 72459 256689 279066 192871 70692 -233108
7494 -233108 -152400 -82937 180154 207031 32221 -64838 -100830 -276496 -120694 -16671 -36763
7483 -36763 191606 220451 29275 -73914 -43984 228286 290749 60728 73005 125851 143546
7472 143546 503268 198012 83008 29388 35873 249536 215532 255857 192298 272439 235127
7461 235127 324968 263346 235172 367648 389873 362793 591138 495822 337931 60078 206319
7450 206319 143700 77540 -37550 105650 225752 22462 59070 292926 215183 169132 289101
7439 289101 291265 145278 160932 260484 114974 99915 119677 209821 87615 30740 141549
$$ packed form
7516D2383K10316r1981p0687j2926q8269p6118N867K22864J08589p8077P2001
7505B43962l8979M7300J75215j76078m3735j35226J84230K2377q6195j22179l03800
7494b33108Q0708O9463K63091K6877j74810r7059l5992j75666J55802J04023k0092
7483c6763K28369K8845j91176j03189K9930K72270O2463k30021J2277N2846J7695
7472A43546L59722l05256j15004n3620O485K13663l4004M0325o3559Q0141l7312
7461B35127Q9841o1622k8174J32476K2225k7080K28345r5316j57891k77853J46241
7450B06319o2619o6160j15090J43200J20102k03290L6608K33856p7743m6051J19969
7439B89101K164j45987J5654R9552j45510j5059J9762R0144j22206n6875J10809
$$ plain form
7428 141549 188542 251306 392326 219005 110807 214095 286211 258637 400273 376190 467212
7417 467212 187277 199395 454597 455102 264147 394103 427923 306713 140765 317894 578824
7406 578824 584563 463775 143575 191587 342306 260777 261392 335414 202923 299729 447250
7395 447250 400519 427579 415810 411642 397692 420073 466684 239163 383663 580797 511697
7384 511697 480568 485774 536672 617827 534882 656453 866339 640993 431894 365632 434983
7373 434983 537102 704849 715571 637894 444404 479347 638504 645341 672360 799721 789692
7362 789692 547371 429541 644342 689778 837518 894939 775709 741862 629182 696282
7352 696282 763750 766438 796379 857490 753956 750228 767882 927306 1183138 1090509 813258
$$ packed form
7428A41549M6993O2764J41020j73321j08198J03288P2116k7574J41636k4083R1022
7417D67212k79935J2118K55202N05j90955J29956L3820j21210j65948J77129K60930
7406E78824N739j20788l20200M8012J50719q1529O15P4022j32491R6806J47521
7395D47250m6731K7060j1769m168j3950K2381M6611k27521J44500J97134o9100
7384E11697l1129N206N0898Q1155q2945J21571K09886k25346k09099o6262O9351
7373D34983J02119J67747J0722p7677j93490L4943J59157O837K7019J27361j0029
7362G89692k42321j17830K14801M5436J47740N7421j19230l3847j12680O7100
7352F96282O7468K688K9941O1111j03534l728J7654J59424K55832r2629k77251
$$ plain form
7341 813258 964368 940759 895316 1035789 1078364 1163068 986627 894188 1049918 997654 1011788
7330 1011788 1116707 1186236 1198973 1299518 1315379 1448857 1234515 1446681 1421371 1238883
7320 1238883 1159086 1053625 1088954 1241961 1313707 1157982 1421001 1517014 1471122 1682834
7310 1682834 1579496 1616914 1642723 1532101 1436848 1347241 1433951 1587384 1508342 1430163 1498216
7299 1498216 1452473 1292285 1304981 1472570 1669050 1535559 1575458 1750833 1674870 1626854
7289 1626854 1631838 1768181 1725316 1784821 1676265 1890065 2085732 2196033 2103544 2201250 2044076
7278 2044076 2155898 2161531 2066270 2303095 2447240 2577023 2532606 2393501 2257980 2387059
7268 2387059 2578570 2593136 2380679 2296005 2525632 2655204 3019618 3127043 2956682 3000067
$$ packed form
7341H13258J51110k3609m5443J40473M2575Q4704j76441r2439J55730n2264J4134
7330A011788J04919O9529J2737J00545J5861J33478k14342K12166k5310j82488
7320A238883p9797j05461L5329J53007P1746j55725K63019R6013m5892K11712
7310A682834j03338L7418K5809j10622r5253q9607Q6710J53433p9042p8179O8053
7299A498216m5743j60188J2696J67589J96480j33491L9899J75375p5963m8016
7289A626854M984J36343m2865N9505j08556K13800J95667J10301r2489R7706j57174
7278B044076J11822N633r5261K36825J44145J29783m4417j39105j35521J29079
7268B387059J91511J4566k12457q4674K29627J29572L64414J07425j70361M3385
$$ plain form
7258 3000067 3086706 3229832 3085787 3265839 3461790 3287075 3294834 3353064 3527144 3763425
7248 3763425 3750279 3821256 4008636 4135678 4344767 4675584 4824517 4855686 4982862 5194584
7238 5194584 5316131 5385431 5290419 5534857 5697517 5798726 5858114 5908764 6079036 6260353
7228 6260353 6559258 6494680 6464310 6736010 6995260 7169480 7281930 7503338 7626182 7876794
7218 7876794 8208299 8389567 8745619 8898227 9214375 9335022 9394523 9559121 9937659 10177973
7208 10177973 10015685 10162929 10469708 10911513 11184360 11446828 11860767 12395025 12773160
7199 12773160 13003826 13695536 14204185 14661670 15179405 15777808 16276259 16774702 17801314
7190 17801314 18814667 19505484 20149253 20793485 21624680 22313545 22974203 23612382 24491106
$$ packed form
7258C000067Q6639J43126j44045J80052J95951j74715P759N8230J74080K36281
7248C763425j3146P0977J87380J27042K09089L30817J48933L1169J27176K11722
7238E194584J21547O9300r5012K44438J62660J01209N9388N0650J70272J81317
7228F260353K98905o4578l0370K71700K59250J74220J12450K21408J22844K50612
7218G876794L31505J81268L56052J52608L16148J20647N9501J64598L78538K40314
7208A0177973j62288J47244L06779M41805K72847K62468M13939N34258L78135
7199A2773160K30666O91710N08649M57485N17735N98403M98451M98443J026612
7190A7801314J013353O90817O43769O44232Q31195O88865O60658O38179Q78724
$$ plain form
7181 24491106 24981929 25736269 26506371 27104937 27608010 28428262 29263590 30246202 31174259
7172 31174259 32170394 33243583 34289333 35438761 36560040 38106032 39631120 41549429
7164 41549429 43787047 46288364 49250878 52943542 57441981 62697865 69548345 77853783
7156 77853783 88531327 101870870 118768839 141023422 172235053 214793689 270552023
7149 270552023 338767385 393961317 390501659 329787176 262165183 201953632 154092948
7142 154092948 122581661 101297833 86556464 75282412 66868241 59873415 53837296
7135 53837296 48613088 44288671 40840411 38204327 35877991 33856098 31972732 29940907
7127 29940907 27757415 26034698 24682988 23138396 21661256 20493705 19611836 18926018
$$ packed form
7181B4491106M90823P54340P70102N98566N03073Q20252Q35328R82612R28057
7172C1174259R96135J073189J045750J149428J121279J545992J525088J918309
7164D1549429K237618K501317K962514L692664M498439N255884O850480Q305438
7156G7853783J0677544J3339543J6897969K2254583L1211631M2558636N5758334
7149B70552023O8215362N5193932l459658o0714483o7621993o0211551m7860684
7142A54092948l1511287k1283828j4741369j1274052q414171o994826o036119
7135E3837296n224208m324417l448260k636084k326336k021893j883366k031825
7127B9940907k183492j722717j351710j544592j477140j167551q81869o85818
$$ plain form
7119 18926018 18285151 17431548 16472147 15487740 14746454 14180408 13374731 12957881 12430228
7110 12430228 12025394 11595568 11368522 10935253 10307116 9862866 9585101 9215929 8644022
7101 8644022 7951891 7638452 7357024 6858909 6385156 6365618 6341617 6016537 5777101 5480339
7091 5480339 5307822 5244442 5218064 5275959 5112011 5029805 4788873 4586945 4547815 4358916
7081 4358916 3994347 3930026 3958321 3862516 3756881 3569310 3556646 3373638 3367944 3318170 3119724
7070 3119724 3152295 3196799 3108564 3000430 3022052 2830424 2741776 2752203 2761831 2603973 2465317
7059 2465317 2379012 2102299 2089813 2296650 2269093 2062963 2113890 1927161 1933878 1834951 1780489
7048 1780489 2115689 2050654 1789262 1839529 1858876 1954855 1682123 1613610 1571625 1381731 1404077
$$ packed form
7119A8926018o40867q53603r59401r84407p41286n66046q05677m16850n27653
7110A2430228m04834m29826k27046m33269o28137m44250k77765l69172n71907
7101H644022o92131l13439k81428m98115m73753j9538k4001l25080k39436k96762
7091E480339j72517o3380k6378N7895j63948q2206k40932k01928l9130j88899
7081D358916l64569o4321K8295r5805j05635j87571j2664j83008n694m9774j98446
7070C119724L2571M4504q8235j08134K1622j91628q8648J0427R628j57858j38656
7059B465317q6305k76713j2486K06837k7557k06130N0927j86729O717r8927n4462
7048A780489L35200o5035k61392N0267J9347R5979k72732o8513m1985j89894K2346
$$ plain form
7037 1404077 1335199 1407363 1597898 1395982 1234072 1131315 1177799 1408801 1331450 1345727
7027 1345727 1029546 951943 773549 851827 970782 788543 810326 861564 1035923 1047757
7017 1047757 799858 814323 876354 1139782 930860 877723 992783 1071270 1037631 944491 961259
7006 961259 863319 732623 739328 936593 900471 1030983 899699 778709 748029 707651 720293
6995 720293 569268 573302 509507 583422 773199 688071 553137 677615 588400 620485 655835
6984 655835 515614 438212 408029 280871 408058 601672 553857 569789 209715 48952
6974 48952 25637 -16343 66353 -104519 19334 136874 157127 250216 159054 187157 40530
6963 40530 203836 269823 222848 101964 229596 181731 381468 229315 244696 241424 137755
$$ packed form
7037A404077o8878P2164J90535k01916j61910j02757M6484K31002p7351J4277
7027A345727l16181p7603j78394P8278J18955j82239K1783N1238J74359J1834
7017A047757k47899J4465O2031K63428k08922n3137J15060P8487l3639r3140J6768
7006I61259r7940j30696O705J97265l6122J30512j31284j20990l0680m0378J2642
6995G20293j51025M034o3795P3915J89777q5128j34934J24478q9215L2085L5350
6984F55835j40221p7402l0183j27158J27187J93614m7815J5932l60074j60763
6974D8952k3315m1980Q2696j70872J23853J17540K0253R3089r1162K8103j46627
6963D0530J63306O5987m6975j20884J27632m7865J99737j52153J5381l272j03669
$$ plain form
6952 137755 277158 88095 150531 105317 208311 110364 109518 357155 300593 280768 171568
6941 171568 235667 359713 183497 -30054 -140505 -111228 -4274 178762 22795 61552
6931 61552 56477 23732 8410 175613 22498 169551 385144 201858 196286 100274 73919
6920 73919 134118 118304 56358 270147 193467 -20131 253095 241433 142072 61407 20130
6909 20130 -48022 -82437 6214 219197 258815 46088 -72269 16762 56976 190329 278173
6898 278173 158729 233003 45122 117364 84096 57207 114466 286104 131935 179449 325088
6887 325088 473222 340248 102329 9791 -41529 28923 13510 116222 263509 358357 -17998
6876 -17998 -196406 -175849 -260562 -167013 -119590 33562 9411 30024 -23772 182158 394477
$$ packed form
6952A37755J39403j89063O2436m5214J02994r7947q46K47637n6562j9825j09200
6941A71568O4099J24046j76216k13551j10451K9277J06954J83036j55967L8757
6931F1552n075l2745j5322J67203j53115J47053K15593j83286n572r6012k6355
6920G3919O0199j5814o1946K13789p6680k13598K73226j1662r9361q0665m1277
6909B0130o8152l4415Q8651K12983L9618k12727j18357Q9031M0214J33353Q7844
6898B78173j19444P4274j87881P2242l3268k6889N7259J71638j54169M7514J45639
6887C25088J48134j32974k37919r2538n1320P0452j5413J02712J47287R4848l76355
6876a7998j78408K0557q4713R3549M7423J53152k4151K0613n3796K05930K12319
$$ plain form
6865 394477 384542 135838 44085 34964 51503 92845 152994 258853 200329 28622 -16281
6854 -16281 92077 -5818 -12885 -185188 -36216 154072 -139288 -226051 38466 -14987 51320
6843 51320 179453 253250 74416 -73949 -64869 -194838 -99082 -73285 18914 -43782 200216
6832 200216 179068 8701 -15750 -128542 46629 -37939 -128781 -195368 -26973 118861 165229
6821 165229 134026 81049 12335 69552 145361 -8877 71002 75468 -17338 42120 -188690
6810 -188690 23185 33658 159836 188779 157011 -82919 -16445 70572 -9331 -170897 -87055
6799 -87055 40224 53298 267103 72720 -13796 33651 -65600 -268115 -387723 -250099 -86760
6788 -86760 -10956 214921 49212 14122 168779 314858 254667 218511 103094 -18947 39603
$$ packed form
6865C94477r935k48704r1753r121J6539M1342O0149J05859n8524j71707m4903
6854a6281J08358r7895p067j72303J48972J90288k93360q6763K64517n3453O6307
6843E1320J28133P3797j78834j48365R080j29969R5756K5797R2199o2696K43998
6832B00216k1148j70367k4451j12792J75171q4568r0842o6587J68395J45834M6368
6821A65229l1203n2977o8714N7217P5809j54238P9879M466r2806N9458k30810
6810a88690K11875J0473J26178K8943l1768k39930O6474Q7017p9903j61566Q3842
6799h7055J27279J3074K13805j94383q6516M7447r9251k02515j19608J37624J63339
6788h6760P5804K25877j65709l5090J54657J46079o0191l6156j15417j22041N8550
$$ plain form
6777 39603 -95935 67701 -5660 86687 -81292 -41788 139557 101116 178648 160557 316691
6766 316691 316849 165776 -1237 -19028 -31629 77919 102264 27474 29222 122066 185704 305454
6754 305454 296820 366689 353033 351503 517446 658678 901695 862595 1013738 1425523 1776138
6743 1776138 1936162 1956098 1735989 1284897 989657 603838 544366 417813 422447 216430
6733 216430 83169 133711 175426 168768 111279 148036 106800 42315 -87078 19573 135540
6722 135540 24142 90332 42856 122595 133054 133469 132027 -31626 -10438 -76589 117764 -58855
6710 -58855 -85980 138091 19476 -48833 -80525 -141901 -57932 -121097 -137714 97961 16157
6699 16157 -156960 -259357 -172542 -342711 -341386 -224764 -109316 -225738 -100966 63326
$$ packed form
6777C9603j35538J63636p3361R2347j67979L9504J81345l8441P7532j8091J56134
6766C16691J58j51073j67013j7791j2601J09548K4345p4790J748R2844O3638J19750
6754C05454q634O9869j3656j530J65943J41232K43017l9100J51143M11785L50615
6743A776138J60024J9936k20109m51092k95240l85819n9472j26553M634k06017
6733B16430j33261N0542M1715o658n7489L6757m1236o4485j29393J06651J15967
6722A35540j11398O6190m7476P9739J0459M15j442j63653K1188o6151J94353j76619
6710e8855k7125K24071j18615o8309l1692o1376Q3969o3165j6617K35675q1804
6699A6157j73117j02397Q6815j70169J325J16622J15448j16422J24772J64292
$$ plain form
6689 63326 180626 145457 210292 169948 -96106 -41402 -189252 -144460 -106980 -248178 -83250
6678 -83250 -125805 -404245 -175295 -260604 -269369 -183380 -88018 -36754 -147375 9439 33870
6667 33870 -107941 -85797 150652 -66859 -22917 8151 -46539 -103121 -144065 -82878 -264571
6656 -264571 -512188 -488861 -190899 -313753 -217136 -179389 -104894 -134492 -193415 175489 85003
6645 85003 -48477 -85700 4826 -49436 -302039 -172188 -118171 -84325 -277657 -114715 -186965
6634 -186965 -227162 -106773 -26773 -46030 -82694 -120626 -120625 -212423 -114856 62900 207194 264237
6622 264237 -27664 -51006 -89342 56045 58485 -104088 -213282 -231652 111690 238832 -4552
6611 -4552 -219996 -112854 -145870 -66790 -49594 5111 -64308 -93562 -291604 -303635 -25760
$$ packed form
6689F3326J17300l5169O4835m0344k66054N4704j47850M4792L7480j41198J64928
6678h3250m2555k78440K28950q5309q765Q5989R5362N1264j10621J56814K4431
6667C3870j41811K2144K36449k17511M3942L1068n4690n6582m0944O1187j81693
6656b64571k47617K3327K97962j22854R6617L7747P4495k9598n8923L68904r0486
6645H5003j33480l7223R0526n4262k52603J29851N4017L3846j93332J62942p2250
6634a86965m0197J20389Q0000j9257l6664l7932Jr1798R7567J77756J44294N7043
6622B64237k91901k3342l8336J45387K440j62573j09194j8370L43342J27142k43384
6611d552k15444J07142l3016P9080J7196N4705o9419k9254j98042j2031K77875
$$ plain form
6600 -25760 -107759 73756 -82743 -67210 -21685 53994 172767 171097 -176710 -344978 -222079
6589 -222079 -155590 -236332 -257499 -261887 -53605 -1253 -107280 -60011 -92849 -94260 -115708 -139020
6577 -139020 -221009 -147520 -132913 -120030 49391 184624 -122736 -241558 -130260 -115290 -220502
6566 -220502 -242738 -175597 50614 -81611 72184 200916 7388 -88507 -107058 -331
6556 -331 -291896 -148249 -54227 -147994 -77594 -25452 -145034 -114245 -177732 -223333 -64444
6545 -64444 84473 16384 -20131 -3406 152083 178761 156016 56804 -83405 36240 -79725
6534 -79725 -172555 -219279 -69472 -6623 -286347 -379464 -332416 -228915 -17135 -17369 -111442
6523 -111442 -111616 -149824 -130692 -51802 -146726 -117108 -179774 -197182 -236829 -45930 -181883 -192915
$$ packed form
6600b5760q1999J81515j56499J5533M5525P5679J18773j670l47807j68268J22899
6589b22079O6489q0742k1167m388K08282N2352j06027M7269l2838j411k1448k3312
6577a39020q1989P3489J4607J2883J69421J35233l07360j18822J11298J4970j05212
6566b20502k2236O7141K26211j32225J53795J28732j93528r5895j8551J06727
6556c31k91565J43647R4022r3767P0400N2142j19582L0789o3487m5601J58889
6545f4444J48917o8089l6515J6725J55489K6678k2745r9212j40209J19645j15965
6534g9725r2830m6724J49807O2849k79724r3117M7048J03501K11780k34r4073
6523a11442j74l8208J9132P8890r4924K9618o2666j7408l9647J90899j35953j1032
$$ plain form
6511 -192915 41733 -140901 -153710 -363408 -287853 7869 -134162 -73734 -268467 -255751
6501 -255751 -196284 -226297 -134214 -185914 -275004 -233491 -282994 -349680 -159822 -47299 -66183
6490 -66183 23204 -190534 -58531 64527 -47681 -50326 -223688 -162485 24675 22232 -223742
6479 -223742 -177790 -311686 -283189 -152174 -380056 -340070 -165220 -307319 -221409 -362292
6469 -362292 -295968 -453899 -345606 -101319 -61242 -52437 -275458 -205816 -191144 -250104 -157336
6458 -157336 -176527 -397845 -244824 42940 -86371 -147696 -238144 -315965 -196752 -64986
6448 -64986 -198941 -261730 -246768 -163334 -44362 -114124 -341487 -214128 -195649 -501033 -514688
6437 -514688 -354249 -379883 -348036 -348030 -218877 -387531 -291146 -194313 -277252 -233011 -148407 -216662
$$ packed form
6511a92915K34648j82634j2809k09698P5555K95722j42031O0428j94733J2716
6501b55751N9467l0013R2083n1700q9090M1513m9503o6686J89858J12523j8884
6490f6183Q9387k13738J32003J23058j12208k645j73362O1203J87160k443k45974
6479b23742M5952j33896K8497J31015k27882L9986J74850j42099Q5910j40883
6469c62292O6324j57931J08293K44287M0077Q805k23021O9642J4672n8960R2768
6458a57336j9191k21318J53021K87764j29311o1325r0448p7821J19213J31766
6448f4986j33955o2789J4962Q3434J18972o9762k27363J27359J8479l05384j3655
6437e14688J60439k5634L1847OJ29153j68654R6385R6833q2939M4241Q4604o8255
$$ plain form
6425 -216662 -247741 -107134 -167379 -105145 -115315 -172169 -178191 -77546 -175405 -70113 82932
6414 82932 208144 11925 -101979 -125861 -111868 -96920 50577 3973 27446 4440 -14253
6403 -14253 184531 187850 149265 -87460 -62282 -184154 -200807 76700 76261 -196148 -141393
6392 -141393 -233744 -259353 -240359 -189573 -106094 -139958 -192907 -376262 -149024 -88829 -87257
6381 -87257 77678 -56967 -162041 -11544 -274470 -359798 -37103 9095 -243738 -182167
6371 -182167 -295606 -165166 -184479 -84378 30954 -247051 -386030 -162652 -102062 -67211
6361 -67211 71324 30760 -51474 -49084 -12302 -270424 -241226 -153166 76963 -19151 -134730
6350 -134730 -148830 -336950 -264419 -308275 -287879 -270981 -82809 -13533 28493 -143555 -218336
$$ packed form
6425b16662l1079J40607o0245O2234j0170n6854o022J00645r7859J05292J53045
6414H2932J25212j96219j13904k3882J3993J4948J47497m6604K3473k3006j8693
6403a4253J98784L319l8585k36725K5178j21872j6653K77507m39k72409N4755
6392a41393r2351k5609J8994N0786Q3479l3864n2949j83355K27238O0195J572
6381h7257J64935j34645j05074J50497k62926q5328L22695M6198k52833O1571
6371a82167j13439J30440j9313J00101J15332k78005j38979K23378O0590L4851
6361f7211J38535m0564q2234K390L6782k58122K9198Q8060K30129r6114j15579
6350a34730j4100j88120P2531m3856K0396J6898J88172O9276M2026j72048p4781
$$ plain form
6339 -218336 43273 22917 -58084 -118158 -154597 52564 -45232 -148145 -96860 -35918 16270
6328 16270 203998 38853 -151560 -56940 -19039 -4768 -121582 -294266 -426710 -372500 -221136
6317 -221136 -279816 -242481 -121248 -82384 -135792 -154180 -75347 -114198 -252698 -241178 -53899
6306 -53899 -125102 -66499 -230754 -257419 -227895 -285472 -433936 -335840 -294801 -221791 -74762
6295 -74762 -62560 -72526 -111279 -36713 -5732 18827 -129571 -115418 -201061 -207988 -90456 -170524
6283 -170524 -45843 52911 62992 166130 -156323 -115352 -130434 -137527 -135782 -164816 -310
6272 -310 -108686 -297931 -246056 -58467 -35998 -7725 -45776 73167 -155906 -136769 -111500
6261 -111500 24126 -96771 -42783 -13296 163963 98251 5791 -80632 64379 -115741 -256789
$$ packed form
6339b18336K61609k0356q1001o0074l6439K07161r7796j02913N1285O0942N2188
6328A6270J87728j65145j90413R4620L7901J4271j16814j72684j32444N4210J51364
6317b21136n8680L7335J21233L8864n3408j8388P8833l8851j38500J1520J87279
6306e3899p1203N8603j64255k6665K9524n7577j48464R8096M1039P3010J47029
6295g4762J2202r966l8753P4566L0981K4559j48398J4153q5643o927J17532q0068
6283a70524J24681R8754J0081J03138l22453M0971j5082p093J745k9034J64506
6272c10j08376j89245N1875J87589K2469K8273l8051J18943k29073J9137K5269
6261a11500J35626j20897N3988K9487J77259o5712r2460q6423J45011j80120j41048
$$ plain form
6250 -256789 -328126 -250745 -73475 -8890 70306 41672 103327 -4517 -128627 -2934 67672
6239 67672 -62349 -73983 -99580 38917 14250 15716 37995 -101933 35928 88778 141936
6228 141936 82023 -53996 -178614 -229235 -435778 -401872 -60368 -128676 -159575 -282128 -297000
6217 -297000 -186983 -165487 -70802 24658 4588 22886 -185228 -132116 -235343 -191735 -296911
6206 -296911 -383750 -511389 -452888 -204547 -57912 18984 9876 -30200 -23335 3262 153318
6195 153318 5383 -107376 -116000 -246959 5767 248314 48955 -91948 -76995 -36530
6185 -36530 -48685 -119334 -76863 -17861 -32621 -92240 44811 84775 -77848 -107113 -27771
6174 -27771 160521 103398 82445 45914 -1003 -32295 124412 -61482 -292303 -73809 149738
$$ packed form
6250b56789p1337P7381J77270O4585P9196k8634O1655j07844j24110J25693P0606
6239F7672j30021j1634k5597J38497k4667J466K2279j39928J37861N2850N3158
6228A41936n9913j36019j24618n0621k06543L3906L41504o8308l0899j22553j4872
6217b97000J10017K1496R4685R5460k0070J8298k08114N3112j03227M3608j05176
6206b96911q6839j27639N8501K48341J46635P6896r108m0076O865K6597J50056
6195A53318j47935j12759q624j30959K52726K42547j99359j40903J4953M0465
6185c6530j2155p0649M2471N9002j4760n9619J37051L9964j62623k9265P9342
6174b7771J88292n7123k0953l6531m6917l1292J56707j85894k30821K18494K23547
$$ plain form
6163 149738 115523 -52324 -61869 -44340 -130628 -220965 -159241 -40721 89538 54632 -142346
6152 -142346 2213 -54069 5739 106464 165446 114452 -16397 -38613 -40596 -64712 -177354
6141 -177354 -56874 -5156 90142 124505 77513 12144 -167194 -24232 72006 85499 231496
6130 231496 63252 -22471 33882 21552 -5191 -62964 -229419 63514 122580 -27258 -42995
6119 -42995 27402 85694 14163 21501 -78658 -97293 -1010 64869 37214 71011 216340 57106
6107 57106 30447 91148 71082 -38291 111270 173808 203482 255884 208633 89501 151450
6096 151450 16778 38128 58950 -33029 152837 78008 -67091 -201664 -14644 -43879 -203595
6085 -203595 -177207 -276078 -150947 -214229 -112705 -160485 -147677 -153431 -135677 -139547 -60099 44518
$$ packed form
6163A49738l4215j67847r545J7529q6288r0337O1724J18520J30259l4906j96978
6152a42346J44559n6282N9808J00725N8982n0994j30849k2216j983k4116j12642
6141a77354J20480N1718R5298L4363m6992o5369j79338J42962R6238J3493J45997
6130B31496j68244q5723N6353j2330k6743n7773j66455K92933N9066j49838j5737
6119d2995P0397N8292p1531P338j00159j8635R6283O5879k7655L3797J45329j59234
6107E7106k6659O0701k0066j09373J49561O2538K9674N2402m7251j19132O1949
6096A51450j34672K1350K0822r1979J85866p4829j45099j34573J87020k9235j59716
6085b03595K6388r8871J25131o3282J01524m7780J2808n754J7754l870P9448J04617
$$ plain form
6073 44518 -89753 145566 57975 -106634 -64398 50433 -275665 -155585 165581 98395
6063 98395 5358 127145 226878 33190 -108525 150323 181023 -146403 -146130 -229418 -242244
6052 -242244 -110421 -104752 43475 137335 115979 15217 -212628 -146174 -101508 49659 38001
6041 38001 8368 -194650 -84492 88127 -128144 -3302 19374 52427 -62262 13583 -4676
6030 -4676 87317 71260 -117115 -143536 99078 446488 150944 73313 -2374 9633 52620
6019 52620 -23814 99575 141154 195865 202697 250446 -21392 -30932 146583 149530 -12058 -48468
6007 -48468 49783 12900 -143766 -51747 -81307 -179863 -60620 -111103 3204 -204659 -126276
5996 -126276 -61038 -202987 -120034 -171776 -129380 -231057 -121926 118269 32594 6126 37597
$$ packed form
6073D4518j34271K35319q7591j64609M2236J14831l26098J20080L21166o7186
6063I8395r3037J21787R9733j93688j41715K58848L0700l27426K73q3288j2826
6052b42244J31823N669J48227R3860k1356j00762k27845O6454M4666J51167j1658
6041C8001k9633k03018J10158J72619k16271J24842K2676L3053j14689P5845j8259
6030d676R1993j6057j88375k6421K42614L47410k95544p7631p5687J2007M2987
6019E2620p6434J23389M1579N4711O832M7749k71838r540J77515K947j61588l6410
6007d8468R8251l6883j56666R2019k9560r8556J19243n0483J14307k07863P8383
5996a26276O5238j41949Q2953n1742M2396j01677J09131K40195q5675k6468L1471
$$ plain form
5985 37597 26198 80907 208720 33081 -69177 -213902 -176871 50376 91960 201416 46494
5974 46494 -128133 -103336 13676 -178777 -222409 62735 -125188 -82901 -76350 55738 81234
5963 81234 -13965 48359 -215499 -295762 -220100 -98331 88117 -21746 -138942 114725 60738
5952 60738 -201584 153159 128162 85872 275998 153243 -72003 -108560 55017 -39479 93129
5941 93129 116443 297453 171843 164690 80308 -121712 -186943 -64305 66941 31738 195943
5930 195943 301736 445848 474080 305691 204221 46687 -23534 185602 155768 226503
5920 226503 375784 405452 223786 197147 99612 209801 328538 359678 399279 412221 338115
5909 338115 293710 229635 390694 400841 339022 436271 430570 665630 523199 648631 911325
$$ packed form
5985C7597j1399N4709J27813j75639j02258j44725L7031K27247M1584J09456j54922
5974D6494j74627K4797J17012j92453m3632K85144j87923M2287O551J32088K5496
5963H1234r5199O2324k63858q0263P5662J21769J86448j09863j17196K53667n3987
5952F0738k62322L54743k4997m2290J90126j22755k25246l6557J63577r4496J32608
5941I3129K3314J81010j25610p153q4382k02020o5231J22638J31246l5203J64205
5930A95943J05793J44112K8232j68389j01470j57534p0221K09136k9834P0735
5920B26503J49281K9668j81666k6639r7535J10189J18737L1140L9601J2942p4106
5909C38115m4405o4075J61059J0147o1819R7249n701K35060j42431J25432K62694
$$ plain form
5898 911325 1040036 864359 984191 1316247 1413447 1553906 1974870 2209113 2239495 2293247
5888 2293247 2609544 2651344 2769169 2560447 2268590 2079183 1991324 1720731 1562626 1431027
5878 1431027 1089377 1058552 840697 644887 551024 543242 494696 558585 368658 150599 260876
5867 260876 529016 408064 164788 370639 271180 294783 136088 104457 294524 309119
5857 309119 133405 40790 182469 133779 119567 177651 216259 248635 367043 356118 256481
5846 256481 81303 169440 69320 -140484 -464791 -167450 -149816 -90027 2091 -57769 100216
5835 100216 207263 72007 -74440 -48816 93303 239116 85534 -54435 -133488 -117586
5825 -117586 30561 -70091 -219462 17453 80871 -120574 51579 -28691 -9956 -20437
$$ packed form
5898I11325J28711j75677J19832L32056R7200J40459M20964K34243L0382N3752
5888B293247L16297M1800J17825k08722k91857j89407q7859k70593j58105j31599
5878A431027l41650l0825k17855j95810r3863p782m8546O3889j89927k18059J10277
5867B60876K68140j20952k43276K05851r9459K3603j58695l1631J90067J4595
5857C09119j75714r2615J41679m8690j4212N8084L8608L2376J18408j0925r9637
5846B56481j75178Q8137j00120k09804l24307K97341J7634N9789R2118n9860J57985
5835A00216J07047j35256j46447K5624J42119J45813j53582j39969p9053J5902
5825a17586J48147j00652j49371K36915O3418k01445J72153q0270J8735j0481
$$ plain form
5815 -20437 141627 343675 336890 345518 211439 33947 -63815 -110328 -10753 -46694 24389
5804 24389 -5252 -10757 109622 144494 -60220 -227208 37252 -85041 -182777 32238 196130
5793 196130 -108063 -66979 123180 34173 2752 159452 124704 -49653 175430 305939
5783 305939 319575 110565 61466 69036 104168 197398 240924 200900 42701 298769 322385
5772 322385 94358 318363 312451 217707 224396 -101128 36778 148491 97127 4057 181897
5761 181897 339054 289429 254502 216617 186428 267861 218308 204276 84453 218334 328478
5750 328478 113279 176475 414349 177269 414944 401206 292838 304361 13706 82027
5740 82027 7634 112508 205178 244930 324843 193529 169002 69489 16334 -43219 96642
$$ packed form
5815b0437J62064K02048o785Q628j34079j77492r7762m6513R9575l5941P1083
5804B4389k9641n505J20379L4872k04714j66988K64460j22293r7736K15015J63892
5793A96130l04193M1084J90159q9007l1421J56700l4748j74357K25083J30509
5783C05939J3636k09010m9099P570L5132R3230M3526m0024j58199K56068K3616
5772C22385k28027K24005n912r4744O689l25524J37906J11713n1364r3070J77840
5761A81897J57157m9625l4927l7885l0189Q1433m9553j4032j19823J33881J10144
5750C28478k15199O3196K37874k37080K37675j3738j08368J1523k90655O8321
5740H2027p4393J04874R2670L9752P9913j31314k4527r9513n3155n9553J39861
$$ plain form
5729 96642 258556 262730 154383 175576 178030 -23134 111351 112688 114205 70877 -54826 4985
5717 4985 221372 410935 140931 -31514 90174 143889 240329 79395 115847 68232 28159
5706 28159 162194 239365 89245 21938 132766 185982 10448 -12917 39454 -121785 -147220
5695 -147220 58178 51841 69616 74917 -111055 -14930 45433 117602 -65033 644 62438
5684 62438 60201 190601 306668 387002 387974 258673 163511 66161 -83116 63552 97941
5673 97941 228652 180122 -20643 92056 -19101 -73486 -102973 181720 364714 144388
5663 144388 113386 98362 33137 -26237 202363 92382 106196 -137050 19788 173570 35914
5652 35914 43882 -53376 91853 460240 378439 394275 346294 234893 480204 597295 506459
$$ packed form
5729I6642J61914M174j08347K1193K454k01164J34485J337J517m3328j25703N9811
5717D985K16387J89563k70004j72445J21688N3715R6440j60934L6452m7615m0073
5706B8159J34035P7171j50120o7307J10828N3216j75534k3365N2371j61239k5435
5695a47220K05398o337J7775N301j85972R6125O0363P2169j82635O5677O1794
5684F2438k237J30400J16067Q0334R72j29301r5162r7350j49277J46668L4389
5673I7941J30711m8530k00765J12699j11157n4385k9487K84693J82994k20326
5663A44388l1002j5024o5225n9374K28600j09981J3814k43246J56838J53782j37656
5652C5914P968r7258J45229L68387q1801J5836m7981j11401K45311J17091r0836
$$ plain form
5641 506459 337941 405506 400483 448092 397634 559441 482017 317023 105702 104313 -284044
5630 -284044 -237195 150809 31028 109425 82053 141148 215180 256022 254069 152058 147197
5619 147197 238514 -42988 -6006 169300 129522 284765 405891 267640 56095 169527
5609 169527 366272 463670 242826 154442 117836 118660 99277 204021 351818 217545 274101
5598 274101 231351 233498 380702 465372 350502 448230 518200 245441 193095 131520 158213
5587 158213 320409 293548 279159 378452 208871 165211 137295 39441 197941 33182 47723
5576 47723 28114 98696 263450 475558 140506 -113706 -38900 77997 131179 -38074 137398
5565 137398 175162 114413 114809 -42894 151968 148351 257230 403019 166032 285270 273423
$$ packed form
5641E06459j68518O7565n023M7609n0458J61807p7424j64994k11321j389l88357
5630b84044M6849L88004j19781P8397k7372N9095P4032M0842j953j02011m861
5619A47197R1317k81502L6982J75306l9778J55243J21126j38251k11545J13432
5609A69527J96745R7398k20844q8384l6606Q24j9383J04744J47797j34273N6556
5598B74101m2750K147J47204Q4670j14870R7728O9970k72759n2346o1575K6693
5587A58213J62196k6861j4389R9293j69581m3660k7916r7854J58500j64759J4541
5576D7723j9609P0582J64754K12108l35052k54212P4806J16897N3182j69253J75472
5565A37398L7764o0749L96j57703J94862l617J08879J45789k36987J19238j1847
$$ plain form
5554 273423 233115 264454 115282 -152981 126296 206003 272093 294828 -9879 -39056 53137
5543 53137 85141 -62269 55730 94211 -44274 161208 59765 84653 120696 2495 -91945
5532 -91945 58173 143252 180399 79689 -114176 64253 163746 178071 126653 108078 -20946
5521 -20946 -2641 -144536 -130960 118081 216101 140853 124173 -41447 -66992 -54791 31137
5510 31137 332719 226355 156534 34790 81892 54197 121120 95287 49048 -140147 -94969
5499 -94969 83429 57309 -68206 47271 -122865 -138402 -124773 -137554 -99086 -333104 -236419
5488 -236419 -100770 -26158 -293784 -24369 110 -15479 -110046 -176481 -77569 8289 -255256
5477 -255256 -340512 -62648 14274 -307797 -51920 -21897 -19593 -8139 -134040 72472 -22241
$$ packed form
5554B73423m0308L1339j49172k68263K79277P9707O6090K2735l04707k9177R2193
5543E3137L2004j47410J17999L8481j38485K05482j01443K4888L6043j18201r4440
5532i1945J50118Q5079L7147j00710j93865J78429R9493J4325n1418j8575j29024
5521b0946J8305j41895J3576K49041R8020p5248j6680j65620k5545J2201Q5928
5510C1137L01582j06364o9821j21744M7102k7695O6923k5833m6239j89195M5178
5499i4969J78398k6120j25515J15477j70136j5537J3629j2781L8468k34018R6685
5488b36419J35649P4612k67626K69415K4479j5589r4567o6435R8912Q5858k63545
5477b55256q5256K77864P6922l22071K55877L0023K304J1454j25901K06512r4713
$$ plain form
5466 -22241 5538 -1753 -6378 -88511 148921 5908 -177394 42772 79325 -117494 -19313
5455 -19313 -134760 -113466 85250 -72232 -42557 -41111 56394 -29842 -186125 -196710 150974
5444 150974 -35934 -80595 75574 -194620 -42190 -166704 -174071 -60143 43618 -101881
5434 -101881 -77846 -50222 28404 -102099 -137624 31229 231404 118022 -130827 -101244 -73255
5423 -73255 -73192 58908 75825 -35603 -176662 -133469 -113156 -31753 13538 -69945 37505 121880
5411 121880 21663 114156 -1899 63657 6807 -134225 111575 38469 116400 87927 247283
5400 247283 96341 -31368 -183744 -212808 -258209 -225326 26435 -80659 -166186 -68761 -223707
5389 -223707 -209374 83002 82354 -36222 -181927 -217313 -105989 -130230 -300799 -254154 -193916
$$ packed form
5466b2241K7779p291m625q2133K37432j43013j83302K20166L6553j96819R8181
5455a9313j15447K1294J98716j57482K9675J446R7505q6236j56283j0585L47684
5444A50974j86908m4661J56169k70194J52430j24514p367J13928J03761j45499
5434a01881K4035K7624P8626j30503l5525J68853K00175j13382k48849K9583K7989
5423g3255O3J32100J6917j11428j41059M3193K0313Q1403M5291q3483J07450Q4375
5411A21880j00217R2493j16055O5556n6850j41032K45800p3106P7931k8473J59356
5400B47283j50942j27709j52376k9064m5401L2883K51761j07094q5527R7425j54946
5389b23707J4333K92376o48j18576j45705l5386J11324k4241j70569M6645O0238
$$ plain form
5378 -193916 -138138 -36610 -94771 -43129 79026 18097 5842 37250 99934 75017 31926
5367 31926 -89 17744 55132 -51505 -48251 30005 -14333 44166 124037 218753 13214 -135976
5355 -135976 28194 -27385 -46106 -60569 148152 242807 174103 152426 233350 5090 11837
5344 11837 28154 -3747 2622 15230 17365 71765 -31418 -90765 31696 -21528 20519 -228534
5332 -228534 -209891 61236 89372 60239 -89977 21622 -75493 -100071 -128564 -96482 -99646
5321 -99646 -137851 -255148 -390400 -373482 -167130 -215146 -203916 120662 186228 14163 57599
5310 57599 85185 71830 142755 -34753 -95709 133248 105867 -16288 -114747 -68635 -175760
5299 -175760 -204867 118133 118220 72045 68594 7179 18851 -12651 -25883 99506 31011 -9898
$$ packed form
5378a93916N5778J01528n8161N1642J22155o0929j2255L1408O2684k4917m3091
5367C1926l2015J7833L7388j06637L254P8256m4338N8499P9871R4716k05539j49190
5355a35976J64170n5579j8721j4463K08721R4655o8704k1677Q0924k28260O747
5344A1837J6317l1901O369J2608K135N4400j03183n9347J22461n3224M2047k49053
5332b28534J8643K71127K8136k9133j50216J11599r7115k4578k8493L2082l164
5321i9646l8205j17297j35252J6918K06352m8016J1230L24578O5566j72065M3436
5310E7599K7586j3355P0925j77508o0956K28957k7381j22155r8459M6112j07125
5299a75760k9107L23000Q7m6175l451o1415J1672l1502j3232J25389o8495m0909
$$ plain form
5287 -9898 12959 948 110413 136993 -51962 161274 29917 15244 -143203 -26003 -30283
5276 -30283 -159358 -127351 -45308 -18178 -49783 -112729 -93430 -150835 -38067 -91779 -81216
5265 -81216 -197836 -48183 36047 -11868 -14687 98084 9767 -45329 144839 140794 165123
5254 165123 36966 -150495 -37895 31562 -48407 -50061 11721 -21038 -276985 -257633 40263
5243 40263 32712 -163593 -286469 -243713 -46551 -43896 16619 28438 7513 12051 84369 97178
5231 97178 328300 282818 91723 3651 -33884 -27677 99019 63395 71587 -23130 -346 -194798
5219 -194798 -348386 -474755 -301515 -19470 181089 237188 -50137 -96762 26380 -154195
5209 -154195 -13305 -32466 -55491 157290 239124 47487 -126604 -111054 -69424 114864 -112092
$$ packed form
5287i898K2857j2011J09465K6580j88955K13236j31357j4673j58447J17200m280
5276c0283j29075L2007Q2043K7130l1605o2946J9299n7405J12768n3712J0563
5265h1216j16620J49653Q4230m7915k819J12771q8317n5096J90168m045K4329
5254A65123j28157j87461J12600O9457p9969j654O1782l2759k55947J9352K97896
5243D0263p551j96305j22876M2756J97162K655O0515J1819k0925M538P2318J2809
5231I7178K31122m5482j91095q8072l7535O207J26696l5624Q192r4717K2784j94452
5219a94798j53588j26369J73240K82045K00559N6099k87325m6625J23142j80575
5209a54195J40890j9161k3025K12781Q1834j91637j74091J5550M1630J84288k26956
$$ plain form
5198 -112092 -135187 -157338 -146676 -284770 -244383 -152856 -95318 -32042 -88534 -253943 -293549
5187 -293549 -267578 -131139 -121808 -187041 -91144 4242 114038 43207 -295489 -293404 -191880
5176 -191880 57810 27253 -135886 -237061 -160818 -31373 -170553 -12681 -164081 -120754
5166 -120754 -71413 -33692 26565 45165 144642 79003 91472 -35803 -153129 -176490 -316853
5155 -316853 -146100 -149221 71585 102025 82453 -80008 -115821 -113647 -51641 -73882 -96078
5144 -96078 -166548 -211758 37522 -2163 -70462 41985 55098 -42161 87924 -12004 -174784
5133 -174784 -64596 -79539 16160 -118967 -171647 -131182 -97371 -123049 -58755 -112514 -130261
5122 -130261 -264305 -370222 -80323 -65895 38770 253676 305603 158215 21105 79552
$$ packed form
5198a12092k3095k2151J0662j38094M0387R1527N7538O3276n6492j65409l9606
5187b93549K5971J36439R331o5233R5897R5386J09796p0831l38696K085J01524
5176a91880K49690l0557j63139j01175P6243J29445j39180J57872j51400M3327
5166a20754M9341L7721O0257J8600R9477o5639J2469j27275j17326k3361j40363
5155c16853J70753l121K20806L0440j9572j62461l5813K174O2006k2241k2196
5144i6078p0470m5210K49280l9685o8299J12447J3113r7259J30085r9928j62780
5133a74784J10188j4943R5699j35127n2680M0465L3811k5678O4294n3759j7747
5122a30261j34044j05917K89899J4428J04665K14906N1927j47388j37110N8447
$$ plain form
5112 79552 127042 161051 188428 70992 64852 -39315 -16327 -39448 -114986 -208412 62021
5101 62021 209572 29944 -33980 95047 95687 41983 -64989 -31884 -41753 -265696 -26351
5090 -26351 -187095 -333395 -120903 -30151 -90807 -303377 -85494 -5046 -37819 60469 -59704
5079 -59704 -224920 -106983 -34021 -25747 -122588 -140954 -134329 -168344 -149770 21860 -52809 98279
5067 98279 29427 -107063 15017 50460 -99055 -81154 -47915 -108341 -41013 -28537 -301872
5056 -301872 -239488 -184637 -14696 -36360 -202464 82918 42569 111143 -22410 118854 188929
5045 188929 34723 -22361 -130913 -66420 165085 159613 -18497 38451 -12663 -81410 90832
5034 90832 11240 -43861 -118549 -85586 90577 131337 252321 153692 87709 55703 39773
$$ packed form
5112G9552M7490L4009K7377j17436o140j04167K2988k3121p5538r3426K70433
5101F2021J47551j79628o3924J29027O40n3704j06972L3105r869k23943K39345
5090b6351j60744j46300K12492R0752o0656k12570K17883Q0448l2773R8288j20173
5079e9704j65216J17937P2962Q274r6841j8366O625l4015J8574J71630p4669J51088
5067I8279o8852j36490J22080L5443j49515J7901L3239o0426O7328J2476k73335
5056c01872O2384N4851J69941k1664j66104K85382m0349O8574j33553J41264P0075
5045A88929j54206n7084j08552O4493K31505n472j78110N6948n1114o8747J72242
5034I0832p9592n5101p4688L2963J76163M0760J20984r8629o5983l2006j5930
$$ plain form
5023 39773 -45814 25747 -37161 -57398 -14980 -159257 -243497 -200888 -231000 -139529 -81887 55377
5011 55377 82237 100269 87040 -709 -184108 -249239 -56406 -195901 -230941 -83813 13626
5000 13626 80805 286169 169525 65396 -31831 79915 145278 94129 -105408 -67155 -26221
4989 -26221 -9362 -39655 13418 -172754 99488 262393 138141 -4721 41592 113234 303546
4978 303546 243335 114424 51112 -42687 109333 217951 -87914 -24812 184383 63344
4968 63344 16654 98513 146083 -76172 -28693 -136547 -129030 78060 14816 9322 -82540 99152
4956 99152 237233 114289 166813 68400 11908 -42562 1615 -51333 24733 9307 80557
4945 80557 83999 82833 13531 -888 11622 130183 62661 114559 124675 51996 -80609 -39010
$$ packed form
5023C9773q5587P1561o2908k0237M2418j44277q4240M2609l0112R1471N7642J37264
5011E5377K6860J8032j3229q7749j83399o5131J92833j39495l5040J47128R7439
5000A3626O7179K05364j16644j04129r7227J11746O5363n1149j99537L8253M0934
4989b6221J6859l0293N3073j86172K72242J62905j24252j42862M6313P1642J90312
4978C03546o0211j28911o3312r3799J52020J08618l05865O3102K09195j21039
4968F3344m6690Q1859M7570k22255M7479j07854P517K07090o3244n494r1862J81692
4956I9152J38081j22944N2524r8413n6492n4470M4177n2948P6066j5426P1250
4945H0557L442j166o9302j4419J2510J18561o7522N1898J0116p2679j32605M1599
$$ plain form
4933 -39010 -135630 -34167 -58221 34399 110919 -29341 -36135 65295 29703 -63363 80320
4922 80320 -56114 10211 22624 -24506 -128092 30614 49275 39723 246609 296049 174599
4911 174599 208523 104067 -7675 139236 146017 130247 84843 76985 76971 93922 128948 192790
4899 192790 -8959 36924 4584 17101 14351 111463 106970 255664 228874 -7969 22384
4888 22384 -19853 -158908 -102964 -21772 42140 -18348 -24784 173894 -23895 -117501 -76439
4877 -76439 -128518 46004 209229 24346 67310 153644 110712 -48845 65781 177996 55541
4866 55541 -166049 -79111 -72631 13663 18653 82737 107611 252914 168716 221457 78137 -12367
4854 -12367 -177138 -292977 -12782 69326 -57346 -98910 81543 57703 229008 205367 28463
$$ packed form
4933c9010r6620J01463k4054R2620P6520j40260o794J01430l5592r3066J43683
4922H0320j36434O6325J2413m7130j03586J58706J8661r552K06886M9440j21450
4911A74599L3924j04456j11742J46911O781j5770m5404p858j4J6951L5026O3842
4899A92790k01749M5883l2340J2517k750R7112m493J48694k6790k36843L0353
4888B2384m2237j39055N5944Q1192O3912o0488o436J98678j97789r3606M1062
4877g6439n2079J74522J63225j84883M2964Q6334m2932j59557J14626J12215j22455
4866E5541k21590Q6938O480Q6294M990O4084K4874J45303q4198N2741j43320r0504
4854a2367j64771j15839K80195Q2108j26672m1564J80453k3840J71305k3641j76904
$$ plain form
4843 28463 92826 57400 34317 9215 122756 61225 -104922 67932 52520 36060 14076
4832 14076 222544 271859 42116 41121 85991 181013 179020 111786 62659 119370 -139469 -243196
4820 -243196 -40550 75471 217184 178109 87718 212816 294837 239923 167153 238706 310613
4809 310613 212687 154344 120138 205882 227652 193535 97852 213864 258290 44339 93310
4798 93310 184085 111106 76468 -13334 150551 120677 35480 104241 13298 -11256 248344
4787 248344 271436 65604 104497 263737 204081 256175 72059 111201 248193 85127 108366
4776 108366 53533 -7389 108634 75867 139108 51311 -228085 -143841 232723 317163 187645
4765 187645 52828 2864 184341 446052 367068 202845 -42830 347828 356363 156851
$$ packed form
4843B8463O4363l5426k3083k5102J13541o1531j66147J72854j5412j6460k1984
4832A4076K08468M9315k29743r95M4870R5022j993o7234m9127N6711k58839j03727
4820b43196K02646J16021J41713l9075r0391J25098Q2021n4914p2770P1553P1907
4809C10613r7926n8343l4206Q5744K1770l4117r5683J16012M4426k13951M8971
4798I3310R0775p2979l4638q9802J63885k9874q5197O8761r0943k4554K59600
4787B48344K3092k05832L8893J59240n9656N2094j84116L9142J36992j63066K3239
4776A08366n4833o0922J16023l2767O3241q7797k79396Q4244L76564Q4440j29518
4765A87645j34817m9964J81477K61711p8984j64223k45675L90658Q535j99512
$$ plain form
4755 156851 167445 73990 202606 298231 334695 281807 168554 64668 215654 230179 222042
4744 222042 120518 -126043 -20022 30362 -3790 43588 -57046 -98948 -59919 124972 -38684
4733 -38684 72039 216325 222127 206796 93303 230519 401142 380719 183850 249149 117219
4722 117219 -7310 93739 95028 164841 303967 386848 217193 152466 349466 391542 368274
4711 368274 430943 315656 265062 -22721 -71374 125048 95838 67135 255230 316166 377608
4700 377608 329116 255755 346518 332912 310880 390600 482757 494103 254283 327878 136526
4689 136526 145184 377870 528301 351822 144950 248551 431237 583672 591576 231737
4679 231737 232679 179960 188644 363427 360616 485185 525386 434214 256166 153564 216146 139857
$$ packed form
4755A56851J0594r3455J28616R5625L6464n2888j13253j03886J50986J4525q137
4744B22042j01524k46561J06021N0384l4152M7378j00634m1902L9029J84891j63656
4733c8684J10723J44286N802j5331j13493J37216J70623k0423j96869O5299j31930
4722A17219j24529J01049J289O9813J39126Q2881j69655o4727J97000M2076k3268
4711C68274O2669j15287n0594k87783m8653J96422k9210k8703J88095O0936O1442
4700C77608m8492p3361R0763j3606k2032P9720R2157J1346k39820P3595j91352
4689A36526Q658K32686J50431j76479k06872J03601J82686J52435P904l59839
4679B31737R42n2719Q684J74783k811J24569M0201r1172j78048j02602O2582p6289
$$ plain form
4667 139857 50822 134057 183802 375020 336675 424814 358144 309360 368013 411532 368197
4656 368197 360314 483947 419701 329076 92478 244844 571417 471769 335011 498166 590970
4645 590970 443896 565862 657845 445647 624203 708770 743181 721171 865610 943825 1094491
4634 1094491 1071805 943627 936983 752164 781147 769276 685598 620996 621569 643302 626643 427917
4622 427917 408902 350867 502249 351456 512793 481393 615522 573812 526774 399215 475155
4611 475155 349054 331153 462412 459877 395300 418064 229499 293421 182832 146944 446301
4600 446301 295880 213151 363504 445568 226766 356663 459173 178361 114682 68925
4590 68925 296335 537353 442074 257849 187223 295791 207393 180856 220446 358602 147292
$$ packed form
4667A39857q9035Q3235M9745J91218l8345Q8139o6670m8784N8653M3519m3335
4656C68197p883J23633o4246r0625k36598J52366L26573r9648j36758J63155R2804
4645E90970j47074J21966R1983k12198J78556Q4567L4411k2010J44439P8215J50666
4634A094491k2686j28178o644j84819K8983j1871q3678o4602N73K1733j6659j98726
4622D27917j9015n8035J51382j50793J61337l1400J34129m1710m7038j27559P5940
4611D75155j26101j7901J31259k535o4577K2764j88565O3922j10589l5888K99357
4600D46301j50421q2729J50353Q2064k18802J29897J02510k80812o3679m5757
4590F8925K27410K41018r5279j84225p0626J08568q8398k6537L9590J38156k11310
$$ plain form
4579 147292 52383 128184 178751 42917 220142 187102 65869 -83926 210878 408552
4569 408552 396801 258102 121376 152484 79810 177583 79630 110752 293053 298285 275512
4558 275512 290446 321238 400107 394138 325815 334325 168428 161832 279137 344110 410517 284522
4546 284522 347943 169310 63249 96147 198713 199644 262437 407529 356533 221133 -28187
4535 -28187 91923 272279 245122 186877 173152 120051 341966 137931 188213 491270 491873
4524 491873 435587 142456 209830 253529 258734 360208 156437 264524 548974 506299 455345
4513 455345 503152 426145 353515 350749 204245 236532 244289 202828 254514 245043 276164 342774
4501 342774 412412 552100 775573 673260 497381 438803 524933 644620 469425 389086
$$ packed form
4579A47292r4909P5801N0567j35834J77225l3040j21233j49795K94804J97674
4569D08552j1751j38699j36726L1108p2674R7773r7953L1122J82301N232k2773
4558B75512J4934L0792P8869n969o8323Q510j65897o596J17305O4973O6407j25995
4546B84522O3421j78633j06061L2898J02566R31O2793J45092n0996j35400k49320
4535b8187J20110J80356k7157n8245j3725n3101K21915k04035N0282L03057O03
4524D91873n6286k93131O7374M3699N205J01474k03771J08087K84450m2675n0954
4513D55345M7807p7007p2630k766j46504L2287P757m1461N1686r471L1121O6610
4501C42774O9638J39688K23473j02313j75879n8578Q6130J19687j75195q0339
$$ plain form
4491 389086 393584 518532 550063 526301 475461 545812 464573 407235 393753 396376 308934 193261
4479 193261 389300 367087 263182 202978 326172 427270 668211 534065 529142 582004 514746
4468 514746 414428 511269 525562 508833 502689 500542 514722 542767 542404 650329 937686 801716
4456 801716 533518 664138 650049 637429 494786 309115 464214 607244 635153 540803
4446 540803 498181 729260 681971 582576 887135 701296 579706 884445 754869 770815
4436 770815 828301 873315 858369 1026972 825013 686072 726478 730102 714987 637970 961188
4425 961188 727370 852533 970878 1081310 1047576 1287422 1375561 1358672 1315080 1409515 1417464
4414 1417464 1516083 1584347 1774582 2135493 2582869 2896162 3397852 3810586 4244525 4086911
$$ packed form
4491C89086M498J24948L1531k3762n0840P0351q1239n7338j3482K623q7442j15673
4479A93261J96039k2213j03905o0204J23194J01098K40941j34146m923N2862o7258
4468E14746j00318R6841J4293j6729o144k147J4180K8045l63J07925K87357j35970
4456H01716k68198J30620j4089j2620j42643j85671J55099J43030K7909r4350
4446E40803m2622K31079m7289r9395L04559j85839j21590L04739j29576J5946
4436G70815N7486M5014j4946J68603k01959j38941M0406L624j5115p7017L23218
4425I61188k33818J25163J18345J10432l3734K39846Q8139j6889m3592R4435P949
4414A417464R8619O8264J90235L60911M47376L13293N01690M12734M33939j57614
$$ plain form
4404 4086911 3522614 3090433 2630152 2281193 2030624 1811072 1542337 1506079 1385406 1429514
4394 1429514 1432125 1242128 1137197 1247384 1126907 913043 940863 911968 945054 1027587 985508
4383 985508 980731 1209532 1103643 1250531 985399 539786 591687 829349 963562 974703
4373 974703 1070154 964062 726553 738808 887704 793331 787557 539498 556896 732038 761409
4362 761409 822323 715092 856223 1187356 1020307 930685 922023 1043723 1094079 1328148 1414121
4351 1414121 1426568 1503157 1882988 2163473 2421451 2370816 2185416 2010236 1870440 1750349
4341 1750349 1455830 1185634 1313141 1417470 1071582 1044074 1086526 1105460 947149 925146
4331 925146 1170938 1389185 1689054 1924169 2258464 2237541 2351094 2017758 1660501 1394047
$$ packed form
4404D086911n64297m32181m60281l48959k50569k19552k68735l6258j20673M4108
4394A429514K611j89997j04931J10187j20477k13864K7820k8895L3086Q2533m2079
4383I85508m777K28801j05889J46888k65132m45613N1901K37662J34213J1141
4373I74703R5451j06092k37509J2255J48896r4373n774k48059J7398J75142K9371
4362G61409O0914j07231J41131L31133j67049q9622q662J21700N0356K34069Q5973
4351A414121J2447P6589L79831K80485K57978n0635j85400j75180j39796j20091
4341A750349k94519k70196J27507J04329l45888k7508M2452J8934j58311k2003
4331I25146K45792K18247K99869K35115L34295k0923J13553l33336l57257k66454
$$ plain form
4321 1394047 967346 660503 563824 712447 629982 581197 604527 517702 256067 207765 377325
4310 377325 568390 537945 580160 431601 333225 349991 267009 425044 301514 383622 292903
4299 292903 112310 178696 272722 470833 416262 424463 357554 163309 243371 459866 191273
4288 191273 285338 403527 584404 623893 540289 474513 545492 581692 626285 659276 486090
4277 486090 331808 251781 258398 320082 367039 510044 254194 226170 339807 381499 441504
4266 441504 457219 354121 279198 411492 269136 191681 65654 270328 384718 233019
4256 233019 169080 162974 270897 272833 258796 263960 194005 228274 137112 220323 184426 329049
4244 329049 137228 152612 107322 130726 291197 345819 337511 355865 161500 174562 378787
$$ packed form
4321A394047m26701l06843r6679J48623q2465m8785K3330q6825k61635m8302J69560
4310C77325J91065l0445M2215j48559r8376J6766q2982J58035j23530Q2108r0719
4299B92903j80593O6386R4026J98111n4571Q201o6909j94245Q0062K16495k68593
4288A91273R4065J18189J80877L9489q3604o5776P0979L6200M4593L2991j73186
4277D86090j54282q0027O617O1684M6957J43005k55850k8024J13637M1692O0005
4266D41504J5715j03098p4923J32294j42356p7455j26027K04674J14390j51699
4256B33019o3939o106J07923J936j4037N164o9955L4269r1162Q3211l5897J44623
4244C29049j91821J5384m5290K3404J60471N4622q308J8354j94365J3062K04225
$$ plain form
4233 378787 294793 280785 484182 459382 382113 348396 304106 363928 274993 235911 108293
4222 108293 105649 305478 240643 180013 331460 375644 359936 275722 479232 271630 274254
4211 274254 361781 463659 590269 350723 189651 307504 316231 288244 141351 399508
4201 399508 498456 391233 197588 200818 205324 316361 234384 238668 212258 182384 251528 234022
4189 234022 267844 477195 293987 150543 186382 -6749 217680 86652 -104868 274133
4179 274133 170975 37179 300171 387470 373517 414213 458764 273242 243131 167660 344694
4168 344694 267319 383077 358475 349673 181333 248090 296029 345458 468610 439019 548776
4157 548776 385551 466281 660604 413559 368295 221807 91390 334192 219250 112337
$$ packed form
4233C78787q3994j4008K03397k4800p7269l3717m4290N9822q8935l9082j27618
4222A08293k644J99829o4835o0630J51447M4184j5708q4214K03510k07602K624
4211B74254Q7527J01878J26610k39546j61072J17853Q727k7987j46893K58157
4201C99508R8948j07223j93645L230M506J11037q1977M284k6410k9874O9144j7506
4189B34022L3822K09351j83208j43444L5839j93131K24429j31028j91520L79001
4179B74133j03158j33796K62992Q7299j3953M0696M4551j85522l0111p5471J77034
4168C44694p7375J15758k4602q802j68340O6757M7939M9429J23152k9591J09757
4157E48776j63225Q0730J94323k47045m5264j46488j30417K42802j14942j06913
$$ plain form
4147 112337 228521 369374 241152 290288 326483 359331 390459 456418 413148 417942 543918
4136 543918 451102 352590 242301 254742 497132 644382 634148 696975 720035 746520 863598
4125 863598 746755 507448 653031 764996 658219 633593 601215 560560 403511 319486
4115 319486 428013 585990 714827 581009 557376 442975 450900 412683 750207 897215
4105 897215 730755 809605 884236 983470 996445 1089941 687196 388963 486135 666687 509272
4094 509272 433646 408485 404207 418055 543130 446599 236929 393719 411220 323000 241235
4083 241235 557506 411144 308389 96666 445067 688563 616425 628335 822870 847431
4073 847431 728218 780008 719247 448515 430292 376060 359463 490865 385070 220418 120869
$$ packed form
4147A12337J16184J40853j28222M9136L6195L2848L1128O5959m3270M794J25976
4136E43918r2816r8512j10289J2441K42390J47250j0234O2827K3060K6485J17078
4125H63598j16843k39307J45583J11965j06777k4626l2378m0655j57049q4025
4115C19486J08527J57977J28837j33818k3633j14401P925l8217L37524J47008
4105H97215j66460P8850P4631R9234J2975R3496m02745k98233R7172J80552j57415
4094E09272p5626k5161m278J3848J25075r6531k09670J56790J7501q8220q1765
4083B41235L16271j46362j02755k11723L48401K43496p2138J1910J94535K4561
4073H47431j19213N1790o0761k70732j8223n4232j6597J31402j05795j64652r9549
$$ plain form
4062 120869 174249 248376 170543 258337 293081 212801 366153 571492 512405 319207 318798
4051 318798 209368 504127 332374 466402 372401 330662 468907 444721 409847 546485
4041 546485 488833 347189 275035 430804 549389 499077 436192 287261 182238 137840 237349
4030 237349 430065 399102 401439 456546 628113 678862 722691 618041 596065 480080 460694
4019 460694 496847 491288 481296 552873 543645 548027 742275 837654 964603 864708 888122 620617
4007 620617 556656 632899 604325 647294 686932 608735 689631 690335 600000 565519 451210 360892
3995 360892 508020 520623 459071 684134 572339 558610 621656 665913 572151 464347 356371
3984 356371 457351 553715 533086 492931 479834 798310 829377 685709 614167 767386 675891
$$ packed form
4062A20869N3380P4127p7833Q7794L4744q0280J53352K05339n9087j93198m09
4051C18798j09430K94759j71753J34028r4001m1739J38245k4186l4874J36638
4041E46485n7652j41644p2154J55769J18585n0312o2885j48931j05023m4398R9509
4030B37349J92716l0963K337N5107J71567N0749M3829j04650k1976j15985j9386
4019D60694L6153n559r992P1577r228M382J94248R5379J26949r9895K3414k67505
4007F20617o3961P6243k8574M2969L9638p8197Q0896P04r0335l4481j14309r0318
3995C60892J47128J2603o1552K25063j11795j3729O3046M4257r3762j07804j07976
3984C56371J00980R6364k0629m0155j3097L18476L1067j43668p1542J53219r1495
$$ plain form
3973 675891 512604 345160 644324 698426 793574 840258 780486 880081 757876 860365 950345
3962 950345 845787 1101510 1085639 1011239 988159 963647 1101240 1030514 1108718 1121949 1067337
$$ packed form
3973F75891j63287j67444K99164N4102R5148M6684n9772R9595j22205J02489Q9980
3962I50345j04558K55723j5871p4400k3080k4512J37593p0726P8204J3231n4612
$$ [...]
##END NTUPLES=NMR SPECTRUM
##END=
