##TITLE=1H_EC-3308(2)
 DMSO
 8 sc, 
 26.12.2023
##JCAMPDX= 6.0         $$ Bruker NMR JCAMP-DX V2.0
##DATA TYPE= NMR SPECTRUM
##DATA CLASS= NTUPLES
##ORIGIN= UXNMR, Bruker Analytische Messtechnik GmbH
##OWNER= root
$$ XWIN-NMR		Version 3.5
$$ Tue Dec 26 14:14:58 2023 Russian Standard Time (UT+4h)  she@DPX200
##.OBSERVE FREQUENCY= 200.1313
##.OBSERVE NUCLEUS= ^1H
##.ACQUISITION MODE= SIMULTANEOUS
##.ACQUISITION SCHEME= undefined
##.AVERAGES= 8
##.DIGITISER RES= 18
##SPECTROMETER/DATA SYSTEM= spect
##.PULSE SEQUENCE= zg30
##.SOLVENT NAME= DMSO
##.SHIFT REFERENCE= (INTERNAL, DMSO, 0, 15.5111)
##AUDIT TRAIL= $$ (NUMBER, WHEN, WHO, WHERE, WHAT)
$$ ##TITLE= Audit trail, XWIN-NMR		Version 3.5
$$ ##JCAMPDX= 5.01
$$ ##ORIGIN= Bruker BioSpin GmbH
$$ ##OWNER= she
$$ F:/spectra/data/she/nmr/H-F/1/pdata/1/auditp.txt
$$ ##AUDIT TRAIL=  $$ (NUMBER, WHEN, WHO, WHERE, WHAT)
(   1,<2023-12-26 14:13:20.76 +0400>,<she>,<DPX200>,
      <created by zg, POWCHK disabled, PULCHK disabled
       configuration hash MD5:
       00 E9 B6 7A A2 85 ED C7 34 08 36 98 17 FE 4E 26
       data hash MD5: 16K
       EE 4B 30 76 B3 20 D7 2C C9 01 CC 60 BB 38 C1 97>)
(   2,<2023-12-26 14:13:22.96 +0400>,<she>,<DPX200>,
      <Start of raw data processing
       efp BC_mod = 2 LB = 0.24 FT_mod = 6 PKNL = 1 PHC0 = -24597.29 PHC1 = 14.65273 SI = 16K 
       data hash MD5: 16K
       BD 11 16 63 19 27 E2 74 35 5A C6 1B F3 91 34 3A>)
(   3,<2023-12-26 14:13:47.12 +0400>,<she>,<DPX200>,
      <pk PHC0 = -0.8267668 PHC1 = -0.7999978 
       data hash MD5: 16K
       1E 58 F3 BC 9F 8B 2E C4 97 7F 66 4A 2F 3F 82 31>)
(   4,<2023-12-26 14:13:50.96 +0400>,<she>,<DPX200>,
      <abs ABSG = 5 
       data hash MD5: 16K
       65 39 B0 6A D3 6A E9 60 27 03 EB 1C 32 35 FB F7>)
(   5,<2023-12-26 14:14:23.00 +0400>,<she>,<DPX200>,
      <pk PHC0 = 1.750388 PHC1 = -3.8 
       data hash MD5: 16K
       B2 F8 2A 64 A7 F3 64 A1 65 98 DE 94 49 FD 18 A8>)
(   6,<2023-12-26 14:14:26.07 +0400>,<she>,<DPX200>,
      <abs ABSG = 5 
       data hash MD5: 16K
       A2 1B 5C 7A 0C 8E E3 92 62 90 63 9D 88 36 99 BA>)
$$ ##END=
$$ 
$$ hash MD5
$$ 80 F9 FC 1E 62 F6 52 56 13 E5 C1 FF 60 09 28 DF
##$RELAX= 
##$RELAX= 
##$RELAX= 
##$RELAX= 
##$RELAX= 
##$RELAX= 
$$ Bruker specific parameters
$$ --------------------------
##$DU= <F:/spectra>
##$EXPNO= 1
##$NAME= <H-F>
##$PROCNO= 1
##$TYPE= <nmr>
##$USER= <she>
##$AMP= (0..31)
100 100 100 100 100 100 100 100 100 100 100 100 100 100 100 100 100 100 
100 100 100 100 100 100 100 100 100 100 100 100 100 100 
##$AQSEQ= 0
##$AQ_mod= 1
##$AUNM= <au_zg>
##$AUTOPOS= <>
##$BF1= 200.13
##$BF2= 200.13
##$BF3= 200.13
##$BF4= 200.13
##$BF5= 200.13
##$BF6= 200.13
##$BF7= 200.13
##$BF8= 200.13
##$BYTORDA= 1
##$CFDGTYP= 0
##$CFRGTYP= 5
##$CHEMSTR= <none>
##$CNST= (0..31)
1 1 145 1 1 1 1 1 1 1 1 1 1 1 1 1 1 1 1 1 1 1 1 1 1 1 1 1 1 1 1 1 
##$CPDPRG= <>
##$CPDPRG1= <>
##$CPDPRG2= <>
##$CPDPRG3= <>
##$CPDPRG4= <mlev>
##$CPDPRG5= <mlev>
##$CPDPRG6= <mlev>
##$CPDPRG7= <mlev>
##$CPDPRG8= <mlev>
$$ [...]
##$SUBNAM3= <"">
##$SUBNAM4= <"">
##$SUBNAM5= <"">
##$SUBNAM6= <"">
##$SUBNAM7= <"">
##$SUBNAM8= <"">
##$SUBNAM9= <"">
##$SW= 18.0517328524113
##$SWIBOX= (0..15)
0 0 2 0 0 0 0 0 0 0 0 0 0 0 0 0 
##$SW_h= 3612.71676300578
##$TD= 16384
##$TD0= 1
##$TE= 0
##$TE2= 300
##$TE3= 300
##$TEG= 300
##$TL= (0..7)
0 120 120 120 120 120 120 120 
##$TP= (0..7)
150 150 150 150 150 150 150 150 
##$TP07= 0
##$TPNAME0= <>
##$TPNAME1= <>
##$TPNAME2= <>
##$TPNAME3= <>
##$TPNAME4= <>
##$TPNAME5= <>
##$TPNAME6= <>
##$TPNAME7= <>
##$TPOAL= (0..7)
0.5 0.5 0.5 0.5 0.5 0.5 0.5 0.5 
##$TPOFFS= (0..7)
0 0 0 0 0 0 0 0 
##$TUNHIN= 0
##$TUNHOUT= 0
##$TUNXOUT= 0
##$USERA1= <user>
##$USERA2= <user>
##$USERA3= <user>
##$USERA4= <user>
##$USERA5= <user>
##$V9= 5
##$VALIST= <valist>
##$VCLIST= <CCCCCCCCCCCCCCC>
##$VD= 0
##$VDLIST= <DDDDDDDDDDDDDDD>
##$VPLIST= <PPPPPPPPPPPPPPP>
##$VTLIST= <TTTTTTTTTTTTTTT>
##$WBST= 1024
##$WBSW= 4
##$XGAIN= (0..3)
0 0 0 0 
##$XL= 0
##$YL= 0
##$YMAX_a= 133123
##$YMIN_a= -125314
##$ZGOPTNS= <>
##$ZL1= 120
##$ZL2= 120
##$ZL3= 120
##$ZL4= 120
##$ABSF1= 15.5111
##$ABSF2= -2.54075
##$ABSG= 5
##$ABSL= 3
##$ALPHA= 0
##$AQORDER= 0
##$ASSFAC= 0
##$ASSFACI= 0
##$ASSFACX= 0
##$ASSWID= 0
##$AUNMP= <proc_1d>
##$AZFE= 0.1
##$AZFW= 0.1
##$BCFW= 0
##$BC_mod= 2
##$BYTORDP= 0
##$COROFFS= 0
##$CY= -3
##$DATMOD= 1
##$DC= 0
##$DFILT= <>
##$DTYPP= 0
##$F1P= 0
##$F2P= 0
##$FCOR= 1
##$FTSIZE= 16384
##$FT_mod= 6
##$GAMMA= 0
##$GB= 0
##$INTBC= 1
##$INTSCL= 3.70164e-10
##$ISEN= 128
##$LB= 0.24
##$LEV0= 0
##$LPBIN= 0
##$MAXI= 10000
##$MC2= 0
##$MEAN= 0
##$ME_mod= 0
##$MI= 1.114404
##$NCOEF= 0
##$NC_proc= -6
##$NLEV= 6
##$NOISF1= 3.799351
##$NOISF2= 2.8
##$NSP= 0
##$NTH_PI= 0
##$NZP= 0
##$OFFSET= 15.5111
##$PC= 1
##$PHC0= -24596.37
##$PHC1= 10.05273
##$PH_mod= 1
##$PKNL= yes
##$PPARMOD= 0
##$PSCAL= 0
##$PSIGN= 0
##$REVERSE= no
##$SF= 200.130002121651
##$SI= 16384
##$SIGF1= 3
##$SIGF2= 2
##$SINO= 5.538805
##$SIOLD= 16384
##$SREGLST= <1H.CDCl3>
##$SSB= 0
##$STSI= 16384
##$STSR= 0
##$SW_p= 3612.71676300578
##$SYMM= 0
##$S_DEV= 0
##$TDeff= 16384
##$TDoff= 0
##$TI= <>
##$TILT= no
##$TM1= 0
##$TM2= 0
##$TOPLEV= 0
##$USERP1= <user>
##$USERP2= <user>
##$USERP3= <user>
##$USERP4= <user>
##$USERP5= <user>
##$WDW= 1
##$XDIM= 16384
##$YMAX_p= 305410214
##$YMIN_p= -340562
$$ End of Bruker specific parameters
$$ ---------------------------------
##NTUPLES= NMR SPECTRUM
##VAR_NAME=  FREQUENCY,     SPECTRUM/REAL,   SPECTRUM/IMAG
##SYMBOL=    X,             R,               I
##VAR_TYPE=  INDEPENDENT,   DEPENDENT,       DEPENDENT
##VAR_FORM=  AFFN,          ASDF,            ASDF
##VAR_DIM=   16384,         16384,           16384
##UNITS=     HZ,            ARBITRARY UNITS, ARBITRARY UNITS
##FACTOR=    0.220516191357247, 1,           1
##FIRST=     3104.23643895887, 0,            0
##LAST=      -508.480324046911, 0,           0
##MIN=       -508.480324046911, -340562,     0
##MAX=       3104.23643895887, 305410214,    0
$$ Real data points
##PAGE= N=1
##DATA TABLE= (X++(R..R)), XYDATA
$$ [...]
8746B632556k01850j68285j15958p9039k8639o04j2403O6249m5407r8781m8549
8735A899290L6489M4865q4526j43813p3394n0886o5010N750r0511o1636k5486
8724A391132l6075L5878j31553o1083j2288k4671P2091o8410n9629k0794j8799
8713A065799p785j50535q6447L1097L8162j04208r1892O3301j38129J54292p2687
8702G00968q7030k1213o457m0587R8860k3879Q4151o0850j06193R1396o9307M164
8690E64023o0948r019N7510k3227m9164N0230j30993K504J7131q8124M5311K2418
8678C97652n2178q4087K5597J9102m2805O994j1617O5924q269K3378j961N0386
8666C88116p6212J42437r180p6682p3759O8399J5154L8311j3223l1160o7733N4852
$$ plain form
8746 2632556 2430706 2262421 2146463 2067424 2038785 2038181 2025778 2092027 2046620 1947839 1899290
8735 1899290 1935779 1980644 1896118 1752305 1678911 1628025 1563015 1568765 1478254 1416618 1391132
8724 1391132 1355057 1390935 1259382 1198299 1186011 1161340 1233431 1165021 1105392 1084598 1065799
8713 1065799 1058014 907479 821032 852129 890291 786083 694191 757492 619363 773655 700968
8702 700968 613938 592725 586268 545681 644541 620662 704813 643963 537770 629166 559859 564023
8690 564023 503075 494056 551566 528339 479175 529405 398412 400916 418047 329923 375234 397652
8678 397652 345474 261387 286984 306086 263281 270275 258658 324582 316313 339691 337730 388116
8666 388116 311904 454341 445161 368479 294720 363119 378273 416584 403361 372201 304468 359320
8654C59320Q3564j52934q0012j4860J71525l4143m9656J5666m5042N6563j1113
8643B98878j0095j1021K0678q1480o0890p1028q6348L266J15345Q3618J1087l0168
8631A81842o4351O7237j2296K8622L0450J2860P4839n9618j89664p6464P2488
8620F5945J10537j01957m5443J2914K3464N5739j10028n0586O9366L7066L6713
8609A03730l1333n553J6649N6543p1907n0165m1145M3246j6319K1111J16310P2514
8597B13681p5416o4552P2744P8596q6224j3922k5436J27152O2425j49802l3133
8586A06113R6621j02042k71004J44904L8170N2844M1019q5046J8051L8590j19122
8575d0902l7169K2913o8087M8372R9317J29299n9300M2853K7651p3987N2466r0296
$$ plain form
8654 359320 442884 289950 209938 195078 366603 332460 282804 298470 253428 309991 298878
8643 298878 288783 277762 298440 216960 156070 85042 -1306 1960 117305 200923 212010 181842
8631 181842 117491 184728 172432 201054 231504 244364 319203 259585 69921 -6543 65945
8620 65945 176482 74525 29082 41996 65460 121199 11171 -39415 29951 67017 103730
8609 103730 72397 66844 83493 140036 68129 17964 -23181 20065 3746 24857 141167 213681
8597 213681 138265 73713 146457 225053 138829 124907 99471 226623 289048 139246 106113
8586 106113 202734 100692 -170312 -25408 12762 65606 106625 21579 39630 78220 -40902
8575 -40902 -78071 -55158 -123245 -74873 24444 153743 94443 137296 164947 90960 143426 53130
8563E3130r2328Q2288o6709k5595N3645n1451j07478Q5592P9615l1176K4947k6520
8551b2040k4728p3003J3461L5054J13054L7337n1804m7384L4968n7473J05202
8540F2644J858o4519n1613K1700M7968L1338R934l3354P3342j0252o9557K5215
8528D4704K0979p4994r382n918l9439L993Q6062K0148m8716K5796K6958q90m6530
8515B771j356P5498J5369m5338n5170K6387J5638K8268k0528j07007l8964J5812
8503h8620J15227M7313j26351n2616Q9510J09885j5616L4948o4537p052M3799
8492H5890j17781n8242L0584O7312O7941N055k4304o7469O8095O7618n8797j30502
8480f4600Q1471Q4739L4170k4054o6035j9992r798n9220k2921Q3415m2026l4680
$$ plain form
8563 53130 -39198 43090 -23619 -49214 4431 -47020 -154498 -68906 10709 -20467 4480 -22040
8551 -22040 -46768 -119771 -106310 -71256 41798 79135 27331 -20053 14915 -42558 62644
8540 62644 64502 -17 -51630 -29930 18038 49376 59310 25956 99298 89046 19489 44704
8528 44704 65683 -9311 -18693 -24611 -64050 -60057 26005 46153 -2563 23233 50191 49301 2771
8515 2771 1415 76913 92282 46944 -8226 18161 33799 62067 41539 -65468 -104432 -88620
8503 -88620 26607 73920 -52431 -105047 -15537 94348 78732 113680 49143 42091 85890
8492 85890 -31891 -90133 -59549 7763 75704 80759 56455 -11014 57081 124699 65902 -64600
8480 -64600 16871 101610 135780 111726 45691 25699 15901 -43319 -66240 17175 -24851 -59531
8468e9531n3239P6054m6834Q7299J25461m492k850q3621K0090L487j26712J22661
8456E7773R5335j56471L5439K1447m449o9392N7739K3620J9147n3156K0221Q6969
8444A34222J3253n6465n7756N4280L0966l5443o7091M2316p3696m1846K6842J50159
8432A19741R8522j24899l7112m5321K8944N7613l3048k4732K0252P5344p5100
8421F0204N5081j62758J0802Q5184q750k0334M4476O9952q2441J00667j21860
8410C0223k533k3545j9517K6004m2131Q3306o749j04605K4090J5988p2937R4354
8398A948J5617o3862p1038J0635l201n7493J9253O393n0876m5698K06010O7698
8386C5386n0244j51346K2672O3447o2723K0871R1314k1943p7224Q8719O7590K3716
$$ plain form
8468 -59531 -112770 -36716 -83550 3749 129210 124718 121868 38247 58337 61824 -64888 57773
8456 57773 153108 -3363 32076 53523 49074 -20318 37421 61041 80188 27032 47253 134222
8444 134222 147475 91010 33254 87534 118500 83057 15966 58282 -15414 -57260 -30418 119741
8432 119741 218263 93364 56252 10931 39875 97488 64440 39708 59960 135304 60204
8421 60204 115285 -47473 -36671 48513 39763 19429 63905 133857 51416 152083 30223
8410 30223 27690 4145 -15372 10632 -31499 51807 45058 -59547 -35457 -19469 -92406 1948
8398 1948 17565 -46297 -117335 -106700 -109901 -167394 -148141 -141748 -192624 -238322 -32312 35386
8386 35386 -14858 -166204 -143532 -80085 -142808 -121937 -30623 -52566 -129790 -41071 26519 50235
8374E0235k15200O0786O4252r1791N4163M9629l5094k4134l5275J791J3443Q0882
8362b6313K5021L1207j27881M7984J534J3590j3449j03539J09933M0294p5138
8351g6757l5808m1891N3129j0369q9251N6918J14106R3791L869q9643k6372K8838
8339a9440K7845P076J8475k645Q079j6743j10284P5978n6878o2673M2431P459
8327h1320p7165N3927J07038p3349j18001Q0608N8397m6799j7815L3926j1969
8316i2522J02293m6367n1408K4485J04359J0516m6904K043j7801k0998K2875l6621
8304d6050p1068P3425q5897J606J07439M1810j35288n526N6713p055P9602r2311
8292h2600n0900q2726L0167R4728N6544k6815K186j3173j21330J49699J07063
$$ plain form
8374 50235 -164965 -104179 -39927 -131718 -77555 -27926 -63020 -87154 -122429 -120638 -107195 -26313
8362 -26313 -1292 29915 -97966 -49982 -48448 -34858 -48307 -151846 -41913 -1619 -76757
8351 -76757 -112565 -154456 -101327 -111696 -200947 -144029 -29923 63868 67737 -21906 -48278 -19440
8339 -19440 8405 15481 33956 31311 39390 22647 -87637 -11659 -68537 -131210 -88779 -81320
8327 -81320 -158485 -104558 2480 -70869 -188870 -108262 -49865 -96664 -114479 -80553 -92522
8316 -92522 9771 -36596 -88004 -63519 40840 51356 4452 6495 -11306 -32304 -9429 -46050
8304 -46050 -117118 -43693 -129590 -127984 -20545 21265 -114023 -119549 -62836 -69891 9711 -82600
8292 -82600 -133500 -216226 -186059 -91331 -34787 -61602 -59416 -72589 -193919 -44220 62843
8281F2843r7098N1477J47403j00850j21947K8429K6436J3903j83796L2247O9219
8270g1734R4463p7494M2341L3899o3821K1018m5476L3608K3732j0008P2678o9061
8258a5855j63171J2335O0339O2833l569q7999r9190J03941K2574l5355l3941P0785
8246a06273j391K6224m4482r4264M7978L7185o8615R0418K8807Q807m7516j4521
8234a37643j5054r5531m1957R2431Q0000k8706k3076L0523K6102m4902M9557J13131
8222D875L6399j19748r4367l0919J05658N4262k5852K4427p0572j2002M6989p7760
8210a58610l2874l5355p2008J54128K0803K7636M4920j6045L121j6503l8965R8486
8198b1266L4595p4287J3914P0690J1096N2670J94418k02827o4417k5586Q7487
$$ plain form
8281 62843 -34255 17222 164625 63775 -58172 -29743 -3307 10596 -173200 -140953 -71734
8270 -71734 22729 -54765 -12424 21475 -42346 -21328 -66804 -33196 -9464 -19472 53206 -15855
8258 -15855 -179026 -166691 -106352 -43519 -47088 -135087 -234277 -130336 -107762 -143117 -177058 -106273
8246 -106273 -107664 -81440 -125922 -220186 -172208 -135023 -203638 -113220 -84413 -75606 -123122 -137643
8234 -137643 -152697 -248228 -290185 -197754 -117754 -146460 -169536 -139013 -112911 -157813 -108256 4875
8222 4875 41274 -78474 -172841 -203760 -98102 -43840 -69692 -45265 -115837 -127839 -80850 -158610
8210 -158610 -191484 -226839 -298847 -144719 -123916 -96280 -51360 -67405 -64284 -80787 -119752 -21266
8198 -21266 13329 -60958 -47044 23646 34742 87412 281830 79003 14586 -11000 76487
8187G6487j3537o4675n0767n9577l7171k0014l8341o406O9768J6782l697L909
8175a27239l7971p5361J50592p5384l1926Q5086J202k051N0737k8039L3415n9555
8163a16494m4504K2518q678J06146k8931j28277l325J57102J027j37980J00253
8152h1143k2388n7642J07039K519L2860j58773m9123R6160J081J9637j00196O9389
8140a40580O3187L934L3550Q2076j96286J10027M9994j0523O309o6678L0886q4609
8128a18713L0200m6057N664N3044m9531j8979p5234J9522J45962n8321n1010l7204
8116b00657J84175J0365m0924j9288r285m9797L7562J0646L0653j0177p9299r3129
8104b29155K6560O8494l7936M7457j00J09263J4509j11399n5747M3248J6068n5745
$$ plain form
8187 76487 62950 -1725 -52492 -112069 -149240 -169254 -207595 -214001 -144233 -127451 -131148 -127239
8175 -127239 -165210 -240571 -89979 -165363 -197289 -112203 -111001 -113052 -62315 -90354 -56939 -116494
8163 -116494 -160998 -138480 -147158 -41012 -69943 -198220 -201545 -44443 -43416 -181396 -81143
8152 -81143 -103531 -161173 -54134 -51615 -18755 -177528 -226651 -130491 -129410 -109773 -209969 -140580
8140 -140580 -77393 -73459 -39909 42167 -154119 -44092 5902 -4621 1688 -64990 -34104 -118713
8128 -118713 -88513 -134570 -128906 -75862 -125393 -144372 -219606 -200084 -54122 -112443 -163453 -200657
8116 -200657 -16482 -6117 -47041 -66329 -75614 -125411 -87849 -77203 -46550 -56727 -136026 -229155
8104 -229155 -202595 -134101 -172037 -124580 -124680 -15417 -908 -112307 -168054 -124806 -108738 -164483
8092a64483m5599j5007j409O2915J40445k7454q6372k7265L2649k3945J5452N9194
8080h0879n7259Q8790L2407j8785m953Q5076L645j22802M545n3037N9841k147
8068f5558q2179J6142j51641R9532R8261K383M0515L4605o1591o6031P4123l1790
8056i3229M8778N8946M3951j34693p3597J216P3242j1166O739K808q7500N1568
8044a12937J14779K7141j27608J3579N4409j604k8574J5733O6980L5351j53591
8033i6342J7553L5290j2924l1910R354p976J5149L6939r9231l2308l0462N1972
8021a44896J49137R3889j01785n1177m4839k7227K9318R4508J7930Q0387K8145
8010A23390r3821o6713o8052j11718j913k0284R2828k4592R625N757k3602K1427
$$ plain form
8092 -164483 -210082 -225089 -226498 -163583 -23138 -50592 -136964 -164229 -131580 -155525 -140073 -80879
8080 -80879 -138138 -49348 -16941 -35726 -40679 44397 48042 -74760 -70215 -123252 -63411 -65558
8068 -65558 -147737 -131595 -283236 -183704 -85443 -83060 -42545 -7940 -69531 -135562 -61439 -93229
8056 -93229 -44451 14495 58446 -76247 -149844 -148628 -75386 -86552 -79813 -77005 -164505 -112937
8044 -112937 1842 28983 -98625 -85046 -30637 -32241 -60815 -45082 21898 57249 -96342
8033 -96342 -78789 -43499 -56423 -88333 -78979 -86955 -71806 -34867 -134098 -166406 -196868 -144896
8021 -144896 4241 98130 -3655 -54832 -99671 -126898 -97580 -3072 14858 95245 123390
8010 123390 29569 -37144 -105196 -216914 -218827 -239111 -146283 -170875 -161250 -155493 -179095 -157668
7998a57668N4566j28743J8883N0489K6178J24370j11524j32929j7870J46820l3429
7987a60857k6689j5440O0273M3331M160j7074k076N1337q9513j9218J72301m9895
7975d9360k6871K8528n7141k7200l452q2019k9901J05422K2632q527J23448o1041
7963f5482n4880M6237j5563j07839N3579R6958J0677p3961K687K8566M7305L3467
7951A751L3258J8080j62178J3754Q8648p2202n519p1214N0490P6676K9031j40
7939D35P4965r8662l3099K6004k1076l4349J7154J7790k5560k2850j00676M7271
7927a52653J0656N5798n8645M0283k5545k6705K0661L6501M6955j00760L2213
7916a21241q0706l9457Q1638M7079M4056q1093P5462K6916l7195j6614k0444K5465
$$ plain form
7998 -157668 -103102 -231845 -212962 -162473 -136295 -11925 -123449 -256378 -274248 -127428 -160857
7987 -160857 -187546 -202986 -142713 -99382 -95222 -112296 -114372 -63035 -152548 -171766 535 -49360
7975 -49360 -76231 -47703 -104844 -132044 -135496 -217515 -247416 -141994 -119362 -127889 -4441 -65482
7963 -65482 -120362 -74125 -89688 -197527 -143948 -46990 -36313 -110274 -107587 -79021 -31716 1751
7951 1751 35009 53089 -109089 -95335 -6687 -78889 -84408 -155622 -105132 -28456 575 435
7939 435 75400 -23262 -56361 -30357 -51433 -85782 -68628 -50838 -76398 -99248 -199924 -152653
7927 -152653 -141997 -86199 -144844 -104561 -130106 -156811 -136150 -99649 -52694 -153454 -121241
7916 -121241 -201947 -241404 -159766 -112687 -68631 -149724 -74262 -47346 -84541 -101155 -121599 -96134
7904i6134J37597j23026l1089P5867l8721P0822l6032p4926p634l0249q259N0794
7892a10990J0581j1912L7918O443k0859N4763n5850p5809J30504j23110r9540
7881b57861J04369k6929P0943Q2758J0163m581q5414m7928K6365k7173J47764
7870g524r033L917N362K302q5906q0944M6169Q9065l2119l8744P3597L4368K6613
7857B7123N1472l3903r6332k8944j02554K8295L8193N6491N0502n6400R732J5541
7845d0784q8635j4150J27920M2584p7292k1703m2494M5046J4837M6719m1912n6254
7833a06118n9133J14127M0921j4743p6742l0166P7675R0870J13957j06077j05858
7822f1287k7301N8538J0706n8775p6307O9741L7573R5523N6472o9547K7796p3493
$$ plain form
7904 -96134 41463 -81563 -112652 -36785 -75506 -4684 -40716 -115642 -123276 -153525 -161784 -110990
7892 -110990 -100409 -112321 -74403 -67960 -88819 -34056 -89906 -165715 -35211 -158321 -257861
7881 -257861 -153492 -180421 -109478 -26720 -16557 -21138 -106552 -154480 -128115 -155288 -7524
7870 -7524 -16557 -12640 -7278 -4976 -90882 -171826 -125657 -36592 -68711 -107455 -33858 510 27123
7857 27123 78595 44692 -51640 -80584 -183138 -154843 -116650 -60159 -9657 -66057 -56325 -40784
7845 -40784 -129419 -143569 -15649 26935 -50357 -72060 -114554 -69508 -54671 -7952 -49864 -106118
7833 -106118 -165251 -51124 -10203 -24946 -101688 -131854 -54179 36691 150648 44571 -61287
7822 -61287 -88588 -30050 -19344 -78119 -154426 -84685 -47112 48411 104883 35336 63132 -10361
7810a0361L5652p3455p9689j6293L7108q806N7705J05117L7092q6410o6021j64566
7798b32927K7891q723l2821P3476M5722M3999n4271k7274R2554M1495p17p7019
7786a08615q008l1079Q9933n153j09397J9320J4547J30856l5365N3002N796o455
7774I382p5905o0672j8309P5088l0422K8387L9404p0990K6843J1633j82097M3699
7762b03959J19325M6993n1115K930R8039J29431r7130j3147j15926j8601Q6489
7751a6671o3801o70L1301j4155J0605N6135Q5239j6940n6275k898p6517l1135
7739i5782k5561m7033l4283N4892J76148R618n6353p9357j17567J0860M9676O1591
7727i3151M1200Q3398J3206j18222o3117n5134q4868N9437O3055m1182j7852l8344
$$ plain form
7810 -10361 25291 -48164 -127853 -144146 -107038 -115844 -58139 46978 84070 -2340 -68361 -232927
7798 -232927 -205036 -213759 -246580 -173104 -127382 -83383 -137654 -164928 -72374 -30879 -31596 -108615
7786 -108615 -116623 -147702 -57769 -62922 -172319 -152999 -138452 -7596 -42961 10041 15837 9382
7774 9382 -66523 -127195 -145504 -70416 -100838 -72451 -33047 -104037 -77194 -65561 -247658 -203959
7762 -203959 -84634 -37641 -88756 -85826 12213 141644 44514 31367 -84559 -103160 -16671
7751 -16671 -80472 -81142 -49841 -63996 -53391 2744 87983 71043 14768 11870 -64647 -95782
7739 -95782 -121343 -168376 -202659 -147767 28381 37999 -18354 -97711 -215278 -204418 -154742 -93151
7727 -93151 -51951 31447 44653 -73569 -136686 -191820 -276688 -217251 -154196 -195378 -213230 -251574
7715b51574M8407P2798L7732P5268P3494j51041q7812l760m6881J24058K5338
7704h3973j5468O5666m2475J6453K7552J941j9554q5234P2890o7290j8315O5525
7692h2282P312j05595M5905R0517L0177o7661n7138L2296J17312J9621q5223j09123
7680a63882Q3017k0135p8253M8718l4015J5030R3744P6827j4899n457o4331l0851
7668i4487L7719O3245n9103N2994j2320N0033r856n5372R145p4371o1772J27886
7656b6259J44152r8521m8420k3785l2920L145M5239k3014o0623R4251J4802m4437
7644e6390j2043N8196Q7433j37708k479P5464K5976M061k508j2169r42N096p7251
7631d5264J5525Q0391K9491n2941o2770q32m8046J2501J0411O2018p1707m9809
$$ plain form
7715 -251574 -203167 -130369 -92637 -17369 56125 -94916 -182728 -186488 -233369 -109311 -83973
7704 -83973 -99441 -33775 -76250 -59797 -32245 -30304 -49858 -135092 -62202 -129492 -147807 -82282
7692 -82282 -74970 -180565 -134660 -44143 -13966 -81627 -138765 -106469 10843 30464 -54759 -163882
7680 -163882 -80865 -101000 -179253 -130535 -164550 -149520 -55776 21051 6152 695 -63636 -94487
7668 -94487 -56768 6477 -52626 368 -11952 38081 28225 -27147 -18002 -92373 -154145 -26259
7656 -26259 117893 19372 -29048 -52833 -85753 -82608 -37369 -60383 -121006 -26755 -11953 -56390
7644 -56390 -68433 -10237 77196 -60512 -62991 12473 38449 42510 40002 27833 26891 31987 -45264
7631 -45264 -29739 50652 80143 27202 -35568 -36400 -84446 -71945 -61534 484 -71223 -121032
7619a21032P2750o3463L8239L7030q240K6171o6756P6063L8831J90948n7254r7661
7607F5626M2539j19751j5666j9148M6149K8714m1075Q8950n8362n0308n2378M0910
7595d3800N0569j0203o5229j7277L4407n1546R2957Q3119L4853n1872J2835j6291
7583E2522l3690L5910J5926l0382k2047K286M3060J05046q6329k6081J08281k5917
7571A38585O9563J754P9195m5099k8259n8810k1037J01402n0820l0723J88469
7560C44220M0055k7052o3471J55655K2911p5258J66216K18831J04806J06795K55780
7549A249488L68565O11561N59187N4498m34314n86019n66890k19525l00104j0827
7539G25620j42985o3388j33104K388m0892k06609p488m8573r257M3029J00264
$$ plain form
7619 -121032 -48282 -111745 -73506 -36476 -44716 -18545 -85301 -9238 29593 220541 163287 65626
7607 65626 108165 -11586 -27252 -46400 -251 28463 -12612 76338 17976 -32332 -84710 -43800
7595 -43800 6769 -3434 -68663 -85940 -51533 -103079 -10122 72997 107850 55978 68813 52522
7583 52522 18832 54742 70668 40286 18239 20525 63585 168631 82302 56221 164502 138585
7571 138585 208148 209902 289097 243998 215739 156929 135892 237294 186474 155751 344220
7560 344220 384275 357223 293752 449407 472318 397060 563276 782107 886913 993708 1249488
7549 1249488 1618053 2229614 2788801 2843299 2408985 1822966 1256076 1036551 736447 725620
7539 725620 582635 519247 386143 388531 347639 141030 133542 84969 75712 118741 219005
7528B19005o7128M1981k6939o3335L733q3594m791o6829M2783J32478m9668p5809
7516A887j6346N1601n9695j292R53m93l5807j0270p4135R4846M1954R8460p3138
7503A8525r6480M5741j2118O5619R715m4118N4584q2744k0717L0177Q9317K7189
7491H4690M1512L2307k0002j16772j2401N3764Q164n5161p3461r427l8759J4037
7479i1509j02113N233L2564Q6337o4638K9498Q2253q2188p9669n9085Q2690L4803
7467a25824J29m6505J17823j6124O1689K0471l2112L1849K4626j3479p6285n0617
7455a04359N9932O9605n1208n4865q4176k5510m2075R4205j4774J9369O1727q692
7443h0821N0207n1450M591J50222N5179N9847k42025l9904Q3650Q4391L1205j19701
$$ plain form
7528 219005 151877 193858 166919 103584 107317 23723 18932 -47897 -5114 127364 77696 1887
7516 1887 -14459 37142 -22553 -23845 -22892 -23385 -59192 -69462 -143597 -48751 -6797 91663 18525
7503 18525 -77955 -32214 -44332 21287 31002 -13116 41468 -41276 -61993 -31816 57501 84690
7491 84690 126202 158509 138507 21735 9334 63098 71262 16101 -57360 -66787 -105546 -91509
7479 -91509 -193622 -188389 -155825 -69488 -134126 -104628 -22375 -104563 -184232 -243317 -160627 -125824
7467 -125824 -125695 -172200 -54377 -70501 -8812 11659 -20453 11396 36022 22543 -53742 -104359
7455 -104359 -44427 25178 -26030 -80895 -165071 -190581 -232656 -138451 -153225 -133856 -72129 -80821
7443 -80821 -30614 -82064 -77473 72749 127928 187775 -54250 -94154 -10504 73887 105092 -14609
7431a4609q5005Q8227l7099m1456n1114J4224p6107J793J495Q4719M9842n435
7419g0525K4819q7441O9071m7377l4199J12521l835P623L5044O516L3172j4177
7407C1212m3102o489Q158p9847l4604J09254j02025N139O3956J04086q4961j84037
7395b13260N6728J42190m9593m2622K6024k4071j4170p9991L292p19J03227J15774
7383B2809l3049m6514K1318q6722m4687Q6218J24778j77743J9943l9771p0668
7372b24088M3119J18221K1122J0297p0660M4392K1375j13149Q2684r3687M4887
7361a15487j4540J5975J61470N6910q3822n1052m4289j79182J7045K6843j5883
7350b26012J618J26679k4787n9204K3846J8479K9297J47690j42369M2828J4921
$$ plain form
7431 -14609 -99614 -11387 -48486 -89942 -141056 -126832 -202939 -201146 -199651 -114932 -65090 -70525
7419 -70525 -45706 -133147 -64076 -111453 -145652 -33131 -36966 -29343 5701 12217 45389 31212
7407 31212 -11890 -18379 -10221 -90068 -124672 -15418 -117443 -112304 -48348 55738 -29223 -213260
7395 -213260 -156532 -14342 -63935 -106557 -80533 -104604 -118774 -198765 -195473 -196192 -92965 22809
7383 22809 -10240 -56754 -35436 -122158 -166845 -80627 44151 -133592 -113649 -153420 -224088
7372 -224088 -180969 -62748 -41626 -31329 -101989 -57597 -36222 -149371 -66687 -160374 -115487
7361 -115487 -130027 -114052 47418 104328 20506 -30546 -74835 -254017 -236972 -210129 -226012
7350 -226012 -224394 -97715 -122502 -181706 -157860 -139381 -110084 37606 -104763 -61935 -47014
7339d7014q3973M8445N3744P8314j22835P3250P582j16877j01143Q3936o4987
7328a91558K672P242J13042m4124M2814K9989r8540O5828M0421O9023O7537l711
7316A00635m4913p3240n1640k7625P8567K1439J9492L8121j7787m0261n0747K7638
7304b0321n3413q9780M8846J22787j19089O8357n5478K638k1767q1536R1618M316
7292a02822k0937J2187K0611N4101N7663N4553n6030r9026q0348k787o947P8144
7280i1638K8604j7518o2017n0301R5846J1642j0885N3288m8630j05623L6540J04765
7268e5927n0497J472m9959O5411L3341L130m8600K5610P1146K1797q1598N6266
7256h408j06140P0882J20575j17583K9282o7829P7086j08653n708R6606L8247
$$ plain form
7339 -47014 -130987 -82542 -28798 49516 -73319 -69 7513 -109364 -210507 -126571 -191558
7328 -191558 -188886 -181644 -68602 -112726 -69912 -39923 -138463 -72635 -32214 36809 104346 100635
7316 100635 55722 -17518 -69158 -96783 -18216 3223 22715 60836 43049 2788 -47959 -20321
7304 -20321 -73734 -163514 -114668 8119 -110970 -42613 -98091 -95453 -117220 -198756 -107138 -102822
7292 -102822 -123759 -111572 -90961 -36860 20803 75356 19326 -79700 -160048 -162835 -169782 -91638
7280 -91638 -63034 -80552 -142569 -192870 -97024 -85382 -96267 -42979 -91609 -197232 -160692 -55927
7268 -55927 -106424 -104952 -154911 -89500 -56159 -53029 -101629 -76019 -4873 16924 -64674 -8408
7256 -8408 -114548 -43666 76909 -40674 -11392 -79221 -2135 -110788 -116496 -19890 18357
7245A8357n6139J454o3841Q52m4387l776M9277N0666j0266p4607J31707p08j50349
7232a51760Q1813q3598o9821m0270K9919P2200j3869l2754J55516K3784p7963
7221a06803k5849L9496M0266N5045o0233J3298m0710Q1943p6495p9700K5067J03723
7209c0952L7108j69853N1245L4613J12353r5471l9988N9828M9295o6192J3610
7198d4404L4705K9048j65830m7404O6985j1767P0433R6129J27732j50001j07834
7187a02208N9373J3830n549N3576Q7313o3970M3271o8343J7226l9886M6900l1314
7175A0219j48578J0082N0351Q5505L8786M4646j04329o6529j26332L0929K2654
7164a52596j4069J089j6290Q0100P4081n5453p5739j0532J95688Q721n7012J30560
$$ plain form
7245 18357 -37782 -36328 -100169 -99317 -143704 -147480 -98203 -47537 -57803 -132410 -703 -1411 -151760
7232 -151760 -69947 -153545 -223366 -263636 -233717 -161517 -175386 -208140 -52624 -28840 -106803
7221 -106803 -132652 -93156 -52890 2155 -58078 -44780 -85490 -3547 -80042 -159742 -134675 -30952
7209 -30952 6156 -163697 -112452 -77839 34514 -60957 -100945 -41117 8178 -58014 -44404
7198 -44404 -9699 19349 -146481 -193885 -126900 -138667 -68234 27895 155627 5626 -102208
7187 -102208 -42835 -29005 -34554 19022 106335 42365 85636 17293 34519 -5367 41533 10219
7175 10219 -138359 -128277 -77926 7579 46365 91011 -13318 -79847 -206179 -175250 -152596
7164 -152596 -166665 -165576 -181866 -101766 -27685 -83138 -158877 -169409 26279 35000 -22012 108548
7152A08548m8951o1714p966K0336j3569l5252M6423O0448k82m4897K2067n6407
7140a1216j3073N6636m6071o0004P697Q7776k799o8778P6510K7977M0044l6536
7128E8163k24608R7072O2579J6174p4343p320K6419M9662K734j7290m2407o9449
7116a22614o9105Q8760Q2278k3620m199L1269j03947K3532R6045M419L8389j47854
7104a06647N5099Q0427l7473J3121k4695p8317P773r0939J2596J8507Q6310K0419
7092d3819J6055l0241K0348P6280J0783N7756j28313l7189N6045J9287k8292r3964
7080a05264r4847R5730m2223n9985K20165n7723p1422M2623L6452k7024M4540
7069a8978m2520n4075o896J04037R8606L499j40664k957R2168k2846p9961j2554
$$ plain form
7152 108548 59597 -2117 -10083 10253 -3316 -38568 7855 68303 68021 23124 45191 -11216
7140 -11216 -24289 32347 -13724 -73728 -66031 21745 18946 -49832 26678 54655 94699 58163
7128 58163 -166445 -69373 -6794 9380 -64963 -72283 -45864 3798 6532 -10758 -53165 -122614
7116 -122614 -191719 -102959 -20681 -44301 -48500 -17231 -121178 -97646 -1601 2818 41207 -106647
7104 -106647 -51548 28879 -8594 4527 -20168 -98485 -90712 -181651 -169055 -150548 -64238 -43819
7092 -43819 -27764 -58005 -37657 38623 49406 107162 -21151 -58340 -2295 16992 -11300 -105264
7080 -105264 -200111 -104381 -146604 -206589 13576 -44147 -115569 -72946 -36494 -63518 -18978
7069 -18978 -61498 -115573 -122469 -18432 80174 83673 -56991 -59948 32220 9374 -70587 -83141
7057h3141l9713n8196J33985o5525m2833k7352J06060J1661J3348R5570K6155
7046G0019q5076o2864n5699L6141J02740J47740p3708n0340j45417o7890N5404
7035a28950R0755J08673k7212o8996K5982L3608o3153K9074m0386n2951K5694
7024f7862o6089l4497N3106K7595J3820J1363J4381k4473r6403J1226K5377q32
7012a33288M4184N6317o3068j30253M9201L8295J58676J0920o7609Q126M2905
7001A4406R0624j29922p2124L5789M8901k8568p7739O2595j4996n356K6520M2241
6989g629l834q5528L8354l1772J2589Q4659L075K059k1556L6104j00970Q9609
6977A5160l054n4317M387m3299l02j2244k7566O3518R6556m6674j17245J2395
$$ plain form
7057 -83141 -122854 -181050 -47065 -112590 -155423 -182775 -76715 -65054 -51706 43864 70019
7046 70019 -15057 -77921 -133620 -97479 5261 153001 79293 28953 -116464 -184354 -128950
7035 -128950 -38195 70478 43266 -25730 252 33860 -29293 -219 -40605 -93556 -67862
7024 -67862 -133951 -168448 -115342 -87747 -73927 -62564 -48183 -72656 -169059 -157833 -132456 -133288
7012 -133288 -89104 -32787 -95855 -226108 -176907 -138612 20064 30984 -36625 -28499 14406
7001 14406 105030 -24892 -97016 -61227 -12326 -40894 -118633 -56038 -71034 -76390 -49870 -7629
6989 -7629 -11463 -96991 -58637 -90409 -77820 6839 9914 11973 -9583 26521 -74449 15160
6977 15160 12106 -42211 -37824 -81123 -81425 -93669 -121235 -57717 38839 -7835 -125080 -112685
6965a12685k8493J46762R0721j23934p622M403q3620N5524J5086O0019J09870
6954A26031n4047p0606L4223j7914l3975k8389l1722M971k8421j2994o15L6681
6942g6777n3344P5426J33138n2042q2322N7891J543r667j05854j4069N3204Q2494
6930I621q2326J4189M7923n6842M2270q5462J21666K6200n3238J0843o362o3226
6918g4744n1472L086Q6446r825n8760o2250Q5557J25050j11276M6475M2550l7997
6906a7160J8781n4858j43284K0016J94404j2892r438o3388P3052P4148J148p4184
6894F345j68953m885N3327L7883L5899O2580o3968P8262k4909J17854o1921r8869
6882c1355m3383L4110L4730l9745M7537J588m5734R280j18k8606P3447P344k3719
$$ plain form
6965 -112685 -141178 5584 96305 -27629 -35251 -30848 -114468 -58944 -43858 16161 126031
6954 126031 71984 1378 35601 17687 -16288 -44677 -76399 -71428 -99849 -112843 -113458 -76777
6942 -76777 -130121 -54695 78443 26401 -55921 1970 3513 -6154 -112008 -126077 -72873 9621
6930 9621 -72705 -58516 -10593 -67435 -25165 -110627 11039 37239 -15999 -5156 -11518 -74744
6918 -74744 -126216 -123130 -36684 -46509 -105269 -167519 -81962 43088 -68188 -21713 20837 -17160
6906 -17160 1621 -53237 -196521 -176505 17899 5007 -4431 -67819 5233 79381 80529 6345
6894 6345 -162608 -167493 -114166 -76283 -40384 22196 -41772 36490 11581 129435 67514 -31355
6882 -31355 -74738 -40628 -5898 -45643 1894 3482 -42252 -32972 -33090 -61696 11751 19095 -4624
6869d624l6526R7820p041j7086Q4338J7011q0268j5659n7187p6840M3243j3062
6857f5881l306l3164J7530m9454Q8266n1064l5808N1411P9941l9327o0015N1294
6845d9577k4991L0349p1992n2l60L3359L9692o5333J38532j8530J0272p4106j09226
6832a61963K2754L1227j4015j7445J07070j49823N3531J30083k7996n1609J24213
6821D6027j04693j03601J09421j5334J0441l3881p142q6846r789L9347n942O0675
6809a01317M3957K3501n9058j799R9328L7991k5595o5983l8836P8258K689n1585
6797e8449p865r0322K0139N2350n27N7397K7227R4333j09359j28958l0171P3475
6785a00730J9805l5479r623p1086K2795R760J13532J04596J9926k5031j54502
$$ plain form
6869 -4624 -41150 56670 49629 32543 116881 133892 53624 37965 -19222 -96062 -52819 -65881
6857 -65881 -69187 -102351 -84821 -134275 -46009 -97073 -132881 -81470 -1529 -40856 -100871 -49577
6845 -49577 -74568 -44219 -116211 -116263 -116623 -83264 -43572 -108905 29627 11097 21369 -52737 -161963
6832 -161963 -139209 -107982 -121997 -139442 -32372 -182195 -128664 1419 -26577 -78186 46027
6821 46027 -58666 -162267 -52846 -68180 -57739 -91620 -98762 -185608 -195397 -156050 -161992 -101317
6809 -101317 -57360 -33859 -92917 -94716 4612 42603 17008 -48975 -87811 -9553 -6864 -58449
6797 -58449 -66314 -156636 -136497 -84147 -84674 -27277 -50 94283 -15076 -144034 -174205 -100730
6785 -100730 -80925 -116404 -126027 -197113 -174318 -164558 -51026 53570 73496 48465 -106037
6774a06037k1624J19753n0233j4554K6148k5698L464Q5417n2104O4490N2786L7770
6762A19578j476j6489L859o4176j11376q4300R7919o4090L0466R41k0581l092
6750a12817J3030J34374J2420o1672P1828N943j03300j08521j8522k2487J97431
6739G707o65j0475j16001J1262K1473o787J00374n8189L5594L4511k5233N5561
6727D9132l3412J7961j693M1198n4487p6480m5559O2372m4957p3082L2398N8943
6715f7666K7135j8739K4437o6640N0730r5789N699P0312R1061q0709J7925r4058
6703a36302j6385M904N8008J9517j627R4175N1544j49309j48250J07906K5420
6692i0399l9021Q6634k4492R773J6387m3970m5948k3393R6242Q2138r4560L6026
$$ plain form
6774 -106037 -127661 -7908 -58141 -72695 -46547 -72245 -68781 16636 -35468 29022 81808 119578
6762 119578 118102 101613 105472 41296 -70080 -154380 -56461 -120551 -90085 -89144 -109725 -112817
6750 -112817 -99787 34587 47007 -14665 57163 63106 -40194 -148715 -167237 -189724 7707
6739 7707 7042 -3433 -119434 -108172 -86699 -93486 6888 -51301 -15707 18804 -6429 49132
6727 49132 15720 33681 31988 73186 18699 -57781 -103340 -40968 -85925 -159007 -126609 -67666
6715 -67666 -40531 -59270 -34833 -101473 -50743 -146532 -140833 -70521 20540 -60169 -42244 -136302
6703 -136302 -152687 -147783 -89775 -70258 -71885 22290 73834 -75475 -223725 -115819 -90399
6692 -90399 -129420 -42786 -67278 -57505 -41118 -85088 -131036 -154429 -58187 23951 -70609 -34583
6680c4583L8332j66676M1278M2013m2502J49264K4017O6863r2039l4382J8810
6669A0395q3174O4620j9004m118Q0577l0381l1937m154m5883J8963p0848O8929
6657d6015J46856m634j4298l0522j43189J45556K390m1940l7250J4199n2178j0162
6645g1187m6895l1052J03585k229l4078q1772K2910P0240N5759K1143p3969m5119
6633a12664J21566n8279k4553P9372l5853M8361K2461o8362J7388j3260q6029
6622a09852J53860N2873j87863k049J8036L8482N3339j275k963J3139J2702p6839
6610c8410l6076J5081K207K2885J6422J49954J2407j30013j48228L8556M3750
6599e1465J0716l330o7618L4290J14049m6310q6960M022K8138O2311L9142j09508
$$ plain form
6680 -34583 3749 -162927 -121649 -79636 -122138 27126 51143 118006 25967 -8415 10395
6669 10395 -72779 -8159 -27163 -31281 49296 18915 -13022 -17176 -63059 -44096 -114944 -46015
6657 -46015 100841 96207 81909 51387 -91802 53754 56144 14204 -23046 -8847 -61025 -71187
6645 -71187 -118082 -149134 -45549 -47778 -81856 -163628 -140718 -70478 -14719 6424 -67545 -112664
6633 -112664 8902 -49377 -73930 5442 -30411 17950 40411 -27951 -10563 -23823 -109852
6622 -109852 44008 96881 -90982 -93031 -74995 -36513 16826 15551 12588 25727 38429 -38410
6610 -38410 -74486 -59405 -57198 -34313 -17891 132063 144470 14457 -133771 -95215 -51465
6599 -51465 -40749 -44079 -111697 -77407 36642 -9668 -96628 -92606 -64468 -2157 36985 -72523
6587g2523L7894j6964L944R0421Q468p2171m3661J0203l8405K4412o1126k3115
6575a52623M5211J10572n7887k1849l5476J12933Q4581q1266o2212J9467J20217
6564H1668O4199k4688r8532p0529l8531N8496K3252m8730Q3436k942J4687r0558
6552d8772l6932J08366L8974q7640r112L8512m4403o2891M7553q703j5138n8590
6540a38776J63360K6454m1674m7002p2378k4601j07089J21845J45717m5559j22228
6529a41931Q8363L4015M5063k3410K5200J9395j95408K4021R3980M0809j23716
6518a13619q2234J42175K2935K8885p0708l1224O7986J12327K0075K2278l0777
6507H8099m7449r5825k690l7550j0676J8098k3037O8358K6893M1852j5123j9618
$$ plain form
6587 -72523 -34629 -51593 -47649 42772 51240 -20931 -64592 -54389 -92794 -68382 -129508 -152623
6575 -152623 -107412 3160 -54727 -76576 -112052 881 85462 4196 -58016 -38549 81668
6564 81668 145867 121179 22647 -47882 -86413 -27917 -4665 -53395 30041 27099 41786 -48772
6552 -48772 -85704 22662 61636 -26004 -35116 3396 -41007 -103898 -56345 -65048 -80186 -138776
6540 -138776 24584 51038 9364 -37638 -110016 -134617 -241706 -119861 25856 -19703 -141931
6529 -141931 -53568 -19553 25510 2100 27300 46695 -148713 -124692 -30712 10097 -113619
6518 -113619 -195853 -53678 -30743 -1858 -72566 -103790 -35804 76523 96598 118876 88099
6507 88099 40650 -55175 -57865 -95415 -106091 -87993 -111030 -42672 -15779 26073 10950 -8668
6495h668L4228l4330j12566m566J55392K0971n1159M5942K3712m4392M1148M3666
6483A09378m9218j08273j04104N5575O1252j29132K1589J5462j8684J45067j7197
6472a8285n830N4316M326o2333q7297J985P8238O4029j06802L5589N2889m3376
6460c2551n5966j01745L8179o8894J77006M9406r3252l094L4761P6943m6207J20149
6448I4735m637q9857K2268K7488p9874p0577n4957k2738Q6968k250M6831J6207
6436c0393o4676L4335J60185p4403l2395j1945l9015l7342N0842J9426Q595J26833
6424A10047j05673n8258M6779j5388k0713N781K8357O3992j8631N3087m1342k0118
6412B7920k2081k6092L7165j5457p6721q6591J39276Q3288j32858k2813J3234
$$ plain form
6495 -8668 25560 -8770 -121336 -125902 29490 50461 -698 45244 68956 24564 65712 109378
6483 109378 60160 -48113 -152217 -96642 -35390 -164522 -142933 -127471 -146155 -1088 -18285
6472 -18285 -24115 30201 34527 -27806 -115103 -113118 -34880 29149 -77653 -42064 10825 -32551
6460 -32551 -88517 -190262 -152083 -220977 -43971 5435 -87817 -90911 -56150 20793 -25414 94735
6448 94735 90098 241 22509 49997 -29877 -100454 -155411 -178149 -91181 -93431 -46600 -30393
6436 -30393 -95069 -60734 99451 25048 -7347 -19292 -58307 -95649 -44807 -25381 -16786 110047
6424 110047 4374 -53884 -7105 -22493 -43206 -37425 -9068 54924 36293 89380 48038 27920
6412 27920 5839 -20253 16912 1455 -75266 -161857 -22581 60707 -72151 -94964 -81730
6401h1730n7947N108R9844K4511M5360Q8111n5653j52010J13792J10416k01376
6390f1574m188P6084Q857P652q6851N1105r7923j0950M6896P1623P0086j06745
6378c5928l7146J3035M4242M1597J1882n3457j24812o0151O8598Q2310L6459N6383
6366D3012J47482j45325o355p3694n4760J13725j4764j4798p4755J05536M9491
6355G4795k2853p2630L7458Q2475k5322k0905r4952m8996J13832N9064j26830
6344d4864k3430K9207m205k3969j06033q8981J56035K8273L8676K4935L3859o6719
6332d7216n9330J43271j6400j3788O5552q3249M7537Q4417k1371j0595p3112n8382
6320d2666R9957p5733j06504J32062J4098q4091N2933L9912J4902R0984n6466
$$ plain form
6401 -81730 -139677 -134569 -34725 -10214 35146 123257 67604 -84406 29386 139802 -61574
6390 -61574 -65762 10322 19179 26831 -60020 -8915 -106838 -117788 -70892 731 70817 -35928
6378 -35928 -73074 -60039 -15797 25800 37682 -15775 -140587 -200738 -132140 -49830 -13371 43012
6366 43012 190494 45169 38814 -34880 -89640 24085 9321 -5477 -80232 25304 74795
6355 74795 51942 -20688 16770 99245 73923 53018 -41934 -90930 22902 81966 -44864
6344 -44864 -68294 -39087 -43292 -67261 -173294 -262275 -106240 -77967 -39291 -14356 19503 -47216
6332 -47216 -106546 36725 20325 6537 72089 -11160 36377 120794 99423 88828 15716 -42666
6320 -42666 57291 -18442 -124946 7116 21214 -62877 -9944 29968 44870 135854 79388
6309G9388o1516K2079K9961p3951j3822J2807p6956l0569O4482Q7116m4925m4417
6297e0323J07357o7712j6099j7327J5936K2696R5389p6286J3183M0627n1038l6155
6285a9752j8881O9899j0030O4424J0710p7636m3759K5334O0336r8167p6515Q4563
6273b9474m826o8662K7368Q5848P2698l2160j5327k5012k7175q3287j4119J62512
6261D8384L2579K427r5750O9058N3731j65185K6973J6232L7391Q8614p2828j5082
6249B6544j25260J23756q4519r8355R0761j1924J00699N0891p9775m5677l527
6238e6386O5663J38122j45467j39606j2364R7405P0434j6033N4418q2501l097
6227b9412M7712j24280P5609J07135r8630l5806J2595K3543k6694L4984q7539
$$ plain form
6309 79388 17872 39951 69912 -4039 -17861 -5054 -82010 -112579 -48097 39019 -5906 -50323
6297 -50323 57034 -10678 -26777 -44104 -28168 -5472 89917 13631 26814 67441 16403 -19752
6285 -19752 -38633 31266 21236 85660 96370 18734 -25025 309 60645 -37522 -114037 -29474
6273 -29474 -34300 -102962 -75594 10254 82952 50792 35465 10453 -16722 -100009 -114128 48384
6261 48384 80963 83390 -12360 56698 110429 -54756 -27783 -11551 25840 114454 41626 26544
6249 26544 -98716 25040 -59479 -157834 -67073 -78997 21702 72593 -7182 -52859 -56386
6238 -56386 9277 147399 1932 -137674 -150038 -52633 17801 1768 56186 -26315 -29412
6227 -29412 18300 -105980 -30371 76764 -21866 -57672 -45077 -21534 -48228 -13244 -100783
6216a00783J9758O3094P0588l2490k7194K8280l2002K9768o2494Q2560J357k5090
6204A5352N2851Q434o9419p0534L0437O526L1075r5684j04664Q4748N0330J5361
6192d5187l3761q119L964N6444J71070L2962j22035j51585m8564k6870N0259K9928
6180i1494M2639Q9438P8362L6700o9075O6814k1324j55080l4153J22909j56986
6169i1250J04030R9174j50089o6599N896j6166M4982P3844k277j5939k0356l2034
6157f6784j4666Q5800J0497O8459k4570j17039J0265Q8769R0727n0093l3207K1727
6145F9885L249n6526j078L0931r920l3386K3510j4055l0939m8937l45o1925R4231
6132c5305L0433O0847L6460j14994P2973L2385p3239K4075J11247m9059l5862
$$ plain form
6216 -100783 -81025 -17931 52657 20167 -7027 21253 -10749 19019 -43475 39085 40442 15352
6204 15352 68203 76637 7218 -63316 -32879 -26353 4722 -90962 -195626 -110878 -60548 -45187
6192 -45187 -78948 -87067 -83103 -26659 144411 177373 55338 -96247 -144811 -171681 -121422 -91494
6180 -91494 -48855 40583 118945 155645 86570 153384 132060 -23020 -57173 65736 -91250
6169 -91250 12780 111954 -38135 -104734 -98838 -115004 -70022 3822 1545 -14394 -34750 -66784
6157 -66784 -81450 4350 14847 83306 58736 -58303 -48038 40731 131458 81365 48158 69885
6145 69885 73134 16608 15530 46461 36541 3155 26665 12610 -18329 -67266 -67611 -129536 -35305
6132 -35305 -4872 55975 92435 -22559 50414 82799 9560 33635 144882 95823 59961
6121E9961l2648n0172M5179j433j10758K1523J0992q5568L8977J22695k3118m2117
6109d6487m74j0129M4298J21958j26698K8946Q1845M100j24188j03407J74456
6098D4220k8083K9550L9855q4184j7888M0816R7008q6792q0561N1552P9048n1764
6086C2777n4467l5288J18628O8384L440P223P982J5817p9125m1177k3426R9160
6074A19928M5443j29755n7431k916r6034N7405M5810J9515l1592j7701O3944k0223
6062c607R365j00553J208P9585N699m367Q6044O7935n7090j10143k3518r82K5248
6049b5176o0741J3501J5460k1113L5713O2059n021o7181K3252R3279j9626n76
6037D3830j9092j8633O4275j2521r1355j60289J4393K8574J32651R4417N6052
$$ plain form
6121 59961 27313 -22859 22320 20887 -89871 -68348 -57356 -142924 -103947 18748 -4370 -46487
6109 -46487 -46961 -57090 -12792 109166 -17532 11414 93259 97359 -26829 -130236 44220
6098 44220 16137 45687 85542 1358 -16530 24286 121294 34502 -46059 5493 84541 32777
6086 32777 -21690 -56978 61650 130034 133474 140697 148679 164496 85371 44194 20768 119928
6074 119928 165371 35616 -21815 -24731 -120765 -63360 -17550 1965 -29627 -47328 16616 -3607
6062 -3607 5758 -94795 -93587 -14002 -8303 -12670 73374 141309 84219 -25924 -49442 -50424 -25176
6049 -25176 -85917 -72416 -56956 -78069 -42356 19703 14682 -52499 -29247 64032 44406 43830
6037 43830 24738 6105 70380 57859 -33496 -193785 -179392 -150818 -18167 76250 132302
6026A32302q5072j14697J0205j6944k069J38766m1204j01680R0292O1198m9808
6015B1289j14613L9466K449J5652J3433k2894p1356J8060J43056L6075K8799N8313
6003A67729K1171m3404l5145n4095K6442j24428k541Q0992K9574m4434r3013L3790
5991c7362L5018l721n0414R2118O452l4967j3650J1086k3611M457m5172m861l1959
5978i6586N9960O3638j7634J7701o6130O7825J1392O6307m6234k3028J7482L2641
5966H7334r5594N1389j060q1938K6595l2893p484J60907k028N6565r7551j3107
5954E1135N2171k5734J6184j58628J44126K8127j02593J37977j80062p6249J37749
5943B4203l4749k2513J1484J07212N2398j05472L3400M9252r9421J2031q194Q0381
$$ plain form
6026 132302 47230 -67467 -57262 -74206 -76275 62491 21287 -80393 9899 71097 21289
6015 21289 -93324 -53858 -51409 -35757 -22324 -45218 -116574 -98514 44542 80617 109416 167729
6003 167729 188900 145496 110351 56256 82698 -41730 -44271 36721 66295 21861 -71152 -37362
5991 -37362 -2344 -6065 -56479 35639 42091 7124 -6526 4560 -19051 -14594 -59766 -64627 -96586
5978 -96586 -36626 27012 9378 27079 -39051 28774 40166 106473 60239 37211 54693 87334
5966 87334 -8260 43129 42069 -39869 -13274 -46167 -53651 107256 105228 161793 64242 51135
5954 51135 103306 77572 93756 -64872 79254 107381 4788 142765 -37297 -113546 24203
5943 24203 -10546 -33059 -21575 85637 138035 32563 65963 115215 15794 27825 19631 100012
5931A00012n8864j56601O6599q050M8618L9404r22N8726K4052m8357M9568j8816
5919I5369K0598L812r2334J17366o7143o8409n9688J36869J7590k1100P259o6813
5907B3376M0818R2913m1524m7690m3377J10771k3856P6714P6538Q360j08771K3908
5895A88180K2404l7252J19731K1474l5227k9380n803J13042m2455n3947K1777
5884B82544o832Q5256o3619j3801K9223q0711J48944P7504p916M3463J03789n3436
5872E44408N0268J6201J19342J38269j30148P6333M8965K3937J30234m7631k3285
5861I46893P0415j19522j14633j37675r240l5913j23031o7635k3177m4441j02998
5850B39043j11455J38545o4926k2935m2674m6839L7517J3909Q0966n1585j0310
$$ plain form
5931 100012 41148 -115453 -48854 -56904 -8286 31118 30196 88922 112974 64617 114185 95369
5919 95369 115967 119779 27445 144811 77668 9259 -50429 86440 104030 82930 90189 23376
5907 23376 64194 157107 115583 67893 24516 135287 111431 188145 264683 273043 164272 188180
5895 188180 210584 173332 293063 314537 279310 249930 244127 357169 314714 260767 282544
5884 282544 275712 360968 297349 283548 312771 232060 381004 458508 450592 494055 597844 544408
5872 544408 594676 610877 730219 868488 738340 814673 863638 887575 1017809 970178 946893
5861 946893 1017308 897786 783153 645478 636238 600325 477294 409659 386482 342041 239043
5850 239043 127588 266133 201207 178272 135598 88759 126276 140185 221151 169566 159256
5839A59256P0117l8393J9675R6948n8384l0706P0786J7663r0551m4257j4962j8721
5827A38471Q7151n2514J17053K678K5102r0020J5340J16739m1243l8003r5357
5816A85397j19825J33638l4498o6894J05284P5466q4711o0098n9449L0852Q7466
5805A92628j12859j18894J42627N0971p9902Q3814L0183J5730n2989R789r516
5794A51582K6440p7842k1423N5780j5912O4711Q7865l9042j45159J72513j1805
5783B47708j01453P326J6178J7403J1577p4514p9167M7693Q4694J21556j03281
5772A95720n6435k2793L9618o4265n5936J327O7638M7661q006K5905j7250n8480
5760I4704L8557k4871J12723O0762j46939p5998N6729L7775k3058r5262M3822
$$ plain form
5839 159256 229373 190980 210655 307603 249219 218513 289299 306962 216411 172154 157192 138471
5827 138471 225622 173108 290161 292839 317941 227921 243261 360000 318757 280754 185397
5816 185397 65572 199210 164712 97818 203102 278568 193857 133759 74310 105162 192628
5805 192628 79769 -39125 103502 154473 74571 158385 188568 204298 151309 161098 151582
5794 151582 178022 100180 78757 134537 118625 183336 271201 232159 87000 259513 247708
5783 247708 146255 153581 169759 187162 198739 124225 45058 92751 177445 299001 195720
5772 195720 139285 116492 156110 91845 35909 37236 104874 152535 144529 170434 153184 94704
5760 94704 133261 108390 221113 281875 134936 58938 115667 153442 130384 35122 78944
5749G8944m7929N0899J95376L0386k8804j5930j11806L8295J2280J0907Q1088
5738B93706l6200j49036J05152k6669j7051O9865J6604K1042n2695Q5753P8304
5727C88775k30755n7384J9722L7030M8042k301k4485k0829n740j8614J09928O6539
5715C09928l4906j4523L6697p8826J8663m6286N6950J19740L9172j61800J7552
5704B62361p5726N4284J20372K834O5816j4819q5052n0328P3217Q2070j2364J00833
5692E23498q3999j4326j1043o4720J4108m4451o9757L7225J48405J0553M7661
5681D93154K7978l7885p4836J6339K7977m5256K8643L4733J23231p5887j4432
5670E03759J9186n4341J17589J4783r9387k6714M628L0365R357K4404J1370L8649
$$ plain form
5749 78944 31015 81914 277290 307676 278872 262942 151136 189431 201711 212618 293706
5738 293706 257506 108470 213622 186953 169902 239767 256371 277413 224718 310471 388775
5727 388775 158020 100636 120358 157388 205430 203129 178644 157815 152075 133461 243389 309928
5715 309928 275022 260499 297196 218370 237033 190747 247697 367437 406609 244809 262361
5704 262361 186635 240919 361291 364125 429941 415122 330070 279742 352959 435029 422665 523498
5692 523498 439499 425173 414130 349410 363518 319067 249310 286535 434940 445493 493154
5681 493154 521132 483247 408411 424750 452727 407471 436114 470847 594078 518191 503759
5670 503759 522945 468604 586193 600976 501589 474875 479503 509868 519225 543629 554999 593648
5658E93648O1133j20581j45266P5630L7331R1828r4221J22480J11718j09161p3086
5647E51453j09284L3809Q2454M9331p5876L5236j6174N172L742J7474o9861j8421
5635D89055L4077M9164K1767M7541q0840k0164o151R5588O1236K7437Q2958L9120
5623H40788l9213J0758j29843P5591j2559k4706N5377N7005o7575j309Q9747m0164
5611H13897Q3007n7470m2338L814J19251q5978M1341L4807P2396O0847m472J5424
5599A054526Q6234o5177j10807L5961Q5216N7744l7713L7878l8685o6299N0599
5588A089477J43701j9338n4836n1332j06548J0504P868J40808J9648p1547P0666
5577A179071R6639M8941J0588o4598j9574N9342k1263m8524J15828O1769r3686
$$ plain form
5658 593648 654781 534200 388934 464564 501895 593723 499502 621982 733700 624539 551453
5647 551453 442169 475978 558432 607763 531887 567123 550949 556121 559863 577337 507476 489055
5635 489055 523132 572296 594063 641604 560764 540600 534449 630037 691273 718710 801668 840788
5623 840788 801575 812333 682490 758081 745522 720816 776193 833198 765623 764314 854061 813897
5611 813897 896904 839434 797096 800910 920161 834183 875524 910331 982727 1043574 1039102 1054526
5599 1054526 1140760 1075583 964776 1000737 1085953 1143697 1105984 1143862 1105177 1038878 1089477
5588 1089477 1233178 1213840 1159004 1107672 1001124 1011628 1019496 1160304 1179952 1108405 1179071
5577 1179071 1275710 1324651 1335239 1270641 1251067 1310409 1289146 1240622 1356450 1418219 1324533
5566A324533J36503J04340O1164O4824j45955l2061Q69M6017N5162j935o3410
5555A550051m7609J10040k1168r4566Q1423N5724P7600j9875M7290N2333M9884
5544A841127J7846j1447R2291o6466J08226R5287K024j1351l9032j06485r755
5533A912265P3813O5068P0870J15781O6740L6240J83158j15363L732k4473l6937
5522B350894O0637N3880O1846O6316J55946q4566n1384J20622J47721k3171O7591
5511B926332K1052J63275O3508j5762P3366n5388Q3045J58766P6367N6992L5671
5500C587224K54901L8223R0286P2300J64028K14205J21968R9369J94990J59712
5490D997206N9016M9860l1581K8271J34601J05651J82137J51961R1767j05211
$$ plain form
5566 1324533 1461036 1565376 1626540 1691364 1545409 1513348 1514217 1560234 1615396 1613461 1550051
5555 1550051 1502442 1612482 1591314 1496748 1578171 1633895 1711495 1691620 1738910 1791243 1841127
5544 1841127 1858973 1847526 1939817 1873351 1981577 2076864 2078888 2067537 2028505 1922020 1912265
5533 1912265 1986078 2051146 2122016 2237797 2304537 2340777 2523935 2408572 2412304 2387831 2350894
5522 2350894 2411531 2465411 2527257 2593573 2749519 2664953 2613569 2734191 2881912 2858741 2926332
5511 2926332 2947384 3110659 3174167 3158405 3231771 3176383 3259428 3418194 3494561 3551553 3587224
5500 3587224 3842125 3880348 3970634 4042934 4206962 4421167 4543135 4642504 4837494 4997206
5490 4997206 5056222 5106082 5074501 5102772 5237373 5343024 5525161 5677122 5768889 5663678
5480E663678N1632K04919J54224O9838R9792K12362J49780J45025J76845J21742
5470G049837J39640J85229K67016J87372J56359K50659L3914L08649K18690J76248
5460H973613P5466N6181J18594J86701J34814L29615J10781L63020K10403L31351
5450A0890539K92080K85931K56162M62975L88659L26117M96658N43937N82887
5441A4525945N29609N97755N89220P33359Q00491O64590P80086P72282Q47385
5432B0840722O57943P08725P69736O72946Q47496Q72574J019315R68222J047607
5423B8405286R12751J072916J163562J163969J270209J534304J749236J917180
5415C9189413K295503K607273L123169L713835M213448N046806O257799P738160
$$ plain form
5480 5663678 5715310 5920229 6074453 6144291 6244083 6456445 6606225 6751250 6928095 7049837
5470 7049837 7189477 7374706 7641722 7829094 7985453 8236112 8270026 8578675 8797365 8973613
5460 8973613 9049079 9105260 9223854 9410555 9545369 9874984 9985765 10348785 10559188 10890539
5450 10890539 11182619 11468550 11724712 12187687 12576346 12902463 13399121 13943058 14525945
5441 14525945 15055554 15653309 16242529 16975888 17776379 18440969 19221055 19993337 20840722
5432 20840722 21498665 22207390 22977126 23650072 24497568 25370142 26389457 27357679 28405286
5423 28405286 29318037 30390953 31554515 32718484 33988693 35522997 37272233 39189413
5415 39189413 41484916 44092189 47215358 50929193 55142641 60189447 66447246 74185406
5407G4185406R480758J1534659J4346044J7778690K2125350K7516192L4349210
5400B11316309M0904187L8678437J4511281k3767409m3793970m3224051l5932191
5393A58692593k8530574k1831708j6333950j2428430r842362p903079o455881
5386E5366609n387466m610589l959461l154428k757673k329330k002651j769143
5378B9395868j747450j455667j409034j452612j347335j068616j127352r39568
5370A8848234p73091p79727p26077p96138p70183o87950o51704o38490n95541
5361A2429333n33504l72925m65089n82252l38561l14146l71487m38522k83780
5352H729067k29449l50540l09998j50663k14740k50640j69544j69162k67662k95930
$$ plain form
5407 74185406 83666164 95200823 109546867 127325557 149450907 176967099 211316309
5400 211316309 252220496 290898933 305410214 281642805 237848835 194624784 158692593
5393 158692593 130162019 108330311 91996361 79567931 69725569 61822490 55366609
5386 55366609 49979143 45368554 41409093 38254665 35496992 33167662 31165011 29395868
5378 29395868 27648418 26192751 24783717 23331105 21983770 20915154 19787802 18848234
5370 18848234 18075143 17295416 16569339 15773201 15003018 14315068 13663364 13024874 12429333
5361 12429333 11895829 11522904 11057815 10475563 10137002 9822856 9451369 9012847 8729067
5352 8729067 8499618 8149078 7839080 7688417 7473677 7223037 7053493 6884331 6616669 6320739
5342F320739k18124q6639j89651k50378k53972j23010j21660k26078k08456q3764
5332D559007k66976j13889M3471j10078k14467l0439m9109o0974q0647r9285j42933
5321C433681j09901N1202j71880k46470r9456j8852k10795j05561j29487O558
5311B399039j5411m455j25613k31065n333M4692Q2828j18704j00229j4445m8118
5300A863186m4105J380j63266j1509k7653p4038q6391j6712K9796O0388l6278
5289A494798o2592K5350N669J2183k2871j54385L885n1081K9644L862j39161o2429
5277A082872L6952Q3000j00063q2498l3194O2527j8519j40884J05832Q0095q3869
5266I92251r8642M1356L981m1988k017l501n4915L4418P404j2160j1723r6583
$$ plain form
5342 6320739 6102615 6015976 5826325 5575947 5321975 5198965 5077305 4851227 4642771 4559007
5332 4559007 4292031 4178142 4221613 4111535 3897068 3866629 3817520 3756546 3675899 3576614 3433681
5321 3433681 3323780 3374982 3203102 2956632 2857176 2838324 2627529 2521968 2392481 2399039
5311 2399039 2383628 2379173 2253560 2022495 2017162 2061854 2144682 2025978 1925749 1911304 1863186
5300 1863186 1819081 1820461 1657195 1645686 1618033 1543995 1457604 1440892 1470688 1531076 1494798
5289 1494798 1432206 1457556 1463225 1475408 1452537 1298152 1302037 1250956 1280600 1284462 1145301 1082872
5277 1082872 1119824 1202824 1102761 1020263 987069 1049596 1031077 890193 996025 1076120 992251
5266 992251 893609 934965 938946 896958 894941 891440 836525 870943 878347 866187 854464 757881
5254G57881O2636N7946J3910n3946N1868l3591k295k19033m108N8518l3385j99966
5242D56435J17130N6387n7240m3542M7930r244J90225r7519j14648p808p2380
5231D65726M5346J31761p5397j04752j2796O6381k8573n202J25630r939Q0237
5220F78422m4361k2567n7843J6L9821o8808j25775J46576o7659k0428L6321l9656
5208D54059o7989L0369j20686j3966N1711l1993p3482L1243O3219q03l366L4100
5196C52416K5434M0985n8345N584k638R4773J5765j04900q9723j1050J21188p9903
5184C09586n0314J29056k5460o6694M8597l0407L8080k6831j2749P031M59n264
5172C15090J5833j03335r5697r901O4944J4694N056p9734j20957K8680N1468J24356
$$ plain form
5254 757881 820517 878463 892373 838427 890295 856704 854409 635376 631268 689786 656401 456435
5242 456435 573565 629952 572712 529170 577100 567856 758081 660562 545914 538106 465726
5231 465726 511072 642833 567436 462684 449888 516269 487696 482494 608124 598185 678422
5220 678422 634061 611494 553651 553667 593488 524680 398905 545481 477822 457394 493715 454059
5208 454059 386070 416439 295753 281787 333498 301505 228023 259266 322485 321682 318316 352416
5196 352416 377850 418835 360490 366074 363436 458209 473974 369074 279351 268301 389489 309586
5184 309586 259272 388328 362868 296174 344771 314364 352444 325613 312864 319895 320354 315090
5172 315090 330923 227588 131891 121990 186934 201628 206684 126950 5993 34673 86141 210497
5160B10497L1395o9221L8341j7252k4803j0512L9463N020j44646m9939j4984Q2187
5148G5546P8744M505j02030J50247J657o1638J17646q7241l4738m1813j9901l5956
5136D5028j6130J47210l227j1550n8151K4856L1169j14863k6592J22261M6170
5125A86181j01409j0571J9494K9872k8613r3244P4435Q2336q925Q619L3646l7667
5113A54154j1472O4500M2586l1645o1243K5518p4622Q4748j05623l9510J22330
5102A69721Q1454p3991p3132l2301N0592L4005L306j04440o5725R1932J16796
5091A98217P4877k19037Q8580P9356r6699j00408l2225n2468R371J21729j41177
5080f9884k4032j5202M8735J64055r8532Q5922J36100k1275k16378L3136J13954
$$ plain form
5160 210497 241892 172671 211012 193760 168957 158445 197908 202928 58282 8343 -6641 75546
5148 75546 154290 158795 56765 207012 208669 147031 264677 177436 142698 100885 80984 45028
5136 45028 28898 176108 172881 161331 103180 128036 159205 44342 17750 140011 186181
5125 186181 84772 74201 93695 123567 94954 1710 76145 158481 149556 158175 191821 154154
5113 154154 142682 207182 249768 218123 156880 182398 107776 192524 86901 47391 169721
5102 169721 251175 177184 104052 71751 122343 156348 159654 55214 -10511 81421 198217
5091 198217 273094 54057 142637 221993 125294 24886 -7339 -59807 -50436 71293 -69884
5080 -69884 -93916 -109118 -60383 103672 5140 91062 227162 205887 -10491 22645 136599
5069A36599n0645n8376K7047M4946K2902j9398j1983p7949k4794J07443q5676
5058A0116n0498R6603P5611m1099M646K3801O0965q7526m7961R3598Q3275j39050
5046H2481J9473P9642l3778k2075j14838N9020P1061m388M187j17412k4128J5994
5034A5239O3509J8707j01980M551M3953m934M1303j16136J19428o309r2791N2551
5022C7091o772O1904l0884m0609p0470K6378K9780n417p6266M8164M4907N6385
5010G4191N6674K6402M049J97N7155k2219j29356n3511j12290J71545J42229m1954
4998A73112p5989K4636M5956p7124p3200l0731Q1444o4754L1483m9820o9510L1893
4986e2604M2555p961j2248J24913j3048l967o6916j37238P8962j95R8278L0909
$$ plain form
5069 136599 85954 27578 54625 99571 122473 103075 91092 13143 -11651 95792 10116
5058 10116 -40382 56221 131832 90733 95379 119180 180145 92619 44658 138256 221531 82481
5046 82481 101954 181596 147818 125743 10905 69925 140986 136598 140785 23373 -755 15239
5034 15239 78748 97455 -4525 26 43979 39045 80348 -35788 83640 77331 -15460 37091
5022 37091 30319 92223 61339 20730 -49740 -23362 6418 1001 -75265 -27101 17806 74191
5010 74191 130865 157267 161316 161513 218668 196449 67093 13582 -98708 72837 215066 173112
4998 173112 97123 121759 167715 90591 17391 -13340 68104 3350 34833 -14987 -84497 -52604
4986 -52604 -10049 -18010 -30258 94655 81607 77640 10724 -126514 -47552 -47747 50531 81440
4974H1440R7237p6783j47183O7190r1045N0853J63422k4102j16730o1542J21987
4963F4744p2849n7987J61771o189l8913j6710p0001L2685K6729M8021p5420r4323
4951i8442J42788o0210m4383m945J58386M6998N4730Q284p5363M684j35908o2593
4939f5974J36565k188L0957J02474j34347r3718K6237M5994m7311r3134J54134
4928E9689L583N7577o741j746K8305r2363Q972K5694q8503K8789L8826l3284R5164
4915A23962j2727M8423n8751J17414K4885l8377r2789j5799J58473l7740j09472
4904A07502J5228K4262O4295l8084j2831P1688L9885M7720j10965j53433J60388
4893B15655j9509N701L3713q5508n6184M3368n0783K4274N3230j41045n1363Q2999
$$ plain form
4974 81440 178677 101894 -45289 21901 -69144 -18291 145131 121029 4299 -57243 64744
4963 64744 -8105 -66092 95679 89490 50577 33867 -36134 -3449 23280 71301 -4119 -98442
4951 -98442 44346 -15864 -60247 -65192 93194 140192 194922 203206 127843 132527 -3381 -65974
4939 -65974 70591 68403 99360 201834 67487 -26231 6 46000 -1311 -94445 59689
4928 59689 63272 120849 114108 112362 140667 48304 57276 82970 -5533 23256 62082 28798 123962
4915 123962 111235 159658 100907 218321 243206 204829 112040 96241 254714 216974 107502
4904 107502 122730 146992 211287 173203 160372 232060 271945 319665 208700 55267 215655
4893 215655 196146 201847 235560 150052 93868 137236 86453 110727 163957 22912 -28451 54548
4881E4548R620l2608N2618n4149J5307J2385j15906N1426O4944m1571r314L6540
4869D3840O0215k2564J0476p9221j8481r437J24741m7285j43926k6432J46953
4858C8879o1790l6428Q5509O1666N095o3302p1571J46287k4228M1005N0660m6767
4846A25015j2148l5836N2374j35164M7376j6595j22419J15355M4246K1323n0393
4835C3134n972O5356J0659j5124N6500j6217n7782J26300j3598L601O0784j76919
4823G0722p4099J00668L1135O0737m2129p5479O6761L4328o2056J4052o5285J6617
4811G5972p4896J06376J48464k833k7374L949k2281r6551j0863L2842L7428k0796
4799A49437p0630K2592L1867R390R9767j16175o7386J32696J46391J0114j21399
$$ plain form
4881 54548 64168 31560 84178 30029 45336 57721 -58185 -6759 58185 16614 7300 43840
4869 43840 104055 81491 91967 12746 -5735 -15172 109569 62284 -81642 -108074 38879
4858 38879 -22911 -59339 26170 87836 92931 29629 -41942 104345 80117 121122 171782 125015
4846 125015 112867 77031 129405 -5759 41617 25022 -97397 17958 62204 83527 33134
4835 33134 27162 92518 103177 88053 144553 128336 70554 196854 183256 186857 247641 70722
4823 70722 -3377 97291 128426 189163 147034 71555 138316 172644 110588 124640 59355 75972
4811 75972 1076 107452 255916 253083 225709 229658 207377 110826 99963 132805 170233 149437
4799 149437 78807 101399 133266 142656 242423 126248 58862 191558 337949 348063 226664
4788B26664k8379k7829J327j16386J33899O8080m7387k5614K0275m447J02962
4777C03165p7397l177m444l2998J33112Q8525j51439k9982Q0248p0959o8579r14
4765A65161P5606j00822M5808q5154O5553k28P89Q5621J0083L5793Q7282m7055
4753C38437k5190M8999r6393j3508l9262L9427J51498J41365l5626j02435n9619
4742C47693J1388J3022l3805R1720k1966o2026L1966j2702j9104N5644J60540
4731E62370k1857j26758Q0676r8351j5498N5463k8534n846J33663J09128j08084
4720E36372l2399N8962R911j13454l978M0928m1104O4877l7310q2650J5053Q6619
4708E01827J8448M3225J20559J2831r3437r3661O1780L4585Q3504K8306j31606
$$ plain form
4788 226664 198285 170456 171783 55397 189296 257376 209989 184375 204650 200203 303165
4777 303165 225768 222591 218147 185149 318261 406786 255347 225365 305613 234654 166075 165161
4765 165161 240767 139945 185753 100599 166152 165924 166713 252334 262417 298210 385492 338437
4753 338437 313247 362246 265853 252345 213083 252510 404008 545373 509747 407312 347693
4742 347693 359081 372103 338298 430018 408052 346026 377992 365290 346186 401830 562370
4731 562370 540513 413755 494431 396080 380582 436045 407511 401665 535328 644456 536372
4720 536372 503973 562935 572846 459392 455414 496342 455238 520115 482805 400155 415208 501827
4708 501827 520275 563500 684059 696890 603453 509792 571572 606157 689661 717967 586361
4697E86361R6362Q761J02281J04891K19307j29029q2724p6512K7220K9342L4992
4686I21252J55438q6610L6066l8188J10994M9810O2104O8958j08483r5830K4680
4675A100191J59241Q7099o6915P0517L7835o681m7382J10571l1767k6956J18280
4664A504033L9574J00556J68790j21664q7702R6521P0349k2063K04778O4565r1984
4653A925753N5801O3733J05802k1382K3232M9181R3848J15786Q9882J38452N8917
4642B699005R2237n7193J14933J15442J1740J11116J28336J95975l6739J20668
4632C495520J13922J72792J53746K8641J38476J48619K46080K20464J56258K61556
4622E136074J55654K59805K71990K06585K81558M09655M68499M53879N26020N81781
$$ plain form
4697 586361 682723 691484 793765 898656 1117963 988934 906210 829698 856918 886260 921252
4686 921252 1076690 990080 1026146 987958 1098952 1148762 1210866 1279824 1171341 1075511 1100191
4675 1100191 1259432 1346531 1279616 1350133 1387968 1381287 1333905 1444476 1412709 1385753 1504033
4664 1504033 1543607 1644163 1812953 1691289 1603587 1700108 1770457 1748394 1953172 2017737 1925753
4653 1925753 1981554 2045287 2151089 2129707 2152939 2202120 2295968 2411754 2501636 2640088 2699005
4642 2699005 2791242 2734049 2848982 2964424 2976164 3087280 3215616 3411591 3374852 3495520
4632 3495520 3609442 3782234 3935980 3964621 4103097 4251716 4497796 4718260 4874518 5136074
4622 5136074 5291728 5551533 5823523 6030108 6311666 6721321 7189820 7643699 8169719 8751500
4612H751500Q29403Q18696J027231J303644J405034J358576J040064P03028N55547
4603A7792723P01846J046172J520056J924705K139518J381684M78666j48794l04527
4594B6532049L56292Q86360J244823J749817J376167J17608j478610j920285j714459
4585B7149762j296277m65639O4408M5575m62702j400715k173353k029703j587827
4576A7843529j220333r71859o77439n87164r15454j293572j380144j306213j130294
4567H361057q92976o99825o42360m68037m52953k16184l30466k75806k41143k89017
4557C852290j58151J5123k38373j47220o5034j84987j43100j18510r8130j01663
4547B612245k10175j13552j20211j23872j0896j34864q2600k6250r5079Q0089
$$ plain form
4612 8751500 9580903 10399599 11426830 12730474 14135508 15494084 16534148 17237176 17792723
4603 17792723 18494569 19540741 21060797 22985502 25125020 26506704 26985370 26836576 26532049
4594 26532049 26888341 27774701 29019524 30769341 32145508 32263116 30784506 28864221 27149762
4585 27149762 25853485 25387846 25452254 25497829 25035127 23634412 21461059 19431356 17843529
4576 17843529 16623196 15651337 14973898 14386734 13471280 12177708 10797564 9491351 8361057
4567 8361057 7468081 6768256 6125896 5657859 5204906 4988722 4658256 4382450 4141307 3852290
4557 3852290 3694139 3709262 3470889 3323669 3258635 3073648 2930548 2812038 2713908 2612245
4547 2612245 2402070 2288518 2168307 2044435 2033539 1898675 1816075 1789825 1694746 1774835
4537A774835j00844j20564J4998j4448j43068k05862k3579J05921m9581n3251
4527A184557J26585j82838l7040N1632p1354j19530M3193r2765r8670K3209o738
4516H20241k0595K6902j08557J9689K0253l5899m4890M5879l877j44596j06282
4505D68268J40709M042l9043k674j9154L2013j06132N1698M7288q6541r505L5652
4493E16621L6334j13151j29251K4620P6300q8818K3679p287j0386L048L228L1302
4481C66239L7845K7441K3766k4770k398j38748p5166j2010J4587r2467N2577Q1998
4469B58894k0184m377r7299M6691j2771K3417p8239M2689J01146j3140r4101K7132
4457A79858l1494l207o3171p128k7662Q9566j11977j8333Q4737K5925L012o994
$$ plain form
4537 1774835 1673991 1553427 1568425 1553977 1410909 1205047 1181468 1287389 1237808 1184557
4527 1184557 1311142 1128304 1091264 1142896 1071542 952012 995205 902440 803770 826979 820241
4516 820241 799646 826548 717991 737680 757933 722034 677144 723023 719146 574550 468268
4505 468268 608977 613019 573976 571302 552148 584161 478029 529727 577015 490474 480969 516621
4493 516621 552955 439804 310553 335173 411473 322655 346334 339047 328661 331709 334937 366239
4481 366239 404084 431525 455291 430521 428123 289375 214209 202199 216786 124319 176896 258894
4469 258894 238710 234333 137034 183725 170954 194371 116132 158821 259967 246827 152726 179858
4457 179858 148364 145157 81986 74858 47196 136762 24785 6452 91189 117114 120126 113132
4445A13132N5649O3546n130k7717L0198l255L3713m0341n2306l3655L2057j17236
4433D8655j4507M9692k9581l9084K6948P3884p0706L5643p2147O4021J52919k6374
4421A99363j27036o1697l4266J28462l0136L2579k314m1640J13635L813Q0675
4410B61438j8119l9998l4420M0826m1990q0695n2556j231L6498J9525o0313K9099
4398E8064j1618m8148K7437n6709j14536L4987M5524m637L7462m45l5450N8216
4386i853j1102j17991J71155N5902j15445L8022L4073J3812j9119l8430J1023
4375A2047m268R7196l9772l4258L7800j14185l433q573M5271m2733r066k70J04946
4362D0702K2396l4934O086p1992J6556P3239J30914j8926j5510O2414m9481l0119
$$ plain form
4445 113132 168781 232327 227197 199480 229678 226423 260136 219795 167489 133834 165891 48655
4433 48655 34148 83840 54259 15175 42123 116007 45301 80944 8797 72818 225737 199363
4421 199363 72327 10630 -23636 104826 74690 107269 104955 63315 176950 180763 261438
4410 261438 243319 203321 168901 209727 167737 87042 34486 33255 69753 89278 28965 58064
4398 58064 46446 -1702 25735 -30974 -145510 -110523 -64999 -69636 -32174 -32619 -68069 -9853
4386 -9853 -20955 -138946 32209 88111 -27334 10688 44761 58573 39454 1024 12047
4375 12047 7779 104975 65203 30945 68745 -45440 -48873 -57446 -12175 -54908 -63974 -64244 40702
4362 40702 63098 28164 34250 -37742 -21186 52053 182967 164041 148531 210945 161464 131345
4350A31345m5356n0063K4846M3045p3881l713M8323N6697O5351o4930J4347l6237
4338A09774Q8457K7333o5267K858n8015j9694N6207p2333L1331Q312M2731K5996
4326A77690O7140M7803o7575L7069P0358j10506l2644n070l7244Q6802q7167N1715
4314A98371J25568J06225J8182n2117k372J2682p5965p3283q123N344j4534j7234
4302B22744j9273K748l2804K8784N7377J1159m4786Q2620L3503j26213j1499J33699
4290C38059N0249o052m5175K7852P8639l6989k3587Q587K5269q5167p4416Q5046
4278C42315P1448Q8922j38865l7951R576j3180o7475j281J23546K6289l8578k2755
4266C42011l3462K1034k2794j2618k31L9160j3533j2583m4520j93072L9885K338
$$ plain form
4350 131345 85989 35926 60772 103817 29936 26223 74546 131243 196594 131664 146011 109774
4338 109774 198231 225564 160297 163155 105140 85446 141653 69320 100651 108963 151694 177690
4326 177690 244830 292633 225058 262127 332485 221979 189335 184265 147021 233823 146656 198371
4314 198371 323939 430164 448346 396229 393857 406539 330574 257291 249168 254512 239978 222744
4302 222744 203471 206219 173415 202199 259576 270735 225949 308569 342072 215859 204360 338059
4290 338059 388308 382256 337081 364933 443572 406583 382996 391583 416852 331685 257269 342315
4278 342315 413763 502685 363820 325869 335445 322265 254790 253509 377055 403344 364766 342011
4266 342011 308549 329583 306789 294171 293940 333100 319567 306984 262464 69392 109277 111615
4254A11615M4878L092p6435r5063N5226L4752L9483J2253N2804O3344k6085J0623
4242B30487K9800O4768N993p9362n8043J23778O5617p8789N2907K8784M3498l5210
4230C94228J19073k31o4072r6033l6086r2655j970O7792j14138J8903K5196k5596
4218A94411Q9397Q5044j7876l7272l2354m3162p0947Q3251O5701P3610p373K7107
4206D09537J66931o6564k7183m0279j55256k5564j1258L3404m7944l5586m5462
4195A54776j17518P9995p2281n9718N3742K7986j599k3722n5396m9559R331J6934
4183c7029M2193P908L0111q6322N4099o5762K9049Q6929j77109j0585l165J30422
4171G39R8321L630K4347o9032q8758k3943P6531R5501q5115j60315j19173R6803
$$ plain form
4254 111615 156493 159585 83150 -11913 43313 78065 117548 129801 182605 245949 219864 230487
4242 230487 260287 325055 331048 251686 193643 317421 383038 304249 357156 385940 429438 394228
4230 394228 513301 513070 448998 352965 316879 224224 222254 290046 175908 194811 220007 194411
4218 194411 283808 368852 350976 313704 281350 238188 167241 250492 316193 389803 382430 409537
4206 409537 576468 509904 482721 442442 287186 261622 250364 283768 235824 200238 154776
4195 154776 37258 117253 44972 -14746 38996 66982 65383 41661 -13735 -63294 -53963 -37029
4183 -37029 5164 13072 43183 -43139 10960 -54802 -25753 61176 -115933 -126518 -129683 739
4171 739 99060 102690 127037 58005 -30753 -54696 21835 117336 32221 -128094 -247267 -150464
4159a50464J67269n2975n8044M191J21957r7546N7261O9368l9487r0331L9880
4148b8921J3982L625O913n6924Q134l3173m2675J04587m9098N3431Q463k8289
4136c9945J0222m0254o2301j0312N186K744Q2836o1530R0042n9280o949J55221
4124F5680Q3798o3226n5621J5929j80192K4555J9810M479J52040o656l1231k4077
4112E288Q1742m4315J1318p4327p4266M1160P0079k9751j01312J7361P2410q7992
4100a12605N2971K6991q9735n3007P5892J48450l5861j10197Q2684P0141j13895
4089e8171j02576N0990L5263K3118K02266j5082k838r3531M06J7834N0322j2051
4077I5950n229n8771J3531L1114N9010N5430P091m6466m0455J51752p2003Q6425
$$ plain form
4159 -150464 16805 -36170 -94214 -90023 31934 -65612 -8351 61017 21530 -68801 -28921
4148 -28921 -14939 -11314 -4401 -61325 -53191 -86364 -129039 -24452 -73550 -20119 -11656 -39945
4136 -39945 -29723 -69977 -132278 -142590 -137404 -134660 -51824 -113354 -23312 -82592 -89541 65680
4124 65680 149478 86252 30631 46560 -133632 -109077 -89267 -84788 67252 60596 29365 5288
4112 5288 87030 42715 54033 -20294 -94560 -53400 16679 -13072 -114384 -97023 -24613 -112605
4100 -112605 -59634 -32643 -122378 -175385 -99493 48957 13096 -97101 -14417 55724 -58171
4089 -58171 -160747 -109757 -74494 -51376 150890 135808 132970 39439 39845 57679 108001 95950
4077 95950 90721 31950 45481 76595 135605 191035 198126 151660 111205 262957 190954 277379
4065B77379n3786r7749J2323L1443l5867l4075K7299N9504j11018l2767L0271
4054G2957l0427L1531m6243k0194r1245L9062J64222n7073m344O4587j5675J0695
4042A17853L0249n529j00163l0424M2308K5404n9950n006M5753k2208L6229m6979
4030B7537N9226O6555k3232m6565M8811o0459L9987R9762r0860k8404k0186j3685
4018E8487R943m8831k5497J01622M0210r4975k3320k0028o1520O8183l7216r845
4006d2787M5281j9082j2279J20808N2747j3681l6238p2268k1843r254J60M6141
3994C7705Q7619j16228j81542J57760k051O6177j03453Q6056k8297l0011Q6548
3983F0283k3184J8952n5523J2394j57130K9884J0494K5155J11721j2204J2217
$$ plain form
4065 277379 223593 125844 138167 169610 133743 99668 126967 186471 75453 42686 72957
4054 72957 42530 74061 27818 7624 -83621 -44559 119663 62590 58246 122833 107158 117853
4042 117853 148102 142573 42410 11986 54294 79698 19748 14742 60495 38287 74516 27537
4030 27537 86763 153318 130086 83521 132332 71873 111860 211622 120762 92358 72172 58487
4018 58487 68430 19599 -5898 95724 135934 40959 17639 -2389 -63909 4274 -32942 -42787
4006 -42787 2494 -16588 -28867 91941 144688 131007 94769 22501 658 -8596 -8436 37705
3994 37705 125324 9096 -172446 -14686 -16737 49440 -54013 32043 3746 -26265 60283
3983 60283 37099 56051 528 12922 -144208 -114324 -103830 -78675 33046 20842 33059
3972C3059L1771l9180j7802j46790Q6145n6421J2324Q1876l1462Q3537K6877O5654
3960A29588k5739k5744N6506j08703R7621j5063j94386M7682K1308O45n2256j0414
3948g8955M4379P3818o340P4579p3185q3046L8174J0711j332j19839P6812Q7719
3936D3495J6638q0525J8516o0023J5296J381n4747R5434k761k1444J0268m7269
3924f5741P5505l155j68817N4245R7811J5438J1483m3338o0128N3430n502q255
3912d7024O1075J40757j03971j55131j16355L2495M1881L0923Q1515L0440l6260
3901c9655L9852K8881j78942o2167J43878R006K276J14878q02n2421N0055l4159
3889B0680r702P4676j8170r7235K8697L0637n9129K6780p6538M0030M9580J25661
$$ plain form
3972 33059 64830 25650 7848 -138942 -52797 -109218 -96894 -15018 -46480 37057 63934 129588
3960 129588 103849 78105 134611 25908 123529 108466 -85920 -38238 -16930 -16285 -68541 -78955
3948 -78955 -34576 39242 32902 107481 34296 -48750 -10576 135 -1197 -121036 -44224 43495
3936 43495 60133 -20392 -1876 -61899 -46603 -45222 -99969 -4535 -7296 -28740 -18472 -65741
3924 -65741 9764 6609 -162208 -107963 -10152 5286 16769 -26569 -86697 -33267 -38769 -47024
3912 -47024 14051 154808 50837 -104294 -220649 -188154 -146273 -115350 -33835 -3395 -39655
3901 -39655 197 29078 -149864 -212031 -68153 -59147 -56871 58007 57205 4784 54839 20680
3889 20680 10978 85654 67484 -29751 -1054 29583 -29546 -2766 -79304 -39274 10306 135967
3877A35967q105k4867j63617o792L6076o7660Q3407L4413j6136L9829J25410j17363
3865E0562n642R3876o4646j73205Q4201n4278k9652J75375n0291k1294M2080j82773
3853a35687Q4455J23127l5751J6070j21562k6843J28057k1601j413R0079r1216
3842G715J9545O1962J3237K2106O2435o9613j90750O8485J15995p8994m8331p849
3830b4057P165K31P2773r819j28008Q3685J02916K3309m2190R2525n2435l0018
3818I6077l4187l5234p987J32103K8207j02375Q2011j7840J9233j07687P5570
3807A27891m337n406l0008j1153l2635J04626k8190o677N1741m9805m1457K6162
3795A00752O3829r9705J5498J8060o7982L3920N0146l8384k8879K2684l4749J37519
$$ plain form
3877 135967 127862 102995 -60622 -67414 -31338 -98998 -15591 18822 2686 42515 167925 50562
3865 50562 44920 138796 74150 -99055 -14854 -69132 -98784 76591 26300 5006 47086 -135687
3853 -135687 -51232 71895 36144 52214 -69348 -96191 31866 10265 8852 98931 7715
3842 7715 27260 89222 102459 124565 187000 117387 -73363 -4878 111117 32123 -16208 -24057
3830 -24057 -16892 -16661 56112 46293 -81715 1970 104886 128195 86005 178530 126095 96077
3818 96077 61890 26656 18669 150772 178979 76604 158615 140775 160008 52321 127891
3807 127891 123554 118148 88140 76987 44352 148978 120788 114111 165852 116047 74590 100752
3795 100752 164581 64876 80374 98434 30452 64372 114518 76134 47255 69939 35190 172709
3783A72709n7659j2557l494K6455l0994n9796L8580r7817P3941m7941J4376P2025
3771H7828o9417N1090j3437k8809j518n4815L5805K0233J07306L8301l3693O6668
3759B05542r2978n0635P578j6839L7694K4724L5443n5860M6395o4787K8220o7207
3747C7290m5575J30185N1769k733m4484M38n3389j7643P2835O9040j4841K801
3735A85693p6968J7607R3094J6502r4338o8214J00852L1865j39112k2104J09440
3724A54317q7508Q6856K7566L4715j19013k7956j00744Q4924O9934K4744N2703
3713B00538j22110l941O0886P8634j9599l1263o6464q468l2390N0815R4781N6413
3701B57832o3407p8313n0541r5482O9818j2403O3698l2795o868j7198J752j6650
$$ plain form
3783 172709 115050 102493 98999 125454 94460 34664 73244 -24573 49368 1427 15803 87828
3771 87828 18411 69501 56064 27255 25737 -29078 6727 26960 134266 172567 138874 205542
3759 205542 112564 61929 69507 52668 90362 115086 150529 94669 141064 76277 104497 37290
3747 37290 -8285 121900 173669 170936 126452 126890 73501 55858 128693 197733 182892 185693
3735 185693 108725 126332 219426 235928 141590 73376 174228 206093 66981 44877 154317
3724 154317 66809 153665 181231 215946 96933 68977 -31767 53157 123091 147835 200538
3713 200538 78428 74487 135373 214007 194408 163145 96681 88213 55823 106638 201419 257832
3701 257832 194425 116112 65571 -29911 39907 27504 91202 58407 51539 34341 36093 19443
3689A9443J10923J86562j29882j950J07019m2101o0457M4897L6582n2339j5137
3678B03560m6565j0929K4235k918R27n0786m9249J50165M0042j46979k1327M3131
3666A33307n5856o3438J81563Q4845j39384l6391J11799k1167j5579j1843M3422
3655B11278L0144j8718l4449j61707k7665J01086L5021p358k4023L5181K8130
3644A66920r4566k8578R8816p7782L7562Q7330L6612o3432m1032J4635k112Q2512
3632B16885J4192m7674J95162l4621j49969n7711Q4570k5816L6503q592l4784
3621A88145l6920J00571k5000j02854P407R7303L2947K2810j7595l1522R8228
3610C33520n7430n4190j5251L3822L0661k8515n3134K3895m7664m2831K4588J35419
$$ plain form
3689 19443 130366 316928 187046 185096 292115 250014 189557 234454 271036 218697 203560
3678 203560 156995 146066 170301 167383 168310 117524 68275 218440 258482 111503 90176 133307
3666 133307 77451 14013 195576 280421 141037 104646 216445 195278 179699 167856 211278
3655 211278 241422 222704 188255 26548 -1117 99969 134990 127632 103609 138790 166920
3644 166920 72354 43776 142592 64810 102372 189702 226314 162882 121850 136485 134373 216885
3632 216885 231077 183403 378565 343944 193975 136264 220834 195018 231521 222929 188145
3621 188145 151225 251796 226796 123942 131349 228652 261599 284409 266814 235292 333520
3610 333520 276090 221900 206649 240471 271132 242617 189483 213378 165714 122883 147471 282890
3598B82890L9628o4515K8009j71029l3573Q8239j0385N2753N6094K1477o984m6423
3586B36181j0202j23599k5633N3571J3490R5021J4520l5605j27662K9910J07953
3575B27945R2273j22526o3988R2307K5768n3038m3437k1753J9662M3999N9912
3564B57124R1529j09009L7187L948p8030m5441J5853K3590K6466N2346K2560k3306
3552B74817j2947J9770O593M252m9678J00549p3457j10212j5225N9038l3875O6302
3540B35927J7707J50098k2858m418q0556j9208O9792j2374l5476K7884J5405J6857
3528C58780k493Q8685O608l0493P826n2342j45827j259L1596M905L8066n5132
3516B48920l9421K6039J17846N943Q0075J2149p4871Q659m2605Q0899L3113m585
$$ plain form
3598 282890 322518 258003 286012 114983 81410 169649 159264 212017 268111 289588 282604 236181
3586 236181 225979 102380 76747 130318 143808 238829 253349 217744 90082 119992 227945
3575 227945 320218 197692 133704 226011 251779 198741 155304 133551 153213 197212 257124
3564 257124 348653 239644 276831 280779 202749 157308 173161 196751 223217 275563 298123 274817
3552 274817 261870 281640 288233 292485 242807 343356 269899 159687 144462 203500 169625 235927
3540 235927 253634 403732 380874 376456 295900 276692 346484 334110 298634 326518 341923 358780
3528 358780 356287 444972 451580 421087 428913 376571 230744 229485 261081 265986 304052 248920
3516 248920 209499 235538 353384 359327 439402 451551 376680 385339 342734 423633 456746 452161
3504D52161O835j9779J18443l7166l4245N7695j2503K0387l4993n4486R5522L5000
3492E92871j55140J9287N1050J70723J30929k44374j0859j3959j6349n6605J4545
3481D82119J593J14118m3210L0836L1720m7904l4939m2306O2659K4987k6662J4033
3469E67044j9306J85950N7176l2878m9719o422J786M290J12268r0886m6345J04579
3457G87537k4697K805m3518p108Q2479J68089N001j08592J34574J16373P910m7850
3445A073003J0767j7132j4930m3789j3183M0627Q5625j1063P1180N9585p3117
3434A167573L8059N3328J7866N5535J970j5964N156P6199N9213J62360k7268n5466
3422A538561L8603K772M3759L1111L6523K9253J04660R1042L8413J88378R9640
$$ plain form
3504 452161 458996 439217 557660 520494 486249 543944 531441 551828 516835 462349 557871 592871
3492 592871 437731 457018 508068 678791 809720 565346 554487 540528 524179 467574 482119
3481 482119 483712 597830 554620 585456 617176 569272 534333 492027 554686 579673 553011 567044
3469 567044 547738 733688 790864 757986 708267 701845 703631 707921 820189 729303 682958 787537
3457 787537 762840 765645 722127 715019 797498 965587 970588 861996 996570 1112943 1120853 1073003
3445 1073003 1083770 1066638 1051708 1007919 994736 1035363 1120988 1109925 1181105 1240690 1167573
3434 1167573 1205632 1258960 1276826 1332361 1334331 1318367 1323523 1399722 1458935 1621295 1594027 1538561
3422 1538561 1577164 1579936 1623695 1654806 1691329 1720582 1825242 1916284 1954697 2143075 2242715
3411B242715J17521J837M343K1115J32693L40540P7060J52162N3424J71260J17229
3400C431899J04458P8506M8960J31048Q2255n4393j13909j35198j14708j05993
3390C352925l34573j41601k27489m07867j15255j13612j84363r8891J86p5151
3380A654309p8537l5243r7009p6964P21l2056q4024n0838j42060k614m9145j8687
3368I87853O2534p3854l9542M458N5693o7805P9155L1157m1439n8929p6028m1257
3356H21996N0287N5104m854M0876L3697M5075j61203j33114J48193J54921m6628
3345A004350j18834p1381L7619k02943n9955L5716n9226R766L6593P724k3619
3334E95810n6502L2200r876l9399j8915k5597M6347N8398k2608L154o508o490
$$ plain form
3411 2242715 2360236 2362073 2366416 2387531 2520224 2860764 2937824 3089986 3143410 3314670 3431899
3400 3431899 3536357 3614863 3663823 3794871 3877126 3822733 3708824 3573626 3458918 3352925
3390 3352925 3018352 2876751 2649262 2241395 2126140 2012528 1828165 1729274 1729460 1654309
3380 1654309 1575772 1540529 1443520 1366556 1367277 1335221 1251197 1200359 1058299 1055685 1006540 987853
3368 987853 1050387 976533 936991 941449 997142 929337 1008492 1039649 998210 939281 863253 821996
3356 821996 872283 927387 922533 963409 997106 1042181 880978 747864 896057 1050978 1004350
3345 1004350 885516 814135 851754 648811 588856 624572 565346 575112 611705 619429 595810
3334 595810 539308 571508 561632 522233 503318 477721 524068 582466 559858 563012 556504 550014
3322E50014k4119M2626l9609j16325O894Q7711L3373J920j05736q2790k5994L0393
3310C58358R245o0412Q3905j09812q745Q6286J7485j07316q8555K6355j769P1025
3298B76050R1717l8185O5052j6197l3429L045p942l312m1833O8816M1953l9788
3286C65947j59444M7039l8221k9460K8774P4422l1498J8980N2801o6819M2334
3275C04855o5096o3247M3157L2454l7859M2280K6868m0669J0490l9077P6300N5154
3263C45610n0145J09751j08666m8536o3645J52112J15790l2009j40118j9181l1801
3252B29162K7995O9042j50059M439J38209r9924J5887J32870l88k8749j03924
3241B34560j4436L941k2608q7153J3888j16093P9211J8953P4401M5580L4753m8068
$$ plain form
3322 550014 525895 568521 528912 412587 419481 507192 540565 542485 436749 353959 327965 358358
3310 358358 367603 307191 391096 281284 272539 358825 376310 268994 180439 206794 205025 276050
3298 276050 367767 329582 394634 378437 345008 348053 340111 336799 294966 363782 405735 365947
3286 365947 206503 253542 215321 185861 214635 289057 257559 276539 329340 262521 304855
3275 304855 239759 176512 219669 252123 214264 256544 283412 242743 253233 214156 290456 345610
3263 345610 295465 405216 296550 248014 184369 336481 452271 420262 280144 260963 229162
3252 229162 257157 326199 176140 180579 318788 218864 234751 367621 367233 338484 234560
3241 234560 220124 224065 201457 114304 128192 12099 91310 110263 184664 230244 264997 216929
3229B16929n026j17076k9548j84Q1580N5553j09271J5053L2710O6176J15733j71995
3217A50634k598M9239j05266O5097l9337o526o4761J02775J6341k1070o1213N1439
3205A34754K5183p1097O0548M0223k4182M7422j13146N1928j1987j14539K108
3194B7215N6791Q4873K8835O8551L6228r6840j1679m0822l1954N8264k3759P7793
3182B33496J07216K337m6499j01855m2063J3437L1854K3387j12364o013L7370
3171A40303J37346O0439n2363L710n8858M209M1391K50j0070M2858j08043J4035
3159B15207J537J188M7144L7998m2519M7306Q8984n4966O6118m3377q4852P9401
3147C59169R764O9661n6306q219p5118k8762P1296K242j2965O2461m9130m4254
$$ plain form
3229 216929 211903 94827 65279 65095 146675 202228 92957 108010 140720 206896 322629 150634
3217 150634 148036 197275 92009 157106 117769 111243 46482 149257 165598 144528 83315 134754
3205 134754 159937 88840 149388 189611 165429 212851 99705 151633 139646 25107 27215
3194 27215 84006 168879 197714 266265 302493 205653 193974 153152 121198 179462 155703 233496
3182 233496 340712 343049 296550 194695 152632 166069 197923 221310 108946 102933 140303
3171 140303 277649 338088 285725 289435 230577 234786 276177 276427 266357 309215 201172 215207
3159 215207 216744 217932 265076 303074 260555 307861 396845 341879 407997 364620 279768 359169
3147 359169 368933 438594 382288 374069 298951 270189 341485 343727 330762 393223 344093 299839
3135B99839P5631j05574L8775J70701R4373j04728p9452J52O596O4198l4706o1821
3123C63984k5163k7686O5770K1460R0553J08157j09244p8719J7738J27048j11474
3112D42424l8356M7509K068J50550k4360K1976q4809N7278p883l2677K9081P1252
3100F34053L9820J9613o96J1102k9620K824m394m065j4951J09144l2150r5919
3088F34761p5742J23949J71848O3j42286R3315P6660R958j8901j0968%l0581J35334
3075I67410N7228J8071O416n3257j38723m5932R3658n7208k3507n9216r6827O1549
3063G29662l7750J04779n3569o0049J19352n7507n2234R6075R5756M6342j04078
3052H26779j2771j8640R1804O7107q4880k2128j6289n6634L1114O7330j44680
$$ plain form
3135 299839 375470 269896 308671 479372 573745 469017 389565 389717 396313 460511 425805 363984
3123 363984 338821 311135 376905 398365 488918 597075 487831 409112 426850 553898 442424
3112 442424 404068 451577 453645 604195 579835 601811 517002 574280 566397 533720 562801 634053
3100 634053 673873 693486 692790 703892 674272 677096 672702 668637 653686 762830 730680 634761
3088 634761 559019 682968 854816 854879 712593 805908 882568 892526 873625 862657 862657 832076 967410
3075 967410 1024638 1042709 1049125 995868 857145 811213 904871 847663 824156 764940 668113 729662
3063 729662 691912 796691 743122 683073 802425 744918 692684 788759 884515 930857 826779
3052 826779 814008 795368 887172 954279 869399 847271 830982 774348 805462 872792 728112
3041G28112J2151l6683m695n123j8765j01240j8511O1370K2038r679N053K168
3029F36196N7836r1126j85471L8389J02900n8965r7290J0342m4822k2010L2109
3018C78088j25359q1945K34102O1344n1418r7710J8500q0673Q445L418J06850
3007C73642j0187j32867j38951K030J55452L5566J2097K4647n4461l4220j86332
2996D6416N194J29622J11000k5149j2642m0173L0090N315j07591K3945m753R5661
2984B56935m2088j35142O4711r9875l6540P8907M5922K7321J0501r3436j03238
2973b6022l0000J24696K9262K9110N2005j7378p8017q3559q1311R4774O0942J0961
2961H5463j5699r4144K3361J12549j2233L3640p16p0560o620j00538J26854J718
$$ plain form
3041 728112 740263 703580 698885 693762 674997 573757 555246 616616 638654 628975 634028 636196
3029 636196 694032 602906 417435 455824 558724 499759 402469 412811 367989 345979 378088
3018 378088 252729 170784 404886 466230 414812 317102 335602 254929 263374 266792 373642
3007 373642 363455 230588 91637 93667 249119 284685 296782 321429 266968 232748 46416
2996 46416 51610 181232 292232 267083 254441 214268 244358 249673 142082 166027 161274 256935
2984 256935 214847 79705 144416 44541 8001 86908 132830 160151 170652 77216 -26022
2973 -26022 -56022 68674 97936 127046 179051 161673 83656 97 -81214 13560 74502 85463
2961 85463 69764 -24380 -1019 111530 99297 132937 132221 61661 55041 -45497 81357 83075
2949H3075j2908K3146l43m8355o5362O9574O0360p5022K676O2892O4928j16117
2937D8544M9597p2991j0557n7227J28956o6676O3257j9794n8950R3438q3653l7841
2925b3897j179n043O4454j364r4036J5516L5085j5809Q2159L0925j65219o5454
2913a43862P0416j3726o1660N3623R1261j6525j00978o4469N4403O8511M5828
2902a7178M9875Q4822l6311k14651L8725j8377j3318N8154n8798Q4553N9022l2430
2890a5912J6661r3907L8695L8368o3020N2822N0980r5813q2783l3557Q9284J08466
2878A0284p2012j1442m6261n4947N6301k9048j861m1499P657J80503O1497r8188
2866c9016j5030M5809L0789l1851K5438l819r209J0853j35315p6191N5666M5102
$$ plain form
2949 83075 70167 93313 92970 44615 -20747 48827 109187 34165 36841 99733 164661 48544
2937 48544 98141 25150 14593 -42634 86322 19646 82903 63109 4159 97597 13944 -23897
2925 -23897 -25076 -30119 34335 32971 -61065 -45549 -10464 -26273 55886 86811 -78408 -143862
2913 -143862 -73446 -87172 -148832 -95209 -3948 -20473 -121451 -185920 -131517 -63006 -17178
2902 -17178 32697 117519 81208 -133443 -94718 -113095 -126413 -68259 -127057 -42504 16518 -15912
2890 -15912 749 -93158 -54463 -16095 -79115 -26293 24687 -71126 -153909 -187466 -98182 10284
2878 10284 -61728 -73170 -119431 -174378 -118077 -147125 -148986 -190485 -182828 -2325 59172 -39016
2866 -39016 -54046 -8237 22552 -9299 16139 12320 3111 13964 -121351 -197542 -141876 -96774
2854i6774P9898Q1155o7978n178k5726k8462l2588L0015L3467L5657n3414j27750
2842a77678J16762M1698j48882R565J2375l3476M3093l4554O7358q3649N7294
2831a30094j2246J7849R3670l39P3243o9787j13246Q3084l9803l9070K2794o0590
2819a74535o2107K3858J16933J25157r5863o3567n7934J5275N2533j9957O618
2808a33589Q006m7586k9915J27293R446r6447j77770O5233M1395Q6850J21304
2797b5780l6508o593j02413q4104p430Q2442J0991N433n834j5271m523l0931N1046
2784a69475P3698P2780o1396l1274R837l0681J1696L6911p2233k808Q3723M2322
2772c6900o5956l5477P9702J2583M6042O1027m5304J9847j27374j1152N3058k9281
$$ plain form
2854 -96774 -16876 64279 -3699 -8877 -34603 -63065 -95653 -65638 -32171 3486 -49928 -177678
2842 -177678 -60916 -19218 -168100 -158535 -146160 -179636 -136543 -171097 -103739 -187388 -130094
2831 -130094 -142340 -124491 -30821 -31160 42083 -27704 -140950 -57866 -97669 -136739 -113945 -174535
2819 -174535 -236642 -212784 -95851 29306 -66557 -130124 -188058 -172783 -120250 -140207 -133589
2808 -133589 -125583 -173169 -203084 -75791 -66345 -162792 -340562 -275329 -233934 -147084 -25780
2797 -25780 -62288 -68881 -171294 -255398 -262828 -180386 -169395 -163962 -169796 -185067 -189590 -220521 -169475
2784 -169475 -95777 -22997 -84393 -115667 -105830 -136511 -124815 -87904 -160137 -162945 -79222 -36900
2772 -36900 -102856 -138333 -58631 -46048 -6 61021 15717 35564 -91810 -102962 -49904 -79185
2760g9185J0813k4041j7042j1966J0003m1410M4460j7532J02531O3651j37422
2749i7140k8627L2859L803k2921m0615J1715M2609j52R1843o3360O2080l0390
2737c8296k5253n2885R4846l6314k8769k7745L5920L1058l0614Q3678m8106N108
2725c7372m7278J9220p2424K3362P8593N9261q7009j3302M6850n7134n8576Q9160
2713e6649m4438K0733k0112J08977m6542j09608m2285n1045J01688O6207n9600
2702a32674K0049j220m6042N3692J2975m304k9871R969n184J39076L2894o7840
2690a8480j11118Q122m6833O1285J8653J6445L0691p2890M181L4576M0415l4728
2678f9681n5401L0502J33454m7674o0170k5230n9826R4401j40605r1821K111O0748
$$ plain form
2760 -79185 -68372 -92413 -109455 -121421 -111418 -152828 -108368 -125900 -23369 40282 -97140
2749 -97140 -125767 -92908 -89105 -112026 -152641 -140926 -98317 -98469 -6626 -69986 -7906 -38296
2737 -38296 -63549 -116434 -21588 -57902 -86671 -114416 -78496 -47438 -78052 5626 -42480 -37372
2725 -37372 -84650 -65430 -137854 -114492 -35899 23362 -63647 -76949 -30099 -87233 -145809 -56649
2713 -56649 -101087 -80354 -100466 8511 -38031 -147639 -189924 -240969 -139281 -73074 -132674
2702 -132674 -112625 -113845 -159887 -106195 -93220 -97524 -127395 -117426 -122610 16466 49360 -18480
2690 -18480 -129598 -121476 -168309 -107024 -88371 -71926 -41235 -114125 -109944 -75368 -34953 -69681
2678 -69681 -125082 -94580 38874 -8800 -68970 -94200 -154026 -59625 -200230 -292051 -289940 -229192
2666b29192P3014j4960J06890J3745m0839k7744o1718p026J18841L204j03947
2655a69732K174L6151N0373j0813n7677R6058j26735Q6051R5428p4087o5894q146
2643a46849j30114O3916J10812O4072k836j03559o7793M74q9506L1972Q9444O2618
2631a17349l3m5553o6389m9416Q3895K9832K0728J1669M9053K1506k399j555k8249
2618i4260k0590J9722K2175J6829p0623j8350j45054K22311J20138k0219p247
2607B4832j14006j8256K629r506p90K3627k7563K2940J8222l7250k1196j0440
2595a46757k2299n4708J14778l6861m0777n8979j5713L7262j4293Q0669J21085
2584c6593o651n3159j05617k5371J34377j891j46935J60122L5327o2829J3567
$$ plain form
2666 -229192 -156178 -171138 -64248 -50503 -91342 -119086 -180804 -187830 -68989 -65785 -169732
2655 -169732 -167558 -131407 -81034 -91847 -149524 -53466 -180201 -94150 1278 -72809 -138703 -146849
2643 -146849 -276963 -213047 -102235 -38163 -40999 -144558 -212351 -211877 -301383 -269411 -179967 -117349
2631 -117349 -117382 -162935 -229324 -278740 -194845 -165013 -144285 -132616 -83563 -62057 -64456 -66011 -94260
2618 -94260 -114850 -95128 -72953 -56124 -126747 -145097 -290151 -67840 52298 32079 24832
2607 24832 -89174 -107430 -104801 -114307 -115097 -91470 -119033 -96093 -77871 -115121 -136317 -146757
2595 -146757 -169056 -223764 -108986 -145847 -186624 -245603 -261316 -224054 -238347 -157678 -36593
2584 -36593 -43244 -96403 -202020 -227391 -93014 -94905 -241840 -81718 -46391 -109220 -95653
2573i5653M761o874L8634l938j17748O0375N2885K063m7023o7139P4316P3037
2561c2304q0011q3121O930P2208M321j5066j8838N8890R9310l2803p2715n1300
2549a44499M8747P659J6978n6712j1774n33o1390J22219m799j02919l3511K19598
2537i36K4604M0585K6408l2560j21341n2362n4582p8376J11838L294K9654l3239
2525a37013R2202l6118M6865n5661J0279J10319j9096m3242q9191K5167q1910
2514a77399m798L0509l2374K5731j740k0178P7883k8388O6729M5431O7036j50119
2502a01677n4888k2765L0329R0819l1584j5462m30P9001j086j86607R9308o9173
2490a84215l375M4567K0408k1563Q7660p3108j6302J77949o0223J9235p283M3216
$$ plain form
2573 -95653 -90892 -97766 -59132 -63070 -180818 -120443 -67558 -65495 -112518 -179657 -105341 -32304
2561 -32304 -112315 -195436 -188506 -116298 -111977 -127043 -145881 -86991 12319 -20484 -93199 -144499
2549 -144499 -95752 -88093 -71115 -127827 -139601 -140134 -201524 -79305 -84104 -187023 -220534 -936
2537 -936 23668 64253 90661 58101 -63240 -115602 -170184 -248560 -136722 -133428 -103774 -137013
2525 -137013 -44811 -80929 -34064 -89725 -79446 30873 11777 -31465 -120656 -95489 -177399
2514 -177399 -182197 -151688 -184062 -158331 -160071 -180249 -102366 -130754 -64025 -18594 48442 -101677
2502 -101677 -156565 -179330 -149001 -58182 -89766 -105228 -105658 -26657 -27743 -214350 -115042 -184215
2490 -184215 -187590 -143023 -122615 -144178 -56518 -129626 -145928 32021 -28202 -8967 -16250 26966
2478B6966q2388j0213J3338l6197j6086k0923j24432N0553J13902J3799l9241
2467a10922J8092O3334k0590M1912J238O152j8067j2742k0674j0359O7553O7495
2455G2422m3684m6856k6020Q049O8221q3811j12661j7822M3614O4435M8871l1247
2443e6489m1113j408L0313J25984l7267j46067L1513j4014j2479n8126L8396J35929
2431d828j241p8718L1646J43079o2883q4781N4014j21809J15679l6931l9096J4624
2419g1245l0900J0841O9251o2031P0880k6701m395p277L9030O6143q6653k1327
2407e4384N4308R2654n7222j5889N3128L5914l9394j25491l8230J23304L2914
2396F1612L7599O1751q0014L4155O6200m5194l2529o7541n8040Q581K4841K9138
$$ plain form
2478 26966 -55422 -65635 -52297 -88494 -104580 -125503 -249935 -199382 -85480 -71681 -110922
2467 -110922 -92830 -29496 -50086 -8174 -6936 -784 -18851 -31593 -52267 -62626 4927 72422
2455 72422 28738 -18118 -44138 -36089 32132 -51679 -164340 -182162 -138548 -74113 -25242 -56489
2443 -56489 -97602 -99010 -68697 57287 20020 -126047 -94534 -108548 -121027 -179153 -140757 -4828
2431 -4828 -6069 -84787 -53141 89938 27055 -57726 -3712 -125521 -9842 -46773 -85869 -71245
2419 -71245 -102145 -91304 -22053 -84084 -13204 -39905 -44300 -51577 -12547 53596 -33057 -54384
2407 -54384 -76 92578 35356 19467 72595 108509 69115 -56376 -94606 28698 61612
2396 61612 99211 160962 80948 115103 181303 136109 103580 36039 -22001 -13420 11421 40559
2384D0559p2267k1299J2040M2883L1917J0238J7003j1711N5657n8704k2691Q4062
2372A07687K2189n2171L6232R1543K3130r8155J6894j8868k7147L6765j0780M1352
2360A68671j1981n8420Q4746K0197P1535m229k2366k4218J5156J26143Q0292o3723
2348C81803o3029J03610J00773J2633k2843P527J03760q1418K0357Q3352N2657
2337F99182N2512p0603p2486O0302k632j02402J16314J01909P8229R7618j0721
2326I47222P3407P0055J23507J67819Q3065j5393M9486J03728M2064J12267J88314
2315A945541L45271L34412N42059O24028O90356Q44547J157454J776765K166611
2306A0427044L91092j817885k177857j714732r82126q24593o41230l61580l29472
$$ plain form
2384 40559 -31708 -53007 -40967 1916 33833 44071 61074 49363 105020 46316 23625 107687
2372 107687 129876 77705 113937 205480 228610 130455 147349 128481 101334 138099 127319 168671
2360 168671 156690 98270 183016 203213 274748 270519 248153 223935 239091 365234 445526 381803
2348 381803 318774 422384 523157 535790 512947 520474 624234 542816 563173 646525 699182
2337 699182 751694 681091 608605 668907 666275 563873 680187 782096 860325 957943 947222
2326 947222 1020629 1090684 1214191 1382010 1465075 1449682 1499168 1602896 1644960 1757227 1945541
2315 1945541 2290812 2625224 3167283 3791311 4481667 5326214 6483668 8260433 10427044
2306 10427044 10818136 9000251 6822394 5107662 4125536 3300943 2659713 2298133 1968661
2297A968661j23973k24844l05771m5802l126Q153j70269j47168K4064l1882j47740
2286H00303l4343r760l5577R485J7174j23266j30785n109q5976j01778K7817O9796
2274C97981j18508M0621q7l1107n5524l8833l1862j08963j29017J04011J65557
2263A94269p0876J578j3348j1077L5176l6697q8622Q1256J46892n6824j08953
2252G2774j01143J09179K5638m6648p2891n9999R56m9721J70229l2954k5115o218
2240a5913N6365l0914k1771j8807Q6860j1194m8355j01725R025m7219J3929J52757
2228B3038q3896o6679R7928N0485l242K2009j11544L1047M3093j09322K0340L9562
2216d7181L4785j3851K8276n3311j47722J05514M8198N212j1395K6520r1525o2459
$$ plain form
2297 1968661 1844688 1619844 1314073 1268271 1265145 1273298 1103029 955861 979925 948043 800303
2286 800303 765960 756200 720623 730108 747282 624016 493231 488122 402146 300368 328185 397981
2274 397981 279473 320094 320007 288900 233376 194543 162681 53718 -75299 28712 194269
2263 194269 123393 124971 111623 100546 135722 99025 10403 91659 238551 181727 72774
2252 72774 -28369 80810 106448 59800 -13091 -73090 -72134 -121855 48374 15420 -9695 -15913
2240 -15913 40452 9538 -12233 -31040 55820 44626 -3729 -105454 -96429 -143648 -129719 23038
2228 23038 -60858 -127537 -29609 20876 17634 39643 -71901 -40854 2239 -107083 -86743 -47181
2216 -47181 -12396 -26247 2029 -51282 -199004 -93490 -45292 -40080 -51475 -24955 -116480 -178939
2204a78939O6584P1206l1977O5988m3978o4803J696k7655J5469R9195n5483m9546
2192a32243L8238o7025J01217Q12l7301J05276l7446n859j02575K0717K6426j1402
2180a01165q8009K4173O8617m3573Q128M1713n6576Q8816p17Q0235m0830n2475
2168g1663j8809o8279O1827P5386K8276m3810j16524l5816R9078M3909l1832o6798
2156a45055J13576j9756n3649Q0990l619j3267L3178o0524l6569k6199K6583m2101
2144a46412m7467M4943K5677m1371J3702O0263q76J0027L9684N317K2512r1059
2132a05060p2612N200J24634O795o9503l6316J31223j05597p2600J9157p6954
2121b51633J01089L5769O7011L239o5417J2879N6366m9892n4219k2713k4626P0134
$$ plain form
2204 -178939 -112355 -41149 -73126 -7138 -51116 -115919 -114223 -141878 -126409 -27214 -82697 -132243
2192 -132243 -94005 -161030 -59813 -59001 -96302 8974 -28472 -34331 -136906 -116189 -89763 -101165
2180 -101165 -189174 -165001 -96384 -139957 -131829 -90116 -146692 -57876 -58593 21642 -19188 -71663
2168 -71663 -90472 -158751 -96924 -21538 6738 -37072 -153596 -189412 -90334 -46425 -78257 -145055
2156 -145055 -31479 -51235 -104884 -23894 -27513 -40780 -7602 -68126 -104695 -130894 -104311 -146412
2144 -146412 -193879 -148936 -123259 -164630 -150928 -90665 -91541 -81514 -41830 -36513 -14001 -105060
2132 -105060 -177672 -172472 -47838 -41043 -110546 -146862 -15639 -121236 -193836 -174679 -251633
2121 -251633 -150544 -114775 -47764 -44525 -109942 -97063 -40697 -90589 -144808 -167521 -192147 -122013
2109a22013j6282O578K8160K9262k6127k9895P8770j7124P840J20205l5016n2965
2097b8607J8022N9786M1505j00748p7820J5619M7756q716o7131M0582l5217p206
2085a02175K9080N1589j02461L1780J30179n0924m1273j6798k9506J1979N6028
2074c2502K8024o1981J3678L1856q9834j15724J7913O4822j84l0042M9101j04476
$$ plain form
2109 -122013 -138295 -131717 -103557 -74295 -100422 -130317 -51547 -68671 -60831 59374 24358 -28607
2097 -28607 -10585 49201 90706 -10042 -87862 -72243 -24487 -33203 -100334 -59752 -94969 -102175
2085 -102175 -73095 -21506 -123967 -92187 37992 -12932 -54205 -71003 -100509 -88530 -32502
2074 -32502 -4478 -66459 -52781 -20925 -110759 -226483 -208570 -143748 -143932 -173974 -124873 -229349
$$ [...]
##END NTUPLES=NMR SPECTRUM
##END=
